##TITLE=1H_CA-9273-1
 CDCl3
 8 sc, 
 29.5.2024
##JCAMPDX= 6.0         $$ Bruker NMR JCAMP-DX V2.0
##DATA TYPE= NMR SPECTRUM
##DATA CLASS= NTUPLES
##ORIGIN= UXNMR, Bruker Analytische Messtechnik GmbH
##OWNER= root
$$ XWIN-NMR		Version 3.5
$$ Wed May 29 13:41:41 2024 Russian Standard Time (UT+4h)  she@DPX200
##.OBSERVE FREQUENCY= 200.1309
##.OBSERVE NUCLEUS= ^1H
##.ACQUISITION MODE= SIMULTANEOUS
##.ACQUISITION SCHEME= undefined
##.AVERAGES= 8
##.DIGITISER RES= 18
##SPECTROMETER/DATA SYSTEM= spect
##.PULSE SEQUENCE= zg30
##.SOLVENT NAME= CDCl3
##.SHIFT REFERENCE= (INTERNAL, CDCl3, 0, 15.8031)
##AUDIT TRAIL= $$ (NUMBER, WHEN, WHO, WHERE, WHAT)
$$ ##TITLE= Audit trail, XWIN-NMR		Version 3.5
$$ ##JCAMPDX= 5.01
$$ ##ORIGIN= Bruker BioSpin GmbH
$$ ##OWNER= she
$$ F:/spectra/data/she/nmr/H-F/1/pdata/1/auditp.txt
$$ ##AUDIT TRAIL=  $$ (NUMBER, WHEN, WHO, WHERE, WHAT)
(   1,<2024-05-29 13:39:40.93 +0400>,<she>,<DPX200>,
      <created by zg, POWCHK disabled, PULCHK disabled
       configuration hash MD5:
       00 E9 B6 7A A2 85 ED C7 34 08 36 98 17 FE 4E 26
       data hash MD5: 16K
       25 47 79 DA C2 0A A5 DB 0D 9C 8E E5 5F 78 8D 02>)
(   2,<2024-05-29 13:39:51.34 +0400>,<she>,<DPX200>,
      <Start of raw data processing
       efp BC_mod = 2 LB = 0.24 FT_mod = 6 PKNL = 1 PHC0 = -25315.28 PHC1 = 14.78748 SI = 16K 
       data hash MD5: 16K
       F5 8D 3D FF BA 30 BA 42 93 2E E2 87 D4 89 9E 67>)
(   3,<2024-05-29 13:40:15.81 +0400>,<she>,<DPX200>,
      <pk PHC0 = -152.4679 PHC1 = -4.4 
       data hash MD5: 16K
       1C 78 70 07 2E 9E 68 B0 5B 6D 82 C4 70 AC F0 2A>)
(   4,<2024-05-29 13:40:19.39 +0400>,<she>,<DPX200>,
      <abs ABSG = 5 
       data hash MD5: 16K
       73 4B 3B 08 0E B3 D0 AF 52 B4 4D 23 94 25 3B 7A>)
$$ ##END=
$$ 
$$ hash MD5
$$ C3 EB F8 98 6D EF F0 92 E0 AB 48 F2 9D 35 E6 54
##$RELAX= 
##$RELAX= 
##$RELAX= 
##$RELAX= 
##$RELAX= 
##$RELAX= 
$$ Bruker specific parameters
$$ --------------------------
##$DU= <F:/spectra>
##$EXPNO= 1
##$NAME= <H-F>
##$PROCNO= 1
##$TYPE= <nmr>
##$USER= <she>
##$AMP= (0..31)
100 100 100 100 100 100 100 100 100 100 100 100 100 100 100 100 100 100 
100 100 100 100 100 100 100 100 100 100 100 100 100 100 
##$AQSEQ= 0
##$AQ_mod= 1
##$AUNM= <au_zg>
##$AUTOPOS= <>
##$BF1= 200.13
##$BF2= 200.13
##$BF3= 200.13
##$BF4= 200.13
##$BF5= 200.13
##$BF6= 200.13
##$BF7= 200.13
##$BF8= 200.13
##$BYTORDA= 1
##$CFDGTYP= 0
##$CFRGTYP= 5
##$CHEMSTR= <none>
##$CNST= (0..31)
1 1 145 1 1 1 1 1 1 1 1 1 1 1 1 1 1 1 1 1 1 1 1 1 1 1 1 1 1 1 1 1 
##$CPDPRG= <>
##$CPDPRG1= <>
##$CPDPRG2= <>
##$CPDPRG3= <>
##$CPDPRG4= <mlev>
##$CPDPRG5= <mlev>
##$CPDPRG6= <mlev>
##$CPDPRG7= <mlev>
##$CPDPRG8= <mlev>
##$CPDPRGB= <>
##$CPDPRGT= <>
##$D= (0..31)
0 1.2 0 0 0 0 0 0 0 0.06 0 0.03 0 0 0 0 0.0002 0 0 0 0 0 0 0 0 0 0 0 0 
0 0 0 
##$DATE= 1716975580
##$DBL= (0..7)
120 120 120 120 120 120 120 120 
##$DBP= (0..7)
150 150 150 150 150 150 150 150 
##$DBP07= 0
##$DBPNAM0= <>
##$DBPNAM1= <>
##$DBPNAM2= <>
##$DBPNAM3= <>
##$DBPNAM4= <>
$$ [...]
##$SUBNAM3= <"">
##$SUBNAM4= <"">
##$SUBNAM5= <"">
##$SUBNAM6= <"">
##$SUBNAM7= <"">
##$SUBNAM8= <"">
##$SUBNAM9= <"">
##$SW= 18.0517689322627
##$SWIBOX= (0..15)
0 0 2 0 0 0 0 0 0 0 0 0 0 0 0 0 
##$SW_h= 3612.71676300578
##$TD= 16384
##$TD0= 1
##$TE= 0
##$TE2= 300
##$TE3= 300
##$TEG= 300
##$TL= (0..7)
0 120 120 120 120 120 120 120 
##$TP= (0..7)
150 150 150 150 150 150 150 150 
##$TP07= 0
##$TPNAME0= <>
##$TPNAME1= <>
##$TPNAME2= <>
##$TPNAME3= <>
##$TPNAME4= <>
##$TPNAME5= <>
##$TPNAME6= <>
##$TPNAME7= <>
##$TPOAL= (0..7)
0.5 0.5 0.5 0.5 0.5 0.5 0.5 0.5 
##$TPOFFS= (0..7)
0 0 0 0 0 0 0 0 
##$TUNHIN= 0
##$TUNHOUT= 0
##$TUNXOUT= 0
##$USERA1= <user>
##$USERA2= <user>
##$USERA3= <user>
##$USERA4= <user>
##$USERA5= <user>
##$V9= 5
##$VALIST= <valist>
##$VCLIST= <CCCCCCCCCCCCCCC>
##$VD= 0
##$VDLIST= <DDDDDDDDDDDDDDD>
##$VPLIST= <PPPPPPPPPPPPPPP>
##$VTLIST= <TTTTTTTTTTTTTTT>
##$WBST= 1024
##$WBSW= 4
##$XGAIN= (0..3)
0 0 0 0 
##$XL= 0
##$YL= 0
##$YMAX_a= 365499
##$YMIN_a= -385966
##$ZGOPTNS= <>
##$ZL1= 120
##$ZL2= 120
##$ZL3= 120
##$ZL4= 120
##$ABSF1= 15.80863
##$ABSF2= -2.243261
##$ABSG= 5
##$ABSL= 3
##$ALPHA= 0
##$AQORDER= 0
##$ASSFAC= 0
##$ASSFACI= 0
##$ASSFACX= 0
##$ASSWID= 0
##$AUNMP= <proc_1d>
##$AZFE= 0.1
##$AZFW= 0.1
##$BCFW= 0
##$BC_mod= 2
##$BYTORDP= 0
##$COROFFS= 0
##$CY= -3
##$DATMOD= 1
##$DC= 0
##$DFILT= <>
##$DTYPP= 0
##$F1P= 0
##$F2P= 0
##$FCOR= 1
##$FTSIZE= 16384
##$FT_mod= 6
##$GAMMA= 0
##$GB= 0
##$INTBC= 1
##$INTSCL= 3.70164e-10
##$ISEN= 128
##$LB= 0.24
##$LEV0= 0
##$LPBIN= 0
##$MAXI= 10000
##$MC2= 0
##$MEAN= 0
##$ME_mod= 0
##$MI= 1.114404
##$NCOEF= 0
##$NC_proc= -6
##$NLEV= 6
##$NOISF1= 3.799351
##$NOISF2= 2.8
##$NSP= 0
##$NTH_PI= 0
##$NZP= 0
##$OFFSET= 15.80312
##$PC= 1
##$PHC0= -25467.75
##$PHC1= 10.38748
##$PH_mod= 1
##$PKNL= yes
##$PPARMOD= 0
##$PSCAL= 0
##$PSIGN= 0
##$REVERSE= no
##$SF= 200.129543688332
##$SI= 16384
##$SIGF1= 3
##$SIGF2= 2
##$SINO= 5.538805
##$SIOLD= 16384
##$SREGLST= <1H.CDCl3>
##$SSB= 0
##$STSI= 16384
##$STSR= 0
##$SW_p= 3612.71676300577
##$SYMM= 0
##$S_DEV= 0
##$TDeff= 16384
##$TDoff= 0
##$TI= <>
##$TILT= no
##$TM1= 0
##$TM2= 0
##$TOPLEV= 0
##$USERP1= <user>
##$USERP2= <user>
##$USERP3= <user>
##$USERP4= <user>
##$USERP5= <user>
##$WDW= 1
##$XDIM= 16384
##$YMAX_p= 313379353
##$YMIN_p= -283143
$$ End of Bruker specific parameters
$$ ---------------------------------
##NTUPLES= NMR SPECTRUM
##VAR_NAME=  FREQUENCY,     SPECTRUM/REAL,   SPECTRUM/IMAG
##SYMBOL=    X,             R,               I
##VAR_TYPE=  INDEPENDENT,   DEPENDENT,       DEPENDENT
##VAR_FORM=  AFFN,          ASDF,            ASDF
##VAR_DIM=   16384,         16384,           16384
##UNITS=     HZ,            ARBITRARY UNITS, ARBITRARY UNITS
##FACTOR=    0.220516191357247, 1,           1
##FIRST=     3162.6711262926, 0,             0
##LAST=      -450.045636713171, 0,           0
##MIN=       -450.045636713171, -283143,     0
##MAX=       3162.6711262926, 313379353,     0
$$ Real data points
##PAGE= N=1
##DATA TABLE= (X++(R..R)), XYDATA
$$ [...]
6732i895q107j619N400O779K6065p56k1669k4445k3274k6205K4765j2029m663
6719f9653J8622k5805M2116K9210k5529k9998J8135J4395j1366J6605q478J5242
6707a6504j4960L37N145n6137L1565L6428l9075L8789p281k5369j9797q625J3088
6694f2396O779J0065j4072J0280k5695O199K8177l139k2903N400Q198K7251O81
6681b5175k1668k8929L1997L544k0989j6024J4422K038j6519K1477J1079k7106
6669g1853L8891J6400j6690R193k7087p66P759J3281M2486l1056O64m763p00J5489
6655h752J5175K190k3004p928J7690j0421j0944p979m1256K4758M6117J746m7917
6642e0525J0806j526l4750L1358N7163k1005j6754k4450q05P988l8749K2486L439
$$ y = [-9895, -18002, -19621, -14221, -7442, 18623, 17867, -3802, -28247, -51521, -77726, -52961, -64990, -69653, -51031, -76836, -34720, -5510, -31039, -61037, -42902, -28507, -39873, -23268, -31746, -16504, -31464, -31127, -25982, -82119, -50554, -14126, -53201, -14412, -21693, -47062, -66859, -75484, -62396, -55617, -45552, -59624, -49344, -75039, -68840, -40663, -43802, -66705, -61305, -53107, -25856, -25175, -46843, -75772, -43775, -40231, -61220, -77244, -62822, -60784, -77303, -55826, -44747, -71853, -32962, -16562, -33252, -24059, -51146, -51912, -44153, -30872, 11614, -19442, -18778, -23541, -24241, -8752, 6423, 8613, -14391, -22319, -4629, -15050, -25994, -33973, -75229, -50471, -4354, -2608, -50525, -39719, -41245, -75995, -44637, 12526, -8479, -25233, -49683, -50488, -42500, -81249, -58763, -55324]
6629e5324k4456N142L2416L3463J881k7367l9523m4986N3390N4120o764r717j1150
6616c8875q801K558K2325j5034r181K5296j12k3540L385L475q708J1441J5104
6603b0667j5661J5245o803K0529J4978m0298K8969j8622l373p359j0248K731J8111
6590b2468j6815k5572j135l534M1175j6101k619l5774J6815J6087K264P700J3003
6577b6974l9623P206l7338l5510L9688J5456L957K3852j1864K1104K3418j4399
6565c1027k8759l2116M5152q274j0432l9763J7999j0125J4725N2367r80p532R678
6552b9087k7143j8144R292K5798j9480j667L6601K1677l932m4405O454j33M409
6539c9760P707J3425J7471j5070l6005K6308J706M903L348p931J9616J711k1311
$$ y = [-55324, -79780, -74638, -42222, -8759, -6878, -34245, -73768, -118754, -65364, -11244, -18008, -27725, -38875, -47676, -45118, -22793, -37827, -47008, -21712, -21824, -45364, -41979, -38504, -47212, -35771, -20667, -36328, -21083, -27886, -7357, 7621, -32677, -3708, -22330, -25703, -33062, -43310, -40579, -22468, -39283, -64855, -65990, -69524, -28349, -44450, -47069, -82843, -66028, -49941, -47677, -39977, -26974, -66597, -59391, -96729, -132239, -92551, -77095, -73138, -49286, -61150, -40046, -16628, -31027, -59786, -91902, -46750, -55024, -65456, -105219, -87220, -97345, -82620, -30253, -31233, -38765, -29087, -56230, -74374, -65082, -39284, -58764, -60431, -23830, -2153, -6085, -50490, -44036, -44169, -39760, -32053, -18628, -1157, -16227, -52232, -25924, -24218, -19315, -15967, -23898, -4282, -2571, -23882]
6526b3882k688J2636L426M557P88j5568p920K6151J8842p241o8873j9746K6352
6513e3166L2407k3178L648O926J9416J3560N9j9753k3082J0937p157J4225j264
6500b6422l7904k1796K1616J9180L5578L515j2637J3265J1124k2034K0101r54
6488B632k9758k5271N2726m691k9006j6251j7606J4781J0942L3968L932o53L9137
6475C4882k9981m0743j3338j5768L3854k0311J0794J7233Q241j0942j2517J8203
6463b0393r512J3826m3886q367K5499m899L1843r8J6124j8172l4688J3680K0431
6450a8612p50M879l2750J4969J6215j9155L245o930l2159j7517M4783J2034K710
6437b9038q31L5066p531R41K2557k0672J98O055K665J0782k0337J6086J7583l6752
$$ y = [-23882, -26570, -13934, -10508, -5951, -5163, -20731, -28651, -2500, 16342, 9101, -59772, -79518, -53166, -20759, -43937, -40289, -33363, -13947, -387, -328, -20081, -43163, -32226, -39383, -25158, -26422, -64326, -86122, -64506, -45326, -9748, -6233, -18870, -5605, 5519, -16515, 3586, 2632, -27126, -52397, 329, -4362, -33368, -49619, -67225, -52444, -41502, -7534, -3602, -4255, 34882, 4901, -35842, -49180, -64948, -31094, -51405, -40611, -23378, -15137, -26079, -38596, -20393, -29905, -16079, -59965, -68332, -42833, -47732, -15889, -15987, 137, -18035, -52723, -39043, -18612, -19362, -14483, -47233, -32264, -16049, -35204, -31959, -38889, -71048, -88565, -43782, -31748, -29038, -29869, 5197, -2334, -1393, 21164, 492, 690, 6745, 9410, 20192, -145, 15941, 33524, -3228]
6423c228K5132J1534k810l3253J3758L665J2970K2225J4378l0421m658k929j6606
6410I757J1061k0323J8260j0158L0261o652M573k7711r412L7659K860l475k5076
6397A1624M2846Q920j0867o031j8219K0742M4583k6838l8057r472m2280J3616
6385i433L1449q5K5189l5143K2744k0106j3170K4882j7741j6925J4748K0823j102
6372B6130q247o452J3836j7032k5655Q62L6194j663K9460O524q638l3309K1804
6359C3814j9399J786j5837n292M7225n583kk7154m000K4448P255Q163J5811J455
6345F2690j1770q706L307l0215R832K0503m122K3103k8364j6916K3917J3933k784
6332E4408k1926K5726n634r317k0811N276N4758l3692j6023J2711j6590k3905
$$ y = [-3228, 21904, 33438, 30628, -2625, 11133, 14798, 27768, 49993, 64371, 33950, 29292, 26363, 9757, 20818, 495, 18755, 8597, 38858, 32206, 36779, 9068, -344, 37315, 40175, 36700, 11624, 54470, 63390, 52523, 46492, 28273, 49015, 93598, 66760, 28703, 19231, -23049, -9433, 22016, 21931, 47120, 11977, 34721, 14615, 1445, 26327, 8586, -8339, 6409, 27232, 26130, 17883, 11431, 25267, 8235, -17420, -16558, 19636, 17973, 47433, 53957, 45319, 12010, 33814, 14415, 16201, 364, -4928, 42297, 36714, 36712, 9558, 5558, 30006, 37261, 45424, 61235, 62690, 50920, 42214, 45521, 15306, 25138, 45641, 41519, 64622, 36258, 19342, 43259, 57192, 54408, 32482, 58208, 52574, 43257, 22446, 27722, 82480, 48788, 32765, 45476, 28886, 4981]
6320D981L7888o940k7119k9758k0118M7250J4238r163P541K0804j5263l951K6538
6307D6928l2118K2402L7076j3616l3410K449N3968J4801k7401n805J0606j4349
6295F1531k4952k1735L8676L5389J1696j2788k4964m1786M793Q439j7621J8187
6283C4865K757J8402J9207j7647k5040o665N1145r362j8672j9633m5150k4116
6271c9909K6266K0944j8041L2763k2293j0888j7020k9170O106M792K7107O034
6259a3309M456j6192M4751J1019r857j4550j1537l2559k6454Q837L5780j6483
6247c6098l5057Q326N2233L866n5166N516k1370K8760n31k420p162L6524L993
6234a8586l409k170j5575J6262k101J1803p468k2264j8225K5746p713j932P656
$$ y = [4981, 42869, 35929, 8810, -20948, -41066, 6184, 20422, 11259, 18800, 39604, 24341, 20390, 46928, 14810, 37212, 74288, 60672, 27262, 29711, 83679, 98480, 71079, 65274, 75880, 61531, 36579, 14844, 53520, 88909, 100605, 87817, 62853, 21067, 25860, 34299, 16678, 34865, 37622, 56024, 75231, 57584, 32544, 25879, 77024, 67662, 48990, 29357, -15793, -39909, -13643, 7301, -10740, 22023, -270, -11158, -28178, -57348, -51242, -46450, -19343, -13309, -8853, -25045, 19706, 30725, 20868, 6318, -5219, -37778, -64232, -55395, -19615, -36098, -71155, -62829, -10596, -6730, -61896, -56380, -77750, -48990, -49521, -51941, -59103, -22579, -18586, -21995, -24165, -39740, -23478, -25579, -13776, -21244, -43508, -61733, -35987, -43700, -45632, -37976]
6221c7976r945K2071J0865l5142j6824r134J7481K494n99L3807l2711J6752K03
6208c8658j1526k853N852K3744J0296m3007L103K5369j5165J8111j085J7830k613
6195a0602j9726j7487L8496j3101j3566J4226l2710J6006P824j5946p315J3219
6183d0682J3326q887M763K2198j7062l80J8988J2078j277O315k3986m1222J586
6170e4242J8308j1939K5700J0679k4128j7106L0819P814j5948L224j4462l415
6158d4696P951M4705j5098j644J472q585k9289k0081L7474L7257l1756P519J0980
6145c791j2426J0481o874p021K988K3343k0208j3382j0438k97N3608l5002l0437
6132d9456K0150p963m1968L0445L1548k3920K4370o610j2767K5079n073l543L756
$$ y = [-37976, -47921, -25850, -14985, -50127, -66951, -76085, -58604, -56110, -56709, -22902, -55613, -38861, -38658, -50184, -53037, -47185, -23441, -13145, -56152, -53049, -27680, -42845, -24734, -25819, -7989, -10602, -30328, -47815, -9319, -22420, -35986, -21760, -54470, -38464, -30640, -46586, -53901, -40682, -27356, -36243, -31480, -9282, -26344, -26724, -7736, 4342, 3065, 9380, -14606, -55828, -54242, -35934, -47873, -22173, -11494, -35622, -52728, -21909, -14095, -30043, -26819, -41281, -44696, -36745, 7960, -7138, -8782, -7310, -15895, -45184, -65265, -27791, 9466, -22290, -14771, -3791, -16217, -5736, -12610, -19631, -16643, 6700, -13508, -26890, -37328, -37625, 15983, -19019, -49456, -29306, -37269, -79237, -48792, -17244, -41164, -16794, -23404, -36171, -11092, -16165, -19708, -15952]
6119a5952j4409J8567l256Q244j5857J5876j1255n777K4160o195j4193P673k017
6106a4391j0247r250J0045Q206L739q315m198j3450j27J4372R830K8245k9483
6093a5024j2553M0615j1684o506k562j8961j0576j1965M3595n649q095o180J5542
6080a0003L0322J9201l6370L4572q619k9139l162j0452K0724K24M0266k849j3151
6067C1564q557R1Q346k0254q90J0774K1327J2105J9486j7430N021j0112k3199
6054B8272M5498N786L097j5157L7603J0666K2018M4218l791K1281j8062j9837
6042A61592q744j2759J2337o5870l153O416q125M309j1419n563p394M436q39Q115
6028G3339l0237j0206K2668L346j9614r934O703j1992l3263K6504n026k3413R128
$$ y = [-15952, -30361, -11794, -15050, -6806, -22663, -6787, -18042, -23819, 341, -5854, -20047, -12374, -14391, -24638, -33888, -23843, -15637, -11898, -20213, -24411, -37861, -37988, -23616, -13786, 14459, -15024, -27577, 13038, 1354, -5152, -7714, -26675, -37251, -49216, -5621, -11270, -19365, -25545, -10003, 20319, 39520, 3150, 37722, 29103, -36, -3198, -13650, 7074, 7298, 47564, 44715, 31564, 23007, 23098, 31444, 11190, 10300, 21074, 42401, 54506, 73992, 56562, 61583, 51471, 28272, 73770, 79556, 82653, 67496, 105099, 115765, 137783, 182001, 178210, 199491, 181429, 161592, 152848, 140089, 152426, 86556, 83403, 89819, 81694, 86003, 74584, 69021, 61627, 66063, 65224, 73339, 43102, 32896, 55564, 58910, 39296, 29362, 36065, 24073, -9190, 17314, 12288, -11125, -1997]
6015a997P304L40N61j9359P871k735L8031j7453j0470K1006K1651j8119r46K4464
6001E0149l445L56j0522j175j4355K3287J7995l827J4140J8784n0994k2072K9497
5988D7818J019k8469j1198j1989M7175J8832m7179j3748J3069J997K8497j4830
5976C0994j5052J4336j530k2157p321K6998J7451J2989K7179k0976j5781j1444
5964C5686J2624k5574J121o553K0812J850m807K934J5103L3201l5290l1385j7310
5951B412J8503L2667l376m5065K4352L3621o234n407M3876k0669j002J2878L3019
5938A19575P141m8281j867L9140j1771l5908j7116J871N0358J0296j5936J2970
5926A10472N766K7573L615P322o215l3054K0063j5574J8040o195k7660K1430J6502
$$ y = [-1997, 5307, 5647, 6208, -13151, -5280, -8015, 30016, 12563, 2093, 23099, 44750, 26631, 25685, 50149, 46704, 47060, 36538, 35363, 21008, 44295, 62290, 58463, 72603, 91387, 40393, 18321, 47818, 48837, 20368, 9170, -2819, 44356, 63188, 16009, 2261, 15330, 17327, 45824, 30994, 15942, 30278, 28748, 6591, -730, 26268, 43719, 56708, 83887, 62911, 47130, 35686, 48310, 22736, 23857, 17304, 38116, 39966, 35159, 38093, 53196, 86397, 51107, 19722, 2412, 20915, 53582, 50206, 5141, 29493, 63114, 56880, 51473, 95349, 74680, 73678, 86556, 119575, 126716, 78435, 76568, 115708, 103937, 68029, 50913, 52784, 103142, 113438, 97502, 110472, 116238, 143811, 147426, 154748, 148533, 115479, 135542, 119968, 138008, 131813, 104153, 125583, 142085]
5913A42085K1308J7579r89n519K1444k4700r746J6m468J9664p044p521K4276L2908
5899B19293N216j7003k5646L3635k44K704q056J4413J0848k650j2055l60M2474
5886B62569j509M6863k2408l7301l015r73J8724P3491J3989k3024j6950K8317
5874C38773q221K9228M923p1724M330N2390J5396K5399J7292l9003J3799K9192
5862D11774L6768M3141M4159K6174K2991M4129M8213M3548J03730P1155J31912
5851A027694J11143J25156K30855J87030O0002L2098Q001k6138o7347j37980j50642
5840A399872k14374k29698r8765q3917r5048l4831j7025J1908k7710p7910l5687
5829D96815L5495P87j8594L3419K662j7166j2754J1109K0949j680P414l8864k2645
$$ y = [142085, 163393, 180972, 179983, 174464, 195908, 171208, 161462, 161478, 157010, 176674, 169630, 162109, 186385, 219293, 224509, 207506, 181860, 215495, 215251, 217955, 209899, 224312, 235160, 232510, 220455, 220095, 262569, 261060, 307923, 285515, 248214, 245199, 244226, 262950, 336441, 350430, 327406, 310456, 338773, 330552, 359780, 364703, 292979, 297309, 349699, 365095, 390494, 407786, 368783, 382582, 411774, 448542, 491683, 535842, 562016, 585007, 629136, 677349, 720897, 824627, 895782, 1027694, 1138837, 1263993, 1494848, 1681878, 1741880, 1773978, 1781979, 1755841, 1688494, 1550514, 1399872, 1185498, 955800, 857035, 773118, 678070, 643239, 626214, 638122, 610412, 532502, 496815, 532310, 533097, 514503, 547922, 550584, 533418, 520664, 531773, 552722, 551042, 558456, 519592, 496947]
5816D96947n3635l8869L0658l844j2241l9603l4207q605k0560l8230l4379J9613
5804B63045j7057n428j7883m1613n26J102k1276J6636P675m4478k067J3347L1254
5791A82731j7198l0360j178j3126J0469L706k176L0046k6855M767N0493j6368
5779A74951q2449l3503O5731M8897j1294n1558K3836L4504k9302K1502j3095j571
5767A46649o862K645P726r222j7689r506J1701n425M8352l2024J0752k6814J8727
5754A39010J2383k3611J8683P51J1201J5825n7848j239j6178K4993M6761j4093
5742A56638R214J2337L1767l5617J0610J1382O0627J5853j4699k5212L457j8029
5730B18328o3K898j681l579J0398N447J553l766p412L8306l2258R908k150j9885
$$ y = [496947, 443312, 404443, 435101, 431257, 419016, 379413, 345206, 336601, 316041, 277811, 243432, 263045, 245988, 240560, 222677, 181064, 180538, 181640, 160364, 177000, 184675, 140197, 138130, 151477, 182731, 165533, 135173, 133995, 120869, 131338, 135044, 132868, 162914, 136059, 140826, 191319, 174951, 92502, 58999, 124730, 173627, 162333, 110775, 134611, 169115, 139813, 161315, 148220, 146649, 139787, 142432, 150158, 140936, 123247, 113741, 125442, 120017, 168369, 136345, 147097, 120283, 139010, 151393, 127782, 146465, 147216, 158417, 174242, 116394, 115155, 98977, 123970, 170731, 156638, 165852, 178189, 209956, 174339, 184949, 196331, 256958, 272811, 258112, 232900, 236357, 218328, 218265, 221163, 219482, 215903, 226301, 231748, 233301, 229535, 222123, 260429, 228171, 238079, 235929, 216044]
5716B16044L8566N907J3199K2076j9231J4692O4327M2238O1563O906L9312K4539
5704E30138k1264L6178J3838k2813M5252J0497k2268K6339k7125k6836J5135K8411
5692E85482j0866Q947O282j775m863k6448J4432J2292Q326J6784j4289j4277K829
5679E82856L0400J3635J4582n7524n6292k5607l3798l5823k6360J1357j6403l2753
5667C68270l4803J9095k1512m858J3266l1745J1877m339L4484k9280O450L6712
5655C63617K1081Q616k490K0718M5622L6249k3514k4405K342k9615l6537j5622
5643C66062K7949K2815n8184r23j6k5558q631r878j4550k3223J6649N0325P183
5630C50020l4360L390K0568k1768O464J7361K6575o871k639M540j924J3440O199
$$ y = [216044, 254610, 260517, 273716, 295792, 276561, 291253, 355580, 397818, 459381, 466287, 505599, 530138, 508874, 545052, 558890, 536077, 581329, 591826, 569558, 595897, 568772, 541936, 557071, 585482, 574616, 583563, 589845, 588070, 583207, 556759, 571191, 583483, 591809, 608593, 594304, 580027, 582856, 613256, 626891, 641473, 583949, 527657, 502050, 468252, 432429, 406069, 417426, 401023, 368270, 333467, 352562, 331050, 326192, 339458, 307713, 319590, 315251, 349735, 320455, 326905, 363617, 384698, 393314, 390824, 411542, 457164, 493413, 469899, 445494, 447836, 418221, 381684, 366062, 394011, 416826, 358642, 357719, 357703, 332145, 323514, 313636, 299086, 275863, 292512, 342837, 350020, 315660, 319050, 339618, 317850, 324314, 341675, 368250, 361379, 358740, 363280, 361356, 374796, 380995]
5617C80995J0277k1938R06l5312m1164m23K3380K6272K539m0224K9438N5357k6931
5604C63172J8029k2786J2021O0157P284J701k4377q066K7265j7877j7838J7236
5592D15921J0915j0490J5508J9133J7886J7164Q575k0128L2989O228K7250K7119
5580E68070J2888L9350J8792K7405L1563O4820M2927N2155O4794M2341m80o1483
5568I03142m9558j8151l0782r986K7125J5835j0334J1298M8421L9964j1516o1176
5556H54282q6788m5762m0635l1577l1763l7572J0767K594j1564L2038n908R137
5544F17249j3942K5708O140j4070k4083J3533L306k430J5080K6293M455l3445
5532F23794K9182K2786n4347K8549P0326J3168K9540k9054j7146K04N519K2124
$$ y = [380995, 391272, 369334, 370240, 334928, 293764, 293341, 316721, 342993, 345532, 305308, 334746, 390103, 363172, 381201, 358415, 370436, 430593, 437877, 439578, 415201, 407135, 434400, 416523, 398685, 415921, 426836, 416346, 431854, 450987, 468873, 486037, 494612, 474484, 507473, 513701, 540951, 568070, 580958, 620308, 639100, 666505, 698068, 762888, 805815, 857970, 922764, 965105, 964625, 903142, 853584, 835433, 804651, 794665, 821790, 837625, 827291, 838589, 887010, 926974, 915458, 854282, 767494, 721732, 681097, 649520, 617757, 580185, 590952, 593546, 581982, 614020, 608112, 617249, 603307, 629015, 635155, 621085, 597002, 610535, 613841, 611411, 626491, 652784, 657239, 623794, 652976, 675762, 621415, 649964, 720290, 733458, 762998, 733944, 716798, 717002, 722521, 744645]
5520G44645K0286q623K8909n332k8376R163M7211J9412R688M108O40M5233M6784
5507I33748k6680L975J3136K1555j4896j0109K0061K5622K4884L2598K29J4921
5495A039044J5264M250L2498m837K9328K5985M4895K4119M486J8726L1523L9313
5483A304594K3242K3841L8796M2061J3777O483M0259N2439L6770K3397M3738L2620
5471A682017P2760P3887K4856N5183L1920L3209L9437O6029J20552O4320Q0676
5460B344846Q9680P2632J24720R5328O7849Q7489J31581R5396J13160J33114R5814
5449C451609R0373N0135J01401J04956J13552J35555Q9661Q5058J42053J44421
5439D508774J10936R4301Q9395J09358J16574J32336J98262J57251J51936J85137
$$ y = [744645, 764931, 756308, 785217, 779885, 751509, 760672, 807883, 827295, 836983, 841091, 841731, 886964, 933748, 907068, 911043, 924179, 945734, 930838, 920729, 940790, 966412, 991296, 1023894, 1024123, 1039044, 1054308, 1058558, 1091056, 1086219, 1115547, 1141532, 1186427, 1210546, 1215032, 1233758, 1265281, 1304594, 1327836, 1351677, 1390473, 1432534, 1446311, 1452794, 1493053, 1545492, 1582262, 1605659, 1649397, 1682017, 1754777, 1828664, 1853520, 1908703, 1940623, 1973832, 2013269, 2079298, 2199850, 2264170, 2344846, 2434526, 2507158, 2631878, 2727206, 2795055, 2882544, 3014125, 3109521, 3222681, 3355795, 3451609, 3541982, 3592117, 3693518, 3798474, 3912026, 4047581, 4137242, 4222300, 4364353, 4508774, 4619710, 4714011, 4803406, 4912764, 5029338, 5161674, 5359936, 5517187, 5669123, 5854260]
5429E854260J41967J99013K06723K13894J66123K01736K11902J87467J88485K72188
5419G843758K42715K28059K97723K95938K98965K69224L19386L28201L63361L78887
5409A0866217M18252M30977M37293N02607N80715N65152O03907O94308P67689
5400A5867117Q39804R79842J085651J229607J354172J605193J835695K091157
5392B6888238K401543K708679L094367L559821M099750M736403N316901N888159
5384E8693861O355560O217161M797934K138371n01360k386095k952060k365057
5376F9998315j115128K83418J466448J945595J400275m32117l335529n794266
5368F4417011p048369p097715o429749n561141m684871l930859l252547k724340
$$ y = [5854260, 5996227, 6195240, 6401963, 6615857, 6781980, 6983716, 7195618, 7383085, 7571570, 7843758, 8086473, 8314532, 8612255, 8908193, 9207158, 9476382, 9795768, 10123969, 10487330, 10866217, 11284469, 11715446, 12152739, 12655346, 13236061, 13801213, 14405120, 15099428, 15867117, 16706921, 17686763, 18772414, 20002021, 21356193, 22961386, 24797081, 26888238, 29289781, 31998460, 35092827, 38652648, 42752398, 47488801, 52805702, 58693861, 65049421, 71266582, 76064516, 78202887, 77701527, 75315432, 72363372, 69998315, 68883187, 69166605, 70633053, 72578648, 73978923, 73546806, 70211277, 64417011, 57368642, 50270927, 43841178, 38280037, 33595166, 29664307, 26411760, 23687420]
5360B3687420k269934j965773j611465j377496j199309j053378r50919q28172
5352A2430974p65339p00046o72743n87907n09645m90131m82954l86134l56740
5343G479335l47239l11335k90438k58866k52123k02820k44837j98704j66782j70972
5333E035219j08358j36999j64067j32436j63915j31084q3742j39347q3861j10469
5323C780941j16573q8065q4362j04263q7731j05598j09211l8315m8776p0618o4172
5312B863257r7292j08059o2301o2692n7868m1121l6055q7366l6720k9211q8024
5301B156548l3689m0205m2560m9099k1929J1338m5737o3461m8652p996k6934m3219
5289A744405M014j1688j1754l8402l575n5530J860K1590k0408k5243j4079k4059
$$ y = [23687420, 21417486, 19451713, 17840248, 16462752, 15263443, 14210065, 13259146, 12430974, 11665635, 10965589, 10292846, 9704939, 9195294, 8705163, 8222209, 7836075, 7479335, 7132096, 6820761, 6530323, 6271457, 6019334, 5816514, 5571677, 5372973, 5206191, 5035219, 4926861, 4789862, 4625795, 4493359, 4329444, 4198360, 4114618, 3975271, 3891410, 3780941, 3664368, 3576303, 3491941, 3387678, 3299947, 3194349, 3085138, 3046823, 2998047, 2927429, 2863257, 2765965, 2657906, 2595605, 2532913, 2475045, 2433924, 2397869, 2310503, 2273783, 2244572, 2156548, 2122859, 2082654, 2040094, 1990995, 1969066, 1980404, 1934667, 1871206, 1822554, 1814558, 1787624, 1744405, 1748419, 1736731, 1724977, 1686575, 1683000, 1627470, 1629330, 1650920, 1630512, 1605269, 1591190, 1567131]
5277A567131k2291K735k059M095L776k7907k9022K9332M7786l3409m0832N3127
5265A552462j9325J7064r332J3174j5554M5679L7433J5091K6420J2874o470j033
5253A668483L0451N5274M6350K8934M5728R144J0139K5555J3557J9085m2229l5316
5241A875155l0964l2525k562k6847k2674m1971o3154j7914m110k2244k8028K4920
5229A607082M9547Q108K5612N2600K3593M0066L345N7454O4827P0313J05702J16619
5217B224868J12570M6110K7174L6539M0219J0860q155q49M2855M1562M8475L8226
5205B660454O5612L2353J3778k3018m5115k2417o228k7447J6973P386N3004K54
5193B725589Q9920J23083M9715N9252R8863Q1512J23143J20152J87243J75998
$$ y = [1567131, 1544840, 1547575, 1545516, 1549611, 1553387, 1525480, 1496458, 1525790, 1573576, 1540167, 1499335, 1552462, 1533137, 1550201, 1540869, 1554043, 1538489, 1584168, 1621601, 1636692, 1663112, 1675986, 1669516, 1668483, 1698934, 1754208, 1800558, 1829492, 1875220, 1884364, 1894503, 1920058, 1933615, 1952700, 1910471, 1875155, 1844191, 1811666, 1809104, 1782257, 1759583, 1717612, 1654458, 1636544, 1632434, 1610190, 1582162, 1607082, 1656629, 1664737, 1690349, 1742949, 1766542, 1806608, 1809953, 1867407, 1932234, 2002547, 2108249, 2224868, 2337438, 2383548, 2410722, 2447261, 2487480, 2498340, 2490185, 2489336, 2532191, 2573753, 2622228, 2660454, 2726066, 2758419, 2772197, 2749179, 2704064, 2681647, 2675419, 2647972, 2664945, 2672331, 2725335, 2725589, 2815509, 2938592, 2988307, 3047559, 3146422, 3227934, 3351077, 3471229, 3658472, 3834470]
5183C834470J15703J78564J30610J24158J39996Q1573P4526N8049j2634K846n6443
5172D671418j4199m9017k0074L4235J8112M844N4207Q8272J16429J64013J38384
5161E206624K08328K08504K21579K89446L38725L28586M19380N56901O54407O90987
5151I123467P66792Q99738R87727J130723J373254J566199J894273K417419K863858
5142B3023450K697888J229472o19141j803282k004124j465889p73258j28994M00328
5133B0556450R22139J556200J841139Q67143j058855k601000l208318k929886
5125A5945012k362082j803178j413147j192846r52646q20524o92681n84311m94405
5116E629192m22574l41640l02446k80976k51441j68890j72388j76837j60372k09527
$$ y = [3834470, 3950173, 4128737, 4259347, 4383505, 4523501, 4605074, 4679600, 4737649, 4725015, 4727861, 4671418, 4657219, 4608202, 4588128, 4622363, 4640475, 4645319, 4699526, 4787798, 4904227, 5068240, 5206624, 5414952, 5623456, 5845035, 6134481, 6473206, 6801792, 7221172, 7778073, 8432480, 9123467, 9890259, 10789997, 11777724, 12908447, 14281701, 15847900, 17742173, 20159592, 23023450, 25721338, 26950810, 26331669, 24528387, 22524263, 21058374, 20285116, 20156122, 20556450, 21478589, 23034789, 24875928, 25743071, 24684216, 22083216, 18874898, 15945012, 13582930, 11779752, 10366605, 9173759, 8221113, 7400589, 6707908, 6123597, 5629192, 5206618, 4864978, 4562532, 4281556, 4030115, 3861225, 3688837, 3512000, 3351628, 3142101]
5106C142101j81148r1575j47388j05916q5793j30453j22195j10968n4868j13673
5096A998124p0924k5156o3747m9462m2107n5624l7850m006m2199m2518k6414o3163
5084A474954p215m8760k0668m5419j3835j8744m8244j3413k5061k6995K3863J5524
5072A245987r097J4411n1980J5547o6l3245J0599Q271j8934l3009k3857l577K3894
5059A144944k9081j3228k2441k1387P556k4806j2136k1314o9190l3356k9458j1758
5047H64345o0489k0342k7256k0948o1429p27k8613l5317K179l1224o376k8545
5035E45258j8932p669k1946K1691J2276J5943l6079k2284k7297m8872J5360j4324
5023D13125k0196j1248J8938r367j8789k837j6400o0518J3708R559m073n1933
$$ y = [3142101, 2960953, 2869378, 2721990, 2616074, 2530281, 2399828, 2277633, 2166665, 2111797, 1998124, 1927200, 1902044, 1838297, 1788835, 1746728, 1691104, 1653254, 1649248, 1607049, 1564531, 1538117, 1474954, 1467739, 1418979, 1398311, 1352892, 1339057, 1320313, 1272069, 1258656, 1233595, 1206600, 1230463, 1245987, 1236890, 1251301, 1199321, 1214868, 1214802, 1181557, 1192156, 1200427, 1181493, 1148484, 1124627, 1121050, 1144944, 1115863, 1102635, 1080194, 1058807, 1066363, 1041557, 1029421, 1008107, 938917, 905561, 876103, 864345, 803856, 783514, 756258, 735310, 673881, 673154, 644541, 609224, 611403, 580179, 573803, 545258, 526326, 518657, 496711, 518402, 530678, 546621, 510542, 488258, 460961, 412089, 427449, 413125, 392929, 381681, 400619, 391252, 372463, 369626, 353226, 292708, 306416, 315975, 311902, 259969]
5011B59969L1652J0043L176l57o827J8908k2727k5624L3523k0685J0887N986m6569
4998B51355r128K676l2410J9549K4481m1198j8663J1468L2645j8202K515J6052
4986B41140L924j7114P437j8965J7472L4678l3203j7525J0269j8479k3764j8239
4974A67631K5168M6665l8914n0R719j3348J914q71J7736m5331J906J2811P961
4961A92997j1244Q393L1641L485j8541J2316j471j0026k476l3579M1664m994m3607
4948A64558m5144N010j0059K9349K9518N000J0111j9158l5503J6496N893M9539
4936B05610m387m4403k2877O260n089J0755k9090p658L6712J6171l4528P021M3417
4923A77914j4270r578q878O25j8796p896K6270j7750m629l010j4602K0523k7975
$$ y = [259969, 291621, 301664, 304840, 304483, 297656, 316564, 293837, 268213, 301736, 281051, 291938, 297924, 251355, 242227, 244903, 212493, 232042, 256523, 215325, 196662, 208130, 240775, 222573, 225088, 241140, 245064, 227950, 235387, 216422, 233894, 268572, 235369, 217844, 228113, 209634, 185870, 167631, 192799, 239464, 200550, 200500, 210219, 196871, 198785, 197914, 215650, 170319, 172225, 185036, 192997, 181753, 190146, 221787, 225272, 206731, 219047, 217576, 207550, 205074, 171495, 213159, 208165, 164558, 119414, 124424, 114365, 143714, 173232, 178232, 188343, 169185, 133682, 150178, 156071, 205610, 201223, 156820, 133943, 140203, 135114, 145869, 116779, 109121, 145833, 162004, 127476, 134497, 177914, 163644, 154066, 145188, 145813, 127017, 119121, 145391, 127641, 123012, 120002, 105400, 125923, 97948]
4910I7948m866L4088L4754j0621j2472K2190p448l4528j0523k3077o88Q371K3235
4897A16363k4253j875K2264N2208j9969l8974K5766j1031k0137K2833L5580l2649
4885A26126k4889M761j0768K4134K0099j5467Q777m1419L0479o208J2963O1558
4873A90146j1714K0602K542Q768j3889K6640K6844l9873m8677k2647j0369K6764
4861A55137m4528l3723j4054K4746J8352L2758r413k3046k0538M0019K9387j3391
4849A41706j7873j6216J4983K0881K422o305K811O082K7290J4297K797k88m578
4836A88009k3472J0777j9392Q659L4783k5396N1235L794l685K6464O789Q496k1656
4823B45405n958k2169l5841K3197M513K9930J0289l259M003R838k9004l8121P345
$$ y = [97948, 93082, 127170, 161924, 151303, 138831, 161021, 153573, 119045, 108522, 85445, 84757, 93128, 116363, 92110, 90235, 112499, 164707, 144738, 105764, 131530, 120499, 100362, 123195, 158775, 126126, 101237, 105998, 95230, 119364, 139463, 123996, 132773, 91354, 121833, 115625, 128588, 190146, 178432, 199034, 201576, 210344, 196455, 223095, 249939, 210066, 161389, 138742, 128373, 155137, 110609, 76886, 62832, 87578, 105930, 138688, 129275, 106229, 85691, 125710, 155097, 141706, 123833, 107617, 122600, 143481, 145903, 139598, 142409, 148491, 175781, 190078, 192875, 192587, 188009, 164537, 175314, 155922, 164581, 199364, 173968, 225203, 228997, 225312, 251776, 258565, 267061, 245405, 239447, 217278, 181437, 204634, 209147, 239077, 249366, 246107, 250110, 259948, 230944, 192823, 200168]
4810B00168J1510n2418J1817K5638j2138n051m9884k3990J3283L9464K6q413j2131
4797A37881M1827r320q933j4352j7405o260J6530J1791k2450K3139K804M423L1125
4784A90800l1138j5211l9301J5749j2331R560K4132J9825k6455J5620J1847j6698
4772A46399R570j9710j1381j9793j1172J8329r640M0296O434J7916j3406j366
4760A52476n131J9881M3166l6154j7842k6807J1729r001j6383R221L9252j8259
4748A46148J1586L5385l1963j1915j4793q256K7928M2361k6522j284j0216o458
4736A52001l2740J091J7383r52K3284k1452q996J2215j0579k307K5496P54L4995
4723A90193k0514J452k5901K8143L8470P480n7995j3898M8003l1962J5583p841
$$ y = [200168, 211678, 159260, 171077, 196715, 184577, 179526, 129642, 105652, 118935, 158399, 158425, 150012, 137881, 179708, 170388, 161455, 147103, 129698, 123438, 139968, 151759, 129309, 152448, 155252, 159675, 190800, 159662, 144451, 105150, 120899, 108568, 118128, 142260, 162085, 135630, 151250, 163097, 146399, 155969, 136259, 124878, 105085, 93913, 112242, 102602, 142898, 149332, 167248, 153842, 152476, 147345, 167226, 210392, 174238, 156396, 129589, 141318, 132317, 115934, 125155, 164407, 146148, 157734, 193119, 161156, 149241, 134448, 126192, 154120, 196481, 169959, 168675, 158459, 152001, 119261, 120352, 137735, 136783, 160067, 138615, 129619, 141834, 131255, 128948, 154444, 155198, 190193, 169679, 171131, 145230, 173373, 211843, 219323, 161328, 147430, 195433, 163471, 179054, 171213]
4711A71213r705M6083J2701l4925q169j648K193k4874J3647P798k0250M9196N628
4698B08888J096k8186J1894L6324j3844K2519j6911J7934M0526l4795m7762l1062
4686A66621j0113K1412Q516K7927o451J3993J7660j9823J7667N310K2877m2601
4674B22995k5863M1403J382J6295l4331k4648J8786j692K7730J0826k9919R504
4662B32468N164n56J317k9908M0351m312Q611J9781J3441K298L875j4133O861
4649B85258Q471k2297J874J0143p859p15J0080m005P12n433R319r132K05J3914
4635B90535l4790m376M3913M355n716n124J1434L6393j7668J8156J0112j3323
4623C33901J7866K2056k1006J3996J3851k5366R938J0281J652k469r674K5614
$$ y = [171213, 161508, 207591, 220292, 185367, 177198, 175550, 177743, 152869, 166516, 174314, 154064, 203260, 208888, 209984, 181798, 193692, 230016, 216172, 238691, 221780, 239714, 280240, 245445, 197683, 166621, 156508, 177920, 186436, 214363, 207912, 221905, 239565, 219742, 237409, 242719, 265596, 222995, 197132, 238535, 239917, 256212, 221881, 197233, 216019, 214327, 242057, 252883, 222964, 232468, 237632, 237076, 238393, 208485, 248836, 244524, 253135, 272916, 286357, 288655, 292530, 278397, 285258, 293729, 271432, 273306, 283449, 275590, 274875, 284955, 280950, 281662, 276229, 285548, 276416, 276621, 290535, 255745, 251369, 295282, 299637, 293921, 288797, 300231, 336624, 318956, 337112, 347224, 333901, 351767, 373823, 352817, 366813, 380664, 355298, 365236, 375517, 377169, 374700, 365026, 390640]
4611C90640J637k3063J6175J9302j9710J7855M6699L0495R22L1442j1452k8820
4599D72122p459j4376k7083l0529J6617J230J7724j8632r998J1576j4578l18j6910
4586C79386l4016k7560K0644K4359j4698j1673j7201l1300j6467J4613R722j6226
4574B79583l255K5693l0735J9104K0007j20p480J1295k5677k1540p317l001K1096
4561B77653o384K4844j5362j0639j3900P804k7286k0444L95K7628L3243k6346
4549B51206j2672J6005K2356J5258p577j994J5361N399j1910j4140N0514k6779
4537C01027J5955j964L0432r84k7110J1323k0486N923J7638j4804N729k103r753
4524C10823J1332j4258K8851J2445j1734L0177k0259K6036L2341j9100k3466p849
$$ y = [390640, 392277, 369214, 385389, 404691, 384981, 402836, 449535, 480030, 480952, 512394, 500942, 472122, 464663, 450287, 423204, 392675, 409292, 410522, 428246, 409614, 399616, 411192, 396614, 396296, 379386, 345370, 317810, 338454, 362813, 348115, 336442, 319241, 287941, 271474, 286087, 295809, 279583, 276328, 302021, 271286, 290390, 310397, 310277, 302797, 314092, 288415, 266875, 259558, 256557, 277653, 271269, 296113, 280751, 270112, 256212, 264016, 236730, 216286, 216681, 244309, 277552, 251206, 238534, 254539, 276895, 292153, 284576, 282582, 297943, 303342, 291432, 277292, 327806, 301027, 316982, 315018, 345450, 344466, 317356, 328679, 308193, 314116, 331754, 316950, 322679, 320576, 310823, 322155, 307897, 336748, 349193, 337459, 367636, 347377, 373413, 405754, 386654, 363188, 355339]
4512C55339K3578N1750j0689p021J2429j0505j0179N550k4936J7835J7548j6445
4500D04254N03K1684p087l1390j428J4683m985J1815p977L1789k4850l7142J9715
4487C89584L979K8197j5554l1897J9347M1050n8648M83l2558j5384m622K0923
4475C44900J6953k475J882j6226o212j9028j0616J1359N966k880K8647M7110q886
4462C90494l382K5464j6539p786j7666m0098j0305K6474M759l3709k7636m548
4450B85522M089J4594J8766n4090K2196J1474j3626K5880K6111j8092n965j2246
4438C04613l283j5748k0977N6146K588n3642K2425L9771J7134k0262p713K9203
4426C50255j7917l1523q895J7350J6613q708j1892M943R501m619Q880n2677L1826
$$ y = [355339, 378917, 430667, 419978, 412957, 425386, 414881, 404702, 410252, 385316, 403151, 420699, 404254, 404757, 426441, 419354, 387964, 386536, 401219, 396234, 408049, 400072, 431861, 407011, 369869, 389584, 393563, 421760, 406206, 374309, 393656, 434706, 376058, 376541, 343983, 328599, 323977, 344900, 361853, 359378, 361260, 345034, 338822, 319794, 309178, 320537, 326503, 323623, 352270, 399380, 390494, 387112, 412576, 396037, 388251, 370585, 330487, 320182, 346656, 351415, 317706, 290070, 285522, 289611, 304205, 322971, 268881, 291077, 302551, 288925, 314805, 340916, 322824, 316859, 304613, 301330, 285582, 264605, 320751, 323339, 269697, 292122, 331893, 349027, 328765, 321052, 350255, 332338, 300815, 291920, 309270, 325883, 317175, 305283, 310226, 319727, 315108, 323988, 271311, 303137]
4413C03137K5205M621N615J4971j9206m553L2220J3061l0821j0815J1972j1353
4401C34054J0009k4569P710j6773J1398L3714k863K5387L6890k1437R94k2919
4389C71595j6414K5845J4561J9962m8684k852L0869K4074Q700j6686n54K0207
4377D30623K2423l4284L8714M4883J5003j3963k1549k5353q070R793M1228L0175
4365E29623K9811j1332P103L6384K625m409k1910K3183N3531k4578N2550J8301
4353F90882J7035L7578J1334k2447j6111Q676k0604k9296J4807Q887j0398O265
4341F96608l687j8574k9473R068Q99j335k8920o967n114J8306J6844j5750k5803
4328F06102J1441j0239O596J0642K3718O696K488M5478n3382k716J8322J3070
$$ y = [303137, 328342, 332963, 338578, 353549, 334343, 329790, 362010, 375071, 344250, 333435, 345407, 334054, 344063, 319494, 327204, 310431, 321829, 355543, 352680, 378067, 414957, 393520, 394514, 371595, 355181, 381026, 395587, 415549, 366865, 364013, 394882, 418956, 427656, 410970, 410416, 430623, 453046, 418762, 457476, 502359, 517362, 503399, 481850, 456497, 448427, 458220, 499448, 529623, 559434, 548102, 555205, 591589, 594214, 589805, 567895, 591078, 644609, 620031, 672581, 690882, 707917, 745495, 756829, 734382, 718271, 726947, 706343, 677047, 691854, 700741, 690343, 696608, 692921, 674347, 644874, 653942, 654841, 653506, 624586, 617619, 612505, 630811, 647655, 631905, 606102, 617543, 607304, 613900, 624542, 648260, 654956, 657444, 702922, 649540, 646824, 665146, 678216]
4316F78216K1065j8336j4098J7106J399p998M6652k0564P143L466J2142J488J3649
4303G41330J080O777K0581j4682k4100p483L5336O067J0682M7849j2734j9927
4291G90776K5922J2027L019k8964k073J860K1001l012L6028M1660j6797j6921
4279H64526K5252N2955L1555k8922L4479j3447L139k908K6511N4479J9945j5234
4267A052330K5374k695j101O2410L8060J6341l0173M0804J9204k9649J4708O0213
4255A265826M8977M3826L5446J5206L7857K0871j303K7399M6315L937j902M0780
4243A583235L7648N5651K7908L0960N4820N848N1879r20M2327O6235K2177L2353
4231B010121q656O8711J8703N387N5114N6161K2422M2380r818O1275O4586J345
$$ y = [678216, 699281, 680945, 666847, 683953, 685352, 677354, 724006, 703442, 710585, 714051, 726193, 727681, 741330, 742410, 749187, 769768, 755086, 730986, 723503, 758839, 764906, 775588, 823437, 810703, 790776, 816698, 828725, 831744, 802780, 800707, 802567, 823568, 820556, 856584, 898244, 881447, 864526, 889778, 942733, 974288, 945366, 979845, 966398, 969537, 966629, 993140, 1047619, 1067564, 1052330, 1077704, 1075009, 1073908, 1136318, 1174378, 1190719, 1160546, 1201350, 1220554, 1190905, 1205613, 1265826, 1314803, 1358629, 1394075, 1409281, 1447138, 1468009, 1466706, 1494105, 1540420, 1544357, 1542455, 1583235, 1620883, 1676534, 1704442, 1735402, 1790222, 1796070, 1847949, 1847029, 1889356, 1955591, 1977768, 2010121, 2001465, 2070176, 2088879, 2094266, 2149380, 2205541, 2227963, 2270343, 2260525, 2321800, 2386386, 2387731]
4219B387731L1656L5086K6496O2354L9660R0605L4873J366Q4252P0300P6927P6712
4207C018018P6812M0800N4476R8132N5801Q9451R3978J32899J07666J44430J91537
4196D104000K01109K01160K77337L28714K93410L68307M16207M59489N54473O52758
4186G856964P62815R50045J047474J096840J081574R09945N29138Q3894l99791
4177A3918898q11221j121041j231170j235113j122039r53327p97496o43899n02334
4168E501258l44731l08886k53146j94632k08459j71818j34381j49447j54476j05942
4158C475340r2587m6131j6657q2330o2682J6155l6420l7446L9891n2347o3199
4147C041587n6989j6972l3592k6020q651M7380L6048J133j3529R077L1073J6295
$$ y = [2387731, 2419387, 2454473, 2480969, 2543323, 2582983, 2673588, 2708461, 2709827, 2794079, 2864379, 2941306, 3018018, 3094830, 3135630, 3190106, 3288238, 3344039, 3433490, 3527468, 3660367, 3768033, 3912463, 4104000, 4305109, 4506269, 4783606, 5112320, 5405730, 5774037, 6190244, 6649733, 7204206, 7856964, 8619779, 9569824, 10617298, 11714138, 12795712, 13705657, 14234795, 14318689, 13918898, 13107677, 11986636, 10755466, 9520353, 8398314, 7444987, 6647491, 6003592, 5501258, 5156527, 4847641, 4594495, 4399863, 4191404, 4019586, 3885205, 3735758, 3581282, 3475340, 3382753, 3336622, 3319965, 3237635, 3174953, 3191108, 3154688, 3117242, 3157133, 3104786, 3041587, 2984598, 2967626, 2934034, 2908014, 2899363, 2946743, 2982791, 2983924, 2970395, 2979472, 3010545, 3026840]
4135C026840l2361l0040N58M336L8699Q3608M9459M0037K2453j4227O6482N4371
4123C310215N2773Q081N3087L8991R1288P9893N2231L6390M6700Q4221R2468O9409
4111D015747L3578P0999N7330O5808P3849M2413M2333O0441J29326J17920Q9830
4100D799574O0262R3744J03808P5821Q4271J00552J22143Q9125J43075J05621
4090E777996Q3895J38723J36335J04501J12750J58832J42664J53402J56041J62870
4080G128009J42013J68569J82122K13476K71899J79993K07806K44417K61810L11811
4070I311925K95251L03109M01230M32988M00644N05444N57914O20736O98637Q37554
4060A4365432R38139J036367J218279J350896J542818J722566J797206J936762
$$ y = [3026840, 2994479, 2964439, 2964997, 2969333, 3008032, 3091640, 3141099, 3181136, 3203589, 3189362, 3255844, 3310215, 3362988, 3371069, 3424156, 3463147, 3554435, 3634328, 3686559, 3722949, 3769649, 3853870, 3946338, 4015747, 4049325, 4120324, 4177654, 4243462, 4317311, 4359724, 4402057, 4462498, 4591824, 4709744, 4799574, 4859836, 4953580, 5057388, 5133209, 5217480, 5318032, 5440175, 5529300, 5672375, 5777996, 5861891, 6000614, 6136949, 6241450, 6354200, 6513032, 6655696, 6809098, 6965139, 7128009, 7270022, 7438591, 7620713, 7834189, 8106088, 8286081, 8493887, 8738304, 9000114, 9311925, 9607176, 9910285, 10311515, 10744503, 11145147, 11650591, 12208505, 12829241, 13527878, 14365432, 15303571, 16339938, 17558217, 18909113, 20451931, 22174497, 23971703, 25908465]
4052B5908465K028252J851734J560051J225203R00557Q66478J089058J564855
4044C6994653K074307K425018K482264J932970N09928r14180j779333k134934
4036D1590693j940469j460876q93109k75559L02172N37799O3246j287878k503405
4027C4132614k949687k783464k370053j960795j526084j191370q30711n09149
4019B0011301l30599n41557r17889j099004j040284q60273o07379m66119m40411
4010A3707786l30865k32055j76021j21622o3075l3486j8778L4530P2543R2729
4000A2931686J15454J17404J55761J26738J72660J92859K68488K82173K87819
3991A4651042K54520K72329K91011L59836L07413L45063L81651M12874M77492
$$ y = [25908465, 27936717, 29788451, 31348502, 32573705, 33474262, 34340740, 35429798, 36994653, 39068960, 41493978, 43976242, 45909212, 46419140, 45504960, 43725627, 41590693, 39650224, 38189348, 37296239, 37020680, 37322852, 37860651, 37923897, 36636019, 34132614, 31182927, 28399463, 26029410, 24068615, 22542531, 21351161, 20520450, 20011301, 19680702, 19139145, 18221256, 17122252, 16081968, 15221695, 14614316, 14148197, 13707786, 13376921, 13144866, 12968845, 12847223, 12784148, 12750662, 12731884, 12766414, 12838957, 12931686, 13047140, 13164544, 13320305, 13447043, 13619703, 13812562, 14081050, 14363223, 14651042, 14905562, 15177891, 15468902, 15828738, 16136151, 16481214, 16862865, 17275739, 17753231]
3982A7753231M93313M80457N03571N45951N84241O28927N90808O76204P56306
3973B3013009P41502P53634Q27767Q69915R26975R92850J005821J068680J089003
3964C1289156J135364J231359J271648J282599J331037J411086J480566J550360
3956D1983175J535932J587532J624541J683723J679218J695300J754471J767487
3948E5311379J747275J713827J696735J676607J767994J758611J736836J806621
3940F9215885J859111J793263J791507J696425J677530J615293J496415J461077
3932H2606506J354884J257959J203123J177482J121066J060033J048383J036640
3924I1866076R92164Q89891P73113O87348N88244M48454K78485R8824J323j08700
$$ y = [17753231, 18246544, 18727001, 19230572, 19776523, 20360764, 20989691, 21580499, 22256703, 23013009, 23754511, 24508145, 25335912, 26205827, 27132802, 28125652, 29131473, 30200153, 31289156, 32424520, 33655879, 34927527, 36210126, 37541163, 38952249, 40432815, 41983175, 43519107, 45106639, 46731180, 48414903, 50094121, 51789421, 53543892, 55311379, 57058654, 58772481, 60469216, 62145823, 63913817, 65672428, 67409264, 69215885, 71074996, 72868259, 74659766, 76356191, 78033721, 79649014, 81145429, 82606506, 83961390, 85219349, 86422472, 87599954, 88721020, 89781053, 90829436, 91866076, 92858240, 93748131, 94521244, 95208592, 95796836, 96245290, 96523775, 96622599, 96623922, 96515222]
3914I6515222k61895l23164l52558m41431n10207n24268n86176o93289q25655
3905I1996579r14462j083588j287338j461611j583864j725628j784623j774330
3897H0381135j838093j819418j769469j798814j859511j890617j893566j995632
3889F5516015k067439k153426k189894k224578k227046k235437k213708k085741
3881D8118746k003311j973107j886818j790381j771969j725139j649873j646926
3873C3671222j581969j568293j511175j447299j409894j307389j211457j160715
3865B2473031j091815j008371r78228q61651q20807p87274o69193o60154n95087
3856A5000451o16165m96474n07350m88337m17604m30598l38491l25930l27211
$$ y = [96515222, 96253327, 95930163, 95577605, 95136174, 94625967, 94101699, 93515523, 92822234, 91996579, 91082117, 89998529, 88711191, 87249580, 85665716, 83940088, 82155465, 80381135, 78543042, 76723624, 74954155, 73155341, 71295830, 69405213, 67511647, 65516015, 63448576, 61295150, 59105256, 56880678, 54653632, 52418195, 50204487, 48118746, 46115435, 44142328, 42255510, 40465129, 38693160, 36968021, 35318148, 33671222, 32089253, 30520960, 29009785, 27562486, 26152592, 24845203, 23633746, 22473031, 21381216, 20372845, 19394617, 18532966, 17712159, 16924885, 16255692, 15595538, 15000451, 14384286, 13887812, 13380462, 12892125, 12474521, 12043923, 11705432, 11379502, 11052291]
3847A1052291k59136k57450k43691k70105k15980j55087j62633j26178j61678
3838I200353j45357j14159j12373j25489j14210p1035r1301l9017p3222m8869
3828H265321k7894k1566o8453n8846J4561j6321j6761k8658n0995m7986j5687
3817G926715K7224m028j7398K7520m2035M3838j2751j095Q084L239J9292J6776
3805G995381M44O696J7618k7858K6427J3015j8323L5588N2853O749Q020L3191
3793H149801N6750P0044L0864R5029O1747J08389R3366R5207J19250J07733J12798
3782I100978J34389J52527J20529J38780J37071J26427J26871Q1323J56742J04100
3772A0379737P5762J06053J04371J22964J21626J38258J31819J30439J33512J37043
$$ y = [11052291, 10793155, 10535705, 10292014, 10021909, 9805929, 9650842, 9488209, 9362031, 9200353, 9054996, 8940837, 8828464, 8702975, 8588765, 8517730, 8426429, 8387412, 8314190, 8265321, 8237427, 8215861, 8147408, 8088562, 8103123, 8086802, 8070041, 8041383, 7990388, 7942402, 7926715, 7953939, 7949911, 7932513, 7960033, 7917998, 7961836, 7949085, 7947990, 7956074, 7959313, 7978605, 7995381, 7995825, 8002521, 8020139, 7992281, 8018708, 8031723, 8013400, 8048988, 8101841, 8108590, 8116610, 8149801, 8206551, 8276595, 8307459, 8402488, 8464235, 8572624, 8665990, 8761197, 8880447, 8988180, 9100978, 9235367, 9387894, 9508423, 9647203, 9784274, 9910701, 10037572, 10118895, 10275637, 10379737, 10455499, 10561552, 10665923, 10788887, 10910513, 11048771, 11180590, 11311029, 11444541, 11581584]
3762A1581584J85862J73551J16140J32867J64878J55355J95434J71886J86658
3753A3064215J98102K13958J93793K98130K97428K44965K63513K89685L59167
3744A5422956L41005L97752L58655L67904M32139M45828M58797N13677M62873
3735A9201586M92213N42406N85811N94022O03830P04013P00925Q41906Q67760
3726B5134472R19683J060957J129352J296225J419942J664276J813379K029483
3718C6467769K224564K514474K823971L200524L557702L995287M380193M842474
3710F4006958N331116N783902N997151N904287N483276M542595L333201J978671
3702A02361157P47997k69471r05821j256560j241048j148624q54345n64168l93345
$$ y = [11581584, 11767446, 11940997, 12057137, 12190004, 12354882, 12510237, 12705671, 12877557, 13064215, 13262317, 13476275, 13670068, 13968198, 14265626, 14510591, 14774104, 15063789, 15422956, 15763961, 16161713, 16520368, 16888272, 17320411, 17766239, 18225036, 18738713, 19201586, 19693799, 20236205, 20822016, 21416038, 22019868, 22723881, 23424806, 24266712, 25134472, 26054155, 27115112, 28244464, 29540689, 30960631, 32624907, 34438286, 36467769, 38692333, 41206807, 44030778, 47231302, 50789004, 54784291, 59164484, 64006958, 69338074, 75121976, 81119127, 87023414, 92506690, 97049285, 100382486, 102361157, 103109154, 102839683, 101933862, 100677302, 99436254, 98287630, 97433285, 96869117, 96475772]
3693I6475772l38837m48176p74547j376303k194692l190040m249558n138650n680907
3684G3084062n901833n773901n367356m858152m237584l710228l194216k780467
3676C7260325k465807k067800j824574j594984j415021j241212j069105r21665
3668B4660157q78290q18774p21525o25427o01237n19855m56065m39142l87127
3659A9212715l01819l09206k36809k14543j70478j61478j20547q4401r1879o6895
3649A7454660l1108K926l3159N131M377N1850J8279M8018R5624Q1573P8358J27263
3637A7903792J54297J57751J23214J40186J76035J75101J85493J49541K12213
3628A9377623K20637K43250K73078K58359K91511L09013L36663L50017L68748
$$ y = [96475772, 96136935, 95688759, 94914212, 93537909, 91343217, 88153177, 83903619, 78764969, 73084062, 67182229, 61408328, 56040972, 51182820, 46945236, 43235008, 40040792, 37260325, 34794518, 32726718, 30902144, 29307160, 27892139, 26650927, 25581822, 24660157, 23781867, 22963093, 22241568, 21616141, 21014904, 20495049, 20038984, 19599842, 19212715, 18910896, 18601690, 18364881, 18150338, 17979860, 17818382, 17697835, 17613434, 17521555, 17454660, 17423552, 17426478, 17393319, 17398450, 17402827, 17454677, 17472956, 17520974, 17616598, 17698171, 17776529, 17903792, 18058089, 18215840, 18339054, 18479240, 18655275, 18830376, 19015869, 19165410, 19377623, 19598260, 19841510, 20114588, 20372947, 20664458, 20973471, 21310134, 21660151, 22028899]
3619B2028899L92190M73745M86846M95670N00363N32509O07877O23957O62889
3610B6804945O70824P03079P61371P50936Q01980Q40856Q58911Q64722R70118
3601C4027742J049017J034979J078672J179167J185408J218671J205807J226030
3593D3205493J264139J209331J133096J075693J103676J031214R94954R94037
3585E2011633J028279J084088J040818J087805J117684J089111J055665R91223
3577F0506306R49867Q69485Q42353P86047P45798P82416Q28076Q65277R99040
3568F8174665J089214J165278J274704J423586J541641J681197J840001K017624
3560H0207910K217601K399939K646613K930753L270792L638277M011449M383022
$$ y = [22028899, 22421089, 22894834, 23381680, 23877350, 24377713, 24910222, 25518099, 26142056, 26804945, 27475769, 28178848, 28940219, 29691155, 30493135, 31333991, 32192902, 33057624, 34027742, 35076759, 36111738, 37190410, 38369577, 39554985, 40773656, 41979463, 43205493, 44469632, 45678963, 46812059, 47887752, 48991428, 50022642, 51017596, 52011633, 53039912, 54124000, 55164818, 56252623, 57370307, 58459418, 59515083, 60506306, 61456173, 62325658, 63168011, 63954058, 64699856, 65482272, 66310348, 67175625, 68174665, 69263879, 70429157, 71703861, 73127447, 74669088, 76350285, 78190286, 80207910, 82425511, 84825450, 87472063, 90402816, 93673608, 97311885, 101323334, 105706356]
3552A05706356M830999N336299N809610O343227O999094P564496Q194193Q843866
3544A59628140R337613R430852R169996Q696000Q010299P373595O745586O186607
3536B24578688N749136N536201N405037N429831N526751N599463N649678N595284
3528B69070069N362308N096355M614336L969184K926778J566664L33049o00376
3520B92338367j069704j126864j007339r56482q98024q29480p96047q62397r47603
3511B83844427r84447r39225r00478o68995n32507k99998M5712M33807J053858
3502B81052154J788674K493367L183841L917414M410953M612486M442260L803350
3494C09704499K635728J039126p57178k730833m383991n517606o062670o043217
$$ y = [105706356, 110537355, 115873654, 121683264, 128026491, 135025585, 142590081, 150784274, 159628140, 168965753, 178396605, 187566601, 196262601, 204272900, 211646495, 218392081, 224578688, 230327824, 235864025, 241269062, 246698893, 252225644, 257825107, 263474785, 269070069, 274432377, 279528732, 284143068, 288112252, 291039030, 292605694, 292938743, 292338367, 291268663, 290141799, 289134460, 288177978, 287279954, 286450474, 285654427, 284792030, 283844427, 282859980, 281920755, 281020277, 280351282, 279818775, 279518777, 279564489, 279998296, 281052154, 282840828, 285334195, 288518036, 292435450, 296846403, 301458889, 305901149, 309704499, 312340227, 313379353, 312622175, 309891342, 305507351, 299989745, 293927075, 287883858]
3486B87883858n737220n317801m812244m448175m278876m387186n044568o205600
3478B47652188p847189r546782j1024955j2153158j2728757j2761007j2323790
3471A69266550j1475680j0355743r100914p791018o672580n592212m711584l947510
3463A09619309l219385k663738k156675j708593j488959j240517j067435r45840
3455I5128167q17889o71181o13409n55599m49416l61249k39640k25657k16335
3446I0977792k35375k98809m42523o07597q06691r68187j195915j427237j645634
3437H3349824j803145j854451j955758k041298k107212k115145k103866k140330
3429F7228619k118202k142148k179837k128432k135134k079686j969009j961094
$$ y = [287883858, 282146638, 276828837, 272016593, 267568418, 263289542, 258902356, 253857788, 247652188, 239804999, 230258217, 219233262, 207080104, 194351347, 181590340, 169266550, 157790870, 147435127, 138334213, 130543195, 123870615, 118278403, 113566819, 109619309, 106399924, 103736186, 101579511, 99870918, 98381959, 97141442, 96074007, 95128167, 94310278, 93639097, 93025688, 92470089, 92020673, 91659424, 91419784, 91194127, 90977792, 90742417, 90443608, 90001085, 89393488, 88586797, 87618610, 86422695, 84995458, 83349824, 81546679, 79692228, 77736470, 75695172, 73587960, 71472815, 69368949, 67228619, 65110417, 62968269, 60788432, 58660000, 56524866, 54445180, 52476171, 50515077]
3421E0515077j877855j814686j776781j661067j545905j481545j425421j348115
3413C7583702j290913j235640j142652j093654j034593r75160r36341r26948q52818
3404B8094983q36954p79955p09917p09591p15917o41536o33923o31330o09410
3395B1826450o17388n65256n42852n37201m44756m99355m91439m24536m36148
3386A7267519m20452l56637l67777l81623l47510l52087l34608k96187l18935
3377A4091703l19359k74668k72519k53186k64111k32696k60796k68186j83225
3368A1762957k03189k47316k20279k17481j93208k00236j99185j78732j86000
3359I917331k10533j76925j37864j16850j59345k12021j67738j42590j52173j42089
$$ y = [50515077, 48637222, 46822536, 45045755, 43384688, 41838783, 40357238, 38931817, 37583702, 36292789, 35057149, 33914497, 32820843, 31786250, 30811090, 29874749, 28947801, 28094983, 27258029, 26478074, 25768157, 25058566, 24342649, 23701113, 23067190, 22435860, 21826450, 21209062, 20643806, 20100954, 19563753, 19118997, 18619642, 18128203, 17703667, 17267519, 16847067, 16490430, 16122653, 15741030, 15393520, 15041433, 14706825, 14410638, 14091703, 13772344, 13497676, 13225157, 12971971, 12707860, 12475164, 12214368, 11946182, 11762957, 11559768, 11312452, 11092173, 10874692, 10681484, 10481248, 10282063, 10103331, 9917331, 9706798, 9529873, 9392009, 9275159, 9115814, 8903793, 8736055, 8593465, 8441292, 8299203]
3349H299203j16239j08587j19343j32703j62526j20818r9290j53018o7944j29273
3339G089462q3628q2389q6504p9121j13521q1014n6902r2187j44466o1527p3379
3328F134824m5604q7834j12611L283p2305m6730m2799r8430p9824o4351m5778
3317E441841q0841p8305k6581p0238r8995p2684m6384k0752q5422k3534k3634
3306D814471n4010n2026n0470k8112m8825q5309r040k6890p8043n2784n5783l5014
3294D238165l9821Q775m966p7001L2826l9650j06239o1641J3164k1702k7432l7111
3282C877367k1186m6502k7402m0297j4285K3264l1876p186J3811j5751k3891m3537
3270C642529m1609J284K4782k5567k4445j739M3698k6939o5022K4171J6542J3262
$$ y = [8299203, 8182964, 8074377, 7955034, 7822331, 7659805, 7538987, 7439697, 7286679, 7218735, 7089462, 7005834, 6923445, 6836941, 6757820, 6644299, 6563285, 6506383, 6414196, 6269730, 6208203, 6134824, 6089220, 6001386, 5888775, 5892058, 5819753, 5773023, 5730224, 5631794, 5551970, 5487619, 5441841, 5361000, 5282695, 5256114, 5185876, 5086881, 5014197, 4967813, 4947061, 4861639, 4838105, 4814471, 4760461, 4708435, 4657965, 4629853, 4581028, 4495719, 4486679, 4459789, 4381746, 4328962, 4273179, 4238165, 4198344, 4207119, 4202153, 4125152, 4157978, 4118328, 4012089, 3950448, 3963612, 3941910, 3914478, 3877367, 3856181, 3809679, 3782277, 3741980, 3727695, 3750959, 3719083, 3711897, 3725708, 3709957, 3686066, 3642529, 3600920, 3602204, 3626986, 3601419, 3576974, 3575235, 3618933, 3591994, 3526972, 3551143, 3567685, 3580947]
3258C580947K1193p763K8224K6541J6023J31K2466M7667N0103r029J8555L8657
3246C833715J2551K3877j729J1876j4053N09Q772N7071K9190K7093K8288L7077
3234D054237j8554j3142l825M382k9384j1970n5259k7780q454p727K465R618j9363
3221C875244n4653O033o157K0021J0544r349J1868J6409L3086J3943j3712m885
3209C898392l0537K5281L0073L2874m225M5531j8573j0261J1048l2498K8650k2177
3197C953578m5471Q481J2663R56j7947l1551O5176L7227j3431Q820J3197l2855
3185C958843L4401k287L2006m729m3405j6207K1889l8127r779o4820r0699j04025
3173C673061j12850r2477j10575j24298j14619n6615q5605p4660o1663n3871n3848
$$ y = [3580947, 3602140, 3594377, 3622601, 3649142, 3665165, 3665296, 3687762, 3735429, 3785532, 3776503, 3795058, 3833715, 3846266, 3870143, 3868414, 3880290, 3866237, 3866746, 3875518, 3932589, 3961779, 3988872, 4017160, 4054237, 4035683, 4022541, 4018716, 4023098, 3993714, 3981744, 3926485, 3898705, 3890251, 3882524, 3884989, 3894607, 3875244, 3820591, 3826624, 3820467, 3840488, 3851032, 3841683, 3853551, 3869960, 3903046, 3916989, 3903277, 3898392, 3867855, 3893136, 3923209, 3956083, 3951858, 3997389, 3978816, 3968555, 3979603, 3947105, 3975755, 3953578, 3908107, 3916588, 3929251, 3930207, 3912260, 3880709, 3945885, 3983112, 3969681, 3978501, 3991698, 3958843, 3993244, 3990957, 4022963, 4018234, 3974829, 3958622, 3980511, 3942384, 3932605, 3867785, 3777086, 3673061, 3560211, 3467734, 3357159, 3232861, 3118242, 3061627, 2976022, 2901362, 2839699, 2785828, 2731980]
3162B731980l5557n8584m3932J7892j0840j2158M617N3974m665K8483O5853Q7214
3150B824277O1528J00546J23711R3761J63481J72931K33254K94138L59824K73095
3140D700546J5928k77322m43628m15082l48071k25220j90038j22861r7230j22697
3130B474325l5704n9935k9536n4810L8134k1794K2289R7924M6770Q2110J00487
3119B660260J08819J27068J85653K02834L11520L61775K78001r6529l64063l76372
3109C398966m32312l68330k55050j39520j61918j40564j18618m5993m3674r4624
3099A598363p4019m6906o1849l9052q303j0950l2576j4475m0251l3035l6808k1592
3087A178547k2205p196p220q973m783l6044l0882m1645K301L1803R182n536k2494
$$ y = [2731980, 2696423, 2637839, 2593907, 2611799, 2600959, 2588801, 2593418, 2647392, 2642727, 2671210, 2737063, 2824277, 2885805, 2986351, 3110062, 3203823, 3367304, 3540235, 3773489, 4067627, 4427451, 4700546, 4716474, 4439152, 3995524, 3580442, 3232371, 3007151, 2817113, 2694252, 2597022, 2474325, 2438621, 2378686, 2349150, 2294340, 2332474, 2310680, 2332969, 2430893, 2477663, 2559773, 2660260, 2769079, 2896147, 3081800, 3284634, 3596154, 3957929, 4235930, 4139401, 3775338, 3398966, 2966654, 2598324, 2343274, 2203754, 2041836, 1901272, 1782654, 1736661, 1692987, 1598363, 1524344, 1477438, 1415589, 1376537, 1368234, 1357284, 1324708, 1310233, 1269982, 1236947, 1200139, 1178547, 1156342, 1149146, 1141926, 1132953, 1128170, 1092126, 1061244, 1019599, 1021900, 1053703, 1062885, 1057349, 1034855]
3074A034855j2401k721j8904L1499L224M642K300q746K3807j5516k1455L2037
3062A052621M7218p859J8913k758n5199l1856j7993o3417k2719m4191j7751J9949
3050H74958l4452j4211j3685J5271q302k8829J9227P457L308l40j1316p064k152
3037G99870J0738K7189K959K1851J1319K9558m0736k6164m0731p544j1997o8804
3025G07508M476K3182k7187l0116O054q121j1200n0451L360J6398j1567k7241
3013E95095L0863k1887n164j0440k4316R069N180K8827L250k4509l133o8J7731
3000F00498K435l1414j0832k177q260M0298P311m5535j6244K9034Q816L6458R316
2987F19704k2329k3697K4513j4657N426J1792k8451M875L5018j0924J7796k29
$$ y = [1034855, 1022454, 1019733, 1000829, 1032328, 1035552, 1040194, 1042494, 1033748, 1057555, 1042039, 1020584, 1052621, 1099839, 1091980, 1110893, 1108135, 1052936, 1021080, 1003087, 939670, 916951, 872760, 855009, 874958, 840506, 826295, 812610, 827881, 819579, 790750, 809977, 817434, 820742, 820402, 809086, 802022, 799870, 810608, 837797, 840756, 862607, 873926, 903484, 862748, 836584, 795853, 788309, 776312, 707508, 711984, 735166, 707979, 677863, 683917, 675796, 664596, 614145, 617505, 633903, 622336, 595095, 625958, 604071, 598907, 588467, 564151, 573220, 578400, 607227, 610477, 585968, 582835, 582767, 600498, 602933, 571519, 560687, 558510, 550250, 590548, 597859, 552324, 536080, 565114, 573930, 610388, 619704, 597375, 573678, 598191, 583534, 588960, 600752, 572301, 577176, 612194, 601270, 619066, 618837]
2975F18837K978j9444K6084P609j367j688L247L017L0680K0724j7495L8293O899
2962G18374l550r766m8153K0080J9789L6271N1799l1960M7934L0285r636N1250
2950H72717O1588J2511L9798j0884N3341M1249K4128O1443O2608P5828Q8304q734
2938A373897P7321L2545l0393L6016R374j5990k5289k340l2820k5952j4348p5443
2926A306578j1211p542j5502K5471m1014j7634j3367L7369L268M5714J1350K189
2914A325669M1317P0894M0036L8758P7540P5458Q4089Q1169J43726Q5566J07680
2903B171902J03322Q2964N6341P5615Q645j5896q7743j03580k5201j02675q1757
2892B081937n7297j18786j31573j20748p7141r6335p3186l4218o8485k883k6223
$$ y = [618837, 621815, 602371, 628455, 636064, 634697, 633009, 636256, 639273, 669953, 690677, 673182, 711475, 718374, 714824, 705058, 656905, 676985, 696774, 733045, 784844, 752884, 800818, 831103, 821467, 872717, 934305, 946816, 986614, 975730, 1029071, 1070320, 1094448, 1155891, 1218499, 1294327, 1382631, 1373897, 1451218, 1483763, 1453370, 1489386, 1498760, 1482770, 1457481, 1455141, 1422321, 1396369, 1382021, 1306578, 1295367, 1287825, 1272323, 1297794, 1256780, 1239146, 1225779, 1263148, 1266416, 1312130, 1323480, 1325669, 1366986, 1437880, 1477916, 1516674, 1594214, 1669672, 1753761, 1834930, 1978656, 2064222, 2171902, 2275224, 2358188, 2414529, 2490144, 2498789, 2482893, 2395150, 2291570, 2266369, 2163694, 2081937, 2024640, 1905854, 1774281, 1653533, 1576392, 1480057, 1406871, 1372653, 1304168, 1301285, 1275062]
2881A275062j8236j348L253j481J1618M8345N765K9238J6611J8487O6730N3284
2869A507328K1953Q7652M6425P75L9331K8960m3307k9185n1041k8729o9316o2381
2857A448465p2378k4463n8438p9246n4184j04771p4485o5262k0228o9280j3384
2846H12346L023l3931j3142K9223p359j1393m9982l2479J7259j8795o3539j1545
2834F19686p784m463M316l5346j9582m0052k9287l0516r959K4518M9326K1933
2822E42790n9987k049j4429k189p138j7332R714R426J7492n847k0146q301L2555
2809D74559J1504k5841N311n1982j0552o845k3136N1102L8191n066R549o619J452
2796D61627j5852J3441l6436q216o061j3783q710j919r650j6590K353m8281N359
$$ y = [1275062, 1256826, 1255478, 1258731, 1257250, 1268868, 1317213, 1322978, 1352216, 1368827, 1387314, 1454044, 1507328, 1529281, 1616933, 1663358, 1664133, 1703464, 1732424, 1689117, 1659932, 1608891, 1580162, 1510846, 1448465, 1376087, 1351624, 1293186, 1213940, 1159756, 1054985, 980500, 915238, 895010, 825730, 812346, 815369, 781438, 768296, 797519, 790160, 778767, 728785, 696306, 713565, 694770, 631231, 619686, 611902, 607439, 611755, 576409, 556827, 516775, 487488, 456972, 447013, 471531, 520857, 542790, 482803, 480754, 466325, 464136, 456998, 439666, 449380, 458806, 476298, 470451, 450305, 442004, 474559, 486063, 460222, 465533, 413551, 402999, 396154, 373018, 424120, 462311, 457245, 466794, 460175, 461627, 445775, 459216, 422780, 414564, 408503, 394720, 386010, 384091, 374441, 357851, 360204, 311923, 317282]
2783C17282m0840k6473J2841M311j1417K4061J2007l1638o935K610j8925J2870
2771B49754k6941l858m430M6170j2183m3604j0586J1501k2023j3342M774K3123
2759A98355o686M925j2410k9093K5757j5728R814J5961J0758m3420j7814J5215
2747A55634M285l343L681o988p800q905O4K2606j5569n467p023j5636J9461j0243
2733A24757k383L4656l1607J4200j6683J9656P354l2023k866K1654Q825r86O118
2720A50672m6681j85l505K5351J4295r864k9868O810k0403j1306R454J7326J682
2707A03778J0940O06l1781L0309J2332m4778l9375J3436K4763J4934J6701q810
2695A03055k581k8610K340J8683J7396n64N376Q093k2400K0038J384n089m516
$$ y = [317282, 276442, 249969, 262810, 267121, 255704, 279765, 291772, 260134, 253199, 255809, 236884, 249754, 222813, 218955, 214525, 260695, 248512, 204908, 194322, 205823, 183800, 170458, 175232, 198355, 191669, 196594, 184184, 155091, 180848, 165120, 174934, 190895, 201653, 158233, 140419, 155634, 159919, 156576, 160257, 153269, 145469, 136564, 136628, 159234, 143665, 138198, 131175, 115539, 135000, 124757, 122374, 157030, 125423, 139623, 122940, 142596, 149950, 117927, 115061, 136715, 145540, 144554, 150672, 103991, 103806, 100301, 125652, 139947, 130083, 100215, 107025, 86622, 75316, 84770, 102096, 103778, 114718, 115324, 83543, 113852, 126184, 81406, 42031, 55467, 80230, 95164, 111865, 103055, 100474, 71864, 74204, 92887, 110283, 109719, 115095, 123188, 100788, 120826, 122210, 117121, 112605]
2682A12605o809N166k5619k3448L266L3305L2849k8758q841O458l4533K4378K1158
2669A11177j335o178R088m825J3988k8674j4822K0466O246p181j8891M4601q546
2656A15114m3316M1521J8486l5980j9707j2495k1499M476L2377j193J8374L154
2644I9312J1564m723K9540J404o752Q786J6950r09p1950J0353j3581M7046O560
2631A33600l9400N282J9084P245J036j2414K5721K1876k0555K9653J1936j6379
2619A66685P896Q015n352J9034l2723j8196K9234J7206l0728q332J8736J1635
2607A83110L6645l663k3877J9947j2280k279J8468J5725O567j4875k7758N4603
2595B50333M4208k2915J1265L2399L952j7447K3365J0369L7230K2069l2838J8559
$$ y = [112605, 105796, 110962, 85343, 61895, 65161, 98466, 131315, 102557, 93716, 100174, 65641, 90019, 111177, 109842, 103664, 112752, 107927, 121915, 93241, 78419, 98885, 105131, 97950, 79059, 123660, 115114, 71798, 113319, 131805, 95825, 76118, 63623, 42124, 46600, 78977, 77784, 96158, 99312, 110876, 106153, 135693, 137097, 130345, 139131, 156081, 155172, 83222, 93575, 79994, 127040, 133600, 94200, 99482, 118566, 125811, 126847, 114433, 140154, 162030, 141475, 171128, 183064, 166685, 174581, 182596, 177244, 196278, 163555, 145359, 174593, 191799, 161071, 152739, 171475, 183110, 219755, 216092, 192215, 212162, 199882, 197603, 216071, 231796, 238363, 223488, 195730, 250333, 294541, 271626, 282891, 315290, 319242, 301795, 325160, 335529, 372759, 394828, 361990, 380549]
2583C80549M2281J6256k6781J6989L993L2987p99p753l2537j2371L89K4419K1177
2570D58799J6970J916j3989L3051L5176K0261J3975L0974L3107J2417J8782J5897
2558F77336m2455L4032M52j431L5861o45K6985R365j0310Q480J9385o915J2314
2545G62454K1736k9870j6873m598M411L4606l602m776J3315l554l2563k5098J6528
2532G32116J8386r513P357P6470J4597K7896K4324K0181K6609K4166L9501Q842
2520A010932K6888p272k8083n4943l2870k6137k2409k3089L0787m2557k2160p709
2508H01378l7725k3295M307J2937p490l08k6946q707j7171k718J0038l1273r916
2495F63111j4027l971J2528J4837p762L7465j146l4969L7974J6023L0710j3724
$$ y = [380549, 422830, 439086, 412305, 429294, 433287, 466274, 465475, 457722, 425185, 412814, 413203, 437622, 458799, 475769, 477685, 463696, 496747, 531923, 552184, 566159, 597133, 630240, 642657, 661439, 677336, 634881, 668913, 669365, 667934, 703795, 703150, 730135, 739500, 729190, 737670, 757055, 750140, 762454, 784190, 754320, 737447, 732849, 737260, 771866, 768264, 763488, 776803, 773249, 740686, 715588, 732116, 750502, 740989, 748346, 824816, 839413, 867309, 891633, 911814, 938423, 962589, 1002090, 1010932, 1037820, 1030548, 1002465, 947522, 914652, 888515, 866106, 843017, 873804, 831247, 809087, 801378, 763653, 740358, 744665, 757602, 750112, 749804, 722858, 714151, 696980, 694262, 704300, 673027, 663111, 649084, 645113, 657641, 672478, 664716, 702181, 701035, 666066, 704040, 720063, 750773, 737049]
2483G37049m7636o0160l2181l3497J3848l5404m5551l7233R421j7982p280n451
2471D37943j5842k4462k1875M973j6255j4470J5528k6011k6558k5509L0501n0697
2459B67266R887l1008j0530R233K256Q494n061J0729l5305j3361m050l218L9016
2446B44348l3237p9638j4823L6329K9375k1680r735l4141k0314j3997J5659L2232
2434A30378Q339l7679o289P708k2020O065j0550J8099J8922m6276K572K6647k8100
2421F7816Q469M121l731j2101k3456j3836J3227K955j7264j4652P260L3879l6137
2408A6550J7036L1539M104k2096j2125m7927K9912K767R498k241N106K7269m1400
2395A7992K7236M844j6894k3108l3955L6710k357P90k4852K334o076J9985J7339
$$ y = [737049, 689413, 629253, 597072, 563575, 577423, 542019, 496468, 459235, 468656, 450674, 443394, 437943, 422101, 397639, 375764, 380737, 364482, 350012, 365540, 339529, 312971, 287462, 317963, 267266, 277153, 246145, 235615, 244848, 247104, 255598, 250537, 261266, 225961, 212600, 208550, 205332, 244348, 211111, 131473, 116650, 152979, 182354, 160674, 150939, 116798, 96484, 82487, 98146, 130378, 138717, 101038, 94749, 102457, 80437, 86502, 75952, 94051, 112973, 66697, 69269, 95916, 67816, 76285, 80406, 76675, 64574, 41118, 27282, 40509, 43464, 26200, 11548, 18808, 52687, 16550, 33586, 65125, 69229, 47133, 35008, -12919, 16993, 19760, 29258, 27017, 32123, 59392, 17992, 45228, 50072, 33178, 10070, -23885, 12825, 10468, 11258, -13594, -11260, -17336, 2649, 19988]
2382A9988k7421J3831q109J5708L2461r115l4835j0939J5419j1314m870l7895
2370d7091K4966K3516O6064O00l0298R56j3267j4915L088R075j3277j6183k6877
2357c3643j1580L9448J0650J439O57j8933J3150K5049j9020K8389k3095l8628
2345b6117L6188j049N09j1831j8751j4243Q372J2426K8800P211J2613K674l0626
2332F176m968m37j447K0199m534m404L5557j7675k7961J2033r060J9225L446n3658
2318b7508q063O7151Q420o3780J2270L0807L2470J689k6218r997j281N3696j8039
2305E1617k7228R029l195k7463Q380j5099J9056R810j0392M680j430J6275n8984
2292b4944J383O42j145M0293r721p2635L3061K3669r854M2073j5070k0250k5973
$$ y = [19988, -7433, 6398, -1711, 13997, 46458, 37343, 2508, -8431, 6988, -4326, -9196, -47091, -22125, 1391, 67455, 68055, 37757, 38713, 25446, 10531, 13619, 22694, 9417, -6766, -33643, -45223, -5775, 4875, 6314, 6971, -11962, 1188, 26237, 7217, 35606, 12511, -26117, 10071, 9022, 9531, -2300, -21051, -35294, -26922, -14496, 14304, 21515, 34128, 36802, 6176, 1208, 771, -676, 19523, 14989, 10585, 46142, 28467, 506, 12539, 3479, 22704, 26150, -27508, -35571, 31580, 40000, -23780, -11510, 19297, 51767, 53456, 27238, 17241, 15960, 69656, 51617, 24389, 33418, 30223, 2760, 11140, -3959, 15097, 24907, 14515, 19195, 17765, 34040, -24944, -23561, -22919, -24064, 16229, 6508, -66127, -33066, -9397, -19251, 22822, 7752, -12498, -38471]
2279c8471J7753L1321L3702j6903Q355k0789J3369l1850o1499j0331M9529R308
2267a6506K4951J0601O15j1977o706k340K5282O933o837q110n290J7981J1841
2254D0438j061l9801j8527M8396j5257j319q062J6871K8121k5094l6108k6207
2242c7610J2755K1706J5155l1480J4662L9437J9093K2014k2736j4356k4513j2476
2230A651j4009j8045L5755j1727m160K3080j891J7973o288j8181j3334J453j3629
2217b1352N5329O164n4218O523J115K5727J0439J0126p767k2328J3334K7417l8208
2204A2301J2138M987q372l4298L7554K868o017M569k5429n107J0953K3848r800
2191B0195q720p973q552m333L3744L6794l5937J0089Q005l1791J1483K7861P711
$$ y = [-38471, -20718, 10603, 44305, 27402, 35757, 14968, 28337, -3513, -65012, -75343, -25814, -16506, 8445, 19046, 19661, 7684, 978, -1362, 23920, 30853, 24016, 15906, 10616, 28597, 40438, 39377, -424, -18951, 29445, 14188, 12869, 4807, 21678, 49799, 24705, -11403, -37610, -24855, -3149, 12006, -19474, -4812, 34625, 53718, 75732, 52996, 38640, 14127, 1651, -12358, -30403, 5352, -6375, -10535, 12545, 10654, 28627, 22339, 4158, -9176, -7723, -21352, 33977, 40141, -14077, -7554, -6439, 19288, 29727, 39853, 32086, 9758, 23092, 50509, 12301, 24439, 29426, 21054, -13244, 24310, 27178, 21161, 25730, 301, -4806, 6147, 29995, 20195, 11475, 3502, -5050, -9383, 24361, 61155, 25218, 35307, 43312, 11521, 23004, 50865, 58576]
2178E8576Q676k4834k1250R020L0801J2983L4753k8575k2290j23j5703J166P963
2165E1163k6719K2077J7636k5743J1138n422J4514J2051l1576J9843L5054L444
2153I7460l4054j5474L8419R294n495N262K9326J5732P744j9662j1295J740J6493
2140A35490Q098k9250M0870k1033k3520Q577J3402L4882N448j91j1996R700J9688
2127A90165K0225L4836q579j4088j54J1063j4656L4784M0891K088L3869M3254
2115C73698J1012L8865J8990J5331O1780L6994L6506M8526K9322N3884K0677m5929
2103F99656m3414l7323k8391m2284k1431q816J3303l4533o920N5751p645l654
2091E34299J092K5336l37K4796J8363M4495J6866l0988J6058J4020M3109J9314
$$ y = [58576, 67252, 42418, 21168, 30188, 60989, 73972, 108725, 80150, 57860, 57737, 42034, 43200, 51163, 24444, 46521, 64157, 38414, 49552, 44130, 58644, 70695, 39119, 58962, 94016, 97460, 63406, 47932, 86351, 95645, 90150, 95412, 124738, 140470, 148214, 128552, 117257, 118997, 135490, 143588, 114338, 155208, 134175, 110655, 119232, 132634, 167516, 172964, 172773, 160777, 170477, 190165, 210390, 245226, 236647, 222559, 222405, 233468, 218812, 253596, 294487, 296575, 330444, 373698, 384710, 423575, 442565, 457896, 519676, 556670, 593176, 641702, 671024, 724908, 745585, 699656, 656242, 618919, 590528, 548244, 526813, 517997, 531300, 496767, 489847, 545598, 537953, 534299, 535391, 560727, 560390, 585186, 603549, 648044, 664910, 633922, 649980, 664000, 707109, 726423]
2079G26423r414J3450N8303N5980K2973K7560K3119J8703Q030M4414M1886M6649
2067A078076O1331L1748O3666M9315Q9255P2855Q8558N9627J43360J40302K00600
2056B078693J78156J56485J85346K36713K78360L05863L96513M95173N02720O12157
2046E426179P20624Q66837J160343J501583J461855L50990r64856j677315j713112
2037G133128j249719r76419p36885n90981m69906l93111l22112k19085j65635
2028B009275j22073q6801j29210j34293j36491j03734r9379j30019p6729o2122
2018I28424n7745l4903l4378n3587o7863m0762n1736m1073k3274k1420j5967j0226
2006D75490m4947N089J956k7964l0590j9180j214k7658k7215J3738L7602l1469
$$ y = [726423, 717009, 730459, 788762, 844742, 867715, 895275, 918394, 937097, 945127, 989541, 1031427, 1078076, 1139407, 1171155, 1234821, 1284136, 1373391, 1446246, 1534804, 1594431, 1737791, 1878093, 2078693, 2256849, 2413334, 2598680, 2835393, 3113753, 3419616, 3816129, 4311302, 4814022, 5426179, 6146803, 7013640, 8173983, 9675566, 11137421, 11488411, 10523555, 8846240, 7133128, 5883409, 4906990, 4170105, 3579124, 3109218, 2716107, 2393995, 2174910, 2009275, 1887202, 1800401, 1671191, 1536898, 1400407, 1296673, 1197294, 1067275, 990546, 928424, 870679, 835776, 801398, 747811, 679948, 639186, 587450, 546377, 523103, 501683, 485716, 475490, 430543, 435632, 437588, 409624, 379034, 359854, 358640, 330982, 303767, 317505, 355107, 323638]
1994C23638l6645K0485r305j9063j8575J7116l394j9458J7227l8299j3520k5545
1982A94662j7428l989m819j0974Q597k602J2115j9031m5740j4713J9705J3668
1970A29451J2263l1420p946K0663O750J0625L619l5580J7957k0035n081K8155
1958A29421l438k4036L1138k3947J2039m6682O86K0731l494k5168r033j5852J3247
1945E5612L259k0193j0314M0016Q631l2845N902N457k0308J8814n110k2049l0547
1932c675K4844L5881k834j1158r871j493R7n192r120m376l902m3140n954N0401
1918A0508J848J8592K7442m4771j3709M496J0503J7388n4700P216J9806j8413
1906a3794j0508Q350J0013O589m913L6132q021l3923J0903o49O162J182n4079
$$ y = [323638, 286993, 307478, 298173, 279110, 260535, 277651, 274257, 254799, 272026, 233727, 220207, 194662, 177234, 173245, 168426, 157452, 166049, 163447, 175562, 156531, 110791, 96078, 115783, 129451, 141714, 110294, 102348, 123011, 129761, 140386, 144005, 108425, 126382, 106347, 101266, 129421, 125983, 101947, 133085, 109138, 121177, 74495, 75181, 95912, 92418, 67250, 58217, 42365, 55612, 58871, 38678, 28364, 68380, 77011, 44166, 50068, 55525, 35217, 54031, 48921, 26872, -3675, 21169, 57050, 54216, 43058, 33187, 31694, 31791, 26599, 17479, 13103, 9201, -33939, -39893, 10508, 12356, 30948, 58390, 13619, -90, 4406, 14909, 32297, -22403, -15187, 4619, -13794, -24302, -15952, -5939, 650, -4263, 31869, 23848, -10075, 828, 179, 6341, 7523, -46556]
1893d6556O6633K3592l2056p596o189Q363P999k069J0847J4118k452k6478L343
1880A1499j1503J1107N144k0248j6456J751J7263n889k6427K5823J7714K754R612
1867B2144m744j481N93j7796k8217J2838j3929m3057J5292P568p117q649J2210
1854e4345p510N591L9347J6235O168j9402k3517K9815k3501K0344K1507j0117
1842F15o292L9511j6579l8388k7778M4442q427L760m100J6729J4167m1437j3571
1829c7348O193J4992J920L3415q344j0383K594k335J4726j383j0688J2805k2384
1816f220M945k4835p850n492j653N9408K0329l3668p388K0403m497m8456j8756
1803e3730J5712o507J6651K2243R909k7871m4980J8208N690M7393L1897l0025
$$ y = [-46556, 20077, 43669, 11613, 4017, -2172, 6191, 14190, 12121, 22968, 37086, 34634, 8156, 11499, -4, 11103, 16247, -4001, -20457, -18706, -1443, -7332, -33759, -7936, 9778, 12532, 22144, 17400, 15919, 16512, -1284, -29501, -16663, -30592, -73649, -58357, -50789, -57906, -66555, -54345, -61855, -56264, -16917, -682, 5486, -13916, -37433, -7618, -31119, -10775, 10732, 615, -5677, 33834, 17255, -21133, -48911, -4469, -12896, -9136, -13236, 3493, 17660, -23777, -37348, -31155, -16163, -14243, 19172, 10828, 445, 3039, 704, 15430, 14047, 3359, 16164, -6220, -1275, -26110, -33960, -39452, -41105, 18303, 38632, 4964, -2424, 17979, 13482, -34974, -53730, -38018, -44525, -27874, -5631, 4278, -23593, -68573, -50365, -44675, 2718, 34615, 4590]
1791D590K419l1706K3071K2060k9862r846O334L6323j0308l0648J7237j340o569
1778h245p44J1726J0469j8691k492N4779l752J3189K0544n4737q534K3j3958j5898
1764a6321J4396J399j2429Q294J8973k7243l0098p324K0363j5387J6329J7559
1752a1489J283k0848j4402j1386M2235R165j7782j2042L1486p985j0802m043j453
1739b8063O514j3518m221Q636J0150o202N345o80J311N168l6320r332K3226N3083
1725A5097j3190k7574K5303p879k8476j1900k9843k8422M3930M9135K3853k6191
1713a6157k863j2380k9260M0225j1926j4682j2243N713L3589J5522k2280K0143
1701f599j1529p339l4809k6840J7550K299M3857K4745K3067r08n1086j2877K8017
$$ y = [4590, 7009, -24697, -1626, 20434, -9428, -19274, -12940, 23383, 13075, -17573, -336, -1676, -8245, -8989, 2737, 13206, -5485, -7977, 46802, 43050, 56239, 76783, 22046, 13512, 13535, -423, -16321, -1925, -526, -12955, -4661, 14312, -12931, -43029, -50353, -29990, -45377, -29048, -11489, -10206, -31054, -45456, -56842, -14607, -5442, -23224, -35266, -3780, -11765, -22567, -26610, -28063, -21549, -35067, -39288, -30652, -20502, -26704, -21359, -22039, -20728, -15560, -51880, -61212, -37986, 15097, 1907, -25667, -364, -8243, -36719, -48619, -78462, -106884, -62954, -13819, 10034, -16157, -19020, -31400, -60660, -20435, -32361, -47043, -59286, -53573, -19984, -4462, -26742, -6599, -18128, -25467, -60276, -87116, -69566, -67267, -23410, 1335, 24402, 23494, -27592, -40469, -12452]
1688a2452J0850o205j0918m706j7784K2481K58P405k0934L2494J2409j9951N786
1675a267m1828n1489J1797L4177J009R991M939O211K0431P511k0921J003q337
1662b6773R749m576n693J2737n706l2342p691L1058R198l1933j280L4139l983
1649b3096J7495j0125J4816J007K8022k7243m2615k1943J723Q573J9268L4716
1637E98O01l7798j8356J2740R425J197K5964J1430r846J2278m263l935L0380k8904
1623A511j1124J7576l9105j8637L1087n944R90J155j9397M0861N100j2995o374
1610a5296j5032R951l8576m488J7823L8207J72j240K3943L091l0023m138p008
1597b2614K245q966N0099M837p5489L3512k484l2749K7454o741J9737R07J8325
$$ y = [-12452, -1602, -7807, -18725, -23431, -41215, -18734, -18476, -11071, -32005, 489, 12898, -7053, -1267, -43095, -94584, -82787, -48610, -47601, -37610, -32671, -26460, -6029, 1482, -19439, -18436, -26773, -17024, -21600, -27293, -14556, -20262, -52604, -60295, -29237, -20039, -51972, -53252, -19113, -23096, -5601, -15726, -910, 97, 28119, 876, -41739, -63682, -61959, -53386, -34118, 598, 1199, -36599, -54955, -42215, -32790, -31593, -5629, 5801, -4045, 8233, 3970, 35, 30415, 1511, -9613, 7963, -31142, -49779, -18692, -24636, -23646, -22491, -41888, -1027, 4073, -8922, -15296, -30328, -20377, -58953, -63441, -45618, -7411, -7239, -8479, 15464, 18555, -11468, -15606, -22614, -20369, -29335, 20764, 25601, -49888, -16376, -18860, -51609, -24155, -30896, -11159, -10252, 8073]
1584H073L9961m7075k255j1297j0523K2526n5389j3179j3382J4197J3899k834
1572e7278J5636p113j3870k611M2898k7349R637J1927J7208j9232m1857M0333
1560c1671R872k3356R754k687l6818K4488P122o971K9463J0888L717j9162P239
1547a8122M1867k5736k1604m544J3432J3381j7928j5075k5431K4250N534l6917
1535f6893j8638L9261N5j3651q390K6802J4670P916j0686K3966k2331j3903j4642
1522e6464L1621l8093K0147o982j0745Q585j9295M0143j7080m0117J7527K4687
1510d6066J3666K2661L5313k571k5497n6251J0602l645N157r595k3229j1229K979
1497h7705L4972j9822J4252L3148K0661J4641m0419k0900j8813J0306J4050j0018
$$ y = [8073, 48034, 959, -1296, -12593, -23116, -590, -55979, -69158, -82540, -68343, -54444, -57278, -41642, -48755, -62625, -65236, -22338, -49687, -40050, -28123, -10915, -30147, -72004, -31671, -21799, -45155, -35401, -38088, -74906, -50418, -43296, -50267, -20804, -9916, -6199, -25361, -18122, 23745, -1991, -23595, -28139, -14707, -1326, -19254, -34329, -59760, -35510, -29976, -66893, -85531, -46270, -46215, -59866, -68256, -41454, -26784, -18868, -29554, -5588, -27919, -41822, -56464, -24843, -62936, -42789, -49771, -60516, -51931, -71226, -31083, -48163, -88280, -70753, -46066, -32400, -9739, 25574, 23003, -2494, -58745, -48143, -51788, -46631, -56226, -79455, -90684, -87705, -52733, -72555, -58303, -25155, -4494, 10147, -30272, -51172, -69985, -59679, -45629, -55647]
1485e5647j2320K9209K1407j1012J1679k1519N04j934j4364K2424k8042L4737
1473b4878J1096m5411K4966K0437K0099j9253j476J5405N082o215J5648l1737
1461a6237L5153j1119J6036l7048m6559M0214M0250K1017k2411k8357k3721R32
1449c1850j7934R232L2264m4887J7755K3635N878l4818J7583o357K656j1739o475
1436d5057l6945J5605K0474K5193K0496j7767j0682K2880J7916q356Q927k9210
1424a6526l7609J0916m276J3103J3399K5186l8589m4567M8771M1073K2422j7693
1412A5610j2581m979k9597k1515N918j3304J1216J9359K2444r972K210l735M2073
1399B3147L070j0889k9248j5721m043J1398P946j3480L2144K274J126k0244Q235
$$ y = [-55647, -67967, -38758, -17351, -28363, -16684, -38203, -37699, -39633, -53997, -31573, -59615, -24878, -13782, -59193, -34227, -13790, 6309, -12944, -14420, 985, 6067, -148, 15500, -16237, 18916, 7797, 23833, -13215, -59774, -19560, 20690, 41707, 19296, -9061, -32782, -31850, -49784, -40552, -8288, -53175, -35420, -11785, -5907, -40725, -23142, -29499, -26843, -38582, -45057, -82002, -66397, -45923, -20730, -234, -18001, -28683, -5803, 12113, 3757, 12684, -16526, -54135, -43219, -47495, -34392, -20993, 4193, -34396, -78963, -30192, 10881, 33303, 15610, 3029, -1950, -31547, -53062, -47144, -60448, -49232, -29873, -7429, -17401, -15191, -18926, 23147, 26217, 15328, -13920, -29641, -33684, -22286, -14340, -27820, 4324, 6598, 7724, -12520, -4285]
1386d285j112k0784k7700k4905J1281J9738N9243R147l8268J1999o171p515j8853
1373c8185k681j7295J443L8474n616N870k179J6668j6053j7189N5978J2613n4972
1360b3124m880L3660P409j6925j0161J2594j3808J0314Q008r170J7879j5077j6283
1347a9564l6273K872O2745q62k2795M804k7810Q851J5908L0522l618O025k6405
1334e600j5835j3333M0439j6838Q135L1695n1847k2044j1894K1959M2126K337
1322I300l9757j412M1653K4909j07r785m3480j7662Q434P345m2770J3530J3021
1309c6781q448J4691j8372k665R639J2028k054j9282j1979K1404o894K4250K5054
1296E91L919k4131J4021p418K052p34n646L1020k6946k3314J9205M2587l3293
$$ y = [-4285, -5397, -26181, -53881, -78786, -67505, -47767, 11476, 20623, -17645, -5646, -11817, -19332, -38185, -40866, -58161, -56718, -18244, -23860, -17990, -20169, -3501, -19554, -36743, 19235, 31848, -23124, -28004, 5656, 13065, -3860, -14021, -1427, -15235, -4921, 3087, -6083, 11796, -3281, -19564, -55837, -52965, 9780, 8918, -13877, -9073, -36883, -28032, -12124, 18398, 14780, 20805, -5600, -21435, -34768, 5671, -11167, -3032, 28663, -23184, -45228, -57122, -35163, 6963, 9300, -30457, -31869, 9784, 34693, 34586, 24801, -18679, -36341, -27907, -20562, -63332, -49802, -36781, -45229, -30538, -48910, -51575, -41936, -29908, -31962, -51244, -63223, -41819, -48713, -24463, 591, 4510, -19621, -5600, -13018, -10966, -11700, -17346, 13674, -13272, -36586, -17381, 25206, -8087]
1283h087L0575J1279n5456J5145K4456O988j2315m5926m3901L0475K4705M529
1271a7533J9234J1437j790k8478j4255P68J7446l0520j0967L2773m439K4233J800
1258b91k2853l761L5631j3140o315k0185m115L4115l7102M8113K3113q809R48
1245B5349k3072J8212K2374k7929l1464p498j339k5238L9719J4413K408q085l2664
1232c4814j9880O268L9817r014j5176j7667J0850P073L55K3004k9806K0458K1676
1219C144L01k7522J1079k9461j9967K5059j964K0446M2339r952m153J1338l6883
1206a6196n709j1562R173j46J1773L6999r753j7455k257K6881k7890o63K0041
1193A3236m7102q58j0147j062K6340K420P567J8569l5910k8563J5007J2410m001
$$ y = [-8087, 22488, 33767, -21689, -6544, 17912, 24900, 12585, -33341, -77242, -46767, -22062, -17533, 1701, 13138, 11348, -17130, -31385, -30617, -13171, -43691, -54658, -21885, -26324, -2091, -291, -23144, -26905, 8726, -4414, -10729, -30914, -35029, -914, -38016, 10097, 33210, 24401, 25349, 2277, 20489, 42863, 14934, -16530, -24028, -25367, -50605, -10886, 3527, 5935, -2150, -34814, -54694, -48426, -8609, -17623, -32799, -50466, -39616, -32543, -32188, -9184, -38990, -18532, 3144, 3445, -24077, -12998, -42459, -62426, -37367, -39331, -18885, 23454, 13502, 9349, 20687, -16196, -21905, -33467, -24294, -24440, -12667, 24332, 14579, -2876, -5133, 21748, -6142, -6805, 13236, -33866, -34724, -44871, -45933, -19593, -17173, -9606, 8963, -26947, -55510, -40503, -28093, -32094]
1180c2094j4220O92J8784K7592J6635n990k9164o377o271J1768L9896j9619j2851
1167a1219J3011P975l0512q860N314k7992n009L9173O139q029j6203J6224L6758
1154A6770j152j3772K1776m419j5717j9451K907n398o313J5879J2015k2890J2800
1141f965N5994j9627k8418J7334O618j8534r673p872l30J2602m8446j142K1967
1128b6492q815K91M937K8571N55j0721j0717J9212P47k7945J4731J3552p807J7491
1114G590k2577J5109J1255q717k1329j4100J8726J0094j2274R149J7171J5780
1102B5877m0267L4107j8966k936K5651l6301J2204j9482K2042J0590m0983m779
1090c3243J1053l6535q695M6514j2890j0084J5531o428K216J8454l486k2839L0755
$$ y = [-32094, -46314, -45622, -26838, 754, 17389, 11399, -17765, -24142, -30413, -18645, 21251, 1632, -11219, 1792, 9767, -20745, -29605, -24291, -52283, -57292, -18119, -11980, -20009, -36212, -19988, 16770, 15618, 1846, 23622, 19203, 3486, -15965, -13058, -18456, -24769, -8890, 3125, -19765, -6965, 49029, 29402, 984, 18318, 24936, 6402, -3271, -11143, -11473, 1129, -47317, -48459, -26492, -35307, -35016, -30079, -1508, -953, -11674, -22391, -3179, -2432, -30377, -15646, -2094, -9901, 7590, -14987, 122, 11377, 2660, -18669, -32769, -14043, -3949, -16223, -7074, 10097, 25877, -14390, 19717, 751, -2185, 23466, -12835, -631, -20113, 1929, 12519, -28464, -33243, -22190, -58725, -67420, -20906, -33796, -43880, -28349, -34777, -32561, -14107, -17593, -40432, -9677]
1077i677l415J3132J0840n4752L483l042N3613l3101L775L0567q930k7831K813
1064b2525K7631N8M812j7665k2484l1154L6541J459N618l7391L5761M3479l0046
1051e906j5974J2879K2396L2517n3350k7869j3370j680K4701K5934l228N293Q882
1038A1225P148N687O921l1587J7402J4216j1857j0960L307k9242j5596K9703J3168
1025I535k0475j7430k5463K3270M919q949R701j1471L2543J0842P528K4467k518
1012C6499k3412J4629r445k5969j2275N276K3502l3815q438M25l68Q282m33K1890
998c652j6343k935r07J5519J5285L4563l462j1392l1529j1109J9733J9259k3534
985e04K0353n717J234r151j3094q544K8050J0018l1937J3997k2924J3301k605
$$ y = [-9677, -13092, 40, 10880, -43872, -40389, -43431, 10182, -22919, -19144, 11423, 2493, -25338, -22525, 5106, 5164, 9976, -7689, -30173, -61327, -24786, -23327, -17709, -55100, -19339, 24140, -5906, -21880, -9001, 13395, 45912, -7438, -35307, -48677, -50357, -25656, 278, -2950, 2343, 11225, 18373, 24060, 30981, -606, 16796, 31012, 19155, 8195, 11502, -17740, -33336, -3633, 9535, -10940, -28370, -53833, -30563, -25644, -34593, -24892, -36363, -3820, 7022, 14550, 39017, 36499, 13087, 27716, 18271, -7698, -19973, -14697, 8805, -25010, -33448, -33023, -33391, -25109, -25542, -3652, -19995, -22930, -23837, -8318, 6967, 41530, 38068, 26676, -4853, -15962, 3771, 23030, -504, 19849, 14132, 15366, 6215, -6879, -15423, 12627, 22645, -9292, 4705, -18219, -4918, -7523]
972g523l2207K1139m2830o106L5047K7770m67J431k8643j8301L1230J5743J7315
959A3598k5555O132M8195j8021l185m9178j6714k49J1378M3528j6995J9018l4409
946b2457M175j4262J9327k178k2571M081K0776K4440K8901r429k8321M6237l0805
933A7914j7059R48j2888J1587p038j0428K2342J6797P531k2791m034j8788j9870
920c5777L600P435K8972N973k0390p090L0945l494j3149J9132m3436K5919p752
907i112j3512N818M725J6628l6580K2730q068J2454P08J0704j6950j1766L5290
894A3069L330o615J0304J0915L246k5539p587J4808J780k522M3304P505n1833
881A4165m1837K9564N567k3075j8457k4438L6274J9032L5642l1519j2887J7996
$$ y = [-7523, -39730, -18591, -61421, -67527, -32480, -4710, -5177, -3746, -32389, -50690, -19460, -3717, 13598, -11957, -5825, 42370, 24349, 21164, -28014, -44728, -44977, -33599, 9929, -7066, 11952, -22457, -18282, -32544, -13217, -15395, -37966, -33885, -13109, 11331, 40232, 30803, 2482, 48719, 17914, 855, 1803, -11085, 502, -6536, -16964, 5378, 22175, 29706, 6915, 2881, -15907, -35777, -32177, -24742, 4230, 10203, -10187, -17277, 13668, 10174, -2975, 16157, -27279, -1360, -9112, -22624, -16806, -12081, 4547, -32033, -9303, -17371, -4917, -4209, 6495, -10455, -22221, 13069, 16399, 9784, 20088, 31003, 34249, 8710, 1123, 15931, 17711, 15189, 58493, 65998, 14165, -27672, 1892, 7459, -15616, -34073, -58511, -22237, -3205, 32437, 918, -11969, 6027]
869F027j1057K5494M458k4659K6249m84j5072J5757j7787J435r735P948r797M409
855C186j3106K6765j5383j0404J7282R927j1628P726n21j9546J0412j0314M413
842a191j0103J6400j2084J0766Q3n5841L881L3200L7489k0099J8826L8168k0289
829C9206r970Q086l7742K9835J1517l027M517l0834j2846P316j2350j2731J1660
816g363J3449nm7775j3541n031P1236J0158J0796j0284O577n025L90r419P186
802B1349J076J917n438K248J3092n005j4057L866K0472j3324j0705O256p461N705
788A9991l298o0q943j4899n565J1314L2402m1906R495J3018r045O571J0324k5049
774e650N563M3579o671k0857p242k6093N491K4175P240j4268j0263k259K593J4509
$$ y = [6027, -5030, 20464, 24922, 263, 26512, 26028, 10956, 26713, 8926, 10361, 626, 8574, -1223, 3186, -9920, 16845, 1462, -8942, 8340, 18267, 6639, 14365, 13844, -5702, 4710, -5604, -1191, -11294, 5106, -6978, 3788, 3871, -51970, -48089, -14889, 22600, 2501, 21327, 59495, 39206, 29236, 37322, -420, 29415, 40932, 37905, 42422, 11588, -1258, 6058, -6292, -19023, -7363, 6086, 6081, -41694, -55235, -60266, 10970, 21128, 31924, 21640, 28217, 23192, 23582, 14163, 21349, 22425, 24342, 18904, 21152, 34244, 29239, 15182, 19048, 39520, 26196, 15491, 21747, 14286, 19991, 16693, 16633, 7690, -7209, -12774, -1460, 30942, -10964, -1469, 11549, 2504, 9075, 19399, -5650, -87, 43492, 36821, 15964, 8722, -17371, -11880, 12295, 19535, 5267, -4996, -7255, -4662, 9847]
760I847K1292q709J9405k1173P51J331o788J0391p380k6775k3069M4570k08q096
746E389K9670p209j3321O819J2593L087r304l2469N6927n50m0257N0489j6163
733D5701k8449m4958J9116O916j5786K3558O282k1207j9974J1132K8038Q673j0404
720H638m601O807R521K417j0761K3864J7419L024l126n5953N326L6241k8106j1570
706h60j7084L5210Q407L243K1426m505l7160j5095j6371r504K6251j5331R109
693a2264K141K0143K5297J5023r055j0911l5752Q215J469P987Q970k5275m790
680h802N561K0853l0398l419K1405M654P221j2987L447P045j5234o516K3340j7807
666a637k4629J4297O280J0166O360O446J0077k1569J0545J6209o0753r386J2016
$$ y = [9847, 31139, 22430, 41835, 20662, 21413, 22744, 15956, 26347, 18967, -7808, -30877, 13693, 13485, 5389, 35059, 27850, 14529, 21348, 33941, 37028, 27724, -4745, 52182, 51632, 11375, 61864, 45701, 17252, -27706, -8590, -1674, -17460, 6098, 12380, -8827, -28801, -17669, 10369, 19042, 8638, 4037, 10844, 20365, 22782, 12021, 35885, 53304, 56328, 53202, -2751, 2575, 38816, 10710, -860, -17944, 17266, 25673, 28916, 50342, 45837, 8677, -6418, -22789, -32293, -6042, -21373, -12264, -10123, 10020, 35317, 50340, 41285, 30374, -5378, 2837, 4306, 12293, 21263, -4012, -8802, -3241, 17612, -12786, -16205, 5200, 9854, 17075, 4088, 7535, 14580, -654, -7170, 16170, -1637, -26266, -11969, -5689, 4477, 10837, 17283, 27360, 5791, 16336, 32545, -28208, -37594, -25578]
653b5578J775K5319K0407m432L0655L338m3222L187J7883J1486m8687P000M6410
640D5541m0596K155k1770L7003J5876J282j8521o080K0812m224j5973m7479J0467
627b1507M9336J8296l1893J1310j2123j6426K8785R39r283k5237K490J7453k6
614A2114J6809j807m868j3697L4290K7462k5814m3511Q94j1338q103q902M196
601b2275L1418J7940j0111r694K4939K1235l9569j9042J817O351p292j5992K3179
588B904K9842m0596J1989l19k0751J6488K6204k9681l181J2927K9912K8640R57
575F5335j8014l6094K353l934J666J5345K833j6683k674P671K1263k9006o68K8922
561C8315o008j2383j1553K7514P110m941l6253J8643J4329j7379K0373k8498k507
$$ y = [-25578, -23803, 1516, 21923, 17491, 48146, 51484, 8262, 11449, 29332, 40818, -7869, -869, 45541, 4945, 7100, -14670, 22333, 38209, 39491, 20970, 14890, 35702, 31478, 15505, -31974, -21507, 27829, 46125, 14232, 25542, 13419, -3007, 25778, 26717, 17434, -7803, -5313, 12140, 12114, 28923, 27116, 22248, 8551, 42841, 70303, 44489, 978, 1872, -9466, -17569, -26471, -22275, 9143, 27083, 16972, 7278, 32217, 53452, 13883, -5159, -3342, 3009, -4283, -20275, 2904, 32746, -7850, 4139, 3820, -16931, -443, 25761, -3920, -7101, 5826, 35738, 64378, 65335, 47321, 11227, 13580, 9646, 11312, 26657, 29490, 12807, 10133, 17804, 39067, 10061, 9393, 38315, 32307, 19924, 8371, 35885, 42995, 38054, 1801, 20444, 34773, 17394, 37767, 9269, 6762]
548F762O529K0425k202O219J69o51l2023K3170J5100j024k5105J2485q393l4742
534a3281N831j3378K5634L0406M85j8024Q172R500l3210Q303J0648J0373j6914
521A4545p36l1516j159o762q472N3848k203L694O122k0310P598L1474p966k5337
507A2820o478N3442j6665r888P958l1346K2543p788j1226m812k8067K1051K6478
494B8022l560k151O74j1971J4689J2348j9855m730P210o974k4454J5267K5249
481B9764j1242N254j0982m064L2341J2123l4811j4283N56Q557J8307m1814j4114
468b4408L5925L314P441J4404J458o546K1531k0129k0710J9436j1760K718L3671
455E6345l0603k2645k0068M3126J9642p838P738k7675J6392K6096l0826O819K3461
$$ y = [6762, 13291, 33716, 31514, 37733, 37902, 37251, 5228, 28398, 43498, 42474, 17369, 29854, 21461, -13281, -7450, -20828, 4806, 35212, 35697, 17673, 25845, 35345, 2135, 10438, 21086, 31459, 14545, 13809, -17707, -18866, -25628, -34100, 19748, 17545, 21239, 27361, 7051, 14649, 46123, 38157, 12820, 6342, 59784, 43119, 33231, 41189, 9843, 32386, 24598, 13372, 8560, -19507, 1544, 28022, 24462, 22311, 22985, 11014, 25703, 38051, 18196, 13466, 20676, 13702, -10752, 4515, 29764, 18522, 23776, 12794, 8730, 41071, 53194, 18383, 4100, 4656, 13213, 31520, -10294, -24408, 11517, 14831, 22272, 36676, 38134, 31588, 53119, 32990, 12280, 31716, 19956, 22674, 56345, 25742, 3097, -16971, 26155, 45797, 37959, 45697, 18022, 34414, 60510, 29684, 36503, 59964]
442E9964j4125j4686j1113J1991K285L1879j9118K1425q806k0378R392p573r577
429C1560l0342J2776P327p330l1478J3109J5000J3997j112j436J9682j1961k0693
416I099m1896N7418L0278j8009j9097K5013L593l636R850j7564k8668Q1j8544
403a2082L227J5054J6691j3425K6332K7243j351l4965L0362j6948k2418L051k0676
390I5L8066l4654j4322j6191N2086j5179k8686O2987K1524l1933J3482p603L685
377D3357j8229l848n419J3637r863J6047p078k2003M1166k5786k2475O324r755
364c925k5963K4740L5617r188K206j2793J3846K0490q024l756p103r658k79J6606
350C2816k6689j3260K3210q488q375J0802L1750J7316j5213q191l243l547J152
$$ y = [59964, 45839, 31153, 20040, 32031, 34316, 66195, 47077, 68502, 59696, 39318, 48710, 41137, 31560, 1218, 13994, 21321, 13991, -17487, -4378, 10622, 24619, 23507, 22071, 41753, 29792, 9099, -32797, 24621, 54899, 36890, 17793, 42806, 46399, 42763, 52613, 35049, 6381, 6462, -12082, -8855, 6199, 22890, 9465, 35797, 63040, 61689, 26724, 57086, 40138, 17720, 20771, 95, 38161, 3507, -10815, -27006, 25080, 9901, -18785, 44202, 65726, 33793, 47275, 39672, 43357, 25128, 21280, 15861, 29498, 19635, 35682, 28604, 6601, 47767, 21981, -494, 5830, -3925, -29888, -5148, 30469, 21281, 23487, 10694, 24540, 45030, 37006, 33250, 26147, 16489, 16210, 32816, 6127, -7133, 16077, 7589, -786, 10016, 41766, 59082, 43869, 35678, 32435, 28888, 30040]
337C0040p466M1191k623J1400q680k4955L548N297o996k5633j9594j0325J4617
324a79K5114n287L8936K91l5257L905L4752k0386m7140J528L7273J1030J5692
311F0272M197m2682o290m259J5456j1101J3670K6822K7087n1321N571L3071m4897
298B5596k198n32j1519O367k2655j8356J7963M0839j0608M650j6887M435N451
285B2546m6214k327L1236L0189q882k2921K8209K6565j2003k7162n480p182L3118
272C9692j1439n150j516K6138N926m1073j561j5228n640J4229J612L0528p147
259B9371j4018R756j7463K2726M349L079J2590k7544l1592R492k632K8001M3892
246G0007m901l1497k7533j88M90k082k1838M1151J3353K0725M542k5575K3507
$$ y = [30040, 22574, 63765, 61142, 72542, 63862, 38907, 42455, 47752, 40756, 15123, -4471, -14796, -179, 24935, 19648, 58584, 58875, 23618, 27523, 62275, 41889, -5251, -3723, 33550, 44580, 60272, 64469, 21787, 15497, 11238, 26694, 15593, 29263, 56085, 83172, 31851, 37422, 70493, 25596, 23398, 22866, 11347, 17714, -4941, -23297, -5334, 35505, 24897, 29547, 12660, 17095, 22546, -23668, -25995, 5241, 35430, 26548, 3627, 31836, 58401, 46398, 19236, 13756, 6574, 39692, 28253, 23103, 21587, 47725, 53651, 12578, 11017, -4211, -9851, 4378, 5990, 36518, 29371, 15353, 25109, 7646, 30372, 34721, 37800, 50390, 22846, -8746, 746, -1886, 26115, 70007, 65106, 33609, 6076, 5888, 6378, 4296, -17542, 23609, 36962, 57687, 62229, 36654, 60161]
233F0161Q214l4497q589K9790J4192k1094q675k5497j20N899p669L7385l725q82
219D4893j6849J2657N151K2508O544k4192k3725q229M7829r587m1406j0365L7895
206D3124p096k5379L6842J4877l8767J2187K222j4932j1953j1499m152j248L4574
193B8800j5899l326q03K6421k6063J195R42R435j7849L065Q563M5108n915o912
179D6762j4050j6954J3707O817j6597k8639L5473K5923j2990L20N746n217K7984
166F8285k4213j8381M399j5574N094P291L4224j6208l0540O445o531K3250J3627
153E1168m778J2473k471m7186Q561K5992J3232K804M29R53j7609j4553j2812p185
139I018N165K5539p632k7933K1304J6609J0277j488l7035P526J1620k5327K000
$$ y = [60161, 68375, 33878, 25289, 55079, 69271, 48177, 39502, 14005, 13885, 19784, 12115, 49500, 45775, 44893, 28044, 40701, 45852, 68360, 74904, 50712, 26987, 18758, 66587, 57000, 15594, 5229, 43124, 36028, 10649, 47491, 62368, 23601, 35788, 38010, 23078, 11125, -374, -4526, -5774, 28800, 12901, 9575, 8772, 35193, 9130, 10325, 11267, 20702, 2853, 5918, 14481, 59589, 53674, 46762, 32712, 15758, 29465, 36282, 19685, -8954, 26519, 52442, 39452, 39772, 45518, 40301, 68285, 44072, 25691, 30090, 14516, 19610, 26901, 61125, 44917, 14377, 20822, 14291, 37541, 51168, 46390, 58863, 56392, 9206, 17767, 43759, 56991, 59795, 60224, 61177, 43568, 29015, 16203, 9018, 14183, 39722, 32090, 4157, 25461, 42070, 52347, 50859, 13824, 21350, 32970, 7643, 9643]
126I643N988J6552l8321m591J1847J3414J1054L888J3648j8640K533K8742R273
113F5030K509j6579M118j8730k7171J1618K2534N391l2872j311L2938k8198O459
100B5736J0594l9112K7000L0226J2554j4936J4900j1899K431P131r216j0005J1709
87E7113j1404l8328J8816J4141j1297m543R754M612o036O045Q968j4343k1157
74A2341j7671K7624m895J2551p158K594J2949j5360K1966l070j5441K1729j5582
61C2577P713j0823k9928J8263O879j8736O961R837R523J738K623J9766k078l105
47E1210j9901O777q220j090K1759N955r067j0499k326l453L429Q940k44o800K253
32C8723k658r422J0135O711j5445j1986K4680K480k7205K2738P111J552J6744
$$ y = [9643, 15631, 32183, -6138, -10729, 1118, 14532, 25586, 29474, 43122, 24482, 27015, 55757, 65030, 67539, 50960, 55078, 36348, 9177, 20795, 43329, 48720, 15848, 14537, 47475, 19277, 25736, 36330, -2782, 24218, 54444, 66998, 52062, 66962, 55063, 57494, 64625, 55409, 45404, 57113, 45709, 7381, 26197, 40338, 29041, 24498, 34252, 38864, 32828, 38873, 47841, 33498, 12341, -5330, 22294, 17399, 29950, 22792, 25386, 38335, 22975, 44941, 41871, 26430, 48159, 32577, 40290, 29467, -461, 17802, 24681, 5945, 12906, 22743, 32266, 34004, 36627, 56393, 54315, 51210, 31309, 38086, 29866, 28776, 50535, 56490, 47423, 36924, 34598, 31145, 34574, 43514, 43270, 36470, 38723, 36065, 26643, 36778, 43489, 28044, 16058, 40738, 43218, 16013, 38751, 45862, 47414, 64158]
19F4158j2010j6107n452k7609K3300n759k042R519m494J6043j7506J2826K7689
6F2556p796j0890j7226Q402P892J0198
0E3136
$$ y = [64158, 52148, 36041, 30589, 2980, 26280, 20521, 18479, 27998, 23504, 39547, 22041, 34867, 62556, 54760, 43870, 26644, 35046, 42938, 53136]
$$ Imaginary data points
##PAGE= N=2
##DATA TABLE= (X++(I..I)), XYDATA
16383a516825M4115K5932M549J1292J1779J4415K0047M1847J5947K9345J8159
16372a279398J5993q412K201L7877M9853R399J5828L5720K0647o873J5497J9721
$$ y = [-1516825, -1472710, -1446778, -1442229, -1430937, -1419158, -1404743, -1384696, -1342849, -1326902, -1297557, -1279398, -1263405, -1271817, -1269616, -1231739, -1181886, -1172487, -1156659, -1120939, -1100292, -1107165, -1091668, -1071947]
$$ [...]
##END NTUPLES=NMR SPECTRUM
##END=
