##TITLE=1H_CA-9267-3
 CDCl3
 8 sc, 
 8.5.2024
##JCAMPDX= 6.0         $$ Bruker NMR JCAMP-DX V2.0
##DATA TYPE= NMR SPECTRUM
##DATA CLASS= NTUPLES
##ORIGIN= UXNMR, Bruker Analytische Messtechnik GmbH
##OWNER= root
$$ XWIN-NMR		Version 3.5
$$ Wed May  8 14:00:28 2024 Russian Standard Time (UT+4h)  she@DPX200
##.OBSERVE FREQUENCY= 200.1309
##.OBSERVE NUCLEUS= ^1H
##.ACQUISITION MODE= SIMULTANEOUS
##.ACQUISITION SCHEME= undefined
##.AVERAGES= 8
##.DIGITISER RES= 18
##SPECTROMETER/DATA SYSTEM= spect
##.PULSE SEQUENCE= zg30
##.SOLVENT NAME= CDCl3
##.SHIFT REFERENCE= (INTERNAL, CDCl3, 0, 16.4312)
##AUDIT TRAIL= $$ (NUMBER, WHEN, WHO, WHERE, WHAT)
$$ ##TITLE= Audit trail, XWIN-NMR		Version 3.5
$$ ##JCAMPDX= 5.01
$$ ##ORIGIN= Bruker BioSpin GmbH
$$ ##OWNER= she
$$ F:/spectra/data/she/nmr/H-F/1/pdata/1/auditp.txt
$$ ##AUDIT TRAIL=  $$ (NUMBER, WHEN, WHO, WHERE, WHAT)
(   1,<2024-05-08 13:59:17.32 +0400>,<she>,<DPX200>,
      <created by zg, POWCHK disabled, PULCHK disabled
       configuration hash MD5:
       00 E9 B6 7A A2 85 ED C7 34 08 36 98 17 FE 4E 26
       data hash MD5: 16K
       29 4A 0D B3 83 01 A7 BB 2F 56 7E 38 09 D4 AF 92>)
(   2,<2024-05-08 13:59:19.87 +0400>,<she>,<DPX200>,
      <Start of raw data processing
       efp BC_mod = 2 LB = 0.24 FT_mod = 6 PKNL = 1 PHC0 = -25455.06 PHC1 = 9.987491 SI = 16K 
       data hash MD5: 16K
       29 85 2C 06 21 65 08 CC 04 32 2C 85 2B 88 96 A9>)
(   3,<2024-05-08 13:59:33.34 +0400>,<she>,<DPX200>,
      <pk PHC0 = -0.9170597 PHC1 = 0 
       data hash MD5: 16K
       36 81 47 B3 A7 12 A7 CB 6A FC 37 97 70 50 F1 63>)
(   4,<2024-05-08 13:59:37.10 +0400>,<she>,<DPX200>,
      <abs ABSG = 5 
       data hash MD5: 16K
       22 45 0E 07 F0 95 BD 72 91 4F 73 D8 D7 03 B9 6D>)
$$ ##END=
$$ 
$$ hash MD5
$$ 4C F2 07 BC 3B 0A 37 9C 2E 7A 96 5D 7D B1 F5 36
##$RELAX= 
##$RELAX= 
##$RELAX= 
##$RELAX= 
##$RELAX= 
##$RELAX= 
$$ Bruker specific parameters
$$ --------------------------
##$DU= <F:/spectra>
##$EXPNO= 1
##$NAME= <H-F>
##$PROCNO= 1
##$TYPE= <nmr>
##$USER= <she>
##$AMP= (0..31)
100 100 100 100 100 100 100 100 100 100 100 100 100 100 100 100 100 100 
100 100 100 100 100 100 100 100 100 100 100 100 100 100 
##$AQSEQ= 0
##$AQ_mod= 1
##$AUNM= <au_zg>
##$AUTOPOS= <>
##$BF1= 200.13
##$BF2= 200.13
##$BF3= 200.13
##$BF4= 200.13
##$BF5= 200.13
##$BF6= 200.13
##$BF7= 200.13
##$BF8= 200.13
##$BYTORDA= 1
##$CFDGTYP= 0
##$CFRGTYP= 5
##$CHEMSTR= <none>
##$CNST= (0..31)
1 1 145 1 1 1 1 1 1 1 1 1 1 1 1 1 1 1 1 1 1 1 1 1 1 1 1 1 1 1 1 1 
##$CPDPRG= <>
##$CPDPRG1= <>
##$CPDPRG2= <>
##$CPDPRG3= <>
##$CPDPRG4= <mlev>
##$CPDPRG5= <mlev>
##$CPDPRG6= <mlev>
##$CPDPRG7= <mlev>
##$CPDPRG8= <mlev>
##$CPDPRGB= <>
##$CPDPRGT= <>
##$D= (0..31)
0 1.2 0 0 0 0 0 0 0 0.06 0 0.03 0 0 0 0 0.0002 0 0 0 0 0 0 0 0 0 0 0 0 
0 0 0 
##$DATE= 1715162356
##$DBL= (0..7)
120 120 120 120 120 120 120 120 
##$DBP= (0..7)
150 150 150 150 150 150 150 150 
##$DBP07= 0
##$DBPNAM0= <>
##$DBPNAM1= <>
##$DBPNAM2= <>
##$DBPNAM3= <>
##$DBPNAM4= <>
##$DBPNAM5= <>
$$ [...]
##$SUBNAM3= <"">
##$SUBNAM4= <"">
##$SUBNAM5= <"">
##$SUBNAM6= <"">
##$SUBNAM7= <"">
##$SUBNAM8= <"">
##$SUBNAM9= <"">
##$SW= 18.0517689322627
##$SWIBOX= (0..15)
0 0 2 0 0 0 0 0 0 0 0 0 0 0 0 0 
##$SW_h= 3612.71676300578
##$TD= 16384
##$TD0= 1
##$TE= 0
##$TE2= 300
##$TE3= 300
##$TEG= 300
##$TL= (0..7)
0 120 120 120 120 120 120 120 
##$TP= (0..7)
150 150 150 150 150 150 150 150 
##$TP07= 0
##$TPNAME0= <>
##$TPNAME1= <>
##$TPNAME2= <>
##$TPNAME3= <>
##$TPNAME4= <>
##$TPNAME5= <>
##$TPNAME6= <>
##$TPNAME7= <>
##$TPOAL= (0..7)
0.5 0.5 0.5 0.5 0.5 0.5 0.5 0.5 
##$TPOFFS= (0..7)
0 0 0 0 0 0 0 0 
##$TUNHIN= 0
##$TUNHOUT= 0
##$TUNXOUT= 0
##$USERA1= <user>
##$USERA2= <user>
##$USERA3= <user>
##$USERA4= <user>
##$USERA5= <user>
##$V9= 5
##$VALIST= <valist>
##$VCLIST= <CCCCCCCCCCCCCCC>
##$VD= 0
##$VDLIST= <DDDDDDDDDDDDDDD>
##$VPLIST= <PPPPPPPPPPPPPPP>
##$VTLIST= <TTTTTTTTTTTTTTT>
##$WBST= 1024
##$WBSW= 4
##$XGAIN= (0..3)
0 0 0 0 
##$XL= 0
##$YL= 0
##$YMAX_a= 93066
##$YMIN_a= -93751
##$ZGOPTNS= <>
##$ZL1= 120
##$ZL2= 120
##$ZL3= 120
##$ZL4= 120
##$ABSF1= 16.56888
##$ABSF2= -1.483025
##$ABSG= 5
##$ABSL= 3
##$ALPHA= 0
##$AQORDER= 0
##$ASSFAC= 0
##$ASSFACI= 0
##$ASSFACX= 0
##$ASSWID= 0
##$AUNMP= <proc_1d>
##$AZFE= 0.1
##$AZFW= 0.1
##$BCFW= 0
##$BC_mod= 2
##$BYTORDP= 0
##$COROFFS= 0
##$CY= -3
##$DATMOD= 1
##$DC= 0
##$DFILT= <>
##$DTYPP= 0
##$F1P= 0
##$F2P= 0
##$FCOR= 1
##$FTSIZE= 16384
##$FT_mod= 6
##$GAMMA= 0
##$GB= 0
##$INTBC= 1
##$INTSCL= 3.70164e-10
##$ISEN= 128
##$LB= 0.24
##$LEV0= 0
##$LPBIN= 0
##$MAXI= 10000
##$MC2= 0
##$MEAN= 0
##$ME_mod= 0
##$MI= 1.114404
##$NCOEF= 0
##$NC_proc= -6
##$NLEV= 6
##$NOISF1= 3.799351
##$NOISF2= 2.8
##$NSP= 0
##$NTH_PI= 0
##$NZP= 0
##$OFFSET= 16.43115
##$PC= 1
##$PHC0= -25455.98
##$PHC1= 9.987491
##$PH_mod= 1
##$PKNL= yes
##$PPARMOD= 0
##$PSCAL= 0
##$PSIGN= 0
##$REVERSE= no
##$SF= 200.129418000616
##$SI= 16384
##$SIGF1= 3
##$SIGF2= 2
##$SINO= 5.538805
##$SIOLD= 16384
##$SREGLST= <1H.CDCl3>
##$SSB= 0
##$STSI= 16384
##$STSR= 0
##$SW_p= 3612.71676300577
##$SYMM= 0
##$S_DEV= 0
##$TDeff= 16384
##$TDoff= 0
##$TI= <>
##$TILT= no
##$TM1= 0
##$TM2= 0
##$TOPLEV= 0
##$USERP1= <user>
##$USERP2= <user>
##$USERP3= <user>
##$USERP4= <user>
##$USERP5= <user>
##$WDW= 1
##$XDIM= 16384
##$YMAX_p= 470040483
##$YMIN_p= -166448
$$ End of Bruker specific parameters
$$ ---------------------------------
##NTUPLES= NMR SPECTRUM
##VAR_NAME=  FREQUENCY,     SPECTRUM/REAL,   SPECTRUM/IMAG
##SYMBOL=    X,             R,               I
##VAR_TYPE=  INDEPENDENT,   DEPENDENT,       DEPENDENT
##VAR_FORM=  AFFN,          ASDF,            ASDF
##VAR_DIM=   16384,         16384,           16384
##UNITS=     HZ,            ARBITRARY UNITS, ARBITRARY UNITS
##FACTOR=    0.220516191357247, 1,           1
##FIRST=     3288.35657391757, 0,            0
##LAST=      -324.360189088197, 0,           0
##MIN=       -324.360189088197, -166448,     0
##MAX=       3288.35657391757, 470040483,    0
$$ Real data points
##PAGE= N=1
##DATA TABLE= (X++(R..R)), XYDATA
$$ [...]
8367c4213K864M357K468J280K5533R333j346l264j6932J2750K1434Q201n3362
8354b0897N353K2214n727M219m5433K8316J4876J328m8938j3860J3408L4345J7340
8341F544j1927J5711R373o546j9724j7813J2686l0220Q176M7435k4251N802N496
8328G42L993o053n6880p375L9152P566N982k6774L0778J0379K048K1656l9048
8315a3834n46R813N985q271l9790M0877J7245N347O663j9359K2157K842j9245
8302I884k1118l899K4626o893J1596J4278M343J4880l313m1393o2828m332K6680
8289c7489O0745R361n925j4644j1509J0423J4558n32j3622j2419k7039K1558j2415
8276a8949L7755l5221j9024K5106K0248q835k2477L794O153P933J0839j7652J1251
$$ y = [-34213, -31349, -26992, -24524, -23244, 2289, 11622, 10276, 7012, -9920, 2830, 24264, 32465, -20897, -15544, 6670, 943, 5162, -40271, -11955, 2921, 4249, -44689, -58549, -45141, -10796, 6544, -5383, 10328, 19701, 13155, -6569, -24382, -11696, -41916, -33740, 13695, -10556, -4754, 742, 4735, -1318, -58198, -65573, -26421, -18855, -12873, -39647, -8869, 1510, 3558, 25214, -13834, -14380, -4567, 1418, -6853, -46643, -5766, 11479, 16826, 23489, 4130, 26287, 29129, 9884, -11234, -15133, 9493, 2600, 14196, 28474, 32817, 47697, 44384, 2991, -59837, -64169, -37489, 23256, 32617, 26692, 12048, 539, 10962, 25520, 24988, 11366, -1053, -28092, -6534, -18949, 18806, -16415, -35439, -10333, 9915, 1080, -21397, -17603, -11450, -3517, 7322, -10330, 921]
8263I21K1931K3695m0267j5578j7638P881J9434l5693J0174N0912J2685j3307
8251B5150l086r236m374J0212K5206k4197K589j497K3147j393j3585j670K976
8238C0242L8868M567r036j1954l4328l0855J5770K531K10L4260K3728n475p870
8225E0658J708J3240k6872R922K4970m1140J4378R857k8515j2368L4911j9961
8213C0788J5657J1476P187l6441j7205j3365J8529n235m481J8874L5223k941J9651
8200G7717K0820K1146J1222K9682j3378Q3233k8001J07327R1339l82327O1289
8189H0069o242L88J0669l4701j5162m574K8615j3668k7347L3931J4971j0975J4381
8176G0355k3463L0317q915l7337j6891M4892L5380l647j9793J2109N136j8059
$$ y = [921, 22852, 46547, 6280, -9298, -26936, -19055, 379, -35314, -25140, 25772, 38457, 25150, 22064, 12828, 8454, 18666, 43872, 19675, 22264, 20767, 43914, 42521, 28936, 27266, 30242, 69110, 73677, 64641, 52687, 18359, -12496, 3274, 5805, 6015, 40275, 64003, 58528, 50658, 52366, 65606, 38734, 48656, 73626, 32486, 46864, 56721, 28206, 15838, 50749, 30788, 46445, 57921, 65108, 28667, 11462, -1903, 16626, 11391, 6910, 25784, 61007, 58066, 77717, 98537, 119683, 130905, 160587, 147209, 230442, 202441, 309768, 401107, 18780, 80069, 73827, 74215, 84884, 50183, 35021, 30447, 59062, 45394, 18047, 51978, 66949, 55974, 70355, 46892, 77209, 68294, 30957, 14066, 58958, 94338, 90691, 70898, 83007, 88143, 70084]
8164G0084M052M461k9159P011J6013R165N283R20P555j4246n220J7306J6104K5902
8150A35231J76k5918j561N8428N863k6735j485K6860j9718K7037O1826L0230j6462
8137B53772J0068L7605j0553k0333N9605K4672n3969L6425J4834q092J201l8276
8125C06959M7813K7663m330j3264J8930K9908N1272K307J9354M1484J931P9485
8113F09512N2416K0245N7450P2777Q9143N4638P8472R5127R1179J61320J71978
8102A554257J55386J24530J40869J91844K54705K78440K92226L46177L16804M34804
8092D090042N30839N65165N79171O83925Q57882Q99720N94392q5876n69216r65638
8082G180406j007371r60129q60784o53847n10431l60409k81919k08386k06630
$$ y = [70084, 74136, 78597, 49438, 56449, 72462, 81627, 86910, 87830, 95385, 81139, 75919, 93225, 109329, 135231, 135407, 109489, 107928, 166356, 172219, 145484, 143999, 170859, 151141, 178178, 240004, 270234, 253772, 263840, 301445, 290892, 270559, 330164, 354836, 300867, 337292, 352126, 344034, 345235, 306959, 354772, 382435, 378105, 364841, 383771, 413679, 464951, 467258, 486612, 528096, 530027, 609512, 661928, 682173, 739623, 812400, 901543, 956181, 1034653, 1129780, 1220959, 1382279, 1554257, 1709643, 1834173, 1975042, 2166886, 2421591, 2700031, 2992257, 3338434, 3655238, 4090042, 4620881, 5186046, 5765217, 6449142, 7307024, 8206744, 8801136, 8715260, 8146044, 7180406, 6173035, 5212906, 4352122, 3698275, 3187844, 2827435, 2545516, 2337130, 2130500]
8073B130500j88648j75060j32929j42095r7537q4847p7853p8441o7640p8665n7039
8062I49746o115k8935l2596n0215o6978j8324K2901k7788l4587m2883K3814o3438
8050F24602l9015j7504j8642j6603j1116m0077k7900J9620n064j9057l8929k861
8038D07454O5k4334n308N459J3909l0797P351N527j7744m0884l9366J0561K2771
8025C14664j333j0002j9031k6509O017m715j2580l4991j571K9447p55k2464j7135
8012A99042K1304o81o958n1272j5281l18J7363J4579j0222L951m003k298Q390
7999A73596l628l0703j1269M852M0157m169n19k3405j2043R469j5372l025l957
7986A19984K4864M1642n843k6740k9513K2190j2515j6475O027m113l2801j313
$$ y = [2130500, 1941852, 1766792, 1633863, 1491768, 1394231, 1309384, 1231531, 1153090, 1085450, 1006785, 949746, 943631, 914696, 882100, 831885, 764907, 746583, 769484, 741696, 707109, 664226, 688040, 624602, 585587, 568083, 549441, 532838, 521722, 481645, 453745, 473365, 468301, 449244, 410315, 407454, 407519, 383185, 377877, 383336, 397245, 366448, 373799, 379326, 361582, 320698, 281332, 291893, 314664, 313331, 303329, 284298, 257789, 263806, 259091, 246511, 211520, 209949, 239396, 238641, 216177, 199042, 220346, 219665, 212707, 161435, 146154, 145836, 163199, 177778, 167556, 171507, 167504, 165206, 173596, 169968, 139265, 127996, 132848, 173005, 168836, 168317, 144912, 132869, 142338, 126966, 123941, 119984, 144848, 186490, 180647, 153907, 124394, 146584, 134069, 117594, 123621, 119508, 86707, 85394]
7974H5394K7286L3928l0980n2113J7641K1569J4974j9430k0541k972K1444k5603
7962G0597k6987J305J5158M498J9300k7173l1056M6420m1424R652J2681k1368
7950C1603J8173q990j484O40K4491J8292N330k1257m156J7131k7583J9393k7288
7937D4295M7O648j1374j7959K247J590K262K5667p513L260r412o661j4613K4128
7923D2612j7088l2631L7598N169k2177n662k2887J3578L203l829K9062r204p59
7910A6985J0805P365j721k2400m014J0599j6262l5013L2767L1413l0949k96J5864
7897A5143N878k4813k6890J3947J7712J1580K4540n4639Q068J9030j9733K330
7885g847N85K2191j7112k2845M2876k343j3478N157p507J7738j9900J2549N205
$$ y = [85394, 112680, 146608, 115628, 63515, 81156, 102725, 117699, 98269, 77728, 74756, 96200, 70597, 43610, 44915, 60073, 64571, 83871, 56698, 25642, 72062, 30638, 40290, 52971, 31603, 49776, 40786, 39302, 39942, 64433, 82725, 88055, 66798, 62642, 79773, 52190, 71583, 44295, 44342, 50990, 39616, 21657, 23904, 25494, 27756, 53423, 45910, 49170, 39758, 33097, 18484, 42612, 25524, -7107, 30491, 35660, 13483, 7821, -15066, -1488, 1715, -2114, 26948, 17744, 16985, 27790, 35155, 33434, 11034, 7020, 17619, 1357, -33656, -889, 30524, -425, -721, 15143, 21021, -3792, -30682, -16735, 977, 12557, 37097, -17542, -9474, 9556, -10177, -7847, -7262, 14929, -2183, -25028, 17848, 15505, 2027, 7184, -323, 17415, -2485, 10064, 15269]
7872A5269l1655j0420M837J1105K1866L1365k4545l430k3838l6373M3170N436
7860B787O656R939L404j5974n4864O413L5669k2413J005O501M602K085M101L531
7846f558J1787j2756j7026K3546J7327k499j0695j4951K6085R489m1693l009J7740
7833c213M1011l1460k4955r594j1934J7352O815J511j7566K5041K508K723P145
7820E384L694p787k2367J5220k0118K7147R604j5217k9783Q208M574L0385k8599
7807a9655j8061P363J7906l0908K8486J1660j29827J19461K2807p755K3531J656
7795B6664L050j7190j7200L74K3452j3761j2221m344j2660K0246J2229K4277q866
7782B4050l4102P298L6582m3469j4640MP960N2349r992j6704n461j5185k2331
$$ y = [15269, -16386, -26806, -21969, -10864, 11002, 42367, 17822, 14392, -9446, -45819, -2649, 2787, 9443, 19382, 22786, 6812, -48052, -41639, -5970, -28383, -27378, -20877, -16275, -14190, -10089, -6558, 5229, -7527, -24553, -1007, 16320, 13821, 3126, -11825, 14260, 23749, -17944, -20953, -3213, 37798, 6338, -18617, -28211, -40145, -22793, -15978, -14467, -32033, -6992, -4484, -1761, 5384, 9078, 1291, -21076, -5856, -25974, 1173, 10777, -4440, -34223, -26015, -21441, 8944, -19655, -37716, -30353, -12447, -43355, -14869, -3209, -133036, -13575, 9232, 1477, 25008, 26664, 29714, 12524, -4676, -4302, 19150, 5389, -6832, -11176, -23836, -3590, 8639, 32916, 24050, -10052, -2754, 33828, -9641, -24281, -24277, -16317, 36032, 26040, 9336, 3875, -11310, -33641]
7769c3641J1414K3817k7662L9009J4657l5974n723J1756k1222R941O728r583j4654
7756c1137K9378j3746J023K8882O612l6289j8780K7994r278m9863J6744K1793
7744b6667J3596K031j4219Q234K04J2973o601j9816j5164K2166j91J3098K1570
7731A1214J9759k4887j1955K3472J6813j3716q825k2351J1826Q635l650r962k112
7718e739k0571J956J6789k0279k321R903j4380K5494j400k760K143J5509Q804
7705A3148n212k6950K7882k5224m448j1436M1851l264k3246k9976L756M900L4386
7692c833J5504j4420K8818o408l4869q678M370j3772K2707K1772J859L293j881
7679A4462L499N545k5196J1105P627l2491l6558J3324L8726j1885J9251P567k508
$$ y = [-33641, -22227, 1590, -26072, 12937, 27594, -8380, -14103, -2347, -23569, -13628, -6900, -16483, -31137, -1759, -15505, -14482, 14400, 21012, -15277, -34057, -6063, -15341, -65204, -48460, -26667, -13071, -11040, -25259, -17025, -16821, -3848, -10449, -30265, -45429, -23263, -23454, -10356, 11214, 30973, 6086, -5869, 17603, 34416, 20700, 11875, -10476, 1350, 9985, 6335, -3627, -5739, -26310, -24354, -7565, -27844, -30165, -20262, -34642, -9148, -10548, -13308, -11165, 4344, 13148, 7936, -19014, 8868, -16356, -20804, -32240, 9611, 6347, -16899, -46875, -43119, -38219, -3833, 11671, -2749, 26069, 19661, -15208, -23886, -19516, -33288, -10581, 11191, 13050, 16343, 14462, 17961, 23506, -1690, 9415, 17042, -15449, -52007, -38683, 43, -11842, 7409, 14976, 12468]
7666A2468L808k7092n785M110N372l7018Q999M6788j1576j2003K7135k1801l403
7653i998N698m14J3284J3039j9188j3755J1377m253K839j1684k416J6297j4943
7640a4117K937j3381j0934K0968N9912j4888j977k3287k4505p698K0292j7570
7628b4248M299L249K3592l4033J592M6341L0450l1863j0285r780j3129k763J4978
7615a600J2854k612K4696L62j2770l9128L789K0491j3556j8519J5204k5107L1068
7602d828M146j1673p881j6733K5489K6136j6115K6420k3999K2013M277l351N70
7589B4471J9407l7708j5439p876l84R08m6235n067M1118J5809l2400N612p287
7576d5071N403K8176K0625m4270m41J4221L2028k7722K1905m0858j1583J4572
$$ y = [12468, 16276, -10816, -16601, -12491, -7119, -44137, -35138, 11650, 74, -11929, 15206, -6595, -9998, -4300, -4714, 8570, 21609, 2421, -11334, 43, -4210, -1371, -13055, -15471, 826, -14117, -11180, -24561, -35495, -14527, 45385, 30497, 28520, 5233, -19272, -26970, -6678, -24248, -19949, -16700, 6892, -27141, -25549, 20792, 51242, 19379, 9094, -686, -13815, -16578, -1600, 11254, 8642, 33338, 33700, 20930, -18198, -14409, 6082, -7474, -25993, -10789, -35896, -4828, -682, -12355, -20236, -36969, -11480, 14656, -1459, 24961, 962, 22975, 27252, 23901, 24471, 43878, 6170, -9269, -17145, -17529, -16621, -62856, -67923, -26805, -10996, -43396, -37784, -45071, -39668, -11492, 9133, -35137, -35578, -21357, 10671, -17051, 4854, -36004, -47587, -33015]
7564c3015j8261J3794O875K1198M3426k9660L2347j7341j9762O266j6579J5064
7552D352o130j2477k0134n031J4685j0987j6863K5722J3756M1003J2874j9341
7540B1429j9115k3971m129j670k582k929K6238K6950L635K6804m0680J467k3991
7527a2544J5184K0435K7490k5248K4133p110l4335k8969K0071K5925k978o717
7515A5337R682j5719p432n091l1323K4573J2539k3347j2637L8618k4066J5608
7503c258L6054l2375j4988m884J2234M869L822j5354K847q140k0358J6654R567
7490a3310J2443J0221K22j0110J629k33L4387j4231j1574n4845N672J2160k2972
7477e0541N4384K285J7019q835r981j2434l9650K4765Q899J0629m325j5584j9311
$$ y = [-33015, -51276, -37482, -30607, -9409, 34017, 4357, 36704, 19363, -399, 5867, -10712, 4352, -1778, -14255, -34389, -39420, -24735, -35722, -52585, -26863, -13107, 27896, 40770, 21429, 2314, -21657, -25786, -27456, -30038, -32967, -6729, 20221, 23856, 50660, 9980, 11447, -12544, 2640, 23075, 50565, 25317, 49450, 42340, 8005, -20964, -893, 25032, 22054, 15337, 25019, 9300, 1868, -3223, -34546, -9973, 2566, -20781, -33418, 5200, -18866, -3258, 32796, 421, -14567, -19451, -7217, -2348, 1474, -13880, -11033, -19173, -39531, -22877, -13310, -867, 9354, 9576, -534, 1095, 862, 35249, 21018, 9444, -45401, -39729, -27569, -50541, 3843, 6128, 23147, 14312, 4331, -8103, -47753, -22988, -14089, -3460, -7785, -23369, -42680]
7464d2680K2128N578L9684K6255l9746J497q759q080K2037n943O337j027m8345
7451c1064j024K6810j0328M2761J4241o9435l3484K8400N2820K3801K7134m296
7439F6336j6986k7712R80n603J694M779j1391j2875M364K5564K5959L9606l4793
7426E9922j637j094k1311M373k9868j6941j9394K8515q781j7493J6970N6093J892
7413E1246j9754J281J4375l1901K6558J1385k7684m134k5102q096j051L5675J2890
7400C5688j7462M230K1776j5535L9818q349K1367M51l716k1738j8265k4346O847
7387B0766K2147k7673j9926L5704L4150j2078m4901N613M3009J3881J5123l7565
7375D8250K299k3954L598j3165K1629j4978L4951n706k5566K5625p280l3033Q727
$$ y = [-42680, -20552, -14974, 24710, 50965, 11219, 12716, 3957, -4123, 17914, 11971, 18308, 17281, -31064, -32088, -5278, -15606, 27155, 41396, -28039, -61523, -33123, 19697, 43498, 70632, 66336, 49350, 21638, 22618, 17015, 18709, 23488, 12097, -778, 3586, 29150, 55109, 94715, 59922, 58285, 57191, 35880, 40253, 10385, -6556, -25950, 2565, -6216, -23709, -6739, 49354, 51246, 31492, 32773, 47148, 15247, 41805, 53190, 25506, 21372, -3730, -11826, -12877, 22798, 35688, 18226, 22456, 44232, 28697, 68515, 60166, 81533, 81984, 78268, 56530, 38265, 13919, 20766, 42913, 15240, -4686, 31018, 65168, 53090, 8189, 13802, 56811, 70692, 85815, 48250, 50549, 26595, 30193, 17028, 38657, 23679, 58630, 52924, 27358, 52983, 45703, 12670, 21397]
7362B1397M5964n2588J9283m130K23L864j9720O294q78K9584p180m6418p084k7515
7348c8904K4256M4762J937k0343J1481K676l1515j5656L7467J5367M02j6331K6683
7335D2282k547j9137L0452J5175r561K5129j5840j1977l2543K2960J351j1562
7323C4182l5117k4856L1746J2222J37l2352J139J2009L1005j2097J5231k6042
7311G207m68K985M663k2123J7226K0890k5860L374j2074j7133m547q2J0659j7981
7297c3264P883K6557j8236J1598m545k1877J4438K7368K2013j8418k9742P523
7285h702M027J6550l585m0186J4979J9608L689k3462K0337K4678j0401J4436l2025
7272e7j4688J6916j5322J5783l736J6649q94l0166k0038M1705l0188R938j317
$$ y = [21397, 67361, 14773, 34056, 29926, 30149, 34013, 14293, 20587, 19709, 49293, 42113, -4305, -11389, -38904, -14648, 30114, 32051, 11708, 23189, 25865, -5650, -21306, 16161, 31528, 31930, 15599, 42282, 39735, 20598, 51050, 66225, 56664, 81793, 65953, 53976, 21433, 44393, 45744, 34182, -935, -25791, 5955, 18177, 18314, -14038, -12899, -890, 30115, 18018, 33249, 7207, 6739, 9724, 14387, -7736, 9490, 30380, 4520, 7894, -4180, -21313, -25860, -25942, -15283, -33264, -25381, 1176, -17060, -5462, -10007, -31884, -17446, 9922, 31935, 13517, -16225, -8702, -4675, 11875, 8290, -31896, -16917, 2691, 6380, -17082, 3255, 27933, 17532, 31968, -57, -14745, 2171, -13151, 2632, -1104, 15545, 14651, -15515, -35553, 6152, -24036, -14098, -15415]
7259a5415J8764j0477l5668J5898J3718J8103m4767O659M96L5198j1193N409J9423
7246A6148m7152M867K1944J283j9639J7002K2983l9278K0077l495L842k3035n826
7233c0279J4196N831J2261J2777k169L533k6572Q207K296k9659L0405k3649K2903
7220H1K4001j2855m0000M0576K1323k2132M65j1854M4195o864l3958O384J4998
7207B4360j0053j849l692l7066N321K3613J8052L567k0296p637m711J3883L0623
7194C4115P841P719p194J0879k7406N26k292O836K8149l0644J094L654j0409k9084
7180f216K5174l774j9436o704O269K1878j6969k2952J9301L2625j3159r455O086
7167A2668J0922K698k9210L2347Q951p426n537j9471M994N828j2152K2381K7947
$$ y = [-15415, 3349, -7128, -42796, -26898, -13180, 4923, -39844, -33185, -32689, 2509, -8684, -3275, 16148, -31004, -26137, -4193, -2910, -22549, -5547, 17436, -21842, -1765, -5260, -1418, -24453, -30279, -16083, -10252, 2009, 14786, 12617, 16150, -10422, -2215, 81, -29578, 827, -22822, 81, 24082, 11227, -28773, 11803, 33126, 10994, 11459, -395, 43800, 36936, 2978, 9362, 24360, 14307, 12458, 8766, -28300, -22979, 634, 18686, 22253, 1957, -5680, -10391, 3492, 34115, 41956, 49675, 42481, 53360, 25954, 26480, 24188, 31024, 59173, 28529, 29623, 33277, 22868, -6216, 18958, 15184, -4252, -10956, -4687, 17191, 222, -22730, -3429, 29196, 16037, 6582, 12668, 23590, 26288, -2922, 29425, 38376, 30950, 25413, 5942, 10936, 16764, 4612, 26993, 54940]
7154E4940j8373n5349o080J0848Q339K8724j429K012M1449l1275k8115L1390j3236
7141B3845n34J57N530o801m564J3837p432j7240M481l4839P384j563k0606N852
7127c2493r423J3563q24j1352K5055k72J7617j908P857J3005L841l772K3033k8162
7113A5765k2006K943O002j504J7273M8082n225l501k3937L736n5259K5586K611
7100A0566j3886K2056m39o073P528J2986k9245k1492J7167p317m063P559k0244
7087b4897K0412Q182K9721R442l5497k345l533P475M708M823L408K3616J1458
7074E6973k7881j2976j944k484J2520L973r357k8859P765j7781l6823K9807j1611
7061c8678M4414P336L7580J2979l2581J0365j6782j84M09k8168j0871L2493k7531
$$ y = [54940, 36567, -18782, -24862, -14014, -5675, 23049, 21620, 23632, 65081, 33806, 5691, 37081, 23845, 23311, 23468, 28998, 22197, 17633, 31470, 24038, 6798, 11279, -23560, -16176, -17739, -38345, -32493, -41916, -28353, -29177, -40529, -15474, -15746, 1871, -37, 7820, 20825, 24666, 20894, 43927, 15765, -6241, -3298, 2704, 1200, 18473, 66555, 61330, 57829, 33892, 37628, -17631, 7955, 10566, -3320, 18736, 18297, 12224, 19752, 32738, 3493, -17999, -832, -8149, -12212, -4653, -24897, -4485, 3697, 33418, 42860, 7363, 5018, 1485, 8960, 13668, 18491, 21899, 45515, 56973, 29092, 16116, 14172, 11688, 24208, 28181, 18824, -10035, -2270, -20051, -56874, -27067, -38678, 5736, 13072, 50652, 63631, 31050, 41415, 24633, 24449, 24858, -3310, -14181, 18312, -9219]
7048i219r570J6971K9489m0484k9922K856M8889K0099k0646J0015j0126n248J8504
7035B1608j4739J0799j3891j8125J3573q425J0824k5720Q351j8049K0200p453
7023b1047K264P910L0233m2j0518j8812K1766j4757o84R074r881j800q84L0581
7009B3403l7214m386N860l097j1558O043K2033R291l3174j0968m621M4278K6845
6996C2735M416j1178j9270k4759J3783J7355J5319q938k2806K2592Q992k2917
6984E324j3600J6042L169j4989J8562K1343J2944j1410l6964j5134j740J0964
6972e489K6323o902j2127k912j4474K3672J959J4035l0338k1497l157j2548O515
6959c6940K8875J1605J9915k7639l171L140j4125q233j301k2041K3932K7575k255
$$ y = [-9219, -18789, -1818, 27671, -12813, -42735, -39879, 9010, 29109, 8463, 18478, 8352, 3104, 21608, 6869, 17668, 3777, -14348, -775, -9200, 1624, -24096, -15745, -33794, -13594, -21047, -18783, -10873, 19360, 19318, 8800, -10012, 11754, -3003, -3687, 5387, -4494, -6294, -7178, 23403, -13811, -18197, -12337, -15434, -26992, -20949, 1084, 10375, -22799, -33767, -38388, 5890, 32735, 37151, 25973, 6703, -18056, -4273, 13082, 28401, 19463, -3343, 19249, 28241, 5324, -8276, 7766, 10935, -4054, 14508, 35851, 48795, 37385, 421, -14713, -16453, -5489, 20834, 13932, 1805, -1107, -15581, 8091, 10050, 24085, -6253, -27750, -30907, -43455, -36940, -8065, 3540, 23455, -4184, -7355, -4215, -18340, -26573, -27874, -49915, -25983, 1592, -663]
6946f63j6634J0307O453m320J9929k3987J8624l872O404n45K2440k4235j4851
6933d950j4346o458K2074j6724K0087j1757k3545m285N0087K0812N000j6519O342
6920B5818q642M857L945j3624J8977j8848k6839K9109O16O51j2675j8621K4579
6907I303j5404K5944J68k7192K1292J4207j0918J0525l527J1893k1713l790J7196
6894B7984O831r069O535J2158j6110k4087J6523r37Q9l5015N896J7964j334J1981
6880A9409N612k3879n644q727j9174J2080K5362k0529K6317k452o431J4873k7704
6867a0887L940P999J0323l313j3886J6357L3750p658j6790M350l049n730m741
6854A0665L050k8903J3568J8402l7573K0247j1062k4438J4570N0189K809j5757
$$ y = [-663, -17297, -6990, -537, -4857, 15072, -8915, 9709, 5837, 12241, 11696, 34136, 9901, -4950, -19296, -25754, -3680, -20404, -317, -12074, -35619, -39904, 10183, 30995, 35995, 19476, 25818, 17176, 22033, 25978, 12354, 31331, 12483, -14356, 14753, 15369, 16020, 3345, -15276, 9303, -6101, 19843, 20011, -7181, 14111, 28318, 17400, 27925, 24398, 36291, 14578, 10788, 27984, 34815, 25746, 32281, 44439, 28329, 4242, 20765, 19828, 19917, -15098, -9202, 8762, 7428, 19409, 25021, 1142, -4502, -13229, -32403, -20323, 5039, -15490, 10827, 8375, 1944, 16817, -10887, -6947, 1052, 11375, 8062, -5824, 10533, 44283, 36625, 19835, 24185, 21136, 15406, 10665, 13715, -15188, -1620, 16782, -20791, -544, -11606, -36044, -21474, 28715, 31524, 15767]
6842A5767k6800k9716J5392J7142K4932n964j7194K559l154P841k5199k730j6170
6829d3294K884o980R902N1677k2977k6629L4635O962j1759l0554K707j7939J1448
6816c9917K995M513R705K6374l502k7284L7148L537j8733L899k2182k1634j3145
6803e8226L9222K7224j0803k755j868J2837J2303J4440n9892J4587L9963R930
6791C6962k1989O42k3641N679k9866J7275K8108Q790n1974k2168K1163J9395o318
6778a7942j8337M166J1226J0174j821Q67K0962Q8M572k0097m6769O863j2847K4344
6764c4551L624J4395m1062L6466K8713k2m2275Q185L3429k7162R923L5350l3339
6751h326j7838J3068j0374q367J8933J0143L468k0397K155M1006k0368l0957k173
$$ y = [15767, -11033, -40749, -25357, -8215, 16717, 10753, -6441, -3882, -7036, 805, -24394, -27124, -43294, -40410, -47390, -37488, 14189, -8788, -35417, -782, 6180, -5579, -36133, -33426, -51365, -39917, -36922, -32409, -22704, 3670, 168, -27116, 10032, 13569, -5164, -1265, -23447, -45081, -58226, -19004, 8220, -2583, -5338, -7206, 5631, 17934, 32374, -27518, -12931, 27032, 36962, 14973, 15615, -8026, -2347, -32213, -14938, 13170, 21960, -30014, -52182, -31019, -11624, -17942, -36279, -32113, -20887, -10713, -12534, -11667, 9295, 9383, 13955, -6142, -52911, -46048, -58895, -34551, -30927, -16532, -57594, -21128, 7585, 7563, -34712, -26527, 6902, -20260, -10337, 25013, -8326, -26164, -13096, -23470, -31837, -12904, -2761, 707, -19690, -17535, 23471, 3103, -27854, -30027]
6738c0027p887M0554J6217j6467q416J0388j9455K2522K545j6064J9554j0661
6726B803k684j2893J9644k6945l6559L9159L2887K06l1591M4507P566k4603k1706
6713a0209J5127J4747j7587K6762j723m4651r8L3392K6622L247m2432j3756J5382
6700D823L656k0897l6547K5366P42J420L1972k2713K3174m6810L5607L9584j8924
6687B0453l4671J1079J3323m52l4076N907M1797M969J7995p650l5479J0246k5751
6674a2310J3170R85L3238k187j3113j8747m631J9624q476k8393r699J6167L9770
6661B5398o537l2374N64M977M5731L515m6706k6892L8292R154k9609K1367K6902
6648C3782J102j2459m9412j26L4626J2729J7602L3802q213k4671j5822J9083m1552
$$ y = [-30027, -37914, 2640, 18857, 2390, -6026, 4362, -15093, 7429, 9974, -6090, 13464, 2803, 119, -12774, 6870, -20075, -56634, -17475, 15412, 15618, -15973, 28534, 36100, 11497, -10209, 4918, 19665, 2078, 28840, 27117, -17534, -17632, 15760, 42382, 45629, 3197, -10559, 4823, 8479, -12418, -48965, -23599, -22857, -21437, 10535, -12178, 10996, -35814, -207, 39377, 20453, -14218, -3139, 10184, 9732, -24344, -18437, 23360, 28329, 46324, 38674, 3195, 13441, -12310, 860, 1845, 35083, 32896, 19783, 1036, -3595, 16029, 7553, -20840, -30539, -14372, 25398, 18861, -13513, -12949, -7972, 37759, 41274, -5432, -32324, 5968, 15122, -14487, 6880, 33782, 34884, 22425, -26987, -27113, 7513, 20242, 37844, 71646, 63433, 38762, 22940, 42023, 471]
6635D71j0540J4291J1235o895j4666L7361j6635k2134K3802J1304l7997k3691
6623c4094M6315P524o890J7856k2968J9421j7980J2171J942j5332j0644l6296
6611c8975K3913K7269J1334j450m167k1849j2940N1636O297l0207q423l3144P93
6598b9913K3333J6312r753J7847l0979j6771L8671K391m8372l569K4629M7052
6586C0878k0551O771p062j655K6048l9584L4445J3892j0439k3920l414K6189Q333
6573C9931J1829k2859J6308j1951q33J4548O567K4023J948l836k0483j3960N2071
6560I3303N403k3839J3252K7076L4470L6819J7092J6071n071k6358k9821l7721
6548A20676l0283j3244o464j5786Q042J7689k2648k0800M086r015O833k470j5875
$$ y = [471, -10069, 4222, 15457, 8562, -6104, 31257, 14622, -7512, 16290, 27594, -10403, -34094, 12221, 19745, 12855, 30711, 7743, 27164, 9184, 21355, 23297, 7965, -2679, -38975, -15062, 12207, 23541, 22091, 17924, -3925, -16865, 34771, 41068, 10861, 2438, -30706, -29913, -6580, 9732, -21, 17826, -13153, -29924, 8747, 11138, -37234, -40803, -16174, 30878, 10327, 17098, 10036, 8381, 34429, -5155, 29290, 43182, 32743, 8823, 5409, 31598, 39931, 51760, 28901, 45209, 33258, 32425, 46973, 53540, 77563, 79511, 75675, 55192, 41232, 93303, 98706, 74867, 88119, 115195, 149665, 186484, 203576, 219647, 214576, 188218, 158397, 120676, 90393, 77149, 70685, 54899, 62941, 80630, 57982, 37182, 41268, 32253, 39086, 36616, 20741]
6535B0741K1323J9839m1259n145R710K7731j6829l5439K2812M2K454q776m505
6522A2699j3881Q713K3627k881q334L67j291k7162j701j4071j8444J8760K1247
6509b352L4614N280j9068O926j3334J8318N387P70o770j0305K6904J4872K403
6496F3645J716k2973m2592J1549j8962j5286O7541j7959J1933j8050j0625Q400
6484A8337j6997M347J1467k5464p184j6049J0911N6236n244k6038n010J4066k2982
6471i604o176J1382J8376J0619M217k1571m0199J1393J1294M639J6725Q099J6615
6458C5809q745q558Q247M659j0876j3984K5186J5299j4029j0532N86j81k688j4314
6444E879K4802m314J9581l3704o234j8206K3125K4704k0653P798m052Q651m9728
$$ y = [20741, 42064, 61903, 20644, 15499, 25209, 52940, 36111, 672, 23484, 23526, 25980, 17204, 12699, -1182, 7531, 31158, 28277, 19943, 20310, 19019, -8143, -9844, -23915, -42359, -23599, -2352, 32262, 37542, 18474, 25400, 12066, 30384, 35771, 36541, 29771, 19466, 46370, 61242, 63645, 65361, 42388, -204, 11345, -7617, -22903, 44638, 26679, 38612, 20562, 9937, 18337, 1340, 5687, 17154, -8310, -15494, -31543, -20632, 35604, 30360, 4322, -688, 13378, -9604, -15780, -4398, 13978, 24597, 28814, 7243, -32956, -21563, -10269, -5630, 11095, 19194, 35809, 27064, 18506, 26753, 31412, 20536, 6552, 31738, 47037, 33008, 22476, 23062, 22881, 20193, 5879, 30681, 26367, 45948, 12244, 6010, -12196, 10929, 35633, 14980, 22778, 18726, 27377, -22351]
6431b2351q435K455N011o007M5629k244l303j2437K941p184r921L7027P890J9716
6417D8787J5108j7387L567P199j0718n847l6192j9375K6909r065J603o732K1482
6404A9339j790K179K543L5292O287j6845r036k1575j4162o285J3003M1861l8717
6391A2094o753j8245J2397K9196Q737M172k2991N935m5076J9567K5938l7815p10
6378a3554O3860k4101k8891k3459L8290R889J6952o4229o982J791o574L1162M5393
6365C9547P907l7908J8173J080m2978J8688J9917n417J3523k1168J0974Q483K3844
6352E4665j2050k2679J4742k734k1094L35k5737J7492M959O763J112k0557L57
6339d426l3891M2638n876k4049J2623o506L1030K9217J2518o966k4372k3003j5836
$$ y = [-22351, -30786, -28331, -23320, -29327, 16302, 14058, 10755, -1682, 1259, -5925, -15846, 21181, 29071, 48787, 63895, 46508, 50075, 57274, 46556, 40709, 4517, -14858, 12051, 2986, 4589, -2143, 19339, 17549, 19728, 22271, 57563, 63850, 47005, 37969, 16394, 2232, -4053, 8950, 50811, 12094, 5341, -12904, -507, 28689, 37426, 41598, 18607, 24542, -20534, -967, 24971, -12844, -13554, 50306, 26205, -2686, -26145, 12145, 22034, 38986, -25243, -32225, -30434, -37008, -5846, 39547, 47454, 9546, 27719, 28799, -14179, 4509, 24426, 19009, 32532, 11364, 22338, 30821, 54665, 42615, 19936, 34678, 31944, 10850, 11185, -14552, 2940, 7899, 14662, 15774, -4783, -4426, -38317, 4321, -1555, -25604, -12981, -19487, 11543, 40760, 53278, 46312, 21940, -1063, -16899]
6326a6899K0371K0687k809J8158l8038n160L0957J200j9857K016L3740J5445j2478
6313D7333j0031J780o539P380n786j0580K6064J9858j9027k0120o19M985j3500
6300B1198p547J8625l6297j826O048N337L5525l785J0760k6014K2479j4541q586
6287B1376L886k3385L1283j1062p000k3683J7665P698P924J2036J0999j051L1013
6274G7699N207k7522j6569K0268j1027j5243j5513J270J6151J222J7349k320j2607
6261C8365k2943J8385J3247R972j7723o281r700J3602L797M0268P753k7045j6460
6248D5237o908K5777k5562L4732L0091q286K6061j8869j5920j630Q532N214O552
6235A05021j761j7068j1987k0726J0719K487J540J3416L0857j1432m3830P678
$$ y = [-16899, 3472, 24159, 21350, 39508, 1470, -3690, 27267, 28467, 8610, 10626, 44366, 59811, 47333, 37302, 39082, 32543, 39923, 34137, 23557, 49621, 69479, 50452, 30332, 29713, 34698, 21198, 13651, 32276, -4021, -5847, 201, 5538, 41063, 37278, 48038, 22024, 44503, 29962, 21376, 25262, 1877, 33160, 22098, 15098, -8585, 9080, 16778, 24702, 36738, 47737, 46686, 77699, 82906, 55384, 38815, 59083, 48056, 32813, 17300, 18570, 34721, 35943, 53292, 50972, 38365, 15422, 33807, 47054, 57026, 39303, 33022, 23322, 36924, 40721, 80989, 88742, 61697, 45237, 38329, 64106, 38544, 73276, 103367, 95081, 121142, 102273, 86353, 84723, 93255, 98469, 105021, 103260, 86192, 74205, 53479, 64198, 66685, 68225, 81641, 112498, 101066, 57236, 64914]
6223F4914K0340j2827k4346j9666k4622Q447L0212l45M749j0528K4103J289K423
6210F4143o72m3946M0073l5709P721Q475l3067K6109J1200j0040q944J8160j4031
6197B9472K5911J8160k4315K1284m651l1297K3906k1254J0252J1850l7327K6379
6185D8370j6498L1929L883k4117K9425j294Q878K3926l807Q343k6958J8591k3771
6172G6900Q861K3404m2149j8870K1181O6J8977J8130k1639k3011k0717l36O799
6159D7596j7336j0881L57J8920O074k0788n434j1923N8201K6948J343k7573m6516
6146A8988k6528K3053j365j3401M1573L6034l101r089n083l53L781K2245k9998
6133E6756o858J3223k4288L615R502k3955R449J2298J8033J0860n69k6876j7653
$$ y = [64914, 85254, 72427, 48081, 28415, 3793, 12240, 42452, 42107, 46856, 36328, 60431, 61720, 64143, 63471, 19525, 59598, 23889, 31610, 40085, 7018, 33127, 44327, 34287, 25343, 43503, 29472, 55383, 73543, 49228, 70512, 65861, 34564, 58470, 37216, 47468, 59318, 21991, 48370, 31872, 63801, 67684, 43567, 72992, 71698, 80576, 104502, 100695, 109038, 82080, 100671, 76900, 85761, 109165, 67016, 48146, 69327, 69393, 88370, 106500, 84861, 61850, 41133, 40797, 47596, 30260, 19379, 19736, 38656, 44730, 23942, 18508, 6585, 64786, 91734, 93077, 65504, 18988, -7540, 15513, 14148, 747, 42320, 78354, 75253, 66164, 61081, 60728, 64509, 86754, 56756, 49898, 63121, 38833, 42448, 51950, 27995, 37444, 49742, 67775, 78635, 78066, 51190, 33537]
6120C3537r495P168k9958l246M0944k1622q367J0216O947J1687J7494Q627L1969
6107I5901l0786j8936M1399k931l2636j2420j763L1554j0708n772J5709k34j7189
6094E1188k2520J2572o419p68n866j8661M1411K8959k3413l1083J7031J0756M75
6081E3662K5040q571k5878j3371L907L0575l0096J2080O39r722L378m353L7520
6068G4810k3221l308J8823l854l68N657l2433j843K5261J5562l2268Q14L291j0140
6054C6783J9198K0616o312Q03j0239K8482J5473J5751l3534k3173l1754k456K433
6041C2071J3808K1489j0433O658j8146K926k2837K7942l4393J4542J3735J455
6029D8817L6124k6856k162L03P805K8314k8666l6179L4163k5874J1981L2998n83
$$ y = [33537, 24042, 31210, 1252, -1994, 38950, 17328, 8961, 19177, 26124, 37811, 55305, 63932, 95901, 65115, 46179, 87578, 84647, 52011, 39591, 37828, 69382, 58674, 52902, 68611, 68377, 51188, 28668, 41240, 34821, 34053, 28187, 9526, 50937, 79896, 56483, 25400, 42431, 53187, 53662, 78702, 70131, 44253, 30882, 34789, 65364, 35268, 47348, 47987, 38265, 41643, 37290, 74810, 51589, 48281, 67104, 63250, 62882, 68539, 36106, 34263, 59524, 75086, 42818, 43632, 46923, 36783, 55981, 76597, 70285, 71088, 60849, 89331, 104804, 120555, 87021, 63848, 32094, 29638, 32071, 45879, 67368, 56935, 63593, 45447, 48373, 25536, 53478, 19085, 33627, 47362, 48817, 84941, 58085, 55923, 56226, 64031, 92345, 63679, 27500, 61663, 35789, 47770, 80768, 80185]
6016H0185P391J3713P608j8535j802l4667J480M7728N855l1766Q137k476J6546
6003I9397j4340K278J0648j607n165M2576l9943k2644J3668j2558p557L411j1837
5990E6327J5868J3878O874j6300k1281L6524k2756J0015Q894J7565K7843j1376
5978A22075j2111P936M447j0041J8115j47j7638P554j978k4564J7518L6264J2070
5965A59500Q407r418R589J2137j5343k4494Q313J7305K3142K4213j5641l1873
5953A65837K1188M3866O743p603k6915l976M2708J1888K461N535N0725J1630J155
5940C25242m733N977J7397k354K0996J3047O264K4229P833m538L8731N5956M3557
5927E47604J4737J3881K6251k505L7256P2029N1036J3360P5914O1037J6947O7081
$$ y = [80185, 87576, 101289, 108897, 90362, 88560, 53893, 55373, 103101, 108956, 77190, 85327, 82851, 99397, 85057, 87335, 97983, 96376, 91211, 133787, 93844, 71200, 84868, 72310, 64753, 68164, 56327, 72195, 86073, 92947, 76647, 55366, 91890, 69134, 79149, 88043, 105608, 133451, 122075, 109964, 117900, 122347, 112306, 130421, 130274, 112636, 120190, 118212, 93648, 111166, 147430, 159500, 167907, 158489, 168078, 180215, 164872, 140378, 148691, 165996, 189138, 213351, 197710, 165837, 187025, 230891, 237634, 230031, 203116, 199140, 241848, 253736, 256197, 261732, 312457, 324087, 325242, 320509, 326486, 343883, 341529, 362525, 375572, 381836, 406065, 413898, 409360, 448091, 504047, 547604, 562341, 576222, 602473, 599968, 637224, 709253, 760289, 773649, 849563, 910600, 927547, 994628]
5915I94628R7702O1786R8054P9324J00536J28285N6046J34093J63263J27668J54632
5904B196017J73797J60668J97546K82296K97540K82988L97418M01104M43372N26299
5894E359045O31966O96579P44757Q53389R49938R64959N10455J0538l28513m90486
5884I902627m37143l60389j61657K6122J69133L79508M79719M7738m45682p60982
5874H838994j010200r55504q91914p82013n71811m76008l83248l12304k75742
5865C180250k21918k03235j83955j59512j28491j18046j50540j10707q7935p8437
5855A737474q3525n8429p5611q2473m3354l9728l3704m1010m3646k9478p3485
5844A133031k1896j9197m6838p690l4612l4797j0339o2181j5922l580k4000o461
$$ y = [994628, 1092330, 1154116, 1252170, 1331494, 1432030, 1560315, 1616361, 1750454, 1913717, 2041385, 2196017, 2369814, 2530482, 2728028, 3010324, 3307864, 3590852, 3988270, 4389374, 4832746, 5359045, 5991011, 6687590, 7432347, 8285736, 9235674, 10200633, 10711088, 10721626, 10393113, 9902627, 9465484, 9105095, 8943438, 8969560, 9138693, 9518201, 9997920, 10045658, 9599976, 8838994, 7828794, 6873290, 5981376, 5199363, 4627552, 4151544, 3768296, 3455992, 3180250, 2958332, 2755097, 2571142, 2411630, 2283139, 2165093, 2014553, 1903846, 1815911, 1737474, 1653949, 1595520, 1519909, 1437436, 1394082, 1354354, 1320650, 1279640, 1235994, 1206516, 1133031, 1111135, 1091938, 1045100, 1037410, 1002798, 968001, 957662, 895481, 879559, 875979, 851979, 845518]
5832H45518j7430q116j1333m8606k1563j3621R649R379l8898J8302m2083M54j3083
5819F68569k8074P879k7739j7666L3752j5319l0770J7544R187p917P468J006j7631
5806F00289j385j4004j0824j762l2218k9546K2474K9231k8665j1626j4236k5889
5794D81839n336j1940M939R35l3738K9842O582l6817j1640l2282k1112m807j9096
5781C47369J6831L1685l2964j3853L631k0329O250l3211R983N8359j3597l067
5769C57087J539m2463o175k2370l9292K3996J0422J3084J7707Q802j1579l9427
5757B71331L048L8172P539m1343J2599j1390n6888N253L3023l0430J161o121P92
5744B26746j3808J8704M1906k9924o549Q730pq068J1667n3162q378M6200j3418
$$ y = [845518, 828088, 819972, 808639, 760033, 738470, 724849, 734498, 743877, 704979, 723281, 681198, 681652, 668569, 640495, 648374, 620635, 602969, 636721, 621402, 590632, 608176, 617363, 609446, 616914, 617920, 600289, 598904, 584900, 574076, 572314, 540096, 510550, 533024, 562255, 533590, 521964, 507728, 481839, 476503, 464563, 469502, 470437, 436699, 466541, 473123, 436306, 424666, 392384, 371272, 366465, 347369, 364200, 395885, 362921, 349068, 352699, 332370, 338620, 305409, 315392, 373751, 360154, 357087, 358626, 316163, 309988, 287618, 248326, 272322, 282744, 295828, 313535, 322337, 310758, 271331, 274379, 312551, 320090, 278747, 291346, 279956, 223068, 228321, 261344, 230914, 232075, 225954, 226746, 212938, 231642, 273548, 243624, 237075, 245805, 245798, 237730, 249397, 196235, 187857, 234057, 220639]
5731B20639j970R511M878j1431j7887J4899J9585j0985j5463K2419o049J1630
5719B39776k5192j8711J5360Q910j0669P641J7193j8756K0050n700m0489L2989
5707B22402j298q039j8048M269J614j6424l261j6977M641k5721R915L1303R501
5694A93877P763k0964k2416L1206L0863k0096o954k8892m5558J4707j4743L715
5682A22508M1168K921k0514J701L7243o999j3117j9309n3356l290J1489O437L9155
5669A46037k1701K5569J5113n3730N100J5300m6807K9725j1413L04J12p340o405
5656H9864n707K4035k4131k018M3706J6957j9289J0755j0672l173J264L613k6767
5643I8437p838J2859j7648J4903M821M0382J256k1562l0678j7213K6659l2762
$$ y = [220639, 218669, 228180, 233058, 221627, 203740, 218639, 238224, 227239, 211776, 234195, 228146, 239776, 214584, 195873, 211233, 220143, 209474, 217115, 234308, 215552, 235602, 229902, 189413, 222402, 221104, 213065, 195017, 199286, 200900, 184476, 181215, 164238, 168879, 143158, 153073, 184376, 193877, 201640, 180676, 158260, 189466, 220329, 200233, 193279, 164387, 118829, 133536, 118793, 122508, 163676, 166597, 146083, 147784, 185027, 178028, 164911, 145602, 92246, 88956, 100445, 106882, 146037, 124336, 149905, 165018, 111288, 116388, 131688, 84881, 114606, 103193, 103497, 103609, 96269, 89864, 84157, 108192, 84061, 82043, 125749, 142706, 123417, 134172, 123500, 120327, 121591, 125204, 98437, 90599, 103458, 85810, 100713, 105534, 145916, 147172, 125610, 94932, 77719, 104378, 71616]
5631G1616J8619L2904J8051n4352j2107K8207p07k0229j9029N4357K0592l5051
5619A02871M560o765K6542l482n144o632j2635J7330M1795j8925j9732P585O392
5606A33760N11j9640N1836j9924j2985M8235k2902j6171K653q378J8909J4212
5594A70116R616j5016j3759K465j3038n948L0344J8564j5166J3240J3476J2115
5582B07009j2651L681j0318O667j2565j6628O635J8142K2487j7551J0676l3749
5570A71835p297K2950l1685Q743k792L0731N269n5787l291j4088J275J5054K3916
5557A64833J2660l6895K149Q496r999l1927N478J6569M7332P423M919m2649j0717
5544A37672R615j0192J2535L1072K403K0646k5335l1430N3522M155k1054j4246
$$ y = [71616, 90235, 123139, 141190, 86838, 74731, 102938, 102231, 82002, 62973, 117330, 137922, 102871, 107431, 100666, 127208, 123726, 118582, 111950, 99315, 116645, 158440, 139515, 119783, 127368, 133760, 134271, 114631, 166467, 146543, 133558, 181793, 158891, 142720, 145373, 136995, 155904, 170116, 179732, 164716, 150957, 153422, 140384, 134436, 164780, 183344, 168178, 181418, 194894, 207009, 194358, 198039, 187721, 194388, 181823, 165195, 171830, 189972, 212459, 194908, 205584, 171835, 164538, 187488, 155803, 164546, 161754, 192485, 197754, 141967, 138676, 124588, 125863, 140917, 164833, 177493, 140598, 142747, 151243, 141244, 109317, 114795, 131364, 178696, 186119, 191038, 148389, 137672, 147287, 137095, 149630, 180702, 183105, 203751, 178416, 146986, 200508, 204663, 183609, 169363]
5532A69363L6530K9465n1896k4984K8336Q788K5603J4103o114k0381N011J581
5520B15405K6865j2146N711r094k0572j7908q484J5342K9778j6110l2308L697
5508A80176K7710P644o783k6154J2296k269M0160R886l68K1776m1873j8800L3482
5495B36883K1807j1384R210J3286K209K8962m2407L651L5849J2356L554j9883
5483B94093j2074K7164K160K1570J7471l946K2454K8877j6029j7797K5361J2119
5471D01423R80L6995M4811r224J7087K8626P468n214J4960J7299M0713K8367p029
5458F17262J5933J7067l148L3976L0579L3583L4415p69K5051K4922R1782L4622
5446I55275N2933Q5258N5505Q5387Q5867R6656J19064Q8302J16013J80826J58595
$$ y = [169363, 205893, 235358, 183462, 158478, 186814, 195602, 221205, 235308, 229194, 208813, 213824, 215405, 242270, 230124, 235835, 226741, 206169, 188261, 179777, 195119, 224897, 208787, 176479, 180176, 207886, 215530, 208747, 182593, 194889, 192620, 232780, 242666, 242298, 264074, 222201, 203401, 236883, 258690, 247306, 256516, 269802, 272011, 300973, 258566, 262217, 298066, 310422, 313976, 294093, 282019, 309183, 311343, 332913, 350384, 346438, 368892, 397769, 381740, 363943, 389304, 401423, 402403, 439398, 484209, 474985, 492072, 520698, 528166, 522952, 537912, 555211, 595924, 624291, 617262, 633195, 650262, 647114, 681090, 711669, 745252, 779667, 778898, 803949, 828871, 920653, 955275, 1008208, 1093466, 1148971, 1234358, 1320225, 1416881, 1535945, 1624247, 1740260, 1921086, 2079681]
5435B079681K13013K21077K34124K76428L46897K45450J8890j08501k31859k62373
5425C032827k10246j99832j28838j25226p6407n4976J7254K6369M5206Q3361J19847
5414B529339J37460J47212J31079J98613K09798K87987L00276K86994L50022M24923
5404E003703M43215N45502O16029O50635P66153Q33767O90294J79862l11118p05754
5394H712288q85621q53910p60897o62113m77487l73767k65671j98992j28250p0977
5384D034603p2676j1415O5026N0072N9769J41135J75813K12657K61881K85771
5374E202636L57841M09399M42804N36277O18154O67046P48946Q92830P54869L09680
5364A0940482j64901n98458q25422q21047p39202o20536m04014k60006j46028
$$ y = [2079681, 2292694, 2513771, 2747895, 3024323, 3371220, 3616670, 3635560, 3527059, 3295200, 3032827, 2822581, 2622749, 2493911, 2368685, 2292278, 2237302, 2254556, 2280925, 2326131, 2409492, 2529339, 2666799, 2814011, 2945090, 3143703, 3353501, 3641488, 3941764, 4228758, 4578780, 5003703, 5446918, 5992420, 6608449, 7259084, 8025237, 8859004, 9549298, 9729160, 9418042, 8712288, 7826667, 6972757, 6211860, 5549747, 5072260, 4698493, 4432822, 4233830, 4105580, 4034603, 3961927, 3950512, 4015538, 4065610, 4125379, 4266514, 4442327, 4654984, 4916865, 5202636, 5560477, 5969876, 6412680, 6948957, 7567111, 8234157, 8983103, 9875933, 10630802, 10940482, 10775581, 10177123, 9351701, 8530654, 7791452, 7170916, 6766902, 6506896, 6360868]
5355F360868j65872k43628k24068k64573k44259j45618q4890M64P7411P9186J60094
5344E305115N8010k9178q7102j19926n8036j4619N8859J33412J30610J55573J69604
5333E702322j4271j77937l14301l71601l71358l18962k92882k32415k20499k34020
5323C154076j74851j98058j59719j75182j26475j20414j25962p3901n7056p1336
5313A871122j05177n4657m1668m4486K024k3368n7216l3864p8181m8941m3943
5302A341645n776k5518k6319k0458l049l1875k7052l2162k3890m7262j2390j4023
5290A071871J580K7395j5921L4093J7090k8708m2636R217k2115k2504K7525J3437
5278A070324j0578O79l6785L4150Q146L6099J4688p016J2147J8920Q156P952M6684
$$ y = [6360868, 6194996, 5951368, 5727300, 5462727, 5218468, 5072850, 4987960, 4988424, 5065835, 5145021, 5305115, 5363125, 5333947, 5246845, 5126919, 5068883, 5054264, 5113123, 5246535, 5377145, 5532718, 5702322, 5688051, 5510114, 5195813, 4824212, 4452854, 4133892, 3841010, 3608595, 3388096, 3154076, 2979225, 2781167, 2621448, 2446266, 2319791, 2199377, 2073415, 1999514, 1942458, 1871122, 1765945, 1711288, 1669620, 1625134, 1627158, 1603790, 1546574, 1512710, 1434529, 1385588, 1341645, 1335869, 1310351, 1284032, 1263574, 1260525, 1228650, 1201598, 1169436, 1145546, 1098284, 1085894, 1071871, 1073451, 1100846, 1084925, 1119018, 1136108, 1107400, 1064764, 1073981, 1051866, 1029362, 1056887, 1070324, 1059746, 1060425, 1023640, 1057790, 1065936, 1102035, 1116723, 1109707, 1121854, 1140774, 1148930, 1156882, 1203566]
5265A203566K4368K8157O3820J1947K509J8052L1300L8580O5991L8194P9948O1391
5253A667823Q6856Q7117J22952J49403Q2221J55340J60863J52014J61834K19162
5243C045585J93767K34043K92350L71094L97845L71797M47015N52283O83881O98772
5233G288432P41302R13278J047930R14715L32719j43369m48199n67648n08033
5224I571127l61152j10876Q0230K38543M59694O05684L52362k83172p34014j044908
5214H773518j083639r93032q37560o66231m98770m15592l55491l13922k50494
5205C358787k60715k02271j53518j29865j33058q8753p4496j30896j08723o7929
5195B008563m9209r3036l1716l3711q4884l8951p5049k5214k6757l1258k1680
$$ y = [1203566, 1227934, 1256091, 1319911, 1331858, 1334367, 1352419, 1383719, 1422299, 1488290, 1526484, 1606432, 1667823, 1754679, 1841796, 1964748, 2114151, 2196372, 2351712, 2512575, 2664589, 2826423, 3045585, 3239352, 3473395, 3765745, 4136839, 4534684, 4906481, 5353496, 5905779, 6589660, 7288432, 8029734, 8943012, 9990942, 10905657, 11238376, 11095007, 10646808, 10079160, 9571127, 9209975, 9099099, 9179329, 9417872, 9877566, 10483250, 10835612, 10552440, 9818426, 8773518, 7689879, 6696847, 5859287, 5193056, 4694286, 4278694, 3923203, 3609281, 3358787, 3098072, 2895801, 2742283, 2612418, 2479360, 2390607, 2316111, 2185215, 2076492, 2008563, 1959354, 1866318, 1834602, 1800891, 1716007, 1677056, 1602007, 1576793, 1550036, 1518778, 1497098]
5184A497098l1340j5255k1604n0510m7293J102K4598j1707m4807J2759N75j6244
5172A297372R905J9995k1936P928k429K0658k1593L1073M0024N4092Q5143O8258
5160A588490K5401Q1088M6312Q5490J26087J32368J78671J57871J80409K15693
5150B817880K54702J43994O21j45111k49204l09467l01348k61283k06914j62523
5140A581347r3323m8523r0606n6219r3629l3171o7992r7651j4323n198k2659j2393
5128I45660l0893o1620l5292M0641o928J4788m86n1532J0910k8873l3204m857
5116G58314k5838J4325j8487R812j7470Q3l4672p041K8091j736l1549J0904l8844
5103F45892k5833j8210l0230L4478L6850p193k7661M584l379J489J1562j3199
$$ y = [1497098, 1465758, 1450503, 1428899, 1378389, 1331096, 1332198, 1356796, 1345089, 1300282, 1313041, 1313616, 1297372, 1307277, 1327272, 1305336, 1313264, 1310835, 1331493, 1309900, 1340973, 1380997, 1435089, 1520232, 1588490, 1613891, 1694979, 1741291, 1826781, 1952868, 2085236, 2263907, 2421778, 2602187, 2817880, 3072582, 3216576, 3217197, 3072086, 2822882, 2513415, 2212067, 1950784, 1743870, 1581347, 1488024, 1439501, 1348895, 1292676, 1199047, 1165876, 1097884, 1000233, 985910, 980712, 958053, 945660, 914767, 853147, 817855, 858496, 851568, 866356, 865870, 814338, 825248, 796375, 763171, 758314, 732476, 746801, 728314, 738126, 720656, 720739, 686067, 679026, 707117, 705381, 673832, 684736, 645892, 620059, 601849, 571619, 606097, 642947, 635754, 608093, 612677, 609298, 610787, 622349, 609150]
5091F09150K1136k732m141n7666q17J1369q061R209J929K1751J0440R462o3304
5078E57725l9766M8232J2148J7275K1868j6166q345k2849j935M023L8975K3015
5066F34200k9182k9427J630m2967J7289M983J945j7227K6249L0856j7013l2864
5054E48472J2429m06L0839M4247J8827l9198P147L7097k93J6402k368K1738K2996
5041G17929j174J1854k013P822p621K3338j0173j7954P524J4639K6052r714j3500
5028G47009J0002J024M2375l9369j4741j3216L703j1128M5494R972l7773l5554
5016G07798o104J0591k711l6423L2275M3938j5400n2499P031J3752L6576M4482
5004G83306N1826K5434j8864m3839l2000l6743k1581j375k0257N6753M1429l1449
$$ y = [609150, 630286, 627554, 623413, 565747, 564930, 576299, 568238, 577447, 579376, 601127, 611567, 621029, 557725, 517959, 566191, 578339, 595614, 617482, 601316, 592971, 570122, 568187, 572210, 611185, 634200, 605018, 575591, 577221, 534254, 551543, 556526, 558471, 541244, 567493, 598349, 581336, 548472, 560901, 560495, 591334, 635581, 654408, 615210, 622357, 659454, 659161, 675563, 673195, 694933, 717929, 716755, 728609, 726596, 734418, 726797, 750135, 739962, 722008, 729532, 744171, 770223, 760509, 747009, 757011, 758035, 800410, 761041, 746300, 733084, 736787, 725659, 771153, 781125, 743352, 707798, 701694, 712285, 709574, 673151, 705426, 749364, 733964, 681465, 688496, 702248, 738824, 783306, 835132, 860566, 841702, 797863, 765863, 729120, 707539, 706164, 685907, 742660, 784089, 752640]
4992G52640o3735o228L93j1318L8661K3872K6271o818n658Q893K8760M3878K6403
4979H56014L0034J8513l213k7160K0965O5330O3554N3435J6182J1803R521L3249
4967A148227L6412M5190L6007N0034P9268k0856j1296l9836o603P2763N9680J8161
4955A467151k0247k6954J2942Q143J2670L2194Q8724M5422J6389K0778K0099k298
4943A675013L1974L8695P6379O2229Q0925J6541k938j5024N6662N0724R2199N0778
4931B214157M0940p197p67k3363J4947J1930J00490M6958k5400j119N8722N4264
4919B484562R4922J05709O7743N8706L5693N1358K1079K1004R4527J09770J37188
4908C282261J24057J10983M2065O8120J13644J01596J46864J82429J40923J15202
$$ y = [752640, 688905, 682677, 683070, 671752, 710413, 734285, 760556, 753738, 748080, 756973, 785733, 829611, 856014, 886048, 904561, 901348, 874188, 895153, 960483, 1024037, 1077472, 1093654, 1105457, 1114978, 1148227, 1184639, 1229829, 1265836, 1315870, 1395138, 1374282, 1362986, 1323150, 1316547, 1389310, 1448990, 1467151, 1446904, 1419950, 1432892, 1441035, 1453705, 1485899, 1574623, 1620045, 1636434, 1657212, 1677311, 1675013, 1706987, 1745682, 1822061, 1884290, 1965215, 1981756, 1978818, 1963794, 2020456, 2071180, 2163379, 2214157, 2255097, 2247900, 2247133, 2223770, 2238717, 2250647, 2351137, 2398095, 2372695, 2371576, 2430298, 2484562, 2579484, 2685193, 2752936, 2811642, 2847335, 2898693, 2919772, 2940776, 3035303, 3145073, 3282261, 3406318, 3517301, 3559366, 3627486, 3741130, 3842726, 3989590, 4172019, 4312942, 4428144]
4898D428144J25275J09579J30958J85828K47433K22807J77729K07477J93021K09558
4888F237809K24304L63137L58857L78278L38454L46656K45123K84330L46773M30219
4878I553940N58641N61771N13532M55500N33653O63654P51270Q91488Q81601Q46053
4868A6211103Q56880Q54980R02579R75861J062457J266279J426939J512690J538710
4859B6608478J513791J500609J605790J875140K186992K503745K691198K939562
4851D3425305L237458L743473M337170M919392N606734O427341P244977P929752
4843H6871602Q384309R092574J0351192J1992696J3542543J5158552J6594903
4836A71988371J8505429K0651412K4110256K8288088L1103953L2893049L9108137
$$ y = [4428144, 4553419, 4662998, 4793956, 4979784, 5227217, 5450024, 5627753, 5835230, 6028251, 6237809, 6462113, 6825250, 7184107, 7562385, 7900839, 8247495, 8492618, 8776948, 9123721, 9553940, 10112581, 10674352, 11187884, 11643384, 12177037, 12840691, 13591961, 14483449, 15365050, 16211103, 17067983, 17922963, 18825542, 19801403, 20863860, 22130139, 23557078, 25069768, 26608478, 28122269, 29622878, 31228668, 33103808, 35290800, 37794545, 40485743, 43425305, 46662763, 50406236, 54743406, 59662798, 65269532, 71696873, 78941850, 86871602, 95255911, 104348485, 114699677, 126692373, 140234916, 155393468, 171988371, 190493800, 211145212, 235255468, 263543556, 294647509, 327540558, 366648695]
4829C66648695M5730787M3123727J4537274j6487036l6722260n0839219n1393630
4822C14598338m7774362m0064931l0773029k3771972j8775225j5054744j2887087
4815A25496988j1262721j0043479q722621p297789n958815n065628m538869m251287
4807F8355779l958581l622857l083873k657804k305724k210671k093712k150725
4799D6271832k038846j943346j714252j541702j394789j304087j216858j313899
4791C3804053j276702j263070j084462r66002r77103r14534q14866q51649p92164
4782B4863501p72931o05627m82686m14470m08303m05184l87411l85370l17029
4773B0684490k81564k34605j88208l67814n19281o36549o85335o06478n58025
$$ y = [366648695, 412379482, 455503209, 470040483, 453553447, 416831187, 365991968, 314598338, 266823976, 226759045, 195986016, 172214044, 153438819, 138384075, 125496988, 114234267, 104190788, 95468167, 88170378, 82211563, 77145935, 72607066, 68355779, 64397198, 60774341, 57690468, 55032664, 52726940, 50516269, 48422557, 46271832, 44232986, 42289640, 40575388, 39033686, 37638897, 36334810, 35117952, 33804053, 32527351, 31264281, 30179819, 29213817, 28236714, 27322180, 26507314, 25655665, 24863501, 24090570, 23484943, 23002257, 22587787, 22179484, 21774300, 21386889, 21001519, 20684490, 20402926, 20168321, 19980113, 19612299, 19093018, 18456469, 17771134, 17164656, 16606631]
4764A6606631m95590m11293m18637m50652m69857m37696l45584l38096k83011
4755A2956215k16611k77229k99744l37234l21781l36821k70887k19296j49307
4746A0527305k04963j90583k29958j91004j31303j06354n6979n7139p9639j66069
4736I113314j28934j48144j16792o6248q3405j02314o6229j54948k17735j66467
4726G862098j47633j67947r5308p3558j14483j40896j20427j62099j04093q6166
4716F649488j12160n2070k9263r9268j14498j12201j29310r3484m0192j2285n9516
4705E795241j29322j46242j05273r9916j09858r2353j06323j15711j42164j55266
4695D592813j16853q3103p4030l5146q1558q8058j19082q9190q2564n4685p3691
$$ y = [16606631, 16111041, 15699748, 15281111, 14830459, 14360602, 13922906, 13577322, 13239226, 12956215, 12739604, 12462375, 12162631, 11825397, 11503616, 11166795, 10895908, 10676612, 10527305, 10322342, 10131759, 9901801, 9710797, 9579494, 9473140, 9416161, 9359022, 9279383, 9113314, 8984380, 8836236, 8719444, 8653196, 8569791, 8467477, 8401248, 8246300, 8028565, 7862098, 7714465, 7546518, 7451210, 7377652, 7263169, 7122273, 7001846, 6839747, 6735654, 6649488, 6537328, 6485258, 6455995, 6356727, 6242229, 6130028, 6000718, 5907234, 5867042, 5854757, 5795241, 5665919, 5519677, 5414404, 5314488, 5204630, 5112277, 5005954, 4890243, 4748079, 4592813, 4475960, 4392857, 4318827, 4283681, 4202123, 4114065, 3994983, 3905793, 3823229, 3768544, 3694853]
4684C694853q9405m5348k8170n1264n9095p9320k4857k5761l2524k2294m9436
4673C187379j02850n6091p2764p2765m8997Q349N275n0047j27776q0707m8288
4662B540718l9022j3608n3241p6091n3670p6454m9616p0788q3864j8967k5606
4651A979791l8002n7150n1997j9534l3413j4658M9673L193m2502j9223q6418k1115
4639A648645k9522k2337j5753n8252k3068l8950j13322m0267p221l9034P702k2865
4627A245756k5087l2691m1680n0136o318k2021J0444j5450P27n3424o1931m3219
4615I04970j9439J0974n222J7385J8722K1502K0083k8447J58k548r703M8184M0615
4602A017234n0876m5396K7013l0469k610L5319L6461n3973m7483K717k1099k1959
$$ y = [3694853, 3605448, 3560100, 3531930, 3480666, 3421571, 3342251, 3317394, 3291633, 3259109, 3236815, 3187379, 3084529, 3028438, 2955674, 2882909, 2833912, 2842261, 2847536, 2797489, 2669713, 2589006, 2540718, 2501696, 2488088, 2434847, 2358756, 2305086, 2228632, 2179016, 2108228, 2024364, 2005397, 1979791, 1941789, 1884639, 1832642, 1813108, 1779695, 1765037, 1814710, 1817903, 1775401, 1756178, 1669760, 1648645, 1619123, 1596786, 1581033, 1522781, 1499713, 1460763, 1347441, 1307174, 1299953, 1260919, 1268621, 1245756, 1220669, 1187978, 1146298, 1096162, 1089844, 1067823, 1078267, 1062817, 1063544, 1010120, 948189, 904970, 885531, 896505, 891283, 908668, 927390, 948892, 968975, 940528, 940686, 938138, 928435, 976619, 1017234, 966358, 920962, 947975, 917506, 914896, 950215, 986676, 932703, 885220, 887937, 866838, 844879]
4590H44879k886k308l2900m437k7264m6247k0862L801l1242m945J3906J5439j3329
4577F91605k7047P032m5576k661K7880k8696J8444o221m5787K285N30J5260o133
4564F00915o307J4145k9560l0535j6762j7377K1495K4078M921L989m9416L3362
4552E52948p101k7868J9928J9663o249J9556j0786m7236l833L2533K3065r631
4540E54989M9264J6217m039k7633k4573M0848M8858J1802k1335r980N635r39k4236
4527F14878M1116J9036R7495M8967l173N9217M4637M0843J5056M6749K2205O378
4515A053404K5658L4806M3091O0988R2090Q0905J56267J58302J47628J66472J67363
4504B186974J81253K83525J74405Q79j42601k88778l57216k91589k20878j68913
$$ y = [844879, 841993, 839685, 806785, 802348, 775084, 728837, 707975, 711776, 680534, 675589, 689495, 704934, 691605, 664558, 671590, 626014, 623353, 651233, 622537, 640981, 634760, 588973, 591258, 591788, 607048, 600915, 594608, 608753, 579193, 548658, 531896, 514519, 536014, 560092, 565013, 569002, 519586, 552948, 545847, 517979, 537907, 557570, 551321, 570877, 560091, 512855, 509022, 541555, 564620, 554989, 604253, 620470, 616431, 588798, 564225, 605073, 653931, 665733, 644398, 634418, 640053, 639114, 614878, 655994, 675030, 772525, 821492, 818319, 877536, 922173, 963016, 978072, 1024821, 1047026, 1053404, 1079062, 1113868, 1156959, 1217947, 1310037, 1390942, 1547209, 1705511, 1853139, 2019611, 2186974, 2368227, 2651752, 2826157, 2827036, 2684435, 2395657, 2038441, 1746852, 1525974, 1357061]
4494A357061j37589q8106o4393j11606q3907p2361j2468m8592k8895q39o7701
4483F40604n5546J1075k5171n6187j1459J9052r327k369j2926j2793j3419N452
4471D76986J1320j9342P313k1241n1922K6553k878j8366L715P543l2316j0764
4459C76601l8610k5301j4664K3552K0004n23K6435k0714k1903r744J7758j8090
4447C14801J2602q020J8401m856k3519j6825k1514L1860J2416l667j1329L1753
4435C32103k8207K2990J5917K5817l8196n754L0675j3381k7865j1672j5193R634
4423B96868J4248k5908P268p466k1592L4569J1387L6612J0200k1088j0414k5965
4411B98719N414n356j8216l960N8982L4315k688J1928l6262m7678R019K8116L1924
$$ y = [1357061, 1219472, 1131366, 1066973, 955367, 871460, 799099, 786631, 738039, 709144, 708305, 640604, 585058, 596133, 570962, 514775, 503316, 522368, 513041, 510672, 497746, 484953, 471534, 476986, 488306, 468964, 476277, 455036, 403114, 429667, 426789, 408423, 412138, 419681, 387365, 376601, 337991, 312690, 298026, 321578, 341582, 341059, 367494, 346780, 324877, 315133, 332891, 314801, 327403, 319383, 337784, 332928, 309409, 292584, 271070, 302930, 315346, 311679, 300350, 332103, 303896, 326886, 342803, 368620, 330424, 324670, 355345, 341964, 314099, 302427, 287234, 296868, 311116, 285208, 292476, 285010, 263418, 297987, 309374, 345986, 356186, 335098, 324684, 298719, 304133, 298777, 280561, 276601, 335583, 369898, 367210, 379138, 342876, 295198, 304217, 332333, 364257]
4398C64257J8987j803m1858J4350J3905K2466k6632J9842M3259o756k3099N6682
4386D53600K4177J2559K0702R420J3138Q6L9373l946J4213k0066J8071J5310K027
4373E98664J2736K0697L9359L0176L1807O9432N4344M1506N4187K405J7090P6352
4361A048755P2917N4012Q7387N4802O3519M4142Q8929J02645J06082Q6711J13746
4350A923647J72139J41965J96131J57430J80191K52668L18561L23547L51143L87129
4340D404551M03720M53229N24960O08864O92051P73255Q18957R11929J077655
4331A0669171J230771J462787J621457J712709K053419K343278K267875Q19040
4323B4180507q64585j929249k668248k649090k438555k051944j587003j193620
$$ y = [364257, 383244, 381441, 339583, 353933, 367838, 390304, 363672, 383514, 426773, 420017, 396918, 453600, 477777, 490336, 511038, 520458, 533596, 533682, 573055, 569109, 583322, 563256, 581327, 596637, 598664, 611400, 632097, 671456, 701632, 733439, 802871, 857215, 898721, 952908, 955313, 972403, 1048755, 1121672, 1175684, 1263071, 1317873, 1381392, 1425534, 1514463, 1617108, 1723190, 1809901, 1923647, 2095786, 2237751, 2433882, 2591312, 2771503, 3024171, 3342732, 3666279, 4017422, 4404551, 4808271, 5261500, 5786460, 6395324, 7087375, 7860630, 8679587, 9591516, 10669171, 11899942, 13362729, 14984186, 16696895, 18750314, 21093592, 23361467, 24180507, 23315922, 21386673, 18718425, 16069335, 13630780, 11578836, 9991833, 8798213]
4315H798213r58113p82309o22328n54865n00379m22423l46082l23117k40408k42541
4305C805648k13854j65984j72468j74443j49432j09188r4852j21170q9883m8991
4295B465383p5754q5520p9408r0556n8349p6386o8766j7623l3120k8968o1332
4284A789601o7483k4125q495l9229n4891K107k0181j0530k006j684L004K755j380
4271A567463L3263J3605j3338k917M8008K4203l3352m386O7256M7875j3805M4335
4259A778210L2632L8670P0376O8344L9561J30214J13650Q8546J25165R9793J51457
4248B736618J34434N4035Q7326Q3474P8659O0662R3027O3610J02922M9481L1422
4237C575670Q0888P0564J08784J08955J38115J67288K07387K67140L10025L52421
$$ y = [8798213, 7840100, 7057791, 6435463, 5880598, 5380219, 4957796, 4611714, 4288597, 4048189, 3805648, 3591794, 3425810, 3253342, 3078899, 2929467, 2820279, 2725427, 2604257, 2514374, 2465383, 2389629, 2304109, 2224701, 2134145, 2075796, 1999410, 1930644, 1913021, 1879901, 1850933, 1789601, 1722118, 1697993, 1689498, 1650269, 1595378, 1597485, 1577304, 1566774, 1564768, 1563084, 1566088, 1568843, 1567463, 1600726, 1614331, 1600993, 1598076, 1646084, 1670287, 1636935, 1632549, 1699805, 1747680, 1733875, 1778210, 1810842, 1849512, 1919888, 1988232, 2027793, 2158007, 2271657, 2360203, 2485368, 2585161, 2736618, 2871052, 2925087, 3012413, 3095887, 3174546, 3235208, 3328235, 3391845, 3494767, 3544248, 3575670, 3656558, 3727122, 3835906, 3944861, 4082976, 4250264, 4457651, 4724791, 5034816, 5387237]
4227E387237M04445M85542N61417N98089O17450O79933Q12525R24064J065746
4218A1536448J193663J314814J452657J697355J959577K245347K500405K680711
4210B6580977L197505L694045L270016Q59752j515832l138803m166732m091923
4202B4689005l775022l067219k396468j879162j460760j078896r99803q88580
4194I143095p72014o53113n35709m59488m13117l58095l18210l03147k55628k36899
4184D837675j98455j71600j83464j55794j40304j47192j59672j13403q6117q4523
4174C397151j13002p9861o6512p5940l3444n3144l8599l6732p076R56R19M1278
4162B935994P9737R615l870K7470k977N5363J0203n0623j6370m4084q0787j06826
$$ y = [5387237, 5791682, 6277224, 6838641, 7436730, 8054180, 8734113, 9546638, 10470702, 11536448, 12730111, 14044925, 15497582, 17194937, 19154514, 21399861, 23900266, 26580977, 29778482, 33472527, 36742543, 37602295, 36086463, 32947660, 28780928, 24689005, 20913983, 17846764, 15450296, 13571134, 12110374, 11031478, 10031675, 9143095, 8371081, 7717968, 7182259, 6722771, 6309654, 5951559, 5633349, 5330202, 5074574, 4837675, 4639220, 4467620, 4284156, 4128362, 3988058, 3840866, 3681194, 3567791, 3481674, 3397151, 3284149, 3204288, 3137776, 3061836, 3028392, 2975248, 2936649, 2899917, 2892841, 2893797, 2894716, 2935994, 3015731, 3025346, 3021476, 3048946, 3045969, 3101332, 3111535, 3060912, 3044542, 3000458, 2919671, 2812845]
4150B812845j20182j24661j04775j43845r6350r6636n4609p5306l7189p0244k2163
4139A866885L192j7039m396J6253m55r896n4087r8564p6642j00666r1738n0001
4127A382846n2509j00702m5458k2918k1385k2822k1398k3779l8198p0345k6112
4116I37220L8903J6790j6741k0860l5845l2259l1250k2079k6550n193j226l1749
4104G69161k5555r9K258j6938m4531k8726J6637K1548j318l3441l8125j9420k4842
4091E76609J0107j3454k3677M3922j2321l7835j6645K235J089k6695r805L401
4079D96931j2924j3173J4520l8993J1429K0165k5063k665l9195k617k9682P81
4067C79514n454K4997J5408l0112j8556k2562J9109k778k5940j8938r357N375
$$ y = [2812845, 2692663, 2568002, 2463227, 2319382, 2223032, 2126396, 2071787, 1996481, 1959292, 1889048, 1866885, 1870077, 1853038, 1848642, 1864895, 1864440, 1854544, 1800457, 1701893, 1625251, 1524585, 1432847, 1382846, 1330337, 1229635, 1184177, 1161259, 1139874, 1117052, 1095654, 1071875, 1033677, 963332, 937220, 976123, 992913, 976172, 955312, 919467, 887208, 855958, 833879, 807329, 802136, 800910, 769161, 743606, 743507, 745765, 728827, 684296, 655570, 672207, 693755, 692437, 658996, 620871, 601451, 576609, 586716, 573262, 549585, 593507, 581186, 543351, 526706, 528941, 530030, 503335, 493530, 496931, 484007, 470834, 485354, 446361, 457790, 477955, 452892, 450227, 411032, 408415, 378733, 379514, 374060, 399057, 414465, 384353, 365797, 343235, 362344, 359566, 333626, 314688, 305331, 310706]
4055C10706L4299m634k9624k7037J8953p523J8496K2561k5850J5339N606l6970
4043B94322j2873l918J0309L4596j8982n5924J1862k1099K4540j0625m6K0213
4031B72375k1566m3245J137M913K883L5841j7365j792K7086l753j043Q800L1017
4018B95288r093K272K655J0088Q081j147L1405q368q1O8451Q957j6384n809K7013
4004D13328R417R68p391K464K4844J464K1824j2997K490Q515M4946J4798J6501
3991E41171J2819M8541O7895Q419M7660Q6694N0253M5115Q4656Q8925R2364J09605
3979A284117J23977J63577J14108J76955J95415J91798K59459K63734K98829K45603
3969C317572J20193P0416l9825M0303N570Q8550J77515K16629K85568L25106K59773
$$ y = [310706, 345005, 340371, 310747, 283710, 302663, 295140, 313636, 336197, 310347, 325686, 331292, 294322, 281449, 277531, 287840, 322436, 303454, 247530, 259392, 238293, 262833, 252208, 252162, 272375, 250809, 207564, 208701, 213614, 216497, 252338, 234973, 233181, 260267, 256514, 255471, 264271, 295288, 286195, 288467, 291122, 301210, 309291, 308144, 339549, 331181, 331100, 399551, 408508, 392124, 386315, 413328, 422745, 423713, 416322, 418786, 443630, 445094, 466918, 453921, 456411, 464926, 509872, 524670, 541171, 553990, 602531, 670426, 678845, 726505, 813199, 863452, 908567, 993223, 1082148, 1174512, 1284117, 1408094, 1571671, 1685779, 1862734, 2058149, 2249947, 2509406, 2773140, 3071969, 3317572, 3437765, 3508181, 3468356, 3508659, 3514229, 3602779, 3780294, 3996923, 4282491, 4607597, 4867370]
3958D867370M9100j72317l18692l49980l55332k89770j60159p1728l8362K6580
3948C186710J2112r9495j96469k67261l07169k43710k16854k23815j39557q3222
3938A421270r6698j18417n9761n9915p4582o5084n1325n6529r114m1599n9739
3927G28507k4472l2082O011r594m7017m0069p273l3901m688K370k6730K437l9108
3914D74391o401J6841O368j4778j6436j2986n173J6016l6381N165J445n317j314
3901D21440J5697k9775J7763L2255n106J2973K9256l16m69M833P373J4508l3481
3888D86951n7260k3117k3514P461o0144k1776q955l7628M052M261l752J2541L3654
3875C12774n910l4776J5508n0729j7625J0375J5679K4254J1337K35k0165l352
$$ y = [4867370, 4916470, 4744153, 4425461, 4075481, 3720149, 3430379, 3270220, 3198492, 3160130, 3186710, 3198822, 3099327, 2902858, 2635597, 2328428, 2084718, 1867864, 1644049, 1504492, 1421270, 1324572, 1206155, 1146394, 1086479, 1011897, 946813, 895488, 838959, 829845, 788246, 728507, 704035, 671953, 677964, 668370, 621353, 581284, 574011, 540110, 535422, 537792, 511062, 513499, 474391, 467990, 484831, 491199, 476421, 459985, 446999, 441826, 457842, 421461, 426626, 428071, 422754, 421440, 437137, 407362, 425125, 457380, 452274, 465247, 494503, 494187, 493718, 498551, 505924, 520432, 486951, 429691, 406574, 383060, 390521, 330377, 308601, 299646, 262018, 266070, 270331, 266579, 279120, 312774, 306864, 272088, 287596, 236867, 219242, 229617, 245296, 269550, 280887, 281122, 260957, 257605]
3863B57605O570L492j3708J1984L3766k4541m1213l088K8862R593k067J9540K022
3850B88817J4563Q523L4182o378K9165J6358J943J1337P919K3013J8248J1015
3838D58705J7650L5538J5432J3017K6643m960Q198K5661O0234M8139N7403P731
3826G69391n139N5670K3715O4642N0289L9762N3900N4211L8018L9575Q9273J18841
3814A392148J09642J29344J15165J62894J76764J61692K34133K89290K70380K94220
3804C335672L21568J11893N8859m5810m9175K0232J06071J50003K05306K61290
3794D475909L54027L94869K16182p6007k57231l84006m25554l24552k74539j34900
3784C564198q8880L762K7544P1396q0332k19573k37824k80223k93854k30646k19330
$$ y = [257605, 264175, 267667, 253959, 265943, 299709, 275168, 233955, 230867, 259729, 269322, 267255, 286795, 288817, 303380, 311903, 346085, 339707, 368872, 385230, 387173, 398510, 406429, 429442, 447690, 458705, 476355, 511893, 527325, 540342, 566985, 562025, 570223, 595884, 656118, 704257, 761660, 769391, 764252, 819922, 843637, 908279, 958568, 998330, 1052230, 1106441, 1144459, 1184034, 1273307, 1392148, 1501790, 1631134, 1746299, 1909193, 2085957, 2247649, 2481782, 2771072, 3041452, 3335672, 3657240, 3769133, 3827992, 3782182, 3733007, 3753239, 3859310, 4009313, 4214619, 4475909, 4829936, 5224805, 5440987, 5364980, 5107749, 4723743, 4298189, 3973637, 3699098, 3564198, 3475318, 3479080, 3506624, 3578020, 3497688, 3278115, 3040291, 2760068, 2466214, 2235568, 2016238]
3773B016238j69642j30415j11806j39596m1148m4498p5503m1321n0820k1215k6142
3762A164132l2776p1852K0949j1628j7319m2093K1392M5875r262j7688L3930O5051
3750A148711N2326K6841j1964n003Q9029O1078Q3110M4254N7393O8469M0245M9783
3738A704272K6548J5755K4523J02586P5826J06862J43113J24514P2595P3361M4456
3727B514411J7327M5667Q1455P9080J19749J51000J50046J49090R0457O0685J5289
3716C474256o549p858l2440k7038k9874j667j4258o1884p6706r3343j16788p6607
3704B929244m8201m8888l9033n3317m6702m5356l7565o0183m2873j7954m4285
3693B444887o1950n3567n6102k7188k3980k2859m0745n2112m6601J5983k9368
$$ y = [2016238, 1846596, 1716181, 1604375, 1464779, 1423631, 1379133, 1303630, 1262309, 1211489, 1190274, 1164132, 1131356, 1059504, 1080453, 1068825, 1051506, 1009413, 1030805, 1076680, 1067418, 1049730, 1083660, 1148711, 1201037, 1227878, 1215914, 1210911, 1299940, 1361018, 1444128, 1488382, 1545775, 1614244, 1654489, 1704272, 1730820, 1746575, 1771098, 1873684, 1949510, 2056372, 2199485, 2323999, 2396594, 2469955, 2514411, 2531738, 2577405, 2658860, 2737940, 2857689, 3008689, 3158735, 3307825, 3398282, 3458967, 3474256, 3467707, 3459849, 3427409, 3400371, 3370497, 3368830, 3354572, 3292688, 3215982, 3122639, 3005851, 2929244, 2881043, 2832155, 2793122, 2739805, 2693103, 2647747, 2610182, 2549999, 2507126, 2489172, 2444887, 2382937, 2329370, 2273268, 2246080, 2222100, 2199241, 2158496, 2106384, 2059783, 2075766, 2046398]
3682B046398o6178q142p4362k7158j936l7309q372n0616n9409m2216n4166o2750
3670A553784k8181j394l9068k3114o8028p3935L686l2297o8216n0707m5108n2841
3658A074581l5325p215m9205l1506r3925k0919j7720l1868l4563o57r979n0908
3646F90791j7123N50n0683n9130K8116M414j1868r57l3327j7141l4558j8501r880
3633D70703M680k1474j8684J0763n2196K1875l7782k8103J7183K038j5492j7090
3621C36421M041J088k4995j1762J4896J0332K796p220j9578k116J3550j5731m8630
3608B53092k0966K306k1236k1015O720k966M8604j2576j8105K449r348l4811Q200
3595A80348J501k6911J7883j4714n94J7770q951k5134J151J111J8066J7644k9410
$$ y = [2046398, 1980220, 1972078, 1897716, 1870558, 1868622, 1831313, 1822941, 1772325, 1712916, 1670700, 1616534, 1553784, 1525603, 1524209, 1485141, 1462027, 1393999, 1320064, 1323750, 1291453, 1223237, 1172530, 1127422, 1074581, 1039256, 1032041, 982836, 951330, 857405, 836486, 818766, 786898, 752335, 751678, 741699, 690791, 673668, 674218, 623535, 564405, 592521, 596935, 585067, 584110, 550783, 533642, 499084, 480583, 470703, 475383, 453909, 435225, 445988, 393792, 415667, 377885, 349782, 366965, 369003, 353511, 336421, 340462, 341550, 316555, 304793, 319689, 330021, 332817, 325597, 306019, 303903, 317453, 301722, 253092, 232126, 234432, 213196, 192181, 198901, 195935, 244539, 231963, 213858, 216307, 206959, 172148, 180348, 181849, 154938, 172821, 158107, 157513, 175283, 166332, 141198, 142349, 143460, 161526, 179170, 149760]
3582A49760J8572k6679j6901P696m0783j6746r560M156K4461K2755J5794J9136
3570A51661j086Q986m7488j3133J5428m266k8756j6602J6324L3937P390m4136
3558G8259j6713J2075n069l7825J2229K5424J236J9718R146j9944J1198j5871
3546G3863n9047r65J6881R593J2834K9124o378p050j7611K4904k4705p417K2819
3533F6845n025l7102j1327J9457J7179q950l0473K0791r065r277N061P010J0956
3520C6080Q650q196k2567L4399l5150j4958L8998q160J6046m651j9569N037K8340
3507E4299j1001K3757J7563j4641K4901j1786o1558N212J5277j7485j8085N337
3495A1790J9823r926P064M388o894L2142j8842j1036o851K3788j5055j6882J1128
$$ y = [149760, 168332, 141653, 124752, 132448, 91665, 74919, 65359, 69515, 93976, 116731, 132525, 151661, 150575, 159561, 112073, 98940, 114368, 110102, 81346, 64744, 81068, 115005, 122395, 78259, 61546, 73621, 68552, 30727, 42956, 68380, 69616, 89334, 98480, 78536, 89734, 73863, 14816, 13851, 30732, 40325, 53159, 82283, 75905, 68855, 51244, 76148, 51443, 44026, 66845, 61820, 24718, 13391, 32848, 50027, 41077, 10604, 31395, 22330, 13053, 18114, 25124, 36080, 44730, 36534, 13967, 48366, 13216, -1742, 37256, 29096, 45142, 40491, 20922, 25959, 54299, 43298, 67055, 84618, 69977, 94878, 83092, 21534, 26746, 42023, 24538, 6453, 11790, 31613, 21687, 28751, 33139, 26245, 58387, 39545, 28509, 21658, 45446, 30391, 13509, 24637]
3482B4637n123k2395l705L3143j5225j2932J1955K3573L5466q790j454l2636l6577
3469a0063J2755J0059J0540k2939K7557J9828j8382k2723k098j653K8368J4224
3457D5473l5076j451J8910m3983j4298K3308L4820J0904N758j252j0939O081k1711
3444A6544O033j5282k4843j2856J8987k2179Q764J5184n029k0522q725J8999L1241
3431F316M4566j5427k1647j7334K4907j6707j7681R281m566Q801P905J5708P709
3418C1831j9006q694o161k2530K561R403j33k9329L2272M7935k1642j8039n465
3405f997K4893j5192n072L6309J4424l054R364j6389n0795K2852K8068L1431m43
3392F9399j8541K4348J2018J0933q669j3486j229p730j5074k1731M334O468j4485
$$ y = [24637, 19514, -2881, -6586, 26557, 11332, -1600, 10355, 33928, 69394, 60604, 59150, 26514, -10063, 2692, 12751, 23291, 352, 27909, 47737, 29355, 6632, 4534, 2881, 31249, 45473, 10397, 8946, 27856, -16127, -30425, -7117, 27703, 38607, 44365, 43113, 32174, 38255, 16544, 22577, 7295, -17548, -30404, -11417, -33596, -24832, -9648, -14677, -35199, -43924, -24925, 6316, 50882, 35455, 13808, -3526, 21381, 4674, -13007, -3726, -8292, 509, 8414, 24122, 31831, 12825, 4131, -2030, -24560, -21999, -12596, -12729, -42058, -9786, 38149, 16507, -1532, -6997, 17896, 2704, -2368, 33941, 48365, 45311, 54675, 38286, -12509, 10343, 38411, 69842, 69399, 50858, 75206, 87224, 98157, 89488, 76002, 74773, 67043, 51969, 30238, 34572, 41040, 26555]
3379B6555J391K4872j4868k4928k0726K0137K1129J1069J1038m10Q539j8624n146
3366D0028j155k5212J7626n177k5747P466l3141j0569K9396j3129O116k914N119
3353a1293j752l2156N823j7365R788p025L3867m590j9897N846L2491N736k883
3340c410J3116j100l2649J2106K0649j9636j6676L065J0230m3478J2269J4987
3328c0527J7574J295J0278N954n745o158J4917k712k6548M557k9458J5342Q762
3315b2469q471K0446J1170k45M210k409k2901J5794K4203l2005j7382P210j9816
3302d2665J5086L7363K1988j739Q478l0624n2461j944K0564O22K0612k6326k8149
3289e9195J4832L2902L1876j7458j0762j8811j6334j6882K4556l221o517L1104
$$ y = [26555, 27946, 52818, 37950, 13022, -7704, 12433, 33562, 44631, 55669, 55259, 63798, 45174, 40028, 38873, 13661, 31287, 26110, 363, 7829, -25312, -35881, -6485, -19614, -13498, -16412, -11293, -13045, -45201, -39378, -56743, -46955, -53980, -20113, -24703, -44600, -38754, -6263, -527, -3410, 9706, 8606, -24043, -11937, 8712, -10924, -27600, -24535, -14305, -57783, -45514, -30527, -12953, -11658, -1380, 4574, -1171, -7329, 7588, 4876, -21672, -17115, -46573, -31231, -22469, -30940, -10494, 676, 431, 4641, 2232, -20669, -4875, 19328, -12677, -30059, -22849, -42665, -27579, 9784, 31772, 30033, 38511, 7887, -44574, -46518, -25954, -25332, -4720, -31046, -59195, -44363, -11461, 20415, 2957, -7805, -26616, -42950, -59832, -35276, -38497, -45014, -13910]
3277a3910l427l6465M9604J8219k7916j4457j7533J9700j1168o277K4932J583
3265a7115k0772K4906K1628k4611j3441k992P35q751J5282P682j3889j3254J845
3252d2747j4O338K9121J1162n832j4204J5851j4739M79o719J4796K4573j3313
3239D752j8992j6275K7951n347o172j5944k451J4715o327j0993M23K8029j9779
3226b6410K4307j2585J1206K1155l044k8985J9243M0810k860n0659j8842J9659
3214g005j2779L4834L0284J2699k8739k6690j7684j5838J2857K4397J5918k113
3202B0141O730k1348j1591k0628m148M3687R260j1604J8345k6780j9436L2827
3190A5455Q618k5251m081l263j9411L0972k651Q475l6437k5627J8238M7164M20
$$ y = [-13910, -17337, -53802, -4198, 14021, -13895, -28352, -45885, -26185, -37353, -43630, -18698, -17115, -37887, -12981, 8647, -15964, -29405, -32397, -31662, -40413, -25131, -17449, -31338, -44592, -42747, -42761, -36423, -7302, 3860, -1972, -16176, -325, -15064, -14585, -21304, -6508, 18065, 4752, -14240, -30515, -2564, -7911, -14083, -30027, -32478, -17763, -24090, -35083, -34660, -6631, -26410, -2103, -14688, -3482, 17673, 14629, -14356, 4887, 45697, 42837, -7822, -26664, -7005, -19784, 15050, 45334, 58033, 29294, 2604, -15080, -30918, -18061, 6336, 22254, 20141, 26871, 5523, -6068, -26696, -30844, 12843, 22103, 10499, 28844, 2064, -17372, 15455, 24073, -1178, -5259, -8522, -27933, 3039, 388, 8863, -27574, -53201, -34963, 12201, 12621]
3177A2621j0184K8179k789j1907L375J2806J4605k665j7761J2421k72m1875J4470
3164A1024K0039K4541Q823j0990n1283k5958J4508K8665k403J2406J1584l596
3152C7360j5444k7639J2280n727M5673m1994l4887L9923L9268j2480k7568o772
3140A993O810j3715K843M862k600J2871L403m160R951k2009j8952K1111K501m704
3126B05j0815r503N757K9084j7093m8004n824L1284J5570J2468J8883l6671l356
3113a8015J1010j057j5667q128j7353N863L0446K2176k7552J0923M4167m8837
3101a2024K4790q331l3829r405K7173Q774j5691K3838K3588m0330l048j348n129
3088b0972M8021K746j6421J7042J2662M285Q852j1928k0834l851n441J9386M147
$$ y = [12621, 2437, 30616, 27827, 15920, 19295, 32101, 46706, 44041, 26280, 38701, 38429, -3446, 11024, 31063, 55604, 64427, 53437, 2154, -23804, -9296, 19369, 16966, 29372, 40956, 37360, 21916, -5723, 6557, 830, 46503, 4509, -30378, 9545, 48813, 36333, 8765, 1993, 8803, -4912, -2069, 2793, 193, 13064, 16467, 12307, 22258, 249, -18703, 2408, 4909, 205, -10610, -20113, -14356, 14728, -2365, -50369, -56193, -24909, -9339, 3129, 22012, -14659, -18015, -7005, -8062, -23729, -31857, -49210, -43347, -12901, 9275, -18277, -7354, 36813, -12024, 12766, 4435, -29394, -38799, -11626, -2852, -18543, 5295, 28883, -11447, -14495, -15843, -20972, 27049, 29795, 13374, 30416, 43078, 47363, 56215, 44287, 23453, 19602, 14161, 33547, 37694]
3075C7694j5940o158r289m786J7941K5768j6678j4674J312R489P788j3711m450
3062A4306K7286J3271P676p764J8835J7352n498k6522K977J9305p064k3267O997
3049E7890j2954K4462J0253k9387j6483m505Q855K926L61L454J3048k0410J1836
3036D9346R971r869j0976l154r914j914J6632K0341m7681L2438J8400J1851J7976
3023I3447j2290l597m272m307j8724k4518L349j0255l3314O2469J7099m651M319
3010F4755k7418K5424j8297J3887P317k7787o492J1501j0511J1159J4622l3207
2998B4953k590k3663K2439P599m0811j3833R289M606L2857J1688N480k9771k9390
2985b1147M2098j8273k5690L3301j7030L6851j2354j45L193K4779k2451L523N450
$$ y = [37694, 21754, 15596, 6307, 1521, 19462, 45230, 28552, 13878, 15190, 24679, 32467, 18756, 14306, 41592, 54863, 62539, 54775, 73610, 90962, 85464, 58942, 61919, 81224, 74160, 50893, 57890, 44936, 69398, 79651, 50264, 33781, 29276, 38131, 41057, 41418, 44872, 57920, 37510, 49346, 59317, 49448, 38472, 35318, 25404, 23490, 40122, 60463, 12782, 45220, 63620, 75471, 93447, 81157, 77560, 73288, 68981, 50257, 25739, 29088, 18833, -14481, 47988, 65087, 60436, 64755, 37337, 62761, 44464, 58351, 65668, 37881, 31389, 42890, 32379, 43538, 58160, 24953, 22363, -1300, 21139, 28738, -12073, -25906, -16617, -12011, 20846, 32534, 38014, 8243, -21147, 20951, 2678, -23012, 10289, -6741, 30110, 17756, 17611, 20804, 45583, 23132, 26655, 32105]
2972C2105l914K5123J0099m2763j3410J9799J3196j9382j7518l579J0385M39M921
2959A5501J4406j9607J3715k4427J6089j9994l2646K9957K4416n785l294J2580
2947B0911l13l1812J9028K474j3366J7675n264k716M6808K991o152j7061J4826
2934D8029p891J4913j2105J165o061k7173j0110M0813l092j1812P107L2664k1885
2921D4562j0301J0119m1628N15J9414J7714J234r575j3241n366J8310J2159j7524
2908B6392P115L3051J7352l8984M6359k675Q588j361j8710K625r631k106p242
2895F0773R207K4740k0840m814P948J5421P235J0869m985l4199j1600Q808R61
2882F9524M1582R900J1582K5261R54o50J7413j067Q325K5800k2841R287M4728
$$ y = [32105, 28191, 53314, 63413, 20650, 7240, 27039, 40235, 20853, 3335, -244, 10141, 10580, 15501, 29907, 10300, 24015, -412, 15677, -4317, -36963, -7006, 17410, 11625, 8331, 20911, 20598, -11214, 7814, 10288, -3078, 14597, 9333, 6617, 53425, 56416, 50264, 33203, 48029, 40138, 55051, 42946, 44111, 38050, 10877, 767, 41580, 38488, 26676, 33783, 66447, 44562, 34261, 44380, 2752, 3267, 22681, 40395, 41629, 32054, 18813, 13447, 31757, 43916, 26392, 33507, 66558, 83910, 44926, 91285, 88610, 97198, 95837, 77127, 79752, 70121, 68015, 60773, 69980, 94720, 73880, 69066, 77014, 92435, 99670, 110539, 105554, 71355, 59755, 68563, 69524, 111106, 121006, 132588, 157849, 158803, 158153, 175566, 174499, 182824, 208624, 185783, 195070, 239798]
2869B39798J8553m2875K1238K8982N1486j8041K3908O1010L3226m769l7328J2267
2857C87455L943j2577j2358p574r053o640o152N298K2139r759M629M8192P871
2844D15414J3133R340L9652L8036M4795M1710J2181O2567L6600P849L5510O3789
2832H20576O8706O0134N9129Q5826P0525K4586M8723P396L1463K9823J3535N7087
2820A377509O3251Q5431Q8221J32015J67514J48089J49549J83184J47762K28240
2810B770765K72028L31033L25238L32982M37143M51597N08807N96918O84313O81566
2800G392390Q01532R67207Q53658L59591k23737n92215q82118r11823q12298o96859
2790F255328n08286l46235k26719j56543o6355J6847j1425J10652J75128J76364
$$ y = [239798, 258351, 215476, 236714, 265696, 317182, 299141, 323049, 384059, 417285, 412516, 375188, 387455, 391398, 378821, 366463, 358889, 349836, 343196, 337044, 342342, 364481, 354722, 359351, 407543, 415414, 428547, 437887, 477539, 515575, 560370, 602080, 614261, 676828, 713428, 721277, 756787, 820576, 889282, 949416, 1008545, 1094371, 1164896, 1189482, 1238205, 1245601, 1277064, 1306887, 1320422, 1377509, 1440760, 1526191, 1614412, 1746427, 1913941, 2062030, 2211579, 2394763, 2542525, 2770765, 3042793, 3373826, 3699064, 4032046, 4469189, 4920786, 5429593, 6026511, 6710824, 7392390, 8193922, 9161129, 10014787, 10374378, 10150641, 9558426, 8676308, 7764485, 6952187, 6255328, 5747042, 5400807, 5174088, 5017545, 4951190, 4968037, 4956612, 5067264, 5242392, 5418756]
2780E418756K26944L09694L76810M44494N09200O03608O52987P27436Q49715R97366
2770A1117010J167636J250562J436416J658700J687199P38826m06449j269668
2762A7380232j842256j952994j800640j562090j181786q80428o89591m99895m31624
2753F538928l71301l04816k49507j16896q4710r7090L738O4324N0623R6243J65960
2742E695496K27415K74625L31123M29015M88185M56848N83957O91156P83586M36016
2732A0397422j69288o13656q66673r99188r96879q18683o61770n50339m58487
2723D262459l25376k68488k62168k43018k24362j78528j22331j26519j06428j10697
2713B294544q7288p7974o5883q8711n2689m7632j5099q8829o0740j9759p0116
$$ y = [5418756, 5645700, 5955394, 6332204, 6776698, 7285898, 7889506, 8542493, 9269929, 10119644, 11117010, 12284646, 13535208, 14971624, 16630324, 18317523, 19056349, 18649900, 17380232, 15537976, 13584982, 11784342, 10222252, 9040466, 8160038, 7470447, 6970552, 6538928, 6167627, 5862811, 5613304, 5496408, 5411698, 5314608, 5318346, 5382670, 5433293, 5529536, 5695496, 5922911, 6197536, 6528659, 6957674, 7445859, 7902707, 8486664, 9177820, 9961406, 10397422, 10228134, 9614478, 8747805, 7748617, 6751738, 5933055, 5271285, 4720946, 4262459, 3937083, 3668595, 3406427, 3163409, 2939047, 2760519, 2638188, 2511669, 2405241, 2294544, 2207256, 2129282, 2063399, 1974688, 1921999, 1874367, 1859268, 1770439, 1709699, 1689940, 1619824]
2702A619824o8317k4786n9651n6879k1125o246p1666n4973l5691k7078j2580M150
2690A184982l8494p936o8025l7650o247l862L8366l5539l9823j1826j059j2741
2678I60146j123l7908J7042j4603l3410j1165J952j4222M237j9355l5162j6884
2666G99545K2846j3967o1525j107q678k487j4499P995q728L455j5505n297k8002
2653F74046l556L0012q304m9464m338R957j087P186P989K5075o0780r600l6188
2640E80948L3519J30j9420j4054J5177R457m6186l3269J3522M64o109O011L426
2627E43616k6205M461j9783m321L386J8162L0909j4624q727n008j7769k6176O961
2614D84882L4935J2947k1688N459n194l4341k9217R931k6351j2455J9797m8342
$$ y = [1619824, 1551507, 1526721, 1467070, 1410191, 1389066, 1382820, 1311154, 1256181, 1220490, 1193412, 1180832, 1184982, 1146488, 1138552, 1070527, 1032877, 1026630, 1022768, 1061134, 1025595, 985772, 973946, 972887, 960146, 959023, 921115, 938157, 923554, 890144, 878979, 880931, 866709, 870946, 851591, 816429, 799545, 822391, 808424, 746899, 745792, 737114, 734627, 720128, 728123, 719395, 722850, 707345, 702048, 674046, 670490, 700502, 692198, 642734, 638396, 648353, 647266, 654452, 662441, 687516, 626736, 617136, 580948, 614467, 614597, 595177, 581123, 596300, 605757, 559571, 526302, 539824, 540288, 534179, 540190, 543616, 517411, 521872, 502089, 497768, 501154, 519316, 550225, 535601, 526874, 521866, 504097, 477921, 484882, 519817, 532764, 511076, 516535, 511341, 477000, 447783, 457714, 431363, 418908, 438705, 390363]
2602C90363k4220k510l9112j8059j038J2012j6607j3960m444K6455j438k8820
2590B78622l4329J6869K2421K492J7685J1579l2437j9532k5205N332n759K100
2578B39838Q661r954j1036J5925J1708k2035l400o556J3646j1952k9560K527r82
2565A96830k5173p346N759k071J078J0442p800j6182L9592j2873j2082p377q77
2552A61920J0287p08Q105k6621K5915J4937j8548q04j2010k1006k0235q219l2
2539A12981j9983n095J7012M992j1475q826K0176P147m3469k6076J1840K8324
2527H7548n129j5970O746L7448m0120k6700j3782M0382J9332k6374J2032j3594
2515F1819J2918q889L7210j4214j6450J1499j5684K2571q351l856o044K1563l265
$$ y = [390363, 366143, 363633, 324521, 306462, 305424, 317436, 300829, 286869, 282425, 308880, 307442, 278622, 244293, 261162, 283583, 286075, 303760, 315339, 282902, 263370, 238165, 243497, 237738, 239838, 248499, 238545, 227509, 243434, 255142, 233107, 229707, 223151, 236797, 224845, 195285, 197812, 196830, 171657, 164311, 170070, 167999, 169077, 179519, 171719, 155537, 195129, 182256, 170174, 162797, 161920, 172207, 171499, 179604, 152983, 178898, 193835, 175287, 174483, 162473, 141467, 121232, 113013, 112981, 92998, 87903, 104915, 109907, 98432, 89606, 109782, 116929, 73460, 47384, 59224, 87548, 82419, 66449, 73195, 110643, 70523, 43823, 30041, 70423, 89755, 63381, 75413, 61819, 74737, 65848, 103058, 88844, 72394, 83893, 68209, 90780, 82429, 78573, 72529, 94092, 90827]
2502I0827j7439J3955j128p835k6583J197R658K954j762P736m144o549j3778L3118
2488H0227j7831q983J7068J3674P916O787M612m3330j6572J6818M9088k9193J7599
2475I7880J1429K4329o261N627m0723j3764K6916q396m2488k7931J7729J2965
2463E7312j6942k177L0820j2550j2245q27J420J226j1233j0726M2706j7236n3508
2450c960K0215L5439j0639l910l739k209L0687j9084j5526n85J8602j535k060
2437D1696N202R424k4040j5152K3323k7738p933m891L6972K213P021j9543k7574
2424a020L6986K1938j2526J2957p752k2170k0303m5820k4344K3673K2475J4985
2412i21j4412P030k2009J8048J7323k1121M700K4068J2784k7605n22J8621J1074
$$ y = [90827, 73388, 87343, 86215, 78380, 51797, 52994, 62652, 65606, 63844, 71580, 67436, 60887, 47109, 80227, 62396, 53413, 70481, 84155, 92071, 98858, 103470, 60140, 43568, 60386, 109474, 80281, 97880, 109309, 133638, 127377, 133004, 92281, 78517, 105433, 97037, 54549, 26618, 44347, 57312, 40370, 38193, 69013, 56463, 44218, 43391, 44811, 46037, 34804, 24078, 66784, 49548, -3960, 16255, 51694, 41055, 37145, 33406, 31197, 61884, 42800, 27274, 26689, 45291, 43756, 41696, 46898, 56322, 32282, 17130, 40453, 12715, 4782, -109, 36863, 39076, 46097, 26554, -1020, 35966, 57904, 45378, 58335, 50583, 28413, 8110, -37710, -62054, -38381, -15906, -921, -15333, -8303, -30312, -12264, 5059, -16062, -11362, 12706, 25490, -2115, -2637, 15984, 27058]
2399B7058q715P522j1022K149K060K6788l604l0609J5269K5206L791k6410M740
2386C4223m4163R916m377R041L0683J6505k3085p380j1634l410q199J5285q802
2373D603k569J4402j9948R316J1706K4318j3052j5450j6512j7266j643K5769J492
2360E166k5044J5718J9937O913K7973k5314m278m259N150L3521j4078j5772k808
2347B2825J5378M079J2795k0726j2874j4255j7173J7969Q644J3041j9445K5119
2335C5377r700J3987m263p273J5254k7212j5718K3063J8953j4405J1585o916L2816
2322F5548J2798j9782j4245l199P31k0687p5M364K3035j0429J3192k3016j7411
2309A0824J2580J6147k4660M40j2281Q63L075P110O391J3083l3187l772M929l345
$$ y = [27058, 18343, 25865, 14843, 16992, 19052, 45840, 42236, 11627, 26896, 52102, 55893, 29483, 34223, -9940, -24, -4401, 4640, 35323, 51828, 28743, 21363, 9729, 6319, -1880, 13405, 4603, 2034, 16436, -3512, 5804, 17510, 41828, 28776, 13326, -3186, -20452, -22095, 3674, 5166, -19878, -4160, 15777, 22690, 50663, 25349, 21071, 16812, 21962, 55483, 41405, 25633, 22825, 38203, 42282, 55077, 34351, 21477, 7222, -9951, 8018, 16662, 29703, 10258, 35377, 25677, 39664, 35401, 28128, 43382, 16170, 452, 23515, 42468, 28063, 39648, 32732, 65548, 78346, 58564, 44319, 41120, 41851, 21164, 21089, 25453, 48488, 38059, 51251, 28235, 10824, 23404, 39551, 14891, 15331, 3050, 3913, 6988, 14098, 20489, 33572, 385, -3387, 1542, -1803]
2295a803K2827K7483k2386k0669j1638Q739K0667j3503j0100J7752J2308J1847
2283D1524k3174j8024n71p270r745r161L3980j9226M083K633L94j2126K3367j2785
2269f101q230J7792O04L278K005j0465n332p124j3598L08N630k4795M3099J2711
2255I782j881M164j7625j8004j2158r65K0792N390q978j7147M0763J0923m0634
2242b5578j6183J9052L014J4998M640j683J4871J0533j0204m9071R709P859L9146
2229B1103J50J38R544m8705L1347j8404l0328L583O191k0637J3197M2920j9008
2216h909J2885K228l922k8711Q816j0056L770q570L9360m848j7893J2744K506
2203f00J3535k6345L7785r793m773k1358k4403n789r539M4378k515l8382j2739
$$ y = [-1803, 21024, 48507, 26121, 5452, -6186, 2553, 23220, 9717, -383, 17369, 29677, 41524, 18350, 326, -245, -7515, -17260, -26421, 7559, -11667, -7584, -4951, -4557, -16683, 6684, -6101, -14331, 3461, 4065, 7343, 9348, -1117, -6449, -13573, -27171, -26863, -21233, -46028, -2929, 9782, 7901, 12065, -5560, -23564, -35722, -36687, -15895, -10505, -19483, -36630, 4133, 15056, -25578, -41761, -22709, -19695, -4697, -57, -1740, 13131, 23664, 13460, -35611, -25902, -18043, 21103, 21253, 21391, 30935, -17770, 13577, -4827, -35155, -31572, -25381, -46018, -32821, 10099, -8909, 3976, 6204, 2282, -26429, -17613, -27669, -23899, -32469, 6891, 2043, -15850, -3106, -600, 12935, -13410, 24375, 14582, 9809, -11549, -35952, -41741, -51280, -6902, -9417, -47799, -60538]
2190f0538L6840J1463L31J6237j5132k2356J3335J3273l1482J1048K1151k0569
2178b6399j6025L4830J4518j2185K454j1538k82k339k7909j9796J8321M3520j7336
2165b0166M703P296L440J8494k9385j8349J4538K4836k6107j1872j1674Q613M471
2152c1162J0019M127l8872J0057L8250J6396m092N332J4314R979l1055l7721l558
2139c7986O745J4093J8867p982l3690o916L4429j4809k4461K7951k4148K3040
2127b4867K6419k3764j0262m4514L7393L9337J2670m9407J0944J1117K2436k7591
2115b0089j9960K042o173r984j3409q714M7854P0426n2646m0449o740J7256J0637
2102b9949L0053j0162L3448M866j8290k0342J608J1838n09k4349j7265J667k814
$$ y = [-60538, -23698, -12235, -11904, 4333, -10799, -33155, -19820, -6547, -38029, -26981, -5830, -26399, -42424, -7594, 6924, -5261, -2807, -14345, -14627, -16966, -44875, -64671, -46350, -2830, -20166, -15463, -8167, -4727, 13767, -15618, -33967, -19429, 5407, -20700, -32572, -44246, -35633, -31162, -21143, -17016, -55888, -45831, -7581, 8815, 4723, 10055, 24369, 34348, 3293, -34428, -37986, -31241, -17148, 1719, -6263, -39953, -46869, -12440, -27249, -51710, -23759, -47907, -24867, 1552, -22212, -32474, -76988, -39595, -258, 12412, -36995, -26051, -14934, 7502, -20089, -40049, -38007, -44180, -54164, -67573, -76287, -28433, 41993, -10653, -51102, -57842, -40586, -29949, 104, -10058, 23390, 28256, 9966, -10376, -8768, 3070, 2561, -21788, -39053, -37386, -40200]
2089d0200k5021j142J1386J4093P275L7118J0248j2840j4776n308l6589K4780
2077c0976K4579n1654Q439Q793J3648k235r728n286m571J4029J1509Q381K0436
2064E364J0864m401J673j8067p581j943r286n042M469k5155l0414M2699Q721P023
2050b1076K116j5417o046J3965M6490j8076j3125J4913j4397k3263O251J0072
2038a7593o870j8016J399j1759J5617J4301K1346k9390l2214L4174J9828N209
2026c968M123k0911j1696J9946K3738j4317q656Q514k5833j8514l1k313N684K5214
2012a9020r476Q760j8651P849K2605J2663m2774j3019R180L5644j0788q484R933
1999a5578m3864j0412N9886j7280k8563r52J3731J0659J9930L8888k5768k0154
$$ y = [-40200, -65221, -66363, -54977, -40884, -33609, 3509, 13757, 917, -13859, -19167, -55756, -30976, -6397, -58051, -49612, -40819, -27171, -29406, -39134, -44420, -48991, -34962, -23453, -15072, 5364, 16228, 11827, 13500, -4567, -12148, -14091, -23377, -28419, -23950, -49105, -79519, -36820, -28099, -21076, -18960, -34377, -40423, -26458, 20032, 1956, -11169, 3744, -10653, -33916, -27665, -17593, -24463, -42479, -41080, -52839, -37222, -22921, -1575, -30965, -63179, -29005, -9177, -3968, 155, -20756, -32452, -12506, 11232, -3085, -11741, -3227, -29060, -47574, -47605, -49918, -44234, -19020, -28496, -19736, -38387, -30538, -7933, 4730, -38044, -51063, -41883, -6239, -17027, -25511, -15578, -59442, -69854, -9968, -27248, -55811, -56763, -43032, -32373, -12443, 26445, 677, -19477]
1987a9477O553J9187l500n347j8648o184P408j1946n585m165q448J7582k1964
1974e4534k9795m768M3939K6715l4616K5747J114j1433J4020J4058J3594R185
1962A3226l9370K693K4328j9858k5689N800k200K6022r363r984J6634L03r929
1949b7387j2186M2545K0337l9616J4392J0426J1043k6623n1380K1938M6806K2259
1937C2554n5651o626O624K5143j4341q481K1001O28l2818J8189m455r667K733
1924b5167P996O632N41k474m171Q957J0868J5454l5589J0260o917l038L088Q799
1910d761J2764m2766m5732J2137M4785l6174k9065p001N3095L1067l782j2431
1898b7864J8415m06N99m9283L533L3670O795p376j729K537r35P556o305L6141
$$ y = [-19477, -12924, 6263, 2763, -2584, -21232, -27416, -20008, -31954, -37539, -41704, -50152, -32570, -54534, -84329, -89097, -45158, -18443, -53059, -27312, -26198, -37631, -23611, -9553, 4041, 13226, -26144, -23451, 877, -18981, -44670, -38870, -41070, -15048, -24411, -34395, -17761, -17458, -27387, -39573, 2972, 23309, -16307, -1915, 8511, 19554, -7069, -58449, -36511, 10295, 32554, -23097, -29723, -23099, 2044, -12297, -20778, 223, 851, -31967, -13778, -18233, -27900, -25167, -17171, -10539, -9998, -12472, -16643, -7686, 3182, 18636, -16953, -6693, -13610, -16648, -13560, -4761, 8003, -34763, -80495, -68358, -23573, -59747, -88812, -95813, -42718, -11651, -15433, -27864, -9449, -9855, -9256, -58539, -55006, -21336, -14541, -21917, -23646, -21109, -22044, -14488, -20793, 15348]
1884A5348r510J2894J3754m5784k3505J7851o925q998J8995j6382l775K1963m8202
1871f2276K3222J6307j2820P572R595J9460n76o831j3039l196l194J4495j4537
1858b5818j0236r912k5030L7881L0798l101J2909n080l4091L5856j4136p371l271
1845b0602m635j0228K4361k104j9780l71L6782l6160j7021J2731J743R895j8459
1832d3848j3180l2400M4414J7506m4641M0051L7332j6520M5415l2889k0189k876
1820b1825k3874J6001n225L061L7917k1508J1302k7050J5030m274l8225R085J4409
1807c5176J218J5522r881n691P806j086j9745r800J3958J8169N150K553Q628J8
1793h357l2240Q958N1517j6304j0819j4316j0907J8473l2543k7616K6795P050
$$ y = [15348, 5838, 18732, 32486, -13298, -36803, -18952, -25877, -34875, -15880, -32262, -36037, -14074, -62276, -39054, -22747, -35567, -27995, -18400, 1060, 484, -6347, -19386, -22582, -25776, -11281, -25818, -36054, -45966, -70996, -33115, -2317, -5418, 7491, 2411, -31680, 4176, -9960, -17331, -20602, -25237, -35465, -11104, -13208, -32988, -33359, 3423, -32737, -49758, -37027, -35284, -25389, -43848, -57028, -89428, -45014, -27508, -72149, -32098, 5234, -11286, 34129, 1240, -18949, -21825, -45699, -29698, -34923, -31862, 6055, -15453, -4151, -31201, -16171, -20445, -58670, -49585, -35176, -33958, -18436, -28317, -34008, -26202, -27288, -47033, -56833, -42875, -24706, -19556, -17003, -8375, -8357, -40597, -31639, 19878, 3574, -7245, -21561, -32468, -13995, -46538, -74154, -47359, -40309]
1781d0309R263L4787J3036l0404J6149l5836q894q297L1247N701l4048J2060M2556
1768G011k9678J5650L0263j3298K457J988k8782m483j5271O134O136k7450J328
1755d7995J5314K7211K0972J0142k950k701j9134k2579o953L5468j0843K6495
1743B2447j157k033N883J6143N169q955k4082p417K4027J412r713j9330j955J938
1729B377k1826K2920k5811L589J4762k1652K4882q823K1599p249j7379k7772J2643
1716b7740J3437j2514j4460k8647K1132p894K5295K7333k2197K9479p416k2134
1704b6326J0967K0615l195q214J9327j7969J8875j6268m133J1462k0318k4505
1692c9682n4J0958K286J8784O278K1654j7614k0748l903K1158K2554j5406n2505
$$ y = [-40309, -31046, 3741, 16777, -13627, 2522, -33314, -42208, -50505, -19258, -13557, -47605, -35545, 7011, -22667, -7017, 23246, 9948, 12405, 14393, -14389, -18872, -34143, -28009, -21873, -49323, -47995, -32681, -5470, 15502, 25644, 22694, 19993, 859, -21720, -28673, 6795, -4048, 22447, 21290, 19257, 25140, 41283, 46452, 37497, 13415, 5998, 30025, 31437, 21724, 2394, 439, 2377, -19449, 3471, -22340, -18751, -3989, -25641, -759, -9582, 12017, 4768, -12611, -40383, -27740, -14303, -26817, -41277, -69924, -48792, -56686, -31391, -4058, -26255, 3224, -4192, -26326, -15359, 5256, 2061, -6153, 13174, -4795, 14080, -2188, -6321, 5141, -15177, -39682, -39736, -28778, -26492, -7708, -1430, 20224, 2610, -18138, -22041, -883, 21671, 6265, -46240]
1679d6240K1228J153j0995k220K444J7404p986K6311k0048r607K6289k169j1440
1666a5876K847L712L183j7062j0458K8784J3252J1003j4158R758N0092j6998l6667
1653A1412l1375o574P122L0707l4991O92K3328J0487K13l6631k870J5150k430
1640a5760J2658l505j0047Q660n026q970j1649J6149P640L806M561j2963o433
1627b0879o447L1718K2035q259l0534k7172K1855l6369M2439p099N941L7149J1746
1614C6124K609j6689m109k3728N596J8690K2150j8243j3363p309m827j195J4450
1601A0156K6394J092r445r690q373j905L0115N087j0989k2147M1141J573k4428
1588B8581m504j9116R694j7820J4261l821N470j5128Q202K214J1932K4624j2455
$$ y = [-46240, -25012, -23859, -34854, -37074, -34630, -17226, -25212, 1099, -18949, -28556, -2267, -4436, -15876, -13029, -9317, -6134, -23196, -33654, -4870, 8382, 19385, 5227, 14985, 65077, 48079, 11412, -19963, -26537, -19415, 11292, -23699, -23007, 321, 10808, 11021, -25610, -28480, -13330, -15760, -3102, -6607, -16654, -7994, -13020, -21990, -33639, -17490, -9850, -6044, -1483, -14446, -20879, -27326, 4392, 26427, 18168, -12366, -39538, -17683, -54052, -11613, -18712, -12771, 24378, 36124, 38733, 22044, 17935, -5793, -197, 18493, 40643, 22400, 9037, 1728, -3099, -4294, 10156, 36550, 37642, 28197, 18507, 10134, 8229, 38344, 43431, 32442, 10295, 51436, 53009, 28581, 24077, 4961, 14655, -3165, 11096, 7275, 12745, -2383, 5819, 8033, 19965, 44589, 32134]
1575C2134j1843L8482K4245j2190k1947J273J5885l1639j731j0837L3087J9037
1563G3956k8614R288Q866J4092k0379m5393j691L5117j1201Q715P237j625K6800
1550G5168l779J374l14k5035K04l1562k480N5563j4707j4545j7169K4016J578
1537D8312K9568P298K6931J5410k2985n105n487K1551J8274L1122n073o888j1705
1524A41223J5848O994L2230M1365p831j4882J543M7475M2017J0891j2416K7426
1512C31883M8872K3161j8661L2770K8401J6622O9505K3384L2143O2751J5900L3569
1500G00300L3979R1736J27467M7508O0850K8277R4599J30449J60753J31762J75115
1489A782795J81108K08253J95305J90200K18860K41014L02308L57894L52658M40912
$$ y = [32134, 20291, 58773, 83018, 70828, 48881, 50154, 66039, 34400, 32669, 21832, 54919, 73956, 45342, 54630, 63496, 77588, 57209, 11816, 10125, 45242, 34041, 42756, 49993, 48368, 75168, 71389, 72763, 72449, 47414, 47618, 16056, 13576, 69139, 54432, 39887, 22718, 46734, 48312, 77880, 85178, 112109, 127519, 104534, 99429, 93942, 115493, 133767, 164889, 159816, 152928, 141223, 157071, 164065, 196295, 237660, 229829, 214947, 216490, 263965, 305982, 316873, 304457, 331883, 380755, 403916, 385255, 418025, 446426, 463048, 532553, 555937, 588080, 650831, 666731, 700300, 734279, 826015, 953482, 1000990, 1061840, 1090117, 1184716, 1315165, 1475918, 1607680, 1782795, 1963903, 2172156, 2367461, 2557661, 2776521, 3017535, 3319843, 3677737, 4030395, 4471307]
1479D471307N09455O05651O72811P01654Q25301J003766R42757K16730m23595
1470I525837r15390j133457j075611r54609q11500o14343m66597l61957k89692
1461B902681k50402j87932j36477j49039j38080j33826j31935j25375j00984j09971
1451A438660p5708j02903j06503n6995k6754j5521n2921q2919m3864m4511m3420
1440G86641j4224n6451l6114J1436k7522r392j1822k3034j5123n3192k2097P168
1428E36274j7601m3323q634J2787q444l8425l0373R430N9501j9091l8690K0851
1416D34262j7576p117j8711J3335q309n6641L796m685N536l3770k353Q152J3691
1403C29610k9328m9523j6601L0553J9194k1263m2017n745J4200J9381K1815q740
$$ y = [4471307, 4980762, 5586413, 6259224, 6960878, 7786179, 8789945, 9732702, 9949432, 9525837, 8610447, 7476990, 6401379, 5446770, 4635270, 4020927, 3554330, 3192373, 2902681, 2652279, 2464347, 2327870, 2178831, 2040751, 1906925, 1774990, 1649615, 1548631, 1438660, 1362952, 1260049, 1153546, 1096551, 1069797, 1054276, 1001355, 918436, 874572, 830061, 786641, 772417, 715966, 679852, 691288, 663766, 654374, 642552, 619518, 604395, 551203, 529106, 536274, 518673, 475350, 466716, 479503, 471059, 432634, 402261, 411691, 471192, 452101, 413411, 434262, 416686, 409569, 390858, 404193, 395884, 339243, 343039, 338354, 343890, 310120, 307767, 315919, 329610, 300282, 250759, 234158, 264711, 283905, 262642, 220625, 214880, 229080, 248461, 270276, 261536]
1391B61536k3478j3572k5398J5353R257n212k5253n311m433l1269K904K9730j3507
$$ y = [261536, 238058, 224486, 199088, 214441, 223698, 218486, 193233, 187922, 183489, 152220, 155124, 184854, 171347]
$$ [...]
##END NTUPLES=NMR SPECTRUM
##END=
