##TITLE=1H_CA-9267-2
 CDCl3
 8 sc, 
 8.5.2024
##JCAMPDX= 6.0         $$ Bruker NMR JCAMP-DX V2.0
##DATA TYPE= NMR SPECTRUM
##DATA CLASS= NTUPLES
##ORIGIN= UXNMR, Bruker Analytische Messtechnik GmbH
##OWNER= root
$$ XWIN-NMR		Version 3.5
$$ Wed May  8 14:05:35 2024 Russian Standard Time (UT+4h)  she@DPX200
##.OBSERVE FREQUENCY= 200.1309
##.OBSERVE NUCLEUS= ^1H
##.ACQUISITION MODE= SIMULTANEOUS
##.ACQUISITION SCHEME= undefined
##.AVERAGES= 8
##.DIGITISER RES= 18
##SPECTROMETER/DATA SYSTEM= spect
##.PULSE SEQUENCE= zg30
##.SOLVENT NAME= CDCl3
##.SHIFT REFERENCE= (INTERNAL, CDCl3, 0, 16.4411)
##AUDIT TRAIL= $$ (NUMBER, WHEN, WHO, WHERE, WHAT)
$$ ##TITLE= Audit trail, XWIN-NMR		Version 3.5
$$ ##JCAMPDX= 5.01
$$ ##ORIGIN= Bruker BioSpin GmbH
$$ ##OWNER= she
$$ F:/spectra/data/she/nmr/H-F/1/pdata/1/auditp.txt
$$ ##AUDIT TRAIL=  $$ (NUMBER, WHEN, WHO, WHERE, WHAT)
(   1,<2024-05-08 14:04:27.32 +0400>,<she>,<DPX200>,
      <created by zg, POWCHK disabled, PULCHK disabled
       configuration hash MD5:
       00 E9 B6 7A A2 85 ED C7 34 08 36 98 17 FE 4E 26
       data hash MD5: 16K
       10 C2 87 27 AA 83 8C F1 06 47 AA 39 38 71 EA C4>)
(   2,<2024-05-08 14:04:29.92 +0400>,<she>,<DPX200>,
      <Start of raw data processing
       efp BC_mod = 2 LB = 0.24 FT_mod = 6 PKNL = 1 PHC0 = -25455.98 PHC1 = 9.987491 SI = 16K 
       data hash MD5: 16K
       48 77 66 B3 9E 9A BA 63 C6 99 48 DF 33 4E D3 1E>)
(   3,<2024-05-08 14:04:33.81 +0400>,<she>,<DPX200>,
      <abs ABSG = 5 
       data hash MD5: 16K
       B9 3A 43 FB BF 1F 61 24 55 51 43 70 23 34 C9 8E>)
(   4,<2024-05-08 14:04:47.98 +0400>,<she>,<DPX200>,
      <pk PHC0 = 10.63784 PHC1 = -14.4 
       data hash MD5: 16K
       77 BE D1 A3 AE 69 CB ED 34 84 4D 8C AA 5C 8A 6E>)
(   5,<2024-05-08 14:04:51.20 +0400>,<she>,<DPX200>,
      <abs ABSG = 5 
       data hash MD5: 16K
       C5 A4 B8 13 07 B3 AA 6F D4 70 B2 AC 4F 35 39 CC>)
$$ ##END=
$$ 
$$ hash MD5
$$ F4 13 B5 8F 1F 0E 25 BE 43 C3 1E DE 17 C2 D8 6B
##$RELAX= 
##$RELAX= 
##$RELAX= 
##$RELAX= 
##$RELAX= 
##$RELAX= 
$$ Bruker specific parameters
$$ --------------------------
##$DU= <F:/spectra>
##$EXPNO= 1
##$NAME= <H-F>
##$PROCNO= 1
##$TYPE= <nmr>
##$USER= <she>
##$AMP= (0..31)
100 100 100 100 100 100 100 100 100 100 100 100 100 100 100 100 100 100 
100 100 100 100 100 100 100 100 100 100 100 100 100 100 
##$AQSEQ= 0
##$AQ_mod= 1
##$AUNM= <au_zg>
##$AUTOPOS= <>
##$BF1= 200.13
##$BF2= 200.13
##$BF3= 200.13
##$BF4= 200.13
##$BF5= 200.13
##$BF6= 200.13
##$BF7= 200.13
##$BF8= 200.13
##$BYTORDA= 1
##$CFDGTYP= 0
##$CFRGTYP= 5
##$CHEMSTR= <none>
##$CNST= (0..31)
1 1 145 1 1 1 1 1 1 1 1 1 1 1 1 1 1 1 1 1 1 1 1 1 1 1 1 1 1 1 1 1 
##$CPDPRG= <>
##$CPDPRG1= <>
##$CPDPRG2= <>
##$CPDPRG3= <>
##$CPDPRG4= <mlev>
##$CPDPRG5= <mlev>
##$CPDPRG6= <mlev>
##$CPDPRG7= <mlev>
##$CPDPRG8= <mlev>
##$CPDPRGB= <>
##$CPDPRGT= <>
##$D= (0..31)
0 1.2 0 0 0 0 0 0 0 0.06 0 0.03 0 0 0 0 0.0002 0 0 0 0 0 0 0 0 0 0 0 0 
0 0 0 
##$DATE= 1715162666
##$DBL= (0..7)
$$ [...]
##$SUBNAM3= <"">
##$SUBNAM4= <"">
##$SUBNAM5= <"">
##$SUBNAM6= <"">
##$SUBNAM7= <"">
##$SUBNAM8= <"">
##$SUBNAM9= <"">
##$SW= 18.0517689322627
##$SWIBOX= (0..15)
0 0 2 0 0 0 0 0 0 0 0 0 0 0 0 0 
##$SW_h= 3612.71676300578
##$TD= 16384
##$TD0= 1
##$TE= 0
##$TE2= 300
##$TE3= 300
##$TEG= 300
##$TL= (0..7)
0 120 120 120 120 120 120 120 
##$TP= (0..7)
150 150 150 150 150 150 150 150 
##$TP07= 0
##$TPNAME0= <>
##$TPNAME1= <>
##$TPNAME2= <>
##$TPNAME3= <>
##$TPNAME4= <>
##$TPNAME5= <>
##$TPNAME6= <>
##$TPNAME7= <>
##$TPOAL= (0..7)
0.5 0.5 0.5 0.5 0.5 0.5 0.5 0.5 
##$TPOFFS= (0..7)
0 0 0 0 0 0 0 0 
##$TUNHIN= 0
##$TUNHOUT= 0
##$TUNXOUT= 0
##$USERA1= <user>
##$USERA2= <user>
##$USERA3= <user>
##$USERA4= <user>
##$USERA5= <user>
##$V9= 5
##$VALIST= <valist>
##$VCLIST= <CCCCCCCCCCCCCCC>
##$VD= 0
##$VDLIST= <DDDDDDDDDDDDDDD>
##$VPLIST= <PPPPPPPPPPPPPPP>
##$VTLIST= <TTTTTTTTTTTTTTT>
##$WBST= 1024
##$WBSW= 4
##$XGAIN= (0..3)
0 0 0 0 
##$XL= 0
##$YL= 0
##$YMAX_a= 76924
##$YMIN_a= -76884
##$ZGOPTNS= <>
##$ZL1= 120
##$ZL2= 120
##$ZL3= 120
##$ZL4= 120
##$ABSF1= 16.43116
##$ABSF2= -1.620743
##$ABSG= 5
##$ABSL= 3
##$ALPHA= 0
##$AQORDER= 0
##$ASSFAC= 0
##$ASSFACI= 0
##$ASSFACX= 0
##$ASSWID= 0
##$AUNMP= <proc_1d>
##$AZFE= 0.1
##$AZFW= 0.1
##$BCFW= 0
##$BC_mod= 2
##$BYTORDP= 0
##$COROFFS= 0
##$CY= -3
##$DATMOD= 1
##$DC= 0
##$DFILT= <>
##$DTYPP= 0
##$F1P= 0
##$F2P= 0
##$FCOR= 1
##$FTSIZE= 16384
##$FT_mod= 6
##$GAMMA= 0
##$GB= 0
##$INTBC= 1
##$INTSCL= 3.70164e-10
##$ISEN= 128
##$LB= 0.24
##$LEV0= 0
##$LPBIN= 0
##$MAXI= 10000
##$MC2= 0
##$MEAN= 0
##$ME_mod= 0
##$MI= 1.114404
##$NCOEF= 0
##$NC_proc= -6
##$NLEV= 6
##$NOISF1= 3.799351
##$NOISF2= 2.8
##$NSP= 0
##$NTH_PI= 0
##$NZP= 0
##$OFFSET= 16.44107
##$PC= 1
##$PHC0= -25445.34
##$PHC1= -4.412509
##$PH_mod= 1
##$PKNL= yes
##$PPARMOD= 0
##$PSCAL= 0
##$PSIGN= 0
##$REVERSE= no
##$SF= 200.12941601733
##$SI= 16384
##$SIGF1= 3
##$SIGF2= 2
##$SINO= 5.538805
##$SIOLD= 16384
##$SREGLST= <1H.CDCl3>
##$SSB= 0
##$STSI= 16384
##$STSR= 0
##$SW_p= 3612.71676300577
##$SYMM= 0
##$S_DEV= 0
##$TDeff= 16384
##$TDoff= 0
##$TI= <>
##$TILT= no
##$TM1= 0
##$TM2= 0
##$TOPLEV= 0
##$USERP1= <user>
##$USERP2= <user>
##$USERP3= <user>
##$USERP4= <user>
##$USERP5= <user>
##$WDW= 1
##$XDIM= 16384
##$YMAX_p= 403756236
##$YMIN_p= -202109
$$ End of Bruker specific parameters
$$ ---------------------------------
##NTUPLES= NMR SPECTRUM
##VAR_NAME=  FREQUENCY,     SPECTRUM/REAL,   SPECTRUM/IMAG
##SYMBOL=    X,             R,               I
##VAR_TYPE=  INDEPENDENT,   DEPENDENT,       DEPENDENT
##VAR_FORM=  AFFN,          ASDF,            ASDF
##VAR_DIM=   16384,         16384,           16384
##UNITS=     HZ,            ARBITRARY UNITS, ARBITRARY UNITS
##FACTOR=    0.220516191357247, 1,           1
##FIRST=     3290.34184920021, 0,            0
##LAST=      -322.374913805564, 0,           0
##MIN=       -322.374913805564, -202109,     0
##MAX=       3290.34184920021, 403756236,    0
$$ Real data points
##PAGE= N=1
##DATA TABLE= (X++(R..R)), XYDATA
$$ [...]
8277d2347J2458j8670L015J5939M5288N606P287J9259j8427k9024m0916k535J3047
8264c0020J3839O5255R486q009k8765m6491k0109q036m406j2494L9857L7472J7682
8251B5261R416m4422l9910o840k5172J2612J6823O4826J7121J855j661l0331j115
8238a537l26k5167J1588m243m738K3730K8600j6032l0833k0210k1222K8492N4010
8225B2112P351Q521J6163j8752K2694o7168l5317J3705K5651j7877J9064K3452
8213A9599m322N062l6135p008p556N110l7097K7412J4697K9497L9060j3818m2908
8200h407j9822m798o7299j7829L2076N0949Q4375q9732J58856J71382j46431k2173
8188A21147j6581j6793J7996j8166L1419M7362n0185k0946m3534l786Q173Q06
$$ plain form
8277 -42347 -29889 -48559 -45544 -29605 15683 21289 28576 47835 29408 384 -40532 -43067 -30020
8264 -30020 -16181 49074 58560 50551 21786 -24705 -44814 -52850 -57256 -69750 -29893 7579 25261
8251 25261 34677 -9745 -49655 -56495 -81667 -69055 -52232 12594 29715 31570 29909 -422 -1537
8238 -1537 -1863 -27030 -15442 -19685 -24423 -693 27907 11875 -18958 -39168 -60390 -31898 22112
8225 22112 29463 37984 54147 35395 58089 -9079 -44396 -30691 -5040 -22917 -3853 19599
8213 19599 15277 20339 -15796 -22804 -30360 -25250 -62347 -34935 -20238 9259 48319 34501 -8407
8200 -8407 -28229 -33027 -100326 -118155 -86079 -35130 49245 -40487 118369 289751 143320 121147
8188 121147 104566 87773 105769 87603 119022 166384 116199 95253 51719 47933 56106 56912
8176E6912j1299L0541M1994l1606j6602j8528j8295j6634J0119K5473J4903j9134
8164D7844l5752K2610J8046k0660k0125j2194N077Q534K6613K6136M450l63l7696
8151C2520k3790n456l2370k145R2501K3462j6327M827l8226m540P545K7325j1677
8138E3649k0353J2248M7577M7112O651N204r931m1584j8722j1178J8500N0740
8126A39913P0570K704L3788K9016j3553k9414J1764n290o2974K1001M4565J9325
8114B61415L480k925l0072Q908O784l015J4721O8348N8176J2985l5490j693M5458
8101D07080K6681J6403L9038L8069P8344P9278N7298Q6449R0816N5753Q1100P2082
8089A128391J40138J47842J86584J96365J92473K11027K41839L47958L31233L96833
$$ plain form
8176 56912 45613 76154 118148 86542 69940 51412 33117 16483 26602 52075 66978 47844
8164 47844 12092 34702 52748 32088 11963 -231 4846 13380 39993 66129 70579 70216 32520
8151 32520 8730 3274 -29096 -31241 61260 84722 68395 73222 34996 30456 38001 65326 53649
8138 53649 33296 45544 93121 140233 146884 152088 142157 100573 81851 70673 89173 139913
8126 139913 210483 213187 246975 275991 262438 233024 244788 239498 176524 197525 242090 261415
8114 261415 264895 261970 231898 240806 247590 244575 259296 327644 385820 398805 363315 361622 407080
8101 407080 433761 450164 489202 527271 605615 684893 742191 828640 919456 975209 1056309 1128391
8089 1128391 1268529 1416371 1602955 1799320 1991793 2202820 2444659 2792617 3123850 3520683
8079C520683M64107N56687O98279P46719O21891L62496k46536o67367q11741q30782
8069D414436o73219n13650l78602l10406k79187k34628j70127k16247j66562j22168
8059A349640p2447n0287r0633m3161m0716m4309q4254o4988m0599k5982k0973
8048G71291J28p9907j972j8065q7489j8520o5767l7787K6454K1567J3441J7771
8036E41145k3381l4661k5338p5901j817P245l7810K8647j845j912N558L6855k1919
8023C94866o6484m9436N63L5286J2452j2619j9969K2212k2283l9025l1323P56
8011B24996j0299N744L0478J0279L293j3762j9376k3484P544k6672J2225K9512
7999B30478k1954J6814R469l4614k7735l2661j8721K407J446M5927K367Q152j0945
$$ plain form
8079 3520683 3984790 4541477 5239756 5986475 6608366 6970862 6724326 6056959 5245218 4414436
8069 4414436 3741217 3227567 2848965 2538559 2259372 2024744 1854617 1638370 1471808 1349640
8059 1349640 1277193 1226906 1136273 1093112 1052396 1008087 923833 858845 818246 792264 771291
8048 771291 771419 691512 689540 671475 583986 565466 499699 461912 488366 509933 523374 541145
8036 541145 517764 483103 457765 381864 380047 387292 349482 378129 376284 374372 379930 416785 394866
8023 394866 328382 278946 279509 314795 327247 314628 294659 316871 294588 255563 224240 224996
8011 224996 214697 220441 250919 261198 264491 250729 231353 207869 215413 188741 200966 230478
7999 230478 208524 225338 234807 200193 172458 139797 121076 123483 124929 170856 173223 181375 170430
7986A70430k8992j6653R60k4508J3603P821J1211L6199k3910m48J872m3086l3042
7973G1457k338j8693J3615M9427L6236k92J1052o9997J1058k4972m1054Q361K8247
7960G2107J7531J5712L6532J0340l5097q820m6859k1043l2215K0287N5258L3975
7948A17708M207l8287p742j2013n026k9391J2591K7035L66k156j4904r470j9842
7935B3076k6747O792L8218J8285L6547O439k626j2905r731m9008k8385J7825J3376
7922C1156j8346K677L1271J6289M075l6416j8848J0016m5260J4471N4887J282
7910D7254J5364k8892k0963o895j4122j4804J0349j2177L1632P721L1385J7882
7898F3734k1637K0219j2524k8822j3446j8854M3738J5575K585Q752k2828l6465
$$ plain form
7986 170430 141438 124785 125745 101237 114840 122661 133872 170071 146161 145713 147585 104499 71457
7973 71457 69119 50426 64041 113468 149704 149412 160464 90467 101525 76553 35499 43860 72107
7960 72107 89638 105350 141882 152222 117125 108305 61446 40403 8188 28475 83733 117708
7948 117708 121915 83628 75886 63873 58847 29456 42047 69082 69448 67292 52388 42918 23076
7935 23076 -3671 3121 41339 59624 96171 102610 99984 87079 77348 28340 -45 17780 31156
7922 31156 12810 15487 46758 63047 67122 30706 11858 21874 -23386 -8915 45972 47254
7910 47254 62618 33726 12763 5868 -8254 -23058 -12709 -24886 6746 14467 45852 63734
7898 63734 42097 62316 49792 20970 7524 -11330 32408 47983 50568 59320 36492 27
7886B7k4304l2464K1668P000M7346K838k33j8383l7773k868J7660R31J9540J7967
7872A8952J1964j5977j4685l390k5864l4363L6164L0101J5301K5243J3344j4293
7860D2497l9517%o478k3423l7654L0594O7283K819L9201q398n2487k0598k751
7847h912j0186o077Q213M0781m407K3146j2039k9826j9413j7857j1504J2803J0958
7834b4320J0134J7352M226K8167k0439k4689l0203j7750K2894K1114L4723p684
7822A3525q514j878p723K1895l2858k7623M701J3453J2771K5656J7032r031k5358
7809c952k5636J3301J4143k4819r373L5886m4579j57080J89826Q953m525l407
7797a1262n753J1410Q921K9402k2306j3274j2797l4684q228P036K7259N8371K3666
$$ plain form
7886 27 -24277 -56741 -35073 -28073 19273 22111 21878 3495 -34278 -37146 -19486 -18555 985 18952
7872 18952 30916 14939 254 -3136 -29000 -63363 -27199 2902 18203 43446 56790 42497
7860 42497 2980 2980 -3498 -26921 -64575 -33981 33302 36121 75322 66924 14437 -6161 -8912
7847 -8912 -19098 -25175 -16962 23819 19412 42558 30519 693 -18720 -36577 -48081 -35278 -24320
7834 -24320 -14186 3166 7392 35559 15120 -9569 -39772 -57522 -34628 -13514 21209 13525
7822 13525 5011 3133 -4590 17305 -15553 -43176 -38475 -25022 -12251 13405 30437 21406 -3952
7809 -3952 -29588 -16287 -2144 -26963 -36336 -450 -45029 -202109 -12283 -3330 -7855 -11262
7797 -11262 -17015 -5605 3316 32718 10412 -2862 -15659 -50343 -58571 -51535 -24276 34095 57761
7784E7761j1412j1544J0630L860p8791j6771q020K1526M5704J9610J1251l1419
7772A2385Q081j3426m0711J7181R016J1120J4922q181P682j3276j8219m6573j283
7759f1282P390N694J2798L104O8816j0795k2652K50l8309m0884J0302K3901J7545
7746b4122P1589j9734k2520l6708l6265m667L0843L5003n074o406K7443R649j6952
7733B079l7219k8101j0490J6971K9635K5144l395K3868j4258j1117P984k4702
7721b3601n7270J2897M9672K4546K7845k2813o318o29l2533n6493M7439K2597
7709a4661l8122N2478J2772l2268M895j2212l1118m217K3631L3874k9598L3261
7697a285M1874J1429q3647k4049j4844R38K1476j0515N0077M7922k151R355j9507
$$ plain form
7784 57761 46349 34805 45435 49295 -29496 -46267 -54287 -32761 12943 32553 43804 12385
7772 12385 20466 7040 -33671 -16490 -7474 3646 18568 10387 18069 4793 -13426 -59999 -61282
7759 -61282 -53892 -48198 -35400 -32296 36520 25725 3073 3323 -34986 -75870 -65568 -41667 -24122
7746 -24122 47467 27733 5213 -31495 -67760 -72427 -41584 -6581 -11655 -18061 9382 19031 2079
7733 2079 -35140 -63241 -73731 -56760 -27125 -1981 -5376 18492 4234 -6883 1101 -23601
7721 -23601 -80871 -67974 -18302 6244 34089 11276 4958 4329 -28204 -84697 -37258 -14661
7709 -14661 -52783 -305 12467 -19801 -14906 -27118 -58236 -62453 -38822 -4948 -34546 -1285
7697 -1285 40589 52018 -31629 -55678 -70522 -69584 -48108 -58623 -8546 39376 37225 46580 27073
7684B7073j8230m0246p711O605j730j3026M3623J0281k7354m386j4804j4394J0511
7671d3788J9291M8774r256K3778N920m2256p1677j7793k7503J8513Q0514q448
7659b3931L6652J9187l5261j4215k2706J1229k2574R049M5735j2377K3913J624
7647A6325O35n2186m3184j1532N2343K8088J1605J6549Q847m258p396m3794j5984
7634d3942M460K1870J6017J6679n263J6629k6915p486k3646m5832K3437M5290
7622h702J1841Q020K8666l0736l6292k4988R776j4250J7374K1858p061M9782L4820
7609F0108j8835l3249k9972j612O439j0055K1194N4411O923j9581P009m7270k2021
7596b6511l0842R662L3675M9791M0653M845k9551p910m4272j2490j4439o193M3702
$$ plain form
7684 27073 8843 -31403 -39114 -32509 -34239 -47265 -3642 6639 -20715 -25101 -39905 -54299 -43788
7671 -43788 -24497 24277 15021 38799 44719 2463 -69214 -87007 -114510 -95997 -15483 -23931
7659 -23931 12721 31908 -3353 -17568 -40274 -29045 -51619 -42570 3165 -9212 14701 16325
7647 16325 16960 -35226 -78410 -89942 -37599 -9511 2094 18643 27490 23232 15836 -27958 -43942
7634 -43942 -39482 -17612 -1595 15084 9821 26450 -465 -7951 -31597 -77429 -53992 -8702
7622 -8702 3139 11159 39825 9089 -27203 -52191 -42415 -56665 -39291 -17433 -24494 25288 60108
7609 60108 41273 8024 -21948 -23560 -17121 -27176 -5982 48429 55352 35771 42780 -4490 -26511
7596 -26511 -57353 -47691 -14016 35775 76428 81273 51722 43812 -460 -12950 -27389 -33582 10120
7583A0120K4321j2903J522o612r926l2983j2567j293K1183J1799j6292J1842K1640
7570I851k5541l2403L9443P299k9338j498j3793L5457l438K1144m7262k2150m9
7557f2278j0751m773K9369L8514L2291k8395m0749J6037l2617k135J2377L3282
7545a9828M3283J5415p907l415l0582n7395j4303K1290l458K5608j280J8861J7061
7532C350l199j3693L311l8257l263J710J8123L9789K9205J425j5917l3801p405
7519a8622J3183j546P687J9627l1503l328M2253Q1086j05678l8383J1978J4408
7507h838K9964J9693K3193P325l5443l411n7585k4875L2535o631L3580K1148L694
7494C4349j9808l3118j4940j1824k816K0386J2289K3657L1448k6013j8981k3375
$$ plain form
7583 10120 34441 21538 23060 16448 6522 -26461 -39028 -40321 -19138 -7339 -23631 -11789 9851
7570 9851 -15690 -48093 -8650 -1351 -30689 -32187 -45980 -10523 -13961 7183 -40079 -62229 -62278
7557 -62278 -73029 -77802 -48433 -9919 22372 -6023 -46772 -30735 -63352 -65487 -53110 -19828
7545 -19828 23455 38870 30963 27548 -3034 -60429 -74732 -53442 -56900 -31292 -32572 -13711 3350
7532 3350 151 -13542 -10231 -48488 -51751 -50041 -31918 7871 37076 38501 22584 -11217 -18622
7519 -18622 -5439 -6985 702 20329 -11174 -14502 27751 108837 3159 -35224 -23246 -8838
7507 -8838 21126 40819 64012 71337 35894 32483 -25102 -49977 -17442 -24073 9507 30655 34349
7494 34349 14541 -18577 -33517 -45341 -48157 -27771 -15482 8175 39623 13610 -5371 -28746
7482b8746l5725k4968N135J7265K1492K212K8783K8030j0312k2881l9669n423
7470f4807n25J4108K3434J0635K6347K090k2203o2929l1500J6333J7705M1483
7458b9829L3044K0138l7367j4995j132j1004l7783R282j2572M6464K7102K8780
7446B0128j5310k4085l5088J5621j6514o264O4142Q761l1787J7503J242p864l6117
7433d5632r125k452K2961K3495K8797O4167j9938m0647l8793o273l572J7462L0014
7420B0464L2589M2753j369l9851m5102k1211O668j1479j7886L4588M0864k0364
7408B0664J2247J0924m1476m1008K2397m068M0086K4117L890K0406k4926m4734
7396a481l3544p316J8829L2257J9148J317J9659j0038j3732K0204j8249n441K5187
$$ plain form
7482 -28746 -64471 -89439 -84304 -67039 -45547 -43335 -14552 13478 3166 -19715 -59384 -64807
7470 -64807 -65332 -51224 -27790 -17155 9192 11282 -10921 -73850 -105350 -89017 -71312 -29829
7458 -29829 3215 23353 -14014 -29009 -30141 -41145 -78928 -69646 -82218 -35754 -8652 20128
7446 20128 4818 -19267 -54355 -38734 -55248 -61512 2630 11391 -20396 -2893 -1651 -9515 -45632
7433 -45632 -54757 -57209 -34248 -10753 18044 82211 62273 21626 -17167 -23440 -27012 -9550 20464
7420 20464 53053 95806 94437 54586 9484 -11727 -5059 -16538 -34424 164 41028 20664
7408 20664 32911 43835 2359 -38649 -16252 -20320 19766 43883 47773 68179 43253 -1481
7396 -1481 -35025 -42341 -23512 8745 27893 29210 48869 38831 25099 45303 27054 21613 46800
7383D6800Q332n49O130j1635j3880q028m2589k1837K6874K0175j5593N0849R975
7370E5024L34k8126j3140n456m0847K6350L0823K2352J9076N6207k6418k9192
7358F6987l0683l6980J6698l446K2662L4144J5090l3452m5134J3572l6989j1418
7346b8949k0769L9958L2647l877m138L7825k3862p8965L572J6341j5655J6005
7334b9867L2878M2755J2563l2535p39m4082q60L3090j1110M1884M1656K6867j5439
7321I7061m5831l2163j4661K5727l7432J8478L5320P130j810k1392k3467J0975
7309A7935l2672j2925J0508J0179P0518j3113j0599l4693j1241j7838m2002M2619
7297b3324J5743K6102J2461l1490j9628N762M346k7609l2251J1112K6611M2132
$$ plain form
7383 46800 55132 54583 60713 49078 35198 27170 -15419 -37256 -10382 9793 -5800 45049 55024
7370 55024 55358 27232 14092 8636 -32211 -5861 24962 47314 66390 122597 96179 66987
7358 66987 36304 -676 16022 12576 35238 69382 84472 51020 5886 19458 -17531 -28949
7346 -28949 -49718 -9760 22887 19010 14872 52697 28835 -50130 -46558 -30217 -45872 -29867
7334 -29867 3011 45766 58329 25794 25055 -19027 -19887 13203 2093 43977 85633 112500 97061
7321 97061 51230 19067 4406 30133 -7299 11179 46499 53629 51819 30427 6960 17935
7309 17935 -14737 -27662 -17154 -6975 63543 50430 39831 5138 -6103 -23941 -65943 -23324
7297 -23324 -7581 18521 30982 -508 -20136 -14374 -10028 -37637 -69888 -58776 -32165 9967
7285I967J4126m062k6924k0725r966k3455M637K5876M2091k2949P566j079j4178
7272a9075O807l4693J8530j9929K6662J8782R016M5543l0530l1848k8178J488
7260c7425J0483j3426J0122O013L4425k4438o438J2804j2925M893Q135k723J0617
7247A17M4553r380k6297o3169q308j1390L3797j6219J2695O5209P668K667l2216
7234b73m6374m2712J0638R918N5347j9361K3190J090q215r497l9754k0321M140
7221h2184K7597M1813Q0978q394m6174O84l7883j3069k4370L2228N0547k0600
7209A173K37l113j628J5630k4159k6325j509K7056J438Q807J3179k5870P850j0528
7195a7762l9898J382O894K9649K3071p687j794j4559M166j6452k2144j188K6853
$$ plain form
7285 9967 24093 20031 -6893 -27618 -37584 -61039 -56402 -30526 11565 -11384 -3818 -4897 -19075
7272 -19075 -12268 -46961 -28431 -48360 -21698 -2916 6100 51643 21113 -10735 -38913 -37425
7260 -37425 -26942 -40368 -30246 -24233 10192 -14246 -20684 -7880 -20805 -15912 -7777 -10500 117
7247 117 44670 35290 8993 -54176 -62484 -73874 -40077 -56296 -43601 21608 29276 31943 -273
7234 -273 -46647 -89359 -78721 -68803 -13456 -32817 -9627 -8537 -16752 -26249 -66003 -86324 -82184
7221 -82184 -54587 -12774 68204 59810 13636 14320 -23563 -36632 -61002 -28774 21773 1173
7209 1173 1410 -1703 -3331 12299 -11860 -38185 -39694 -12638 -11200 -2393 10786 -15084 -7234 -17762
7195 -17762 -57660 -56278 -49384 -19735 3336 -4351 -6145 -20704 -16538 -32990 -55134 -56322 -29469
7182b9469M8604K8140K3763L796l8782n8527j5601N2856K4120n306j0684L1182
7170E4092R645k0429m1910p605l0525R558K2402L6647R026m2062k1156p38k3504
7157d6559n115k5373J7752L8107J601J9145L1309l1183l4878n351k45O510N819
7144b8461M1345J2125p050k8491j0346r251l1942L2038L4187Q50K1537K9947J594
7131E8082l2660q207j6354k4309k8117O766L3987M3619l7220k4320l3712n4557
7119a17002K8577L07K4230O9836K0121K1175m3647k3098l177k0102k543n925L2402
7106a8846L1904J5065j5252m1534j1459p077k7031K5377L2864J0896m0771J2483
7094c3381J5552J2661l6288j1807J5056m781K3848K6469j516J1225l033l8524
$$ plain form
7182 -29469 19135 47275 71038 74834 36052 -22475 -38076 14780 38900 33594 22910 54092
7170 54092 63737 43308 1398 -6207 -36732 -27174 -4772 31875 40901 -1161 -22317 -23055 -46559
7157 -46559 -51674 -77047 -59295 -21188 -19587 -442 30867 -316 -35194 -40545 -40790 -34280 -28461
7144 -28461 12884 25009 17959 -10532 -20878 -30129 -62071 -30033 4154 5004 26541 56488 58082
7131 58082 25422 17215 861 -23448 -51565 -44799 -10812 32807 -4413 -28733 -62445 -117002
7119 -117002 -88425 -88118 -63888 5948 26069 47244 3597 -19501 -22678 -42780 -45323 -51248 -18846
7106 -18846 13058 28123 12871 -28663 -40122 -47199 -74230 -48853 -15989 -5093 -45864 -33381
7094 -33381 -17829 -5168 -41456 -53263 -38207 -42988 -19140 7329 5813 17038 14005 -24519
7082b4519m4158J1540J9111M0243K6270o60J2969l7516m1327l0152p507K6754
7070d8952J1703K3357J9325k659j9260M427j9719m5503j1027M9149j2706L9503
7058a2362P3082J3632o0551l6650N771j3216K8125J682J5889K2376j4057l9238
7046a5517o453n0692K8969j4358K4477R567Q24O164K2091j1148r570k9040m2478
7033h7164j330O7146J3212K3755J9268l2654o8024k0698P92M9960K7081K7394
7021A8738J261Q537j1544l0690j9384k3209j7593J5191M3590L1082J2150j2248
7009A5881j7474k5575l5012k3669L4162L0472P529K7158J4324m9264J0287n1935
6997f3116l6088M300K1558N0214L2274O030k375o0895M172j2793n1198l5355N9434
$$ plain form
7082 -24519 -68677 -57137 -38026 2217 28487 27827 40796 3280 -38047 -68199 -75706 -48952
7070 -48952 -37249 -13892 5433 2774 -16486 -12059 -31778 -77281 -88308 -39159 -51865 -12362
7058 -12362 60720 74352 13801 -22849 -17078 -30294 -2169 -487 15402 37778 23721 -15517
7046 -15517 -21970 -72662 -43693 -58051 -33574 -24007 -23183 -17019 5072 -6076 -15646 -44686 -87164
7033 -87164 -88494 -21348 -8136 15619 34887 2233 -65791 -86489 -85697 -35737 -8656 18738
7021 18738 19999 28536 16992 -13698 -33082 -56291 -73884 -58693 -15103 15979 28129 15881
7009 15881 -1593 -27168 -62180 -85849 -51687 -21215 -13686 13472 27796 -21468 -11181 -63116
6997 -63116 -99204 -94904 -73346 -23132 9142 15172 12797 -48098 -43926 -56719 -107917 -143272 -83838
6984h3838N0856L2772j5357l7937l6318N752K5399q46J2659K4765J2983j3803
6972b2913k773L7j3452m6639l8028J7493J9401M8020O4380o782m2058L636k4299
6959d3977l0304L591K3162R282L2688J2622j7115k1101k8955K1093M837q436L9239
6946c374N3488L944m5888j8997k9511l2236L381J5614K7889R611L8253j3448j3696
6933d970l3631L9912J1259j5583r511p475J5658n01K719j8616j4913m550J828
6920c8374J8646K4846J2002R892J6898k7691m5470l4912J7483j2445L5106K4501
6908D82j1764P543k9225l4336n753Q0l769O0193J2193K5099j906k7792l7863j8476
6894f5294l2035Q831P284O3575L0386l636k0626j0931l3099N781k416J0039J3797
$$ plain form
6984 -83838 -32982 -210 -15567 -53504 -89822 -84070 -58671 -59517 -46858 -22093 -9110 -22913
6972 -22913 -25686 -25649 -39101 -85740 -123768 -106275 -86874 -38854 25526 18744 -23314 -19678 -43977
6959 -43977 -74281 -70690 -47528 -38246 -5558 7064 -10051 -31152 -60107 -39014 -34177 -42613 -3374
6946 -3374 50114 54058 8170 -10827 -40338 -72574 -69193 -53579 -25690 -16079 22174 8726 -4970
6933 -4970 -38601 1311 12570 -3013 -12524 -19999 -4341 -4842 -2123 -20739 -35652 -40202 -38374
6920 -38374 -19728 5118 17120 27012 43910 16219 -29251 -64163 -46680 -59125 -24019 482
6908 482 -11282 -3739 -32964 -67300 -73053 -72973 -76742 -16549 -4356 20743 18837 -8955 -46818 -65294
6894 -65294 -97329 -88498 -81214 -17639 12747 9111 -11515 -22446 -55545 -49764 -52180 -42141 -28344
6881b8344M326K9965Q13k1375k7505k6917L40J6671K5267J2525J9892L9810k8410
6868A7058j4357m8510l0644M9467J5138N040j7978M2320K8271k0467p5826n4213
6856a04701L4663j7075J4059O4745M4784k6736m1815M852K3392k6775m090J2380
6844b2317L4316l188L3192j8868m8929m1238j780J0789L6039j5221L8674J6936
6832A8405q423j5637k3042m7802m340L0559M3954N3778j2913j0832o1396k2590
6820f0279j3126l4732J6649M6541K3464J6508j9170J3203K0998n8021m05N272
6808d3098L2702J5989J5481J1553o636j1290k9756l6427j0200N3743j0870K9004
6796A0195L4674j6189k6182l1742j8133j0037L2514K2738J7346O077K4879k4087
$$ plain form
6881 -28344 -24018 5947 6760 -14615 -42120 -69037 -68697 -52026 -26759 -14234 5658 45468 17058
6868 17058 2701 -45809 -76453 -26986 -11848 -6808 -24786 17534 45805 25338 -50488 -104701
6856 -104701 -70038 -87113 -73054 -8309 36475 9739 -32076 -27224 -3832 -30607 -34697 -22317
6844 -22317 11999 8811 42003 23135 -25794 -67032 -68812 -58023 -21984 -37205 1469 18405
6832 18405 9982 -5655 -28697 -76499 -80839 -50280 -6326 47452 34539 23707 -37689 -60279
6820 -60279 -73405 -108137 -91488 -44947 -21483 -4975 -24145 -10942 10056 -47965 -48370 -43098
6808 -43098 -10396 5593 21074 32627 25991 14701 -15055 -51482 -61682 -7939 -18809 10195
6796 10195 44869 28680 2498 -29244 -47377 -57414 -24900 -2162 15184 21261 46140 22053
6784B2053k4787m1020k6525J2938J9916K3456L49r654j696K0185n1400k322k3434
6771h1941j2298M9813J6946l380K6848K1838l4971l5468j5194K7548L9915K3696
6759B3352K6879j5651j1468j5858l6978k0911P370K1908r736J4546J8757l4316
6747c2106k4787n4733o923K9627M0185M410J8141L1775j9653k7434j6224l1819
6735h9541m198L5256M0198K5713L5748k8883l7605l8320n227j0036M4428K2665
6723i802J1669J1267p271J1295l7221r625j2625k3196J4555K6320L2425k80k2114
6710a4603l7106k0348k3350K7078L419K4661L6061K506k671l2302j3408m765j018
6697e5846j5114K3541M0707J3466k2563n88l2485J0600k3501J2041J0995N259
$$ plain form
6784 22053 -2734 -43754 -70279 -57341 -37425 -13969 -13620 -23274 -24970 -4785 -56185 -58507 -81941
6771 -81941 -94239 -44426 -27480 -30860 -4012 17826 -17145 -52613 -67807 -40259 -344 23352
6759 23352 50231 34580 23112 7254 -29724 -50635 -43265 -21357 -31093 -16547 2210 -32106
6747 -32106 -56893 -111626 -118549 -88922 -48737 -44327 -26186 5589 -14064 -41498 -57722 -89541
6735 -89541 -93739 -58483 -18285 7428 43176 14293 -23312 -61632 -66859 -76895 -32467 -9802
6723 -9802 1867 13134 5863 17158 -20063 -29688 -42313 -65509 -50954 -24634 7791 7511 -14603
6710 -14603 -51709 -72057 -95407 -68329 -64910 -40249 -4188 -1682 -4353 -36655 -50063 -54828 -55846
6697 -55846 -70960 -47419 -6712 6754 -15809 -16397 -48882 -38282 -61783 -49742 -38747 -33488
6685c3488K7211K546j7358K27m741k4813K731J0277N8480K262k4235j669k0658
6672b3228l4322p509j860J0776K9149L4444N5152n705m7260k7490l0088k7963
6660g5904L5555K5325m697L1750j5513l3249k1429l3650L4359J593p638N2378
6648a1120L9081j5548o214j9058k3066k7974P281M3624r73J1320L1997r174m5623
6635b5447k4341j8087r219K0633R988M8801j0489Q021l8861m1031Q22L449R195
6622f6566N0622l439K8779k0652j5377k8604m8977J2091R663M1221L8641M1979
6610C9381k1192k3994k5824j1218j1804r241K8165M8978L9792p062m3384k2505
6598a9908o5730Q882L3932L0773K7680K0451l1590J3505k8677m0195m7075L418
$$ plain form
6685 -33488 -6277 -3731 -21089 -20862 -25603 -50416 -47685 -37408 21072 23334 -901 -2570 -23228
6672 -23228 -57550 -65059 -66919 -56143 -26994 7450 62602 56897 9637 -17853 -47941 -75904
6660 -75904 -40349 -15024 -19721 12029 -3484 -36733 -58162 -91812 -57453 -55860 -63498 -11120
6648 -11120 27961 12413 6199 -12859 -35925 -63899 -56618 -12994 -13967 -2647 29350 20176 -25447
6635 -25447 -49788 -67875 -77094 -56461 -46473 2328 -8161 -140 -39001 -80032 -79210 -75761 -66566
6622 -66566 -15944 -19383 9396 -11256 -26633 -55237 -104214 -92123 -82460 -41239 -2598 39381
6610 39381 18189 -5805 -31629 -42847 -54651 -63892 -35727 13251 53043 45981 2597 -19908
6598 -19908 -85638 -76756 -42824 -12051 15629 36080 4490 17995 -10682 -50877 -97952 -94534
6586i4534L0662K0363M1181Q814L073j9509k4311n2299k191K8806K8136K3561
6574h248J5371j454k1711m4638n4154J6929M9419L6667K9930N7572j1450n6224
6562H009m2904j0010J6428o089p561L7891M0236J2387k2040k5336k4452j5539
6550c8980N7927j090J0637L844R174L7366r924l5147k8509k8244K2189K8268J2500
6537D0011k099N13J688m0172m7316J0055L5515L283P509J8544R518n1978p992
6524b2921m6735L59K8804J1893J3319j138K1729q392k5638l6794n27n10N601M5580
6510a5370L9224n242R417m2317l6248j2296J8713M4346J9924K0498l2164R061
6498A7546l4999j6780m222j0066K4589J7389J1792M1269k851l8102j2151m5651
$$ plain form
6586 -94534 -63872 -43509 -2328 6486 9559 -9950 -34261 -86560 -88751 -59945 -31809 -8248
6574 -8248 7123 5669 -16042 -60680 -114834 -97905 -48486 -11819 18111 75683 64233 8009
6562 8009 -34895 -44905 -28477 -34566 -42127 -4236 36000 48387 26347 1011 -23441 -38980
6550 -38980 18947 17857 28494 32338 41512 78878 68954 33807 5298 -22946 -757 27511 40011
6537 40011 37912 38425 40113 -59 -47375 -37320 -1805 1478 8987 27531 37049 -14929 -22921
6524 -22921 -69656 -69297 -40493 -28600 -15281 -16419 5310 -3082 -28720 -65514 -66041 -66551 -60950 -15370
6510 -15370 23854 18612 28029 -14288 -50536 -62832 -44119 227 20151 40649 8485 17546
6498 17546 -17453 -34233 -38455 -48521 -23932 -6543 5249 46518 43667 5565 -6586 -52237
6486e2237K1604K6966K0843N4198J4850q639k8758o503k2723k7558J8164L4415
6474D4622J9413j7393J8096k5673p3837l4898K634J9432R5614J3763O93K7171
6462H9637n5692n2553k5710j2577P839L3027K1380N847l154k8725j8569l6214
6450g5464L85J3607K0086J3782J8558Q380o419m2872j0583j3451Q137P2084K821
6437I051K0694q79n5124Q019J9168l9553M946J99L5984K5978j5268P037l3730
6424a3478l2707k664j2652q71K3001N490L8359k429M969k0220k2511M549j337
6411c2501Q578N2326M108k9098J2485n4602l6345j1388O748L4145M6342J3304
6399A4102L2603k2315n2490k0083L786J9853j3299j2496O3341l197k3024m2644
$$ plain form
6486 -52237 -30633 -3667 17176 71374 86224 77585 48827 42324 19601 -7957 10207 44622
6474 44622 64035 46642 64738 39065 -34772 -69670 -67036 -47604 48010 61773 62466 89637
6462 89637 33945 -18608 -44318 -56895 -49056 -16029 5351 11198 8044 -20681 -39250 -75464
6450 -75464 -75079 -61472 -41386 -27604 -9046 -666 -7085 -49957 -60540 -73991 -65854 6230 9051
6437 9051 29745 28866 -26258 -18239 929 -38624 -33678 -33479 2505 28483 13215 20252 -13478
6424 -13478 -46185 -48849 -61501 -62372 -39371 -33881 4478 2049 7018 -13202 -35713 -31164 -32501
6411 -32501 -23923 28403 32511 3413 15898 -38704 -75049 -86437 -79689 -45544 798 14102
6399 14102 46705 24390 -28100 -48183 -44397 -24544 -37843 -50339 13002 9805 -13219 -55863
6387e5863k6301M0388j6761j8209N9251K2038R171j9352O744j8436l4002L802
6375d7530j509M3261P689N578j6087j7687j4101p828k2613M4445J7743K1329J7216
6362B9906l2243m3288m1082J1604J1232L9444M385J0916J1512J3074k7477k9668
6350d1685k2233K5566L3645M1254L0890r033k1422m8480k4766j1762j60J2531
6338c5655K4398L5097m355p692k6328l6185j7691R22J0242n629N1628K6562o018
6325I296l4214m5073l5052pL5023M3478K6750N3160j5963m5158l3672j9418J8085
6312d2765K3410O189J0643j647O163M13l8076O602Q649j878K7574J5006k14K9659
6298D9728l5003m4232J213j5729K2991R845M4161J4751l9778k3179k558Q670l5111
$$ plain form
6387 -55863 -82164 -41776 -58537 -76746 -17495 4543 13714 -5638 1106 -17330 -51332 -47530
6375 -47530 -49039 -5778 1911 7489 -8598 -26285 -40386 -48214 -70827 -26382 -8639 12690 29906
6362 29906 -2337 -45625 -86707 -75103 -63871 -24427 -20042 -9126 2386 15460 -12017 -41685
6350 -41685 -63918 -38352 -4707 36547 67437 58404 36982 -11498 -36264 -48026 -48186 -35655
6338 -35655 -11257 23840 19485 11793 -14535 -50720 -68411 -67489 -57247 -62876 -11248 15314 9296
6325 9296 -24918 -69991 -105043 -105050 -70027 -26549 201 53361 37398 -7760 -41432 -60850 -42765
6312 -42765 -19355 -13166 -2523 -4170 1993 2406 -35670 -29068 -20419 -22297 5277 20283 20069 49728
6298 49728 14725 -29507 -28294 -44023 -21032 -11187 32974 47725 7947 -15232 -17790 -9120 -44231
6285d4231M862L4591N832J6946o572k3989l5746k7393K8684K1522j134L4050M2421
6272D9843N728o0889Q690l6783k9321J9547M5915O1343j0275l6798k9276j3029
6260b5305m6945J7893Q304J0673M5465P879L286j7105n2690J0719j6645M640L5925
6247a3906J5654k0930K6511k4468m2769J334J3793K1791N2989L58R636j4306m2987
6234a7300j5026l6723M5156n084j832N3414L9328l2579j6850k2999k8756Q946
6222c0305L5464N2001k1535K248o739n0074l0540k0716j3974L3229O3659K6571
6210C9289n966k9232l2728J1555k4958n891m502J7380M5615J8491M865n6270j0513
6197c2865j8932p302O644M5047K0437L7909Q397m4984j1364l1159j1460L3288
$$ plain form
6285 -44231 -39369 -4778 1054 18000 11428 -12561 -48307 -75700 -47016 -25494 -26628 7422 49843
6272 49843 55571 -5318 3372 -33411 -62732 -43185 2730 64073 53798 17000 -12276 -25305
6260 -25305 -72250 -54357 -46053 -35380 10085 17964 21250 4145 -48545 -37826 -54471 -49831 -13906
6247 -13906 1748 -19182 7329 -17139 -59908 -58574 -44781 -22990 29999 30357 39993 25687 -17300
6234 -17300 -32326 -69049 -23893 -28977 -30809 22605 61933 29354 12504 -10495 -39251 -30305
6222 -30305 5159 57160 35625 37873 31134 -18940 -49480 -70196 -84170 -50941 12718 39289
6210 39289 33323 4091 -28637 -17082 -42040 -47931 -52433 -35053 10562 29053 33918 -22352 -32865
6197 -32865 -51797 -59099 -52455 -7408 13029 50938 59335 14351 2987 -28172 -39632 -6344
6185f344K1118M3271J4715l3017m6889j9066k0421L4471Q18K8794K2430N834j8417
6172B7297l0700k674K029o67J6333K9335L118N6665q488k9975p0904k8788J7153
6159b0266K2549J4293J1544L5333L985k0994q5112M795K3092j484K5121O683L4951
6146E4490k7620k8453m8387o843j5905L6044N8124M064K783j0407l971P752m7679
6133b6008K019q415N0132M8009j1081R75m1964n8411o4854J4465O3979J7778J9931
6120F555j3170j2433K288l0016k1418J6997K8572L0561N52o455j7643Q478k3928
6107c1060k9086O362K2435K8517j1581L5113J0271m5813l6223k2818j9380M9173
6095d4090K3876J0002Q043j0495l6067J0321k6899J694N2951R048Q183J4555k9105
$$ plain form
6185 -6344 14774 58045 72760 39743 -7146 -26212 -46633 -12162 -11344 17450 39880 45714 27297
6172 27297 -3403 -6077 -4048 -4715 11618 40953 44071 100736 92248 62273 -8631 -37419 -20266
6159 -20266 2283 16576 28120 63453 67438 46444 -38668 -33873 -10781 -12265 12856 19539 54490
6146 54490 26870 -1583 -49970 -56813 -72718 -36674 21450 25514 28297 17890 13919 21671 -26008
6133 -26008 -23989 -32404 17728 65737 54656 55631 13667 -44744 -109598 -95133 -31154 -13376 6555
6120 6555 -6615 -19048 -16760 -46776 -68194 -51197 -22625 7936 8488 2033 -15610 -7132 -31060
6107 -31060 -60146 -53784 -31349 -2832 -14413 20700 30971 -14842 -51065 -73883 -93263 -44090
6095 -44090 -20214 -10212 -2169 -12664 -48731 -38410 -65309 -63615 -10664 -1616 6567 21122 -7983
6082g983J4481q667k7269R106K4143K2213K3643J0200n8326k1503n8117j9410
6070i7489L2544J4868M9648L1938l8175j9615k8269k87k3707J0910O2170N2847
6058D7383J6292l2227j6359j6140l8087J4948M9857J1417p894J2535J9856p1940
6046a0359J5793l0759J4536O630K6364l1J1817p957m5483l8863O067K4950O435
6033b0860L2134J1253K8011R34n5042m2387j596k4735L1626P8066N7031j7016
6021G7419j7716l7741l5783j0902J2562K0897K1560J8817o413k5696k1833m3335
6009d8164N514O725Q877L3050K729K0801j1686n8641j393k2129L3553K4883K8543
5996B2662N409l3843K9204j5619o410K866o826N214M1084J1025k0773j7778r990
$$ plain form
6082 -7983 6498 -2169 -29438 -20332 3811 26024 49667 59867 1541 -19962 -78079 -97489
6070 -97489 -64945 -50077 -429 31509 -6666 -26281 -54550 -54837 -78544 -67634 -5464 47383
6058 47383 63675 31448 15089 -1051 -39138 -24190 25667 37084 29190 41725 61581 -10359
6046 -10359 5434 -25325 -10789 -4159 22205 22174 33991 26034 -19449 -58312 -52245 -27295 -20860
6033 -20860 11274 22527 50538 51472 -3570 -45957 -47553 -72288 -40662 37404 94435 77419
6021 77419 59703 21962 -13821 -24723 -12161 8736 30296 49113 42700 17004 -4829 -48164
6009 -48164 -42650 -35925 -27048 6002 8731 29532 17846 -40795 -42188 -64317 -30764 -5881 22662
5996 22662 28071 -5772 23432 7813 1403 4269 -2557 2657 43741 54766 33993 16215 6225
5983F225j4172J8498j9627L4336O1935m2971J1443j0738m0153q309J0043M1445
5971D7955k2084L86K157j8700J5395j7672N192P370L0041m818K5276j8399l9628
5958A2471j6556k5161n814J5259K9048N6287O2986r712n6819k9403j0892o5m893
5945A6736L0938L9545J6650k0844l5517j8649j0583k2718p537N2985K4353K3559
5933H8918k865O912m7897J4467p383Q639K5005L603L9373m639K109l3602R207
5920A01847L1003J4940J5297M3725j458J6972J8169j6990j0781L9708N5905K9496
5908C37833N4751M8227J7893L491J9059O814O8803Q5458N1731P8971N3697J1686
5896H38414M132O9054Q1344J08609J35633J62282J68012J30902J43691J79507
$$ plain form
5983 6225 -7947 10551 -9076 25260 87195 44224 55667 44929 4776 -3533 6510 47955
5971 47955 25871 26257 28414 9714 25109 7437 12629 19999 50040 45222 70498 52099 12471
5958 12471 -4085 -29246 -35060 -19801 9247 65534 128520 118808 61989 32586 21694 21629 16736
5945 16736 47674 87219 103869 83025 47508 28859 18276 -4442 -11979 41006 65359 88918
5933 88918 86053 92965 45068 59535 52152 60791 85796 89399 128772 124133 126242 92640 101847
5920 101847 132850 147790 163087 206812 205354 222326 240495 223505 212724 252432 308337 337833
5908 337833 392584 440811 458704 462195 481254 488068 556871 642329 694060 773031 826728 838414
5896 838414 842546 911600 992944 1101553 1237186 1399468 1567480 1698382 1842073 2021580
5886B021580K22091K88465L38475L78975M29957L86360L05282O0109j23306k06818
5876D101170j83817j18747r6139j7485R1041R0042J15569O8426j22582k85315
5866C642163l63249l81568l46236l04838k73411k26118j80673j61165j13828p2610
5856A218467n5681l4592p5584r0084p7658l7841n6903l6947j4454J2399N6p0468
5844F80710q7899l3025m6044m7860J6976K7943Q757L3457l5512o1057l3553l2370
5832C90523J257L1722K9693j056J89k7946j2483m4090K1287Q975K7494K5856K087
5819D53508j6294l1518m5236k5134L0747O6287P6115R984L0492m781K07m8472
5807D95905k1867Q3209P1615P1463N9837P4531J067k5662n993L5723J3368K0622
$$ plain form
5886 2021580 2243671 2532136 2870611 3249586 3679543 4065903 4371185 4431294 4307988 4101170
5876 4101170 3917353 3798606 3702467 3684982 3776023 3866065 3981634 4050060 3927478 3642163
5866 3642163 3278914 2897346 2551110 2246272 1972861 1746743 1566070 1404905 1291077 1218467
5856 1218467 1162786 1128194 1052610 962526 884868 847027 790124 753177 738723 751122 751178 680710
5844 680710 592811 559786 513742 465882 482858 510801 519558 553015 517503 456446 422893 390523
5832 390523 391780 423502 453195 452139 452328 424382 411899 367809 389096 398071 425565 451421 453508
5819 453508 437214 405696 360460 335326 366073 432360 508475 518459 548951 544170 544377 495905
5807 495905 474038 557247 628862 700325 760162 834693 835760 810098 804105 839828 853196 873818
5795H73818P5739L4219K3169L0904K1959J648N3967j840J1549q853r2382j44299
5783H79598j07302j16673q1090o0068n639J3816l3368K2444m7000r4038n9732
5772C10948k6834k0132M0451L3468K1738m7004n3499l830k8350K34J3221n671
5760B34740L2447J0289j8170J3299n7875l7724J6279J728K1078R089j1082J2005
5748B26103n0860m3992J7138J6105M6392j029m5544Q162j3509l3056k405j7899
5736A05606q472L5046O4649J5677l0628j6270l9770L042K6253L5122J9366R856
5724B19477M3809p542j8049m3663Q731j0600N3511M1409R257L8694K8120N458
5712C68612l2038L2617P1565M0451J7460R837l4146n2195p2638J5045L4140O8365
$$ plain form
5795 873818 949557 983776 1006945 1037849 1059808 1061456 1115423 1113583 1125132 1116279 1023897 879598
5783 879598 772296 655623 574533 514465 508826 522642 489274 511718 464718 370680 310948
5772 310948 284114 263982 304433 337901 359639 312635 259136 255306 226956 227190 240411 234740
5760 234740 267187 277476 259306 272605 214730 177006 193285 195013 216091 225180 214098 226103
5748 226103 175243 131251 148389 164494 210886 209857 164313 172475 158966 125910 123505 105606
5736 105606 97134 132180 196829 212506 181878 165608 125838 128880 155133 190255 209621 219477
5724 219477 263286 255744 237695 194032 202763 192163 245674 287083 296340 335034 363154 368612
5712 368612 336574 369191 440756 481207 498667 508504 474358 422163 349525 364570 398710 467075
5700D67075P6032M282j8878k3534q5482o6812m3089p991J706r061l821n6306l2175
5687B01946n3088r348O774J1425o766L6982K5540l0385j5521m1617p86l4119K6035
5674A17072P2544k424j7985j6518n7861k0213m6205k05N4257L6326O744j4280
5662A11252j4025o0732p506L1265L0389K8151J2243n906l0362m7362N811k7774
5650B5444N70O9499J5281J2258n356l0529o5280J977J3085Q350N5153K8698m2071
5637H7079l9302J079k9359j0483P048M2075L4643q211O970n2202m3895j3672J5154
5624c076N1863J4603K3989J3107l1025l1174p9699J5996N3434l4606L4666K7793
5612E5871M518k4382j8019m4999k4278N7725N0574M6387l1670k0228J0306k8177
$$ plain form
5700 467075 543107 547389 528511 504977 419495 352683 309594 301603 303309 294248 290427 234121 201946
5687 201946 148858 139510 146284 157709 150943 187925 213465 183080 167559 125942 125156 91037 117072
5674 117072 189616 187192 169207 152689 94828 74615 28410 28205 82462 118788 125532 111252
5662 111252 97227 36495 28989 60254 90643 118794 131037 125131 94769 47407 53218 25444
5650 25444 26014 95513 110794 123052 117696 87167 21887 23864 36949 45299 100452 129150 87079
5637 87079 47777 48856 19497 9014 16062 58137 92780 84569 91539 39337 -4558 -18230 -3076
5624 -3076 48787 63390 87379 100486 69461 38287 -41412 -25416 28018 -6588 28078 55871
5612 55871 60389 36007 17988 -27011 -51289 6436 57010 103397 71727 51499 61805 33628
5600C3628Q120L2454l606p305K407j3273j8518k3868l7624Q140O9639K3348J3962
5587H7504J869O878k6520m9873j0609Q900L1947O5428O807j4851m2154j5713k4919
5574B4694j1510M1047M8546L5856n4359j4378j877l9137K0417J457M3399K0361
5562A14516K5184L2632l8678n9550m4734J8944K9501k1677K8956K0963j5490m3195
5550D7372j6348p680J6972J6080L8166q686n2697j9433K702n830K1886P098P616
5537D7218M8197K7373k0254n5463j2404j6861N261P2251M6711k9136k4852k5509
5525F2532j4101k8275L1566L6214K3020K0145L7082k1716o0077m6248k242j5115
5513B2785Q3157N4428o887j8588p7465l8189l9040J2153J06208J9411J8768P048
$$ plain form
5600 33628 41748 74202 70596 63291 65698 52425 33907 10039 -27585 -19445 50194 73542 87504
5587 87504 89373 96251 69731 19858 9249 18149 50096 115524 122331 107480 65326 49613 24694
5574 24694 13184 54231 102777 138633 84274 69896 68019 28882 49299 50756 94155 114516
5562 114516 139700 172332 133654 74104 29370 48314 77815 56138 85094 106057 90567 47372
5550 47372 31024 23344 40316 56396 94562 85876 33179 13746 16448 10618 32504 39602 47218
5537 47218 95415 122788 102534 47071 34667 17806 23067 95318 142029 112893 88041 62532
5525 62532 48431 20156 51722 87936 110956 131101 168183 146467 86390 40142 37900 22785
5513 22785 105942 160370 153483 134895 57430 19241 -19799 -7646 98562 117973 136741 143789
5501A43789n4380n7581n0954R716P3321L4614L886j4177Q692m2254p878J3879
5489F0673l576J6929M5759J7130j857K897o4429l0108p036P9503M1236J5948L13
5476A73382l2987j1026q4508r04N9957O1542K8866l359J6007j9818p7909j6017
5464I3226J3122L3542N5045J2106k1796j3688o059l6241J1185J8478P3757K5294
5452B57971N646k053n3526k7002j3404L7154r047M8512L0737J3337l2729l427
5440B52169r363O1491N6095O9132M7564j4413J9403M643j0403J2559O5811R4746
5428F49434R3350L4482R2222J2264O3042P5595J35713L2516K1748m7744j09781
5417A052841j07666q0328p3076O157M2313o167j2841L1423j7493j3215Q721P1342
$$ plain form
5501 143789 89409 31828 -19126 -9410 63911 98525 102411 88234 96926 54672 46794 60673
5489 60673 57097 74026 119785 136915 135058 137955 73526 43418 36382 115885 157121 173069 173382
5476 173382 140395 129369 44861 43957 103914 165456 194322 190963 206970 187152 109243 93226
5464 93226 106348 139890 194935 207041 185245 171557 165498 129257 140442 158920 232677 257971
5452 257971 263617 261564 208038 181036 167632 204786 195739 244251 274988 288325 255596 252169
5440 252169 242806 304297 360392 429524 477088 462675 482078 486721 476318 488877 554688 649434
5428 649434 742784 777266 869488 881752 944794 1020389 1156102 1188618 1210366 1162622 1052841
5417 1052841 945175 864847 791771 797928 840241 834074 821233 852656 835163 821948 830669 902011
5405I02011O1113P4944R5393J05731O0741Q371N3350J40375J84394K11885K36435
5394B134743J91920K25429K54005J75490K17177J66381n2055j95381k96558k77697
5384B543454k49594k10314j92131j07608n3448j7330k3980J1434m1323j9545R890
5373A649505M8731M8337R8219J30365Q2253R5608P6211J24756J86605K29805K68530
5362C038925K77269L48505L34997L10410L21124K33997J26206m3343j6380n0138
5352D881572o1080O3430J42964K04794K03171J01226o7969k04773k83697j90157
5342D789481j60244n0504Q7042K42633K43571J76654l9126k65031l82889l94918
5332D246669k77793k28412j11791k6066j9603p1801j03366p6981j27894j57055
$$ plain form
5405 902011 963124 1038068 1133461 1239192 1299933 1308304 1361654 1502029 1686423 1898308 2134743
5394 2134743 2326663 2552092 2806097 2981587 3198764 3365145 3313090 3117709 2821151 2543454
5384 2543454 2293860 2083546 1891415 1783807 1730359 1713029 1689049 1700483 1659160 1639615 1649505
5373 1649505 1698236 1746573 1844792 1975157 2057410 2153018 2229229 2353985 2540590 2770395 3038925
5362 3038925 3316194 3664699 3999696 4310106 4631230 4865227 4991433 4948090 4931710 4881572
5352 4881572 4820492 4883922 5026886 5231680 5434851 5536077 5468108 5263335 4979638 4789481
5342 4789481 4629237 4578733 4665775 4908408 5151979 5328633 5289507 5024476 4641587 4246669
5332 4246669 3968876 3740464 3628673 3602607 3583004 3511203 3407837 3330856 3202962 3045907
5322C045907j62140j13623j24426j22682j40008o9479n7295n0828m1551n2888
5312B110987k5096j09940j48792j20861o0575n2035l059L291o6223o3230l8821
5301A425646n6544n4501j3220O7125k978o7249o5366o5843j17431o7521m4289
5290I37829j5882L7716J1647o829p0866q8453n9292j9056J4656M7633O6043k9705
5278H25441r2735o6287K294j389k1023M1163L9309J6947k231q5470J244M1657
5266F98920N278J6056J9818L9216j6941n4686R07K9602L7158M6883J8510R543
5254H50264j513j9654M789J8825M0048J02807J18204O4624j1191j7920m031Q1519
5242A226771J34684J21840J48981J35369O9261P6738R5625J57659J87326K32063
$$ plain form
5322 3045907 2883767 2770144 2645718 2523036 2383028 2313549 2256254 2205426 2163875 2110987
5312 2110987 2085891 1975951 1827159 1706298 1645723 1593688 1590629 1593920 1527697 1464467 1425646
5301 1425646 1369102 1314601 1301381 1368506 1365528 1298279 1232913 1167070 1049639 982118 937829
5290 937829 921947 959663 971310 964481 893615 805162 745870 726814 741470 789103 855146 825441
5278 825441 732706 666419 668713 667324 646301 687464 726773 743720 741489 656019 657263 698920
5266 698920 704198 720254 740072 779288 762347 707661 708568 738170 775328 822211 840721 850264
5254 850264 848751 829097 833886 852711 892759 995566 1113770 1178394 1167203 1149283 1145252 1226771
5242 1226771 1361455 1483295 1632276 1767645 1836906 1913644 2009269 2166928 2354254 2586317
5232B586317K43161K15415K67285L21409L32938L73007M79250N57058O74704P53811
5222F804355P47676P39639M91280p503l35598m31401l78767k92263k14410K783
5212G125791J98402L40012M49218M08590J05684m60330q37469r36427q57164p35301
5202D801006n31215m13070l37829k74672k62677k57023k98271j77632j07184p5116
5192B066317p3860n8813o9586j05954j37734j06881q2031L0154O875r5010r4237
5181A279240l2821o6967n6608N118L3762J2190o5002k6325m1548k9826l2822O662
5169I85053N1637J9766j4095l0504m5427J9676k9261N471M1373K8040N4777l6151
5157A050355l5988j3681K3374Q7841M9550O7046L1062K1695k2206L0560Q6416
$$ plain form
5232 2586317 2829478 3044893 3312178 3633587 3966525 4339532 4818782 5375840 6050544 6804355
5222 6804355 7552031 8291670 8782950 8775447 8439849 8008448 7629681 7337418 7123008 7125791
5212 7125791 7324193 7664205 8113423 8522013 8627697 8167367 7329898 6393471 5536307 4801006
5202 4801006 4269791 3856721 3518892 3244220 2981543 2724520 2426249 2248617 2141433 2066317
5192 2066317 1992457 1933644 1864058 1758104 1620370 1513489 1431458 1461612 1468487 1373477 1279240
5181 1279240 1246419 1179452 1122844 1127962 1161724 1173914 1108912 1082587 1041039 1011213 978391 985053
5169 985053 1036690 1056456 1042361 1011857 966430 986106 956845 962316 1003689 1031729 1086506 1050355
5157 1050355 1014367 1000686 1024060 1111901 1161451 1228497 1259559 1281254 1259048 1289608 1376024
5146A376024J64249J43267J27605J41406J14874J64781J55657J18649P8630n0616
5136B534526j96987k74368k93615k15565j76772j29301p5759q267m5200p2895
5126A045797j38318j07386m8508k2100L0229L8884j0620n3053k7317n7017m6946
5115F03645J9614O3585K2600l4234n4729o0074j2834l2484J330P2007N6404k4590
5103F20240q8782l9145k7791j5462J8254N8245M1753n5613m2327m6304n5649L2007
5091C99426Q3671N5609j0650l6581m6748k7286m4054K8705O5656J3097L6085k5911
5079D91019o4859p3647K5976O8869M5852K4595j1761l3343r0376k8005J2983O0598
5067D27901N0584o25m5745n0412k1707k7829j7473N7235Q6206J3465j3256r5791
$$ plain form
5146 1376024 1540273 1683540 1811145 1952551 2067425 2232206 2387863 2506512 2585142 2534526
5136 2534526 2337539 2063171 1769556 1553991 1377219 1247918 1172159 1163892 1118692 1045797
5126 1045797 907479 800093 751585 729485 759714 798598 787978 734925 707608 650591 603645
5115 603645 623259 686844 709444 675210 620481 560407 547573 515089 516419 588426 644830 620240
5103 620240 531458 492313 464522 449060 467314 525559 567312 511699 469372 423068 367419 399426
5091 399426 483097 538706 528056 491475 444727 417441 373387 402092 467748 480845 516930 491019
5079 491019 426160 352513 378489 447358 493210 517805 506044 472701 382325 354320 367303 427901
5067 427901 478485 477860 432115 381703 359996 332167 314694 371929 458135 471600 458344 362553
5055C62553p4204J9259Q0902P7087n314J0020l7043q0023l1173L8478O4574O5868
5043D90984K5862j0193l4331l5644k5788L1103R2098L3786J078n5547q1700p1830
5031C59878J0824N8070J1006O6089K806l1443n6630n0943L9728R3456O4253J4347
5019E81441l9566o5030l6086J9686M2159Q8017Q8210l9966o8347p3221q037M6916
5007E36176O1621P3322O8237p5070j05606j6395J8453O3782J30527J15302L4121
4996I04470j6650l7881L7551Q7132R8937P4456L6278p139r7487m6455j008K7874
4984A060078O9401P1632k9108j04351j03126m7180o002P6402L6894q3281j16172
4973H25187p1825p0389K8493N8502N9627J8564l9450r8986o8924r114J05593J03463
$$ plain form
5055 362553 288349 307608 388510 465597 460283 470303 433260 353237 322064 360542 425116 490984
5043 490984 516846 506653 472322 436678 410890 441993 534091 567877 568955 513408 431708 359878
5031 359878 370702 428772 439778 505867 508673 477230 420600 369657 409385 502841 567094 581441
5019 581441 541875 476845 440759 460445 502604 590621 678831 638865 570518 497297 489260 536176
5007 536176 597797 671119 739356 664286 558680 542285 560738 624520 755047 870349 904470
4996 904470 887820 849939 887490 974622 1073559 1148015 1184293 1177154 1079667 1033212 1032204 1060078
4984 1060078 1129479 1201111 1172003 1067652 964526 917346 911344 987746 1024640 941359 825187
4973 825187 753362 682973 711466 769968 829595 848159 808709 709723 640799 631685 737278 840741
4961H40741M6503j6832k8062m0615k2408P4843J06721O3558J2932k1446n2212
4950I63723j8568K8806Q7173N2114K5064l9916m2591n1257L0670J14020J01704
4939A250942L5285k8757l7314l8553K9442R8864J39782O2885q760p2565q5269
4928A345982N3109M1330P0650R0902J2397l2313o0218q984M9043J39265J42245
4917A843408k8324m5102p2140k2303N3351J42691Q2102M9239j8639j9641M244
4906A968886J04405J24252J09352M5029J0424m9142M2459Q6133J11750J50918
4896B704466P3937q218K2898N0303J29669J89952J50516P3703J2699J7769Q0795
4885C498489J85941K37670J74315J15172M8365R6515J51594K86386L00624K39800
$$ plain form
4961 840741 887244 870412 842350 801735 779327 854170 960891 1024449 1037381 1015935 963723
4950 963723 945155 973961 1061134 1113248 1138312 1098396 1055805 1004548 1035218 1149238 1250942
4939 1250942 1286227 1257470 1220156 1181603 1211045 1309909 1449691 1512576 1503816 1431251 1345982
4928 1345982 1399091 1440421 1511071 1601973 1614370 1582057 1521839 1512855 1561898 1701163 1843408
4917 1843408 1815084 1769982 1697842 1675539 1728890 1871581 1953683 2002922 1984283 1964642 1968886
4906 1968886 2073291 2197543 2306895 2351924 2362348 2313206 2355665 2441798 2553548 2704466
4896 2704466 2778403 2770185 2793083 2843386 2973055 3163007 3313523 3387226 3399925 3417694 3498489
4885 3498489 3684430 3922100 4096415 4211587 4259952 4356467 4508061 4794447 5095071 5334871
4875E334871J77340J05456J16043K73617L64028L76506L71146K85619K51297L50038
4865H005961M69362N83790O57491M96818M80053N16340O26337P81910Q89916R32114
4855A4440092Q29916Q31610R24559J127947J297094J383910J376760J347824J415077
4846B4974789J738976K076810K381923K521938K664706K803083L210094L737092
4838D6109411M397598M820533N127641N659703O519964P444763P923519Q508333
4830I6511465R384218J0462245J1563743J3286991J5466404J7788610K0759947
4823A95223623K3162151K4885132L0038535L5702468L8218003L4767269K1759055
4816D03756236o304660l2115901m3322414m4842286m0626904l3567199k6835792
$$ plain form
4875 5334871 5512211 5617667 5733710 6007327 6371355 6747861 7119007 7404626 7655923 8005961
4865 8005961 8475323 9059113 9716604 10213422 10693475 11209815 11836152 12618062 13507978 14440092
4855 14440092 15270008 16101618 17026177 18154124 19451218 20835128 22211888 23559712 24974789
4846 24974789 26713765 28790575 31172498 33694436 36359142 39162225 42372319 46109411
4838 46109411 50507009 55327542 60455183 66114886 72634850 80079613 88003132 96511465
4830 96511465 105895683 116357928 127921671 141208662 156675066 174463676 195223623
4823 195223623 218385774 243270906 273309441 309011909 347229912 381997181 403756236
4816 403756236 397451576 365335675 322013261 277170975 236544071 202976872 176141080
4809A76141080k1778361j7174203j3955504j1865040j0751061r107330p629993
4802H3879588o355699n382548m654462m131252l614616l294590k967669k777863
4794E0700889k558871k368964k112215k018195j840520j709543j618092j526475
4786C4948014j446802j337598j181670j124806j050835j000321q52434q81048
4778B6072500p66992p32532o35886o25909n85608n82007n21626m85196m10495
4769B0726249m23130l93850l30093l19061k55699k70532j88690j72531k18253
4760A8154410k79384m71924n51176o47801n92559n21573n24991n25569n03632
4751A3535801m40007l89082l58586l46472l11444l15207l21908k84835k83141
$$ plain form
4809 176141080 154362719 137188516 123233012 111367972 100616911 91509581 83879588
4802 83879588 77523889 72141341 67486879 63355627 59741011 56446421 53478752 50700889
4794 50700889 48142018 45773054 43660839 41642644 39802124 38092581 36474489 34948014
4786 34948014 33501212 32163614 30981944 29857138 28806303 27805982 26953548 26072500
4778 26072500 25305508 24572976 23937090 23311181 22725573 22143566 21621940 21136744 20726249
4769 20726249 20303119 19909269 19579176 19260115 19004416 18733884 18545194 18372663 18154410
4760 18154410 17875026 17403102 16851926 16204125 15611566 15089993 14565002 14039433 13535801
4751 13535801 13095794 12706712 12348126 12001654 11690210 11375003 11053095 10768260 10485119
4742A0485119k29866k81556k45431k17413k02965j77069j60624j20275j46567
4733H703353j60045j26571j49752j48487j24221q4128p0906j17691p8481n8501
4723G584570q5482r1829r4106j02325j31855r2625p6950j37460j13498q7904j30683
4712F439853j35805j02283j03303j29829o4254q8907j13995j02050j11780o3616
4702E424031r6976j07953j00749o2338r6028q9314r1649q8409q8556j24923r7784
4691D379352r4752j06265q1014p6076r9626q4735n8226j00566p3243r0086o0769
4680C453994l7351j07679p6396n2645q7940r7969p6140j9042p2635k3285j01275
4669B701637o1429o7850m6607m0283m5758p9915n6583j05565p6020q0265j00397
$$ plain form
4742 10485119 10255253 9973697 9728266 9510853 9307888 9130819 8970195 8849920 8703353
4733 8703353 8543308 8416737 8266985 8118498 7994277 7910149 7839243 7721552 7643071 7584570
4723 7584570 7499088 7407259 7313153 7210828 7078973 6986348 6909398 6771938 6658440 6570536 6439853
4712 6439853 6304048 6201765 6098462 5968633 5904379 5815472 5701477 5599427 5487647 5424031
4702 5424031 5327055 5219102 5118353 5056015 4959987 4870673 4779024 4690615 4602059 4477136 4379352
4691 4379352 4284600 4178335 4097321 4021245 3921619 3836884 3778658 3678092 3604849 3514763 3453994
4680 3453994 3416643 3308964 3232568 3179923 3091983 2994014 2917874 2898832 2826197 2802912 2701637
4669 2701637 2640208 2572358 2525751 2485468 2439710 2359795 2303212 2197647 2121627 2041362 1940965
4658A940965k7539r0061o2040j02827q5733n3190p1442l2142k7402k7833m7431
4647A313325m8720n7870j4281n4331j6653j689j5554L3564M7340L7347P674L1051
4635A261203j109j0971L091J0382K384k6609l4766k6637J337m5677j6718k1631
4623A094279k5027l1204k0482k0235K717q559l1127k400k5121K7705m0002l6400
4611H84144j1886k5676l2901M2180k4295l8998N039k7796j9471m6615n438m838
4599F93449l1010n4506M139L2888K9844j5797j8341l694j3018K2833L2933m6388
4587F33332l2622M0106j7038j6908j1624j9459o687L0998k8359J0055q242k8898
4575E44654q930j5715k3400K2506j933j255j5021j2945Q085k9728K1092J9431
$$ plain form
4658 1940965 1913426 1823365 1761325 1658498 1572765 1519575 1448133 1415991 1388589 1360756 1313325
4647 1313325 1264605 1206735 1192454 1138123 1121470 1119781 1104227 1137791 1185131 1222478 1230152 1261203
4635 1261203 1260094 1249123 1252214 1262596 1264980 1238371 1203605 1176968 1178305 1132628 1115910 1094279
4623 1094279 1069252 1038048 1017566 997331 1000048 991489 960362 957962 932841 960546 920544 884144
4611 884144 872258 846582 813681 855861 831566 792568 797607 769811 750340 703725 698287 693449
4599 693449 662439 607933 612072 644960 674804 659007 640666 636972 623954 646787 679720 633332
4587 633332 600710 640816 623778 606870 595246 575787 569100 600098 571739 581794 573552 544654
4575 544654 535724 520009 496609 519115 517182 515927 500906 487961 496046 466318 487410 506841
4563E06841k7197o788k0900M354J795l8313m041L928j6863P228j2362M133J8983
4550D20798j3023l5365k8886N233O462K5495K8707j6270l4037J5696l932k9083
4538C41795L3560J1828k7677l12M476k540M351J7176j6723J7997K229j1588J1355
4525C85927K4808K7386l0046j3717Q072r272j0503K9008K3754J2704N2641L5728
4513E36490M1622L2657M2533q451J5338P5156j2941J2770L5599P0884N4776N9202
4501I55635M7910J05483Q8465J22257J32160J34635K00201K09521J74328J89614
4491B360209J1103j59350k28783k31218k39068k13219j52566j40320q2414j15651
4481H08723m8536p6719p7246k7266k3490k0710m6811q594j6221m5518k1285R563
$$ plain form
4563 506841 479644 472856 451956 456310 458105 419792 415751 419679 402816 410044 397682 401815 420798
4550 420798 407775 372410 343524 348757 355219 380714 409421 393151 359114 374810 370878 341795
4538 341795 375355 387183 359506 359194 363670 361130 365481 382657 365934 383931 386160 374572 385927
4525 385927 410735 438121 408075 394358 402430 393158 382655 411663 435417 448121 500762 536490
4513 536490 578112 610769 653302 644851 660189 735345 722404 735174 770773 841657 896433 955635
4501 955635 1003545 1109028 1197493 1319750 1451910 1586545 1786746 1996267 2170595 2360209
4491 2360209 2371312 2211962 1983179 1751961 1512893 1299674 1147108 1006788 924374 808723
4481 808723 760187 683468 606222 578956 555466 534756 487945 479351 463130 417612 396327 405890
4469D05890L890m631l117m1647m3256m8671K2387J8215j1030k0584j1299k0838
4457B45309N764J4078p761J7766j6321J5939j9048m8720K0456J0945j4867m2452
4445A81088K9732P741j5879l0347J0761K1400Q391k2288L478J5645j1029J6506
4433B15199Q044k6316l956j1113J7070J7438K640j9540n3883J0071j4222J4114
4421A55546k1474j5497J4403K5060M716k1910l0213K718K4579J8146k4898j5614
4409A15562J8733j1681J2957j4022L0411p461J3133r087q732J0911k9278k8846
4397I2600K6480O382J3980p884P037O834k0339J5027j4419J7961J0740L588J6926
4384A74913J354J6008n177m6993J4849J8870k9549K6531J5876K9267k4577K441
$$ plain form
4469 405890 409780 405149 402032 360385 317129 268458 290845 309060 298030 277446 266147 245309
4457 245309 251073 265151 257390 275156 258835 274774 255726 207006 227462 238407 223540 181088
4445 181088 210820 218561 202682 172335 183096 204496 212887 190599 194077 209722 198693 215199
4433 215199 223243 196927 192971 181858 198928 216366 219006 199466 145583 155654 141432 155546
4421 155546 134072 118575 132978 158038 162754 140844 110631 113349 137928 156074 131176 115562
4409 115562 134295 122614 135571 121549 151960 144499 157632 148545 139813 150724 121446 92600
4397 92600 119080 125462 139442 131558 138595 145429 125090 140117 125698 143659 154399 157987 174913
4384 174913 176267 192275 187098 140105 154954 173824 144275 170806 186682 215949 191372 193813
4372A93813q244J0360J6439P292R788k3004J4229L1945L2815l7161l654K0108
4360B64726J688L1817J4416K3676L268q378L5530l628M1138K7735J8803N3773
4348E04564L4053J1799L7551N9947L7687K4671O2053K3898N2579J18930R1877
4337A059609N8068J28934R6605J11520J42227J43119J69570K06173K41392K43516
4327B600733K16765K73000L52265M04403M80643M93179N89429O67169P80506R34846
4317G792938Q92182O52209P0214o54743j012337j085758j000034q33837o78604
4308D142230m90814m14152l65632k63977k26500k52793j52972j79988j08564j14637
4298A572201j25399p7101p5740n0788n6282m2612n0484m9353o5912l7534k7910
$$ plain form
4372 193813 185569 195929 212368 219660 229448 206444 220673 252618 285433 248272 244618 264726
4360 264726 266414 298231 312647 336323 339591 331213 366743 363115 404253 431988 450791 504564
4348 504564 538617 550416 587967 647914 685601 710272 772325 796223 848802 967732 1059609
4337 1059609 1117677 1246611 1343216 1454736 1596963 1740082 1909652 2115825 2357217 2600733
4327 2600733 2817498 3090498 3442763 3847166 4327809 4820988 5410417 6077586 6858092 7792938
4317 7792938 8685120 9337329 9407543 8752800 7740463 6654705 5654671 4820834 4142230
4308 4142230 3651416 3237264 2871632 2607655 2381155 2128362 1975390 1795402 1686838 1572201
4298 1572201 1446802 1369701 1293961 1243173 1186891 1144279 1093795 1044442 978530 940996 913086
4287I13086o5163k1324j5863l0055n6674o880l5799j9709j639k1486k8142N621
4275F15973k7521k8087m2456J5846K7538j5168l2226k5777l616J3570L234j7597
4263D83713q497r758J5359K6955m122k9357J3105l123L1807o287j9693j1869r225
4250D69008L0324o226l4528K6302K8923J0816m669L4660k5110k4198K9548K5196
4238E60046M6908L0537l2508L4598N0223M355K3537O1265P4087O3182r973L6581
4226I42838R9888Q3485O9895Q3833R6049J13546R7314J37139J50365J86145J53279
4215B213776K18120K38393K80888K55582K94293L55068L93603M17719N17586O07996
4205E793024O92291P15229Q90334J023245J148878J140563P94637Q6200q31128
$$ plain form
4287 913086 847923 826599 810736 780681 724007 717127 681328 661619 659980 638494 610352 615973
4275 615973 588452 560365 517909 533755 561293 546125 513899 488122 484506 498076 501310 483713
4263 483713 475216 465458 480817 507772 503650 474293 487398 484275 516082 509795 490102 478233 469008
4250 469008 499332 493106 458578 484880 513803 524619 519950 554610 529500 505302 534850 560046
4238 560046 606954 637491 604983 639581 689804 694159 717696 778961 853048 916230 906257 942838
4226 942838 1042726 1126211 1196106 1279939 1375988 1489534 1586848 1723987 1874352 2060497 2213776
4215 2213776 2431896 2670289 2951177 3206759 3501052 3856120 4249723 4667442 5185028 5793024
4205 5793024 6485315 7200544 8090878 9114123 10263001 11403564 12198201 12284401 11453273
4196A1453273j302926j366686j275564j084074q88068p00445n44580m36574l75426
4187C478930k98117l25210k53246j28302j48696j75991j23675j03412j08948m0850
4177A772483m2667o5420m3539l3440p3308k2141k6528k3968K7337L0578j126M5289
4165A543550l8679R605K0267l3464o4420p3587o4270o4723j16666o1374p5501
4154I80738m0235j1497k2246n1054l2740k1597m9618n618r464L576J3033m7402
4142G05876k272m0240j675j9284k9624n303q898k9000k0907j5905l8584o1999
4130D32185R747L8919o2675j7670K4655J0407m3960k3333K0317J8304m0879k8908
4118C37109M6423l9915o415j0583J4051J5093j0755J933K5931k1307k4609L6846
$$ plain form
4196 11453273 10150347 8783661 7508097 6424023 5535955 4835510 4290930 3854356 3478930
4187 3478930 3180813 2855603 2602357 2474055 2325359 2149368 2025693 1922281 1813333 1772483
4177 1772483 1729816 1664396 1620857 1587417 1514109 1491968 1465440 1441472 1468809 1499387 1498261 1543550
4165 1543550 1504871 1514476 1534743 1501279 1436859 1363272 1299002 1234279 1117613 1056239 980738
4154 980738 940503 929006 906760 855706 822966 801369 751751 746133 736669 740245 753278 705876
4142 705876 703604 663364 661689 642405 612781 607478 598580 569580 548673 532768 494184 432185
4130 432185 441932 480851 418176 400506 425161 435568 391608 368275 388592 406896 366017 337109
4118 337109 383532 343617 337202 326619 340670 355763 345008 346941 372872 351565 326956 363802
4106C63802k4003K4991J5649k158p301Q539J2510j3016P478J9718J0090j236K5813
4093D40876P0884M2742k5326P8764M7982P1502O7414N0073J1369m5307p5829o7536
4081F67608n1210n5096p2858n7167j8338m8376J441l9781r385k7643k8485l4075
4069B26635R43k5946k927k5891J862J6819l407P090j5380k4451m7112k4386N2915
4056A36764k7197l1326n332J1379K7963j4279l2060L8631L8643j1894k4701k4405
4044H2186n88J0632Q929p382l5756L265L0802j7409p808j8017j6455K9113L0089
4031I1601j4929l2570j9347M607J5191L0671q740M626o917M278N398o705j8152
4018D9012N568O81k1722J585K4191J1539l5684J3431j0814J5948J3237J5713k6257
$$ plain form
4106 363802 339799 364790 380439 378281 370980 379519 392029 379013 386491 406209 416299 415063 440876
4093 440876 511760 554502 529176 607940 655922 727424 794838 844911 856280 810973 735144 667608
4081 667608 616398 561302 488444 431277 412939 364563 366004 326223 316838 289195 260710 226635
4069 226635 227578 201632 198705 172814 174676 191495 188088 195178 179798 155347 108235 83849 136764
4056 136764 109567 78241 72909 84288 112251 97972 65912 104543 143186 131292 106591 82186
4044 82186 81598 92230 101159 93777 58021 61286 92088 74679 66871 48854 32399 61512 91601
4031 91601 76672 44102 24755 29362 44553 75224 66484 71110 64193 68471 73869 67164 49012
4018 49012 54580 55261 33539 35124 59315 70854 35170 48601 37787 53735 66972 82685 56428
4005E6428J0662k2518n228K8780q458M1185M666k3163J0258M642K119J3668M164
3992A17205L1396k2998k7147O946K2821K2633l0937O24P507P362L5896K1636K972
3979A95916K1855L2606J642k9219L9800M6984J7672l341M9315J3411K6452P2065
3967D85158K7961L1347O6626Q2889M7934Q6045J07437J22586J07767J02958M7797
3956A316505O125K5267Q720r248M5110P0007Q3783J26030J47630J03208K6508
3945A949645n1968j07869j53232j56867j11476q0980m3096k0025q596L236m1331
3934A177441o8532p7007r5399q6950q2372j10406n9125p0032m3722n9059j4337
3923D10500k5016J5163l6918n0719k3395J8434j2359q558M642k8170k3001O867
$$ plain form
4005 56428 67090 44572 39344 68124 59666 100851 105517 82354 92612 97254 99373 113041 117205
3992 117205 148601 125603 98456 105402 128223 150856 119919 120543 128050 135412 171308 192944 195916
3979 195916 217771 250377 252019 222800 262600 309584 327256 323915 373230 386641 413093 485158
3967 485158 513119 544466 611092 693981 741915 827960 935397 1057983 1165750 1268708 1316505
3956 1316505 1322630 1347897 1356617 1347369 1392479 1462486 1546269 1672299 1819929 1923137 1949645
3945 1949645 1897677 1789808 1636576 1479709 1368233 1287253 1244157 1224132 1215536 1218772 1177441
3934 1177441 1108909 1031902 936503 849553 767181 656775 597650 527618 483896 424837 410500
3923 410500 385484 400647 363729 313010 289615 308049 295690 287132 291774 263604 240603 247470
3911B47470Q227R073J2652k1215M236J7740j6363P229L3213k0104q889K0653J8833
3898C12755M015m193l1720P415L081j1941K6686M4063J5162k1262Q573K2864q979
3885C66519M0540L8874L1386n035K4671K4161k3585J4348O0517K7434J2447L5037
3873F47314Q7706R4178L4235M6661R2271J03057J53666J55943J50060J60273K03760
3862A929124K64493K58629L08656L09296L28533K10164O4719p6158k63324l09036
3852C025096l68713k66978k87207k80291k05340j51904j09768j44299j03164p6788
3842A030644o3348o0900n4394o4492r242j4837k1882o9127o0322R936j7039Q422
3830F13419l6998m1721k360L3605O533L946l3848J368J7062m2406L0089K5167
$$ plain form
3911 247470 255697 264770 277422 256207 260443 278183 261820 269049 302262 282158 273269 293922 312755
3898 312755 316770 312577 280857 288272 291353 279412 306098 350161 365323 344061 352634 375498 366519
3885 366519 407059 445933 477319 472284 496955 521116 497531 511879 572396 599830 612277 647314
3873 647314 735020 829198 863433 910094 1002365 1105422 1259088 1415031 1565091 1725364 1929124
3862 1929124 2193617 2452246 2760902 3070198 3398731 3608895 3673614 3597456 3334132 3025096
3852 3025096 2656383 2389405 2102198 1821907 1616567 1464663 1354895 1210596 1107432 1030644
3842 1030644 967296 906396 852002 787510 778268 763431 741549 672422 612100 622036 604997 613419
3830 613419 576421 534700 532340 565945 572478 576424 542576 543944 561006 518600 548689 573856
3818E73856j1415P567L473L8522L2490j3181j5619N4449Q7608O6597K4505K8180
3806H77032N1311N4008P7645O9468Q1040J20769J46529J62527J27755J20825K21832
3795B110741K22669K48596K40773J76945N2141j0723k0854j7761P3231R2744J56347
3784C324849K00510K97243K78189K47412P2084j98172k91844l08886l07867k19450
3774C094068j59319n4466j1754M6020O5012l4274j03287k04206k50132k66913
3764B120749k16414j95360j29933q3301j02825j15340o0733k8333m6699m9270
3754A092541n5774l1735j8986K4782Q196K2056J7137l7869l064R984O2299J2966
3742A102533J4272k0386P9310N5908K8601J18052J24146J35417J09477J01967
$$ plain form
3818 573856 562441 570008 573481 612003 644493 631312 615693 670142 757750 824347 848852 877032
3806 877032 928343 982351 1059996 1129464 1210504 1331273 1477802 1640329 1768084 1888909 2110741
3795 2110741 2333410 2582006 2822779 2999724 3051865 3041142 3020288 3002527 3075758 3168502 3324849
3784 3324849 3525359 3822602 4100791 4348203 4420287 4222115 3930271 3621385 3313518 3094068
3774 3094068 2934749 2880283 2868529 2914549 2979561 2945287 2842000 2637794 2387662 2120749
3764 2120749 1904335 1708975 1579042 1495741 1392916 1277576 1216843 1188510 1141811 1092541
3754 1092541 1036767 1005032 986046 1010828 1019024 1041080 1058217 1020348 1017284 1027268 1089567 1102533
3742 1102533 1116805 1096419 1175729 1231637 1260238 1378290 1502436 1637853 1747330 1849297
3732A849297M3391M4964l6043m0456J0213j2084N1533R0595J01732J24412J26105
3721B353659O7866l0522j14480k06623j73872n1217p8866m4091n1861O529K2550
3710A699072l284p0572o4531j49034j55508o1126q5768l7944l4768k9772j7715
3699I89050l2656l7283l9778k3885k7918n5349k9121J1231l2269m497J9897j6376
3687G21046m2164m1415l4291l071j4888l5096J0727j3104Q428K0121k6977m8144
3675E01172o357r1523k2877L3186k625l126j3887l1022j7514k7446p434n605k8384
3662B76558l4893k3261K99K6437l4605j9998k3039q149L3138m1908q078O656M8478
3649A97635p089l8448p078l0226J0988k6931o661J6090j8156L1092l530m0421
$$ plain form
3732 1849297 1892688 1937652 1901609 1861153 1871366 1859282 1910815 2001410 2103142 2227554 2353659
3721 2353659 2421525 2391003 2276523 2069900 1896028 1844811 1765945 1721854 1669993 1676522 1699072
3710 1699072 1695788 1625216 1560685 1411651 1256143 1195017 1109249 1071305 1036537 1006765 989050
3699 989050 956394 919111 879333 855448 827530 772181 743060 754291 722022 717525 737422 721046
3687 721046 678882 637467 603176 600105 585217 550121 560848 547744 556172 576293 549316 501172
3675 501172 494815 403292 380415 413601 410976 407850 393963 362941 345427 317981 310547 304942 276558
3662 276558 241665 218404 218703 245140 210535 190537 167498 159349 192487 150579 142501 149157 197635
3649 197635 190546 152098 145020 114794 125782 98851 92190 108280 90124 121216 117686 77265
3637G7265j0840j5824K2476M7615j9899j2036j1934j5109r786K4691j6950L808
3625F3477N5575L0277l6757k6683j3204j4537J1432j5639J540J99P521O571N540
3612G5312J9670k5267k6784K2006l3968K8901j6544J1011J4373k259j7340j1469
3600C7642J406j171K947j0376j9418M276R804K4199J7308k7051j7811J7054k9566
3587I243J9987L0943j0893L902k4982k2275q394L7883j6647r545J8767j2682J0871
3574B6178L3343k6444j4750P033K6131p83p143K26p63q778O589r678L329k8335
3560F155k1225L8750k5541m700K3848K7232j7862l879J5116p707p98k1648M514
3547A2255L0531l640k346M48l5351L8917k3530m3542J5204R094J5585j5477K065
$$ plain form
3637 77265 66425 50601 73077 120692 100793 88757 76823 61714 51928 76619 59669 63477
3625 63477 119052 149329 112572 85889 72685 58148 69580 53941 55481 55680 63201 69772 75312
3612 75312 94982 69715 42931 64937 30969 59870 43326 54337 68710 66451 49111 37642
3600 37642 39048 37877 40824 30448 11030 15306 25110 49309 66617 39566 21755 38809 9243
3587 9243 29230 60173 49280 53182 28200 5925 -2469 35414 18767 9222 27989 15307 26178
3574 26178 59521 33077 18327 25360 51491 50708 43565 43791 43028 34250 40839 31161 34490 6155
3560 6155 -15070 23680 -1861 -6561 17287 44519 26657 22778 37894 30187 29389 7741 12255
3547 12255 42786 39146 36800 37248 1897 40814 17284 -26258 -11054 -1960 13625 -1852 213
3534B13K2311j9245Q45N309j9459j7904J846Q709O56J1328m612l098j274j551
3520a5926Q083R92j966K2224j1805m408k2924K0833J1201J8837k5206M382m870
3507e53o0167J0513L7971K5013n375O507q919J7876k1301o490N354L3201k0395
3494A3235L0696j6210l6331N75j9155j685P2931m07P093J6563K2582j5508n564
3481F8815J8271L443K4495j8791n845K41m9490j7146K3421R210O60j1524K7133
3468G2893j3907k759M1378l4740j6852L0362j4116J1134k7614j8156J2340J6212
3456E6175m0759k3435K3280o680j476J3531r856L769l1273L2635k2397R673K4983
3443B8170j9859J1394J2112m87k084L5168K0757j2715m1434l3668K6442M030K8276
$$ plain form
3534 213 22524 3279 4124 9433 -10026 -27930 -26084 -17375 -16719 -5391 -10003 -13101 -14375 -15926
3520 -15926 -7843 -6851 -8817 13407 1602 -2806 -25730 -4897 6304 25141 -65 4317 -553
3507 -553 -60720 -50207 -12236 12777 7402 13909 4990 22866 1565 -4925 429 33630 13235
3494 13235 43931 27721 -8610 -8035 -27190 -28875 44056 43649 50742 67305 89887 74379 68815
3481 68815 87086 90529 115024 96233 90388 90629 41139 23993 47414 56624 57284 45760 72893
3468 72893 58986 56227 97605 62865 46013 76375 62259 73393 45779 27623 39963 56175
3456 56175 15416 -8019 15261 8581 7105 20636 10780 14549 -16724 15911 -6486 3187 28170
3443 28170 8311 19705 31817 31330 29246 64414 85171 72456 31022 -2646 23796 27826 56102
3430E6102R785q026k5183j8677r497N424L961J1675k728k0938J7530l5131J1436
3417d267L4082L704l3165m970K1819L3342L902j605J5157k0832L91r801L1731
3404F9488K2164k868j1937L2024n658K5848J4085J3267m697n543J9520O1499N8947
3391B86139J4793K0333K459Q0165N3582R6897O9826J08090P0784R2477O1227R941
3379I66713p6731j26482j03887q1202o4109p7588p5195m0370o1874n1268J2917
3368B20924J2281m6288j9113Q586m4686j7742j5693K3158J3737l2090O412j5904
3356I3582M653K1669j2918J4592k6548R834j939J2508j4503j1558l1872J1917
3344F9417J5684k3951k2806J9212L175j6464Q536m0516p8j5317J0921M0108P143
$$ plain form
3430 56102 65887 57861 32678 14001 4504 9928 13889 25564 22836 1898 19428 -15703 -4267
3417 -4267 29815 33519 354 -4616 17203 50545 54447 52842 67999 47167 47558 37757 69488
3404 69488 91652 88784 76847 108871 103213 129061 143146 156413 151716 146173 165693 227192 286139
3391 286139 300932 321265 323724 403889 457471 554368 624194 732284 803068 895545 956772 966713
3379 966713 889982 763500 659613 578411 514302 436714 361519 321149 259275 208007 220924
3368 220924 233205 186917 167804 176390 131704 113962 98269 121427 135164 103074 109486 93582
3356 93582 98235 119904 106986 121578 95030 104864 102925 115433 100930 89372 57500 69417
3344 69417 85101 61150 38344 57556 60731 44267 52803 12287 12209 -3108 7813 47921 55064
3331E5064k2965P86r10l529L3643K5571J2403j5865l8320n199K0497j3333j6417
3318C1426r647K491N5944p613m2195j6327O445K4742J9298j9186k6290q100m7
3305A0941N030L5580j8239n514o23K7610k1701j0787J9691l946J9909J562k3876
3292C5637j5445M4158j2398m4073n977L4529L647L152j1997r458J4360j1755j5735
3279H645j0254K1560M5462Q989k732n076J1454l0962J0654N142m6162J6105J6316
3266D9141K5338l591l7261P31K6179L302K0268j4060r917L1365j0997K015J6255
3253I8768l8678J1387J1895L0897L7028j6071m1574j184J0683M030K2192k8630
3241A00743j6874L3136K3667j489p698j7210J222L2778j7143K4053N441K0660
$$ plain form
3331 55064 32099 32885 31975 28446 62089 87660 100063 84198 45878 40679 61176 47843 31426
3318 31426 21779 24270 80214 72601 30406 14079 20524 45266 64564 45378 19088 10988 10941
3305 10941 15971 51551 33312 27798 27175 54785 33084 22297 41988 38042 57951 59513 35637
3292 35637 20192 64350 51952 7879 1902 36431 40078 43230 31233 21775 36135 24380 8645
3279 8645 -1609 19951 65413 74402 71670 66594 78048 47086 57740 62882 16720 32825 49141
3266 49141 74479 70888 33627 34358 60537 63839 84107 70047 60130 91495 80498 82513 98768
3253 98768 60090 71477 83372 114269 151297 135226 93652 92468 103151 107181 129373 100743
3241 100743 83869 117005 140672 139183 131485 114275 115497 148275 131132 155185 160626 181286
3229A81286K5710j7001L0377Q341k816l290L5210L602Q0618M641N848l0277M4531
3216C66780N4345K7792K0821J1541K0783L7166O831N4182N6205M9548J07640Q0431
3204H94065J00649Q9650J20496P4305J19515J40594J20628J34662J62642J11265
3194B068471R0207J16222R1113R3220N4195O2515R1364R5046N0693o730K6470
3183B832786M4635J6103m896j5858J747j9573m1003k7719k2803m1484o3238m2608
3171B616089m2358p6102p6964l1754l6772m9337n2520o3269q9796o8146p4453
3160A954618k1373n9715p0511p1079k6175q8463p0874o4324l9793l8022n0514
3149A353775n7312o0539n3004k2044n2825l7362m6158o1323j8396l0270m2121
$$ plain form
3229 181286 206996 189995 220372 228713 225897 222607 257817 261419 342037 346678 352526 322249 366780
3216 366780 421125 448917 469738 481279 502062 539228 546059 600241 656446 705994 813634 894065
3204 894065 994714 1084364 1204860 1279165 1398680 1539274 1659902 1794564 1957206 2068471
3194 2068471 2158678 2274900 2366013 2459233 2513428 2575943 2667307 2762353 2813046 2806316 2832786
3183 2832786 2877421 2893524 2888628 2872770 2874517 2854944 2813941 2786222 2763419 2721935 2658697 2616089
3171 2616089 2573731 2497629 2420665 2388911 2352139 2302802 2250282 2187013 2097217 2029071 1954618
3160 1954618 1933245 1873530 1803019 1731940 1705765 1617302 1546428 1482104 1442311 1404289 1353775
3149 1353775 1296463 1235924 1182920 1160876 1108051 1070689 1024531 963208 944812 914542 872421
3138H72421j7841k7003j9724k0570l0630P40k4414j4576l1524j8106m8474l8587
3126E81712m9973l796q728J4582L392l0949j7559j0505l5110L2913j9166m0590
3114D16223j6086J022R135j0222k0233r348L767k3531k254P716l3295j3892l0530
3101B78472j0712J8754P431l435j4124j1010k4856j6662j7267Q177L2682r277
3089B38173k3278K020J4391j1571k8293j7633j6608q82L0693j9940J797K1301
3077A90170J3658j6384j3892K2703k8182l1625R713R540j9675k158P037J4947
3065A55852J5036k4098l6122P187J610J7518j7305O703m2435o486J3980o794K6649
3052A11295J113P301N335R533M400k0824k0438M486L0321Q85m1131j9653N751
$$ plain form
3138 872421 854580 827577 807853 787283 756653 757393 732979 718403 686879 668773 620299 581712
3126 581712 531739 527943 519215 533797 537189 506240 488681 478176 443066 475979 456813 416223
3114 416223 400137 401159 410294 400072 379839 370491 374258 350727 348473 356189 322894 309002 278472
3101 278472 267760 286514 293945 290510 276386 265376 240520 223858 206591 214768 247450 238173
3089 238173 214895 216915 231306 219735 191442 173809 157201 156319 187012 167072 168869 190170
3077 190170 203828 187444 173552 196255 168073 136448 146161 155701 136026 133868 140905 155852
3065 155852 170888 146790 110668 117855 119465 136983 119678 126381 83946 77460 91440 84646 111295
3052 111295 112408 119709 125044 134577 138977 118153 97715 102201 132522 133407 92276 72623 78374
3039G8374p178k5877J9876k5745j4144J0760K264K4724r06J8254j5649j4818J1540
3026F1475J2369q203j042j3396J2948j632k0576j2293l6408q941M1255Q575K2505
3013E6636o266P560N754k4776J837n743q98l7937o566K9082o007r894J6997K0622
2999D0401m2537k1001r864j2171N3463J6358J6911O85l3659j1999J1930n701J0851
2986A3667J4138k0119k0748n297j8167J6922M1948j1410q938j0719j4167L7196
2974A4306p351j8512l47J6115k9485K353J5640j4914J7914N076k8351N119J1238
2961a1199k0628l008K1488j9495L147J1788P065O555j0235J1403J4336l499l558
2948D160k4470Q630m544k290l025l891J6871j3239q034J0041j9455j0415J7873
$$ plain form
3039 78374 71196 45319 65195 39450 25306 36066 38330 63054 62148 80402 64753 49935 61475
3026 61475 73844 65641 64599 51203 64151 62519 41943 29650 -6758 -15699 25556 34131 56636
3013 56636 50370 57930 63684 38908 40745 35002 34104 -3833 -10399 18683 12676 2782 19779 40401
2999 40401 -2136 -23137 -33001 -45172 8291 24649 41560 42245 8586 -3413 8517 2816 13667
2986 13667 27805 7686 -13062 -18359 -36526 -19604 22344 10934 1996 -8723 -22890 14306
2974 14306 6955 -11557 -11904 4211 -25274 -22921 -7281 -22195 -4281 795 -27556 -22437 -11199
2961 -11199 -31827 -34835 -13347 -32842 -29695 -17907 -10842 -4287 -14522 -3119 11217 7718 4160
2948 4160 -20310 -11680 -16224 -18514 -21539 -25430 -8559 -21798 -29832 -19791 -39246 -49661 -31788
2935c1788J6553Q757m355L5527J9104K2312m5512m6831P95O649j2763K9668K2690
2922B0806K1854j9993l0438J5783j0993j7133p596K8083j816n312J2373J7336
2910B2954J4305m6759K7285K3451k1424P603Q287J0049K831m2109O931N668j3598
2897E474P746K19J636l1530k425n516K7735M193J4512P069J771k8754L3233L4290
2883F9653n1599j0404K714L6584j400k5599J6827j889j3005J6469q942M122M0947
2870G4478J7241k5485o122n9280q311J0969O777M7321K48j696L4128K791K0362
2857A13421j6176L6022J2883k005M1493j1809K3434j5848l5792J7388o146l852
2845A53013k9074j832L1403n799L9237N816m8817r474L2302J5791J5522m751K062
$$ plain form
2935 -31788 -15235 -6478 -10833 24694 43798 66110 20598 -26233 -25438 -18789 -31552 -1884 20806
2922 20806 42660 22667 -7771 8012 -2981 -20114 -27710 373 -1443 -6755 5618 22954
2910 22954 37259 -9500 17785 41236 19812 27415 35702 45751 48582 6473 13404 19072 5474
2897 5474 13220 13439 15075 -16455 -18880 -24396 3339 7532 22044 29113 30884 2130 35363 69653
2883 69653 18054 7650 10364 46948 45548 19949 36776 34887 21882 38351 29409 33531 74478
2870 74478 91719 66234 60112 832 -7479 3490 10267 57588 57836 56140 90268 93059 113421
2857 113421 97245 133267 146150 144145 185638 173829 197263 181415 145623 163011 156865 153013
2845 153013 123939 122107 153510 147711 186948 192764 143947 134473 166775 182566 198088 193337 195399
2832A95399L9773K3808j4300O2912M97N25k945J6839O4128M7553J0352O1775L2112
2819E38428Q307O012k6348K909q62K230K5731p075J598Q705O6454L1782J3161
2806F71032P8932Q4522L8317Q6312R1556P3971Q6613J03927J59947J63260J96139
2795A834528J73601J78610K30254K98075L01418K83722J71023j6201j91074k86194
2785B977762l06903k66789k20226j69237j76666q2059o4462j1864k1512K9280
2775A687324L0515L8030N9985J12120Q8769J21645J06978J36391J95116K18933
2765B795806K42657K62082K79922L29725M26000M95744N36409N05347L75153n1163
2755F197682m16567o19280o51494n83187m78241m14002l22639k66702j79335j29837
$$ plain form
2832 195399 235172 258980 244680 307592 308089 308614 305669 322508 386636 434189 444541 506316 538428
2819 538428 546735 552747 526399 529308 528446 530676 556407 549332 550930 559635 626089 657871 671032
2806 671032 749964 834486 872803 959115 1050671 1124642 1211255 1315182 1475129 1638389 1834528
2795 1834528 2008129 2186739 2416993 2715068 3016486 3300208 3471231 3455030 3263956 2977762
2785 2977762 2670859 2404070 2183844 2014607 1837941 1755882 1691420 1679556 1658044 1687324
2775 1687324 1717839 1755869 1815854 1927974 2016743 2138388 2245366 2381757 2576873 2795806
2765 2795806 3038463 3300545 3580467 3910192 4336192 4831936 5368345 5873692 6248845 6197682
2755 6197682 5781115 5161835 4510341 3927154 3448913 3034911 2712272 2445570 2266235 2136398
2745B136398j10598j23588p2266m8614j5375j5674Q888p012L5513N4215N9949
2734A901836N1884Q9172J45987J04811J47896J68252J92524J96386K03637J48842
2724C351227K1638j92923l32778l12534l00175k91841k05349j84819j77989j09739
2714A264718j01972q3748p3535n1175n3823k8586m8152q116o3918m5396r219k4364
2702F72714l7752l3655j6193J522l906j744m8265o5665j882j1150M286l1471j3290
2689D13549m7320k0598j0240n118R547K0820k7161K4286k790m9667l1348K6494
2677C00454j6280N677k6016J2685p052r119J5397r362p580P100N460k8497L3768
2664B76635l4156j5924o960K1114L0364l1800L0398o950N959l455l2036l049K2412
$$ plain form
2745 2136398 2025800 1902212 1829946 1781332 1765957 1750283 1759171 1752159 1787672 1841887 1901836
2734 1901836 1953720 2042892 2188879 2293690 2441586 2609838 2802362 2998748 3202385 3351227
2724 3351227 3372865 3179942 2847164 2534630 2234455 1942614 1737265 1552446 1374457 1264718
2714 1264718 1162746 1078998 1005463 954288 900465 871879 823727 815611 751693 706297 697078 672714
2702 672714 634962 601307 585114 586636 582730 580986 532721 467056 465174 454024 458310 426839 413549
2689 413549 366229 345631 335391 330273 339820 360640 333479 357765 354975 305308 273960 300454
2677 300454 284174 289851 263835 276520 269468 260349 275746 266384 258804 265904 271364 242867 276635
2664 276635 242479 226555 219595 240709 271073 239273 269671 262721 268680 265225 233189 230140 252552
2651B52552J5151l5673K5661j0215K7469m6452r350J5143K8344J214l9543p805
2639B16496J3582K3917K1850j8316k3517j984J5826J8817n3423L8093J9412r487
2627B61266L9647M06K4084j0702j2238L0848K9500K2227J2314j7363N5044M1575
2615D76608N970j5848M7974K7272K3162n407L9L2239j5235l8717k2525J5988j9074
2602E12446n081l641j1368J7619J4799l6175p778pk1515k4572j7166K109N1793
2589D71463q880J3069l995J4804j0135J5600n101J3110K5780R978Q5361O2565
2577F83619n8195k8769k1139p7612l7709l0948m9091l9919k8577l674j424k3663
2565B82899k5802J9506k4102L650J2958J344l937l8278l6427J4064o574K392J5607
$$ plain form
2651 252552 267703 232030 257691 247476 274945 228493 219143 234286 262630 263844 224301 216496
2639 216496 230078 253995 275845 257529 234012 232028 247854 266671 213248 251341 270753 261266
2627 261266 300913 301319 325403 314701 302463 333311 362811 385038 397352 379989 435033 476608
2615 476608 482578 466730 514704 541976 565138 559731 559770 592009 576774 538057 515532 531520 512446
2602 512446 507365 503724 492356 509975 524774 488599 480821 480814 459299 434727 417561 419670 471463
2589 471463 462583 475652 471657 486461 476326 491926 486825 499935 525715 535693 621054 683619
2577 683619 625424 596655 575516 497904 460195 429247 380156 340237 311660 307986 306562 282899
2565 282899 257097 276603 252501 256151 269109 270453 266516 228238 191811 205875 199301 201693 217300
2552B17300j9014K9255K9919J7511j1593L6182K160Q295j0576k9273j9959k3917
2540B26290l5813j5284O662k4334k6053j643Q623j0081l0398j1395K4008j803
2528A08779l7715J1068M2887k6600k6574k6311j0125j4352J3178J4082J4719J6687
2516G9723q013R054l7146K963J1307j5084j8416l953j9724J3654K2276N576k3718
2503A8499L6320k3799l2155q344k715L4074l0899q247j2471k050L8955j5710J3937
2490E395r69q399N353L5986p680j7179J6363l356k1821r372k2061l265N3521j8668
2476C848k243j9290J14j224j5209J6416n36N7114k4908j2877J2275k014K0760
2463C2226O342o181k3482p081j176l984j4833M250j43j7852k2548k6474M9816
$$ plain form
2552 217300 198286 227541 257460 274971 263378 299560 301720 310015 299439 270166 250207 226290
2540 226290 190477 175193 181855 157521 131468 129825 138448 128367 97969 86574 110582 108779
2528 108779 71064 82132 125019 98419 71845 45534 35409 21057 34235 48317 63036 79723
2516 79723 71710 80764 43618 46581 57888 42804 24388 20435 711 14365 36641 42217 18499
2503 18499 54819 31020 -1135 -9479 -12194 21880 -9019 -17266 -29737 -31787 7168 -8542 5395
2490 5395 4426 -3973 1380 37366 29686 12507 28870 25514 3693 -5679 -27740 -31005 22516 3848
2476 3848 1605 -17685 -17571 -18795 -34004 -17588 -18124 38990 14082 1205 13480 11466 32226
2463 32226 38568 32387 8905 1824 648 -3336 -18169 -13919 -14062 -31914 -54462 -80936 -31120
2450c1120K6554j7473j4065P316j2725k0326J387K3448j58M19N5081l3307O032
2437h937J4251j3517m9454J4654o844J6076r56o316k5903o169q455j7125K0299
2424g8396K8684K1121l3315N875M308J8238q532k8036J4200q419j116P322K642
2411e5424l2727K2384M1302k0384K2785j6884m055J6048K4775l3322k7762K0438
2399d2826j0780k938o944P185J541K8908n7907R616K6996q94R199k0917l22n885
2385f5968j6300q872j717L0079N347J5651O949K0301p924j740o071l528j7747
2372e1540j5180J1467j7569O284k1893O231J7238L3939J2888K597j550k7639K591
2359d2136k5784J0543K7926l6419J0123P834N643j1023N0758k1068l0531l2057
$$ plain form
2450 -31120 -4566 -22039 -36104 -28788 -41513 -61839 -60452 -37004 -37162 -36743 18338 -14969 -8937
2437 -8937 5314 -8203 -57657 -43003 -49847 -33771 -34727 -41043 -66946 -73115 -81570 -98695 -78396
2424 -78396 -49712 -28591 -61906 -56031 -51723 -33485 -42017 -70053 -55853 -64272 -65388 -58066 -55424
2411 -55424 -88151 -65767 -24465 -44849 -22064 -38948 -43003 -26955 -2180 -35502 -63264 -42826
2399 -42826 -53606 -56544 -63488 -56303 -54762 -25854 -83761 -74145 -47149 -48043 -38844 -59761 -60083 -65968
2385 -65968 -82268 -91140 -92857 -62778 -57431 -41780 -34831 -14530 -22454 -24194 -30265 -33793 -51540
2372 -51540 -66720 -55253 -72822 -66538 -88431 -82200 -64962 -31023 -18135 -15538 -17088 -44727 -42136
2359 -42136 -67920 -57377 -29451 -65870 -55747 -47913 -42270 -53293 -2535 -23603 -54134 -86191
2347h6191J7236K0219J2442L5034j1204J4773l3512M494K2035r681r150J3288
2335a0217j5812j7353K6590n1071J2453L6297m630k6432J5532L1853j6610m1566
2323f0966J4568p082K9668J7211j5848j4280K5990j7998J727J4324j6703J4956
2311a4433m5640J4545Q358K55j0416J5708L4508j4649k9679J0400K7302R847p743
2298a637j0843j5093l2529L2063P324Q009k8072j780J954j7803L9805K2379o874
2285c097j749k2407K1578l299k1247J4790k7460J4293O295K6143j6828j9660j0183
2272d2831R41K8693k7968M252K6879m3463j3208K6917j6853J2425K7294J6218
2260g04p706J4514J8511n038N975m0594L964N054J4903k6114J6132r328l5682
$$ plain form
2347 -86191 -68955 -48736 -36294 -1260 -12464 2309 -31203 -26709 -4674 -14355 -23505 -10217
2335 -10217 -26029 -43382 -16792 -67863 -55410 -19113 -23743 -50175 -34643 -2790 -19400 -60966
2323 -60966 -46398 -53480 -23812 -6601 -22449 -36729 -10739 -28737 -27010 -12686 -29389 -14433
2311 -14433 -60073 -45528 -37170 -36915 -47331 -31623 2885 -11764 -41443 -31043 -3741 6106 -1637
2298 -1637 -12480 -27573 -60102 -28039 -20715 -12706 -40778 -42558 -40604 -58407 -18602 3777 -3097
2285 -3097 -4846 -27253 -5675 -8974 -30221 -15431 -42891 -28598 -22303 3840 -12988 -32648 -42831
2272 -42831 -41890 -13197 -41165 -36913 -10034 -53497 -66705 -39788 -56641 -44216 -16922 -704
2260 -704 -8410 6104 24615 19577 25552 -15042 -11078 -6024 8879 -17235 -1103 -10431 -46113
2247d6113j2372K7301p969o054m717L5120Q754R714j7112k0377Q884J1984o510
2234a9467K7024R694j2249q669k5111r644j3078l416J1866J7586j3520l663k2364
2221f5011j3429l463L3259K6494p48O829k3749j0539L5341j9466J288J3091l7569
2208e7672m59K9150O117j872k0521j9009J0664k348k5926J8618K0572j7593O611
2195e3668N270j5165J8089k923p033j6466j4542K2462J8812J7590l333j115O55
2182c1367m203m0031L762J5634j2302L1640K5400j4536m1279M6916O210o3649
2170g7805P145M6283J0476k0719l9779o610n344K4653j8333j2540j6430K7070
2158h1933q178J4640j349J4342L3763n2663k1706K876K1130L666K3564J3933l6357
$$ plain form
2247 -46113 -58485 -31184 -39153 -45207 -49924 -14804 -6050 3664 -13448 -33825 -24941 -12957 -19467
2234 -19467 7557 17251 5002 -3667 -28778 -38422 -51500 -54916 -43050 -25464 -38984 -42647 -65011
2221 -65011 -78440 -81903 -48644 -22150 -22898 -16069 -39818 -50357 -15016 -34482 -33194 -20103 -57672
2208 -57672 -58131 -28981 -22864 -24736 -45257 -64266 -53602 -55950 -81876 -63258 -42686 -60279 -53668
2195 -53668 -48398 -63563 -45474 -48397 -55430 -71896 -86438 -63976 -45164 -27574 -30907 -32022 -31367
2182 -31367 -35570 -75601 -71839 -56205 -68507 -36867 -11467 -26003 -67282 -20366 -14156 -77805
2170 -77805 -70660 -24377 -13901 -34620 -74399 -81009 -86353 -61700 -80033 -92573 -109003 -81933
2158 -81933 -90111 -75471 -76820 -62478 -28715 -81378 -103084 -100208 -79078 -75412 -51848 -37915 -74272
2145g4272L740K1755J6926J9675j7484k3830L1241k7074n150J9303j3895K7165
2133b1900n274k663j3275J7670j0430p179K9627k5186j3634k5648o482L1895J1279
2120d1200L544j2115j8431j6101J862r640L083M5594L7521l7024j6839K0359j7740
2107e7127k5501L6280J4281m1720L013m39K9203r236p247O584m623K0688J2018
2094b3826k2771r494k2485j448K1450N830K9359j1823R721j3906j1343K0367J0961
2081a9408j0526j1852l9492K9478L2177o283j02L54j4685M715P489J10j4838k704
2067d5567P998K259P40j3210j5134O409Q75r216j3584P056R884J3496r417r057
2053f6468p205K1703O132J144j0271K1908L154k1382j2945l8315K910J066J7283
$$ plain form
2145 -74272 -70532 -48777 -31851 -12176 -29660 -53490 -22249 -49323 -54473 -35170 -49065 -21900
2133 -21900 -27174 -29837 -43112 -25442 -35872 -43051 -13424 -38610 -52244 -77892 -84374 -52479 -41200
2120 -41200 -37656 -49771 -68202 -84303 -82441 -92081 -88998 -43404 -5883 -42907 -59746 -39387 -57127
2107 -57127 -82628 -46348 -32067 -73787 -70774 -71213 -42010 -51246 -58493 -51909 -56532 -35844 -23826
2094 -23826 -46597 -56091 -78576 -80024 -58574 -52744 -23385 -35208 -25487 -39393 -50736 -30369 -19408
2081 -19408 -29934 -41786 -81278 -51800 -19623 -25906 -26008 -25654 -40339 -35624 -28135 -28025 -42863 -45567
2067 -45567 -37569 -35310 -34570 -47780 -62914 -56505 -55630 -64846 -78430 -71374 -61490 -47994 -57411 -66468
2053 -66468 -73673 -51970 -45838 -44694 -54965 -33057 -29903 -51285 -64230 -102545 -99635 -98569 -81286
2040h1286J0605j8687J1257J7028J1189J9200n500L1333k1442q740k3738j2794
2028g1575J5883n121J1869J5727m585j0540j6500o190r778J5181k0764J6816M4428
2015b5149j441k3860k6074j9754L2587J131j5524L9665l510p523M91q9k6559L6836
2001c8773K0735J187j6592l5746k2895J2804P695J4610K2885j3769k27j4293N087
1988e7292j9779l78K0772Q318K7937K4851l1523j1181l151j5149J8987Q309K800
1975b6479m170j1279j7374J0103l7863P011L5314J7232J6335j3866k860j1758
1963c9654J2169l13o118l2237J932L1636j598J0955l6077j5511N6641j651k4915
1950d4741J400l0502j4037L0930J1407J4967J4154l096N480j7231j4345k0735
$$ plain form
2040 -81286 -70681 -89368 -78111 -61083 -49894 -30694 -36194 -4861 -26303 -35043 -58781 -71575
2028 -71575 -55692 -60813 -48944 -33217 -37802 -48342 -64842 -71032 -80810 -65629 -86393 -69577 -25149
2015 -25149 -26590 -50450 -76524 -96278 -63691 -62560 -78084 -38419 -41929 -49452 -48961 -49050 -75609 -38773
2001 -38773 -18038 -16851 -33443 -69189 -92084 -79280 -71585 -56975 -34090 -47859 -48086 -62379 -57292
1988 -57292 -77071 -77449 -56677 -48359 -20422 4429 -27094 -38275 -41426 -56575 -37588 -29279 -26479
1975 -26479 -30649 -41928 -59302 -49199 -87062 -80051 -44737 -27505 -11170 -25036 -27896 -39654
1963 -39654 -27485 -27798 -33916 -66153 -64221 -32585 -34183 -23228 -59305 -74816 -18175 -19826 -44741
1950 -44741 -43341 -73843 -87880 -56950 -45543 -30576 -16422 -19518 -14038 -31269 -45614 -66349
1938f6349o552J3424j151J8861O345J0578k58l0808L406K4789K769j0971L2255
1925c662L2965l9560o966L471l315j1196j209J0090J1573Q898l2235q427j3139
1912e2712k8406L7885J9037j6354K0628k193J5936k003j6839m0047p171L5993
1900c6246Q435J31P127K5739k5478o129l0807Q596K8183l9148N883K0530k9625
1887f2809J6949J702m596K5173p268j9398l229j1879O1680J689J877k9409l4669
1874f4187J6944o266J4604N147J9246l662N591o478j4740l2933q780j0184J7998
1861f7700K6928l8246K6340J3126j0502K3673k5009l682J1224K837L244N868l9
1848c1938k5094k077L8846l3238Q766J1481k3950K3192K3648j7995P912m131J0170
$$ plain form
1938 -66349 -72901 -59477 -60628 -41767 -35422 -24844 -25102 -55910 -52504 -27715 -24946 -35917 -3662
1925 -3662 29303 -10257 -17223 -13752 -17067 -28263 -29472 -19382 -7809 1089 -31146 -39573 -52712
1912 -52712 -81118 -43233 -24196 -40550 -19922 -22115 -6179 -8182 -25021 -65068 -72239 -36246
1900 -36246 -27811 -27680 -20553 5186 -20292 -26421 -57228 -48632 -20449 -59597 -53714 -33184 -62809
1887 -62809 -45860 -44158 -48754 -23581 -30849 -50247 -53476 -65355 -3675 -1986 -109 -29518 -64187
1874 -64187 -47243 -53509 -38905 -33758 -14512 -18174 -12583 -19061 -33801 -66734 -75514 -85698 -67700
1861 -67700 -40772 -79018 -52678 -39552 -50054 -26381 -51390 -55072 -43848 -41011 -37767 -31899 -31938
1848 -31938 -57032 -59109 -20263 -53501 -44735 -33254 -57204 -34012 -10364 -28359 -20447 -24578 -14408
1835a4408k4264Q814Q086N795j6249k4163J6126k287j4684k1094J1923J6195J8449
1822c1761j1374l5500K3424j2171L6903O860J3182K8259l0226l874r065J6688
1810h655j1144l3472J1085J7280j1681o447J1443q40j3243j5364k0394J0057P538
1797f3837L0063j7024p796J1025j0513l0125J0356K8986R764J8654L763K26m251
1784b0709k2189r106J3726K575k1878K4543L6552l8229J9967P42M75k8254m535
1771d6320L4003m551J4485j2533j1119j6811J1518J6319l9348j4506j1494K7616
1759e2741K5899J4761R224J4272J1781k1933j3927l2771M0908l432J1560m0659
1747c7058P423k497k3622M494K4698J7635K7607j6577J3470r19k1980r935K3096
$$ plain form
1835 -14408 -38672 -29858 -21772 -15977 -32226 -56389 -40263 -42550 -57234 -78328 -66405 -50210 -31761
1822 -31761 -43135 -78635 -55211 -67382 -30479 -23619 -10437 17822 -12404 -16278 -25343 -8655
1810 -8655 -19799 -53271 -42186 -24906 -36587 -43034 -31591 -32431 -45674 -61038 -81432 -71375 -63837
1797 -63837 -33774 -50798 -58594 -47569 -58082 -88207 -77851 -48865 -39101 -20447 -16684 -16458 -20709
1784 -20709 -42898 -52004 -38278 -35703 -57581 -33038 3514 -34715 -14748 -14006 -13531 -41785 -46320
1771 -46320 -12317 -16868 -2383 -14916 -26035 -42846 -31328 -15009 -54357 -68863 -80357 -52741
1759 -52741 -26842 -12081 -2857 11415 23196 1263 -12664 -45435 -4527 -7959 3601 -37058
1747 -37058 -29635 -32132 -55754 -51260 -26562 -8927 18680 2103 15573 14654 -7326 -17261 5835
1734E835N933j0625R502J3032j7500K3031l0379k1374N0433q518j4065j1173L9779
1721C3911k6752n793j6299o463k116j807o79J671j8254j074r211J2180J7103K8113
1707D530k1808k9184K5874P005n761K3125l3680j2190J9697o0L1104K832Q949
1694B0433m0865j7348P155O754j1733m061M3688j8054r174j3292J8558k067r099
1681b9105O7480n6932j5793q129n862L3008j2310N66q009J7300j1253j8916p996
1668e5951M9527n868P82M485j6944k0874L1397n59J24K293l47k5261j8319K6611
1654b8904K8218r378j733O314j7029J2250L032N963o327L0047k0130r142j2430
1641a9249M350l2350J2042L4053K5563m6370l683J6905J8339k4728J0304J0207
$$ plain form
1734 5835 11768 1143 10645 23677 6177 29208 -1171 -22545 27888 19370 5305 -5868 33911
1721 33911 7159 1366 -14933 -21396 -23512 -25319 -25998 -24327 -42581 -43655 -52866 -40686 -23583 4530
1707 4530 -17278 -46462 -20588 -13583 -19344 3781 -29899 -42089 -22392 -22452 8652 11484 20433
1694 20433 -20432 -37780 -30625 -23871 -35604 -39665 4023 -14031 -23205 -36497 -17939 -20006 -29105
1681 -29105 38375 -18557 -34350 -42479 -48341 -15333 -27643 -27077 -35086 -17786 -29039 -47955 -55951
1668 -55951 -6424 -12292 -11510 -7025 -23969 -44843 -13446 -14005 -13881 -11588 -11935 -37196 -55515 -28904
1654 -28904 -686 -10064 -11797 -5483 -22512 -10262 -7230 -1267 -7594 22453 2323 -6819 -19249
1641 -19249 -14899 -47249 -35207 -1154 24409 -21961 -25644 -8739 9600 -15128 -4824 5383
1629E383j3192K578L3823M486o640l4089k8679K8145m035Q503m9354K2800l465
1616c3736K8662J9327O693R877O647k7150m038q326n682R276p165J545j7816J8558
1602c328j2384l8198K8235Q195M3410j1495k9393K9848l6542J5898J1327m6315
1590d0742j2405K4578K1537Q760K1051r053p373l3333J4117j7368K8177j9402
1578b1456P553N2678r479j8228K3858r202N169J3188L686J9310j2363j602N904
1565E9016R997M404Q356j9700K34k9359j7512p920L4181L099q954r129n777L5739
1551E6675K6008m6704M619P208J0602k1348J1290N552J5980k1005j6940J7559
1539D9496M2124M7721l8082J6823l1454r045K4124J7093R491K0935l1603m2272
$$ plain form
1629 5383 -7809 -5231 28592 33078 26438 -7651 -36330 -8185 -12220 -3717 -53071 -30271 -33736
1616 -33736 -5074 14253 20946 30823 37470 10320 6282 -2044 -7726 1550 -5615 -4070 -21886 -3328
1602 -3328 -15712 -53910 -25675 -17480 25930 14435 -14958 14890 -21652 -5754 5573 -40742
1590 -40742 -53147 -28569 -7032 1728 22779 13726 6353 -26980 -12863 -30231 -2054 -21456
1578 -21456 -13903 38775 29296 11068 34926 25724 30893 44081 47767 67077 54714 53112 59016
1565 59016 69013 73417 81773 62073 62307 32948 15436 7516 41697 44796 35842 26713 20936 56675
1551 56675 82683 35979 40598 47806 58408 37060 48350 53902 69882 48877 31937 49496
1539 49496 91620 139341 101259 118082 86628 77583 101707 118800 128291 149226 117623 75351
1527G5351j896J0318K5247M394K7433R625j54m705p792j312K3831r178O951N254
1513A63367P602l247K1792R837J5572M8421K744K0167L5931N449K919O806M2616
1500C79976L5250K86K8216N6163O2836M9954Q355O4352N4533N205M9749P1716
1488H66591M3045R0249P5460J19498J39941J07636J37392J23428J63663J66309
1478B033212K15522K04800J76953J83337K67815K99807L26442M38844N02866N22733
1468E172331N62847P20340Q36005Q21124O33823O2782o90735j004223j014767
1459F099527r44630q15121o23323m90681l82286l07388k51457j97626j62757j42755
1449A781503j02193q0180j25828r9591j14726q9576j05852n7988p8176o7789n1626
$$ plain form
1527 75351 73455 83773 109020 113414 140847 150472 150318 145613 137821 136509 160340 151162 158113 163367
1513 163367 170969 167722 189514 199351 214923 263344 266088 286255 322186 327635 330554 337360 379976
1500 379976 415226 415512 443728 499891 562727 612681 621036 685388 739921 745126 794875 866591
1488 866591 909636 999885 1075345 1194843 1334784 1442420 1579812 1703240 1866903 2033212
1478 2033212 2248734 2453534 2630487 2813824 3081639 3381446 3707888 4146732 4649598 5172331
1468 5172331 5735178 6455518 7291523 8112647 8746470 8809252 8118517 7114294 6099527
1459 6099527 5154897 4339776 3716453 3225772 2843486 2536098 2284641 2087015 1924258 1781503
1449 1781503 1679310 1599130 1473302 1373711 1258985 1169409 1063557 1005569 927393 859604 807978
1438H07978o388l7956p690l1524n4195l5839k3811o8886q182J4718J3k3474n8420
1425D66344k6858l499l9157L669K9692j3861R68k9195j6017O032n491k8801N158
1412C48984j0919l5625N319p803K5607k984l6414J6376k6474J303k4468j7234
1400B35668o366m0498l1337M037K38j9729J0310j4908L6622L7016J181l6253j2417
1387A63564o991l0044K5531q491k6875O384j2648j2130J7957j6369J2123K426
1375A14437p763j9697O514n078j8111M5804L712k9181j5168j3208J4798K7154
1363A04213r204j4223K3821k8977j9988L7077L6559m7016k9254p797M9596P154
1351A01961k6710j6918j2225m302K3326j8919K9334J347n5296k2J3966K1870J4585
$$ plain form
1438 807978 801590 763634 755944 724420 670225 634386 610575 541689 533507 548225 548238 524764 466344
1425 466344 439486 435987 396830 400499 430191 416330 417298 388103 372086 378118 372627 343826 348984
1412 348984 338065 302440 307759 299956 325563 322579 286165 302541 276067 277370 252902 235668
1400 235668 229302 188804 157467 161504 161742 142013 152323 137415 174037 211053 212234 175981 163564
1387 163564 156573 126529 152060 143569 116694 123078 110430 98300 116257 99888 112011 114437
1375 114437 106674 86977 93491 88413 70302 116106 119818 90637 75469 62261 77059 104213
1363 104213 95009 80786 104607 75630 55642 92719 129278 82262 53008 45211 94807 101961
1351 101961 75251 58333 46108 41806 65132 46213 75547 76894 21598 21576 35542 57412 71997
$$ [...]
##END NTUPLES=NMR SPECTRUM
##END=
