##TITLE=1H_CA-9266-1
 CDCl3
 8 sc, 
 6.5.2024
##JCAMPDX= 6.0         $$ Bruker NMR JCAMP-DX V2.0
##DATA TYPE= NMR SPECTRUM
##DATA CLASS= NTUPLES
##ORIGIN= UXNMR, Bruker Analytische Messtechnik GmbH
##OWNER= root
$$ XWIN-NMR		Version 3.5
$$ Mon May  6 15:37:23 2024 Russian Standard Time (UT+4h)  she@DPX200
##.OBSERVE FREQUENCY= 200.1309
##.OBSERVE NUCLEUS= ^1H
##.ACQUISITION MODE= SIMULTANEOUS
##.ACQUISITION SCHEME= undefined
##.AVERAGES= 8
##.DIGITISER RES= 18
##SPECTROMETER/DATA SYSTEM= spect
##.PULSE SEQUENCE= zg30
##.SOLVENT NAME= CDCl3
##.SHIFT REFERENCE= (INTERNAL, CDCl3, 0, 16.4433)
##AUDIT TRAIL= $$ (NUMBER, WHEN, WHO, WHERE, WHAT)
$$ ##TITLE= Audit trail, XWIN-NMR		Version 3.5
$$ ##JCAMPDX= 5.01
$$ ##ORIGIN= Bruker BioSpin GmbH
$$ ##OWNER= she
$$ F:/spectra/data/she/nmr/H-F/1/pdata/1/auditp.txt
$$ ##AUDIT TRAIL=  $$ (NUMBER, WHEN, WHO, WHERE, WHAT)
(   1,<2024-05-06 15:36:11.34 +0400>,<she>,<DPX200>,
      <created by zg, POWCHK disabled, PULCHK disabled
       configuration hash MD5:
       00 E9 B6 7A A2 85 ED C7 34 08 36 98 17 FE 4E 26
       data hash MD5: 16K
       7B 7F 96 95 A1 7F F1 D2 83 3A 1B A1 E1 5F 28 2E>)
(   2,<2024-05-06 15:36:13.79 +0400>,<she>,<DPX200>,
      <Start of raw data processing
       efp BC_mod = 2 LB = 0.24 FT_mod = 6 PKNL = 1 PHC0 = -25380.18 PHC1 = 10.78749 SI = 16K 
       data hash MD5: 16K
       0E 28 BF B0 B1 6D 57 15 13 D6 7F AF 6D FD D9 36>)
(   3,<2024-05-06 15:36:27.42 +0400>,<she>,<DPX200>,
      <pk PHC0 = 76.11007 PHC1 = 8 
       data hash MD5: 16K
       8E 38 BA 22 DC 4C E2 BA B8 C7 87 80 E6 B1 46 99>)
(   4,<2024-05-06 15:36:31.04 +0400>,<she>,<DPX200>,
      <abs ABSG = 5 
       data hash MD5: 16K
       76 BA AA 12 6B 13 1F FA 1F D9 7D 06 60 00 2B 8D>)
$$ ##END=
$$ 
$$ hash MD5
$$ BE 20 47 26 87 1B 17 F3 B1 77 31 30 EF 23 16 87
##$RELAX= 
##$RELAX= 
##$RELAX= 
##$RELAX= 
##$RELAX= 
##$RELAX= 
$$ Bruker specific parameters
$$ --------------------------
##$DU= <F:/spectra>
##$EXPNO= 1
##$NAME= <H-F>
##$PROCNO= 1
##$TYPE= <nmr>
##$USER= <she>
##$AMP= (0..31)
100 100 100 100 100 100 100 100 100 100 100 100 100 100 100 100 100 100 
100 100 100 100 100 100 100 100 100 100 100 100 100 100 
##$AQSEQ= 0
##$AQ_mod= 1
##$AUNM= <au_zg>
##$AUTOPOS= <>
##$BF1= 200.13
##$BF2= 200.13
##$BF3= 200.13
##$BF4= 200.13
##$BF5= 200.13
##$BF6= 200.13
##$BF7= 200.13
##$BF8= 200.13
##$BYTORDA= 1
##$CFDGTYP= 0
##$CFRGTYP= 5
##$CHEMSTR= <none>
##$CNST= (0..31)
1 1 145 1 1 1 1 1 1 1 1 1 1 1 1 1 1 1 1 1 1 1 1 1 1 1 1 1 1 1 1 1 
##$CPDPRG= <>
##$CPDPRG1= <>
##$CPDPRG2= <>
##$CPDPRG3= <>
##$CPDPRG4= <mlev>
##$CPDPRG5= <mlev>
##$CPDPRG6= <mlev>
##$CPDPRG7= <mlev>
##$CPDPRG8= <mlev>
##$CPDPRGB= <>
##$CPDPRGT= <>
##$D= (0..31)
0 1.2 0 0 0 0 0 0 0 0.06 0 0.03 0 0 0 0 0.0002 0 0 0 0 0 0 0 0 0 0 0 0 
0 0 0 
##$DATE= 1714995370
##$DBL= (0..7)
120 120 120 120 120 120 120 120 
##$DBP= (0..7)
150 150 150 150 150 150 150 150 
##$DBP07= 0
##$DBPNAM0= <>
##$DBPNAM1= <>
##$DBPNAM2= <>
##$DBPNAM3= <>
##$DBPNAM4= <>
##$DBPNAM5= <>
$$ [...]
##$SUBNAM3= <"">
##$SUBNAM4= <"">
##$SUBNAM5= <"">
##$SUBNAM6= <"">
##$SUBNAM7= <"">
##$SUBNAM8= <"">
##$SUBNAM9= <"">
##$SW= 18.0517689322627
##$SWIBOX= (0..15)
0 0 2 0 0 0 0 0 0 0 0 0 0 0 0 0 
##$SW_h= 3612.71676300578
##$TD= 16384
##$TD0= 1
##$TE= 0
##$TE2= 300
##$TE3= 300
##$TEG= 300
##$TL= (0..7)
0 120 120 120 120 120 120 120 
##$TP= (0..7)
150 150 150 150 150 150 150 150 
##$TP07= 0
##$TPNAME0= <>
##$TPNAME1= <>
##$TPNAME2= <>
##$TPNAME3= <>
##$TPNAME4= <>
##$TPNAME5= <>
##$TPNAME6= <>
##$TPNAME7= <>
##$TPOAL= (0..7)
0.5 0.5 0.5 0.5 0.5 0.5 0.5 0.5 
##$TPOFFS= (0..7)
0 0 0 0 0 0 0 0 
##$TUNHIN= 0
##$TUNHOUT= 0
##$TUNXOUT= 0
##$USERA1= <user>
##$USERA2= <user>
##$USERA3= <user>
##$USERA4= <user>
##$USERA5= <user>
##$V9= 5
##$VALIST= <valist>
##$VCLIST= <CCCCCCCCCCCCCCC>
##$VD= 0
##$VDLIST= <DDDDDDDDDDDDDDD>
##$VPLIST= <PPPPPPPPPPPPPPP>
##$VTLIST= <TTTTTTTTTTTTTTT>
##$WBST= 1024
##$WBSW= 4
##$XGAIN= (0..3)
0 0 0 0 
##$XL= 0
##$YL= 0
##$YMAX_a= 326129
##$YMIN_a= -443817
##$ZGOPTNS= <>
##$ZL1= 120
##$ZL2= 120
##$ZL3= 120
##$ZL4= 120
##$ABSF1= 16.46311
##$ABSF2= -1.588793
##$ABSG= 5
##$ABSL= 3
##$ALPHA= 0
##$AQORDER= 0
##$ASSFAC= 0
##$ASSFACI= 0
##$ASSFACX= 0
##$ASSWID= 0
##$AUNMP= <proc_1d>
##$AZFE= 0.1
##$AZFW= 0.1
##$BCFW= 0
##$BC_mod= 2
##$BYTORDP= 0
##$COROFFS= 0
##$CY= -3
##$DATMOD= 1
##$DC= 0
##$DFILT= <>
##$DTYPP= 0
##$F1P= 0
##$F2P= 0
##$FCOR= 1
##$FTSIZE= 16384
##$FT_mod= 6
##$GAMMA= 0
##$GB= 0
##$INTBC= 1
##$INTSCL= 3.70164e-10
##$ISEN= 128
##$LB= 0.24
##$LEV0= 0
##$LPBIN= 0
##$MAXI= 10000
##$MC2= 0
##$MEAN= 0
##$ME_mod= 0
##$MI= 1.114404
##$NCOEF= 0
##$NC_proc= -5
##$NLEV= 6
##$NOISF1= 3.799351
##$NOISF2= 2.8
##$NSP= 0
##$NTH_PI= 0
##$NZP= 0
##$OFFSET= 16.44327
##$PC= 1
##$PHC0= -25304.07
##$PHC1= 18.78749
##$PH_mod= 1
##$PKNL= yes
##$PPARMOD= 0
##$PSCAL= 0
##$PSIGN= 0
##$REVERSE= no
##$SF= 200.129415575803
##$SI= 16384
##$SIGF1= 3
##$SIGF2= 2
##$SINO= 5.538805
##$SIOLD= 16384
##$SREGLST= <1H.CDCl3>
##$SSB= 0
##$STSI= 16384
##$STSR= 0
##$SW_p= 3612.71676300577
##$SYMM= 0
##$S_DEV= 0
##$TDeff= 16384
##$TDoff= 0
##$TI= <>
##$TILT= no
##$TM1= 0
##$TM2= 0
##$TOPLEV= 0
##$USERP1= <user>
##$USERP2= <user>
##$USERP3= <user>
##$USERP4= <user>
##$USERP5= <user>
##$WDW= 1
##$XDIM= 16384
##$YMAX_p= 379321668
##$YMIN_p= -1180148
$$ End of Bruker specific parameters
$$ ---------------------------------
##NTUPLES= NMR SPECTRUM
##VAR_NAME=  FREQUENCY,     SPECTRUM/REAL,   SPECTRUM/IMAG
##SYMBOL=    X,             R,               I
##VAR_TYPE=  INDEPENDENT,   DEPENDENT,       DEPENDENT
##VAR_FORM=  AFFN,          ASDF,            ASDF
##VAR_DIM=   16384,         16384,           16384
##UNITS=     HZ,            ARBITRARY UNITS, ARBITRARY UNITS
##FACTOR=    0.220516191357247, 1,           1
##FIRST=     3290.78196114299, 0,            0
##LAST=      -321.934801862777, 0,           0
##MIN=       -321.934801862777, -1180148,    0
##MAX=       3290.78196114299, 379321668,    0
$$ Real data points
##PAGE= N=1
##DATA TABLE= (X++(R..R)), XYDATA
$$ [...]
7595G6656K5435l360o1190O890k0843p823Q698j4098J0791J0840j2639l317J0959
$$ 76656 102091 98731 37541 44431 23588 15765 24463 10365 21156 31996 19357 16040 26999
7582B6999J3867o165k2691j8886K9060K4210o7994l826N6924j5753n4522L1717
$$ 26999 40866 34701 12010 -6876 22184 46394 -21600 -25426 31498 15745 -38777 -7060
7570g060J2524m2813J836k4542l549N3419n4844K1719N063J0023k9841J254J6389
$$ -7060 5464 -37349 -35513 -60055 -63604 -10185 -65029 -43310 -38247 -28224 -58065 -56811 -40422
7557d0422j8002j6707N6787L5864p764m2265K6375r239l699O381l0639k765p6938
$$ -40422 -58424 -75131 -18344 17520 9756 -32509 -6134 -15373 -19072 -12691 -43330 -46095 -123033
7544a23033l2956Q9977P212j1481r148k5691N4173K9670l2098n6935J3297J0967
$$ -123033 -155989 -66012 -58800 -70281 -79429 -105120 -50947 -21277 -53375 -110310 -97013 -86046
7532h6046K7401o883J9455L9950m5793j856K9180L2130k9885p037J1011m2468
$$ -86046 -58645 -65528 -46073 -6123 -51916 -53772 -24592 7538 -22347 -29384 -18373 -60841
7520f0841n4222l777L6646n16L3192R304j7975O105K1084R030m0556K291l3668
$$ -60841 -115063 -118840 -82194 -82710 -49518 -40214 -58189 -52084 -31000 -21970 -62526 -60235 -93903
7507i3903O0103M7452k3233m2506M0095K8585k6742m9579K4268L1202l9914q808
$$ -93903 -33800 13652 -9581 -52087 -11992 16593 -10149 -59728 -35460 -4258 -44172 -52980
7495e2980k8622m2748M2721R538l3404Q1057n6364K5502Q525Q7939k9761j12603
$$ -52980 -81602 -124350 -81629 -72091 -105495 -24438 -80802 -55300 -46775 41164 11403 -101200
7483a01200R367J1619M16L7099L1795k9207P668m4178j1569M8047L3784l3752
$$ -101200 -91833 -80214 -79798 -42699 -10904 -40111 -32443 -76621 -88190 -40143 -6359 -40111
7471d0111J3495N867q665l0736j4124K3044P4965l0290o5695M3467n8914K2748
$$ -40111 -26616 -20749 -29414 -60150 -74274 -51230 23735 -6555 -72250 -28783 -87697 -64949
7459f4949J9875l81L6094K4092L4754o9772k6101m4342P730p305O5855p786p5059
$$ -64949 -45074 -45455 -9361 14731 49485 -20287 -46388 -90730 -83000 -90305 -24450 -32236 -107295
7446a07295L1085M3304p558K5493l8005M47K3160l0362o220L774L4866J6487P1433
$$ -107295 -76210 -32906 -40464 -14971 -52976 -52529 -29369 -59731 -65951 -62177 -27311 -10824 60609
7433F0609m4175K5939p71k1198n7009J9183q444L2026l5588K2936J415l7921k5726
$$ 60609 16434 42373 41602 20404 -36605 -17422 -25866 6160 -29428 -6492 -5077 -42998 -68724
7420f8724J7925J6945M391j4852j7730K0998K5982O405k052m0609n17J1270q265
$$ -68724 -50799 -33854 -29463 -44315 -62045 -41047 -15065 -8660 -10712 -51321 -51838 -40568 -48833
7407d8833J8121L0593o931n2491q751J4160r111L216M3429n1503l6652k5749M4069
$$ -48833 -30712 -119 -7050 -59541 -68292 -54132 -63243 -60027 -16598 -68101 -104753 -130502 -86433
7394h6433P7090O989R771M873K4228k4052q2884R430M9637k4025k1918M6972J0409
$$ -86433 -9343 -2354 7417 12290 36518 12466 -70418 -60988 -11351 -35376 -57294 -10322 87
7381H7K7418J5088m3089Q63j3173m4500M5741P970L4059j5815l8347k6624L385
$$ 87 27505 42593 -496 367 -12806 -57306 -11565 -3595 30464 14649 -23698 -50322 -46937
7368d6937o081p854P118O0203j777j5839j2301J8146L2424o9522K6198K631j0401
$$ -46937 -53018 -60872 -53754 6449 4672 -11167 -23468 -5322 27102 -42420 -16222 -13591 -23992
7355b3992K615j5727N0290j6025j7056q0681M4067L996j5151L8934L444J7076
$$ -23992 -21377 -37104 13186 -2839 -19895 -100576 -56509 -52513 -67664 -28730 -25286 -8210
7343h210J6489N386p47J8480o669k9892n628j2909m365J6135m615J7315J920j6054
$$ -8210 8279 13665 12918 31398 24729 -5163 -10791 -23700 -28065 -11930 -16545 770 2690 -13364
7329a3364q389P4062l6751l7319K5255O8145J4746J8492L8631l096m1553m3962
$$ -13364 -21753 52309 15558 -21761 3494 71639 86385 104877 143508 140412 98859 54897
7317E4897N0383k0759k2143R700n1281K480k4559J5719j2266m4365L8391O976
$$ 54897 105280 84521 62378 72078 20797 23277 -1282 14437 2171 -42194 -3803 3173
7305C173j0153n4767j3577L4792P1069j8346j0437K5883K1831m3904o0090M7233
$$ 3173 -6980 -61747 -75324 -40532 30537 12191 1754 27637 49468 5564 -54526 -7293
7293g293J4146l2018j9434L2776L1600K59n4515M2672L6473l9658m4522o666K1915
$$ -7293 6853 -25165 -44599 -11823 19777 20036 -34479 8193 44666 5008 -39514 -46180 -24265
7280b4265J7629m0790J3542J0922l4786J9272j1870q051K3902J887J8661J0713
$$ -24265 -6636 -47426 -33884 -22962 -57748 -38476 -50346 -58397 -34495 -32608 -13947 -3234
7268c234j3778L9557n2602j5695L3530J295L7218k6063l2571M259J6030k925n4617
$$ -3234 -17012 22545 -30057 -45752 -12222 -10927 26291 228 -32343 -28084 -12054 -14979 -69596
7255f9596k480p453l760R1653J0258m8004j7643L4747l0128K5658l391j6124Q852
$$ -69596 -72076 -79529 -83289 8364 18622 -29382 -47025 -12278 -42406 -16748 -20139 -36263 -27411
7242b7411k7028K0416J7154k0382J4056J6593n6940N199O5492m468m8722K4994
$$ -27411 -54439 -34023 -16869 -37251 -23195 -6602 -63542 -58343 7149 2681 -46041 -21047
7230b1047j1070K1939j2677K285K0633J5850j8738m769J6238m378q0549K193K5906
$$ -21047 -32117 -10178 -22855 -20570 63 15913 -2825 -7594 8644 4266 -76283 -74090 -48184
7217d8184L5151K4813j3779K174k1694p423N7043q734l4921j4887l7737K4834
$$ -48184 -13033 11780 -1999 175 -21519 -28942 28101 19367 -15554 -30441 -68178 -43344
7205d3344L9238l3282n992m271l1633K9835K0110j321J3315m1992k2363O8717
$$ -43344 -4106 -37388 -43380 -47651 -79284 -49449 -29339 -30660 -17345 -59337 -81700 -12983
7193a2983j321K1462j178J5892p4182m297q261N2687J8694N638K194j3254k1537
$$ -12983 -14304 7158 5980 21872 -52310 -56607 -64868 -12181 6513 12151 14345 1091 -20446
7180b0446m3457M8667k7289j0946L6080K8222L0162k5371k4267K8212K4548j9132
$$ -20446 -63903 -15236 -42525 -53471 -17391 10831 40993 15622 -8645 19567 44115 24983
7168B4983l6710M1087K087m9637K973Q53M461L0039l362L4233l2832Q99K5031
$$ 24983 -11727 29360 31447 -18190 -15217 -14364 -9903 20136 16774 51007 18175 19074 44105
7155D4105k54J8925o0436L2544m0582m3971L6448k9346M2353J3296r39m1403J9692
$$ 44105 43851 62776 2340 34884 -5698 -49669 -13221 -42567 -214 13082 12143 -29260 -9568
7142i568J2682j5496N296K496k2867J0926J0149K296k9010m8086R2906K907l4472
$$ -9568 3114 -12382 -7086 -4590 -27457 -16531 -6382 -4086 -33096 -81182 11724 14631 -19841
7129a9841L5118o0625p43P0950n102J3644m3976j5177K6362K670j6124K3760j532
$$ -19841 15277 -45348 -46091 24859 19757 33401 -10575 -25752 610 3280 -12844 10916 9384
7116I384K0695k3177K9855L466n346k1739k2260j2605O528J2969L0333k0496J710
$$ 9384 30079 6902 36757 40223 34877 13138 -9122 -21727 -15199 -2230 28103 7607 9317
7103I317r504j2284M3473n3827L9215J7866o208m2055N872O7511M5752m6384o3592
$$ 9317 -187 -12471 31002 -22825 16390 34256 28048 -14007 -8135 59376 105128 58744 -4848
7090d848m885M278o577J7337j0343L5795L5481m485J0944k2467l6707K9027j9359
$$ -4848 -9733 -5455 -12032 5305 -5038 30757 66238 61753 72697 50230 13523 42550 23191
7077B3191j165m6602L2037l864n4090J9070M5540M2966J2034m3340l504L7683
$$ 23191 22026 -24576 7461 3597 -50493 -31423 14117 57083 69117 25777 22273 59956
7065E9956j0651k3888q834J0772m0842N7520Q389q152q073o5465k5584O009J5126
$$ 59956 49305 25417 16583 27355 -13487 44033 52422 44270 36197 -29268 -54852 -48843 -33717
7052c3717N518n1832l0207J8519J3449J5226J9134n208j897j2631j2268N123M1206
$$ -33717 -28199 -80031 -110238 -91719 -78270 -63044 -43910 -49118 -51015 -63646 -75914 -70791 -29585
7039b9585j3980l9075R213M5100P1850q75K2834m7898m3880k2473O0086N7160
$$ -29585 -43565 -82640 -73427 -28327 43523 42648 65482 17584 -26296 -48769 11317 68477
7027F8477k4386n4703r878R199L822n912M929l1530j9111J3079p09N6486m4545
$$ 68477 44091 -10612 -20490 -11291 -7469 -13381 -8452 -39982 -59093 -46014 -46723 9763 -34782
7014c4782M5208l4816r268R701J0012L2375k9964L2348k25k996k4879k3872l3615
$$ -34782 10426 -24390 -33658 -23957 -13945 18430 -11534 20814 20589 17593 -7286 -31158 -64773
7001f4773L2640J1523N108P8480l5823k5188k2734m6972M8528L4532k5025K877
$$ -64773 -32133 -20610 -15502 62978 27155 1967 -20767 -67739 -19211 15321 -9704 -6827
6989f827j5747R903m3476L5836j9133L3791J039K1802k0466l3032N5952q376L8912
$$ -6827 -22574 -12671 -56147 -20311 -39444 -5653 -4614 17188 -3278 -36310 19642 11266 50178
6976E0178n9623M9817K4722m647k6429K480k8699l119L1527l7946j7578J6689
$$ 50178 -9445 40372 65094 60447 34018 36498 7799 4680 36207 -1739 -19317 -2628
6964b628l3354q410N757k7996K511L5412K615k4068M5400j1702J0144n2729Q614
$$ -2628 -35982 -44392 -38635 -66631 -64120 -28708 -26093 -50161 -4761 -16463 -6319 -59048 -50434
6951e0434O4202L8149j2178r56k508p7635L4571L014k2893j0206l991J1212L0178
$$ -50434 13768 51917 39739 38783 36275 -41360 -6789 -3775 -26668 -36874 -40865 -29653 525
6938E25k5297K6129P544l1663j5835N6526j2242q478k8257j5132P2948K7555l5834
$$ 525 -24772 1357 8901 -22762 -38597 17929 5687 -2791 -31048 -46180 26768 54323 18489
6925A8489m552J2853r652L4521l910K7373n957m0443L1680J416l4767k1826l1779
$$ 18489 13937 26790 17138 51659 47749 75122 69165 28722 60402 61818 27051 5225 -26554
6912b6554K3374j8192N9465j3416m4906K8092r5k4479m9663m2288O4559L0227
$$ -26554 -3180 -21372 38093 24677 -20229 7863 7768 -16711 -66374 -108662 -44103 -13876
6900a3876J2842L5208n373p098n645n1430J4985K9741J2177m439j5752Q981J6713
$$ -13876 -1034 34174 28801 21703 16058 -35372 -20387 9354 21531 17092 1340 10321 27034
6887B7034r229l6375k4326L801J9178J263L275J5114J242j7807l4262K2138p406
$$ 27034 17805 -18570 -42896 -39095 -19917 -18654 -15379 -265 977 -16830 -51092 -28954 -36360
6874c6360K168r107K7979k4806J330K0169m626K217l7173L0551K1209m496M0886
$$ -36360 -34192 -43299 -15320 -40126 -38796 -18627 -23253 -21036 -58209 -27658 -6449 -10945 29941
6861B9941l027O160l3917k3818j6439K5570L5269k8397k158j5782L6065r496J6629
$$ 29941 26914 33074 -843 -24661 -41100 -15530 19739 -8658 -10816 -26598 9467 -29 16600
6848A6600k990J8253J2021j3485j7694J5666r283K1616l1574O2605J237n607j2115
$$ 16600 13610 31863 43884 30399 12705 28371 19088 40704 9130 71735 72972 67365 55250
6835E5250L9386j0233m5696n3305K5677L0772k2032J0825k4285k0029l1174j4001
$$ 55250 94636 84403 38707 -14598 11079 41851 19819 30644 6359 -13670 -44844 -58845
6823e8845N1120L6295O3507m1645k1719L3467j5705K7711l376j804j821r897j273
$$ -58845 -7725 28570 92077 50432 28713 62180 46475 74186 70810 69006 67185 57288 56015
6810E6015k2354l8425J728K2286N7925J2092o521l5278R78M2383k6519l8852r720
$$ 56015 33661 -4764 -3036 19250 77175 89267 82746 47468 48446 90829 64310 25458 15738
6797A5738k5782L2280j906k0735o0943M1494J9524J2420J6687j9562j6704K8038
$$ 15738 -10044 22236 20330 -405 -61348 -19854 -330 12090 28777 9215 -7489 20549
6785B0549J5272j4774k9646K91M8093K3731k9566j8704m0344p115O2562n1022
$$ 20549 35821 21047 -8599 -8308 39785 63516 33950 15246 -25098 -32213 30349 -20673
6773b0673n408L9685k4329j0286J1966j0172K7124M5665K0706p1338J0729j2972
$$ -20673 -26081 13604 -10725 -21011 -9045 -19217 7907 53572 74278 2940 13669 697
6761F97J1975j8413k8623L31l461r351K7114N2621j0004M2002l6120l9888J5141
$$ 697 12672 -5741 -34364 -34033 -37494 -46845 -19731 32890 22886 64888 28768 -11120 4021
6748D021K2820J9816o323j15845L6996j1576J1058L1688P020J7537L524k2983
$$ 4021 26841 46657 40334 -75511 -38515 -50091 -39033 -7345 -325 17212 20736 -2247
6736b247p844J6706j3485K683K3917K7602m8358N0871J5505n369Q638k2765j2012
$$ -2247 -10091 6615 -6870 -4187 19730 47332 -1026 49845 65350 59981 68619 45854 33842
6723C3842Q565M644l5167l3739K6926L1408J468J9376r055K4768l3620l3356L2054
$$ 33842 42407 47051 11884 -21855 5071 36479 37947 57323 48268 73036 39416 6060 38114
6710C8114M5316q34m7569N8009K2278n7937l9090Q495n1507J1852K8350J1307
$$ 38114 83430 82596 35027 93036 115314 57377 18287 26782 -24725 -12873 15477 26784
6698B6784L4479j148m3392n5476L3237j0819m461J6363M1780k504j8151J8538
$$ 26784 61263 60115 16723 -38753 -5516 -16335 -20796 -4433 37347 34843 16692 35230
6686C5230J03l5745L2447L3217n201K36m3506k5536j118j2878Q277N1223P2265
$$ 35230 35333 -412 32035 65252 60051 60287 16781 -8755 -9873 -22751 -14474 36749 109014
6673A09014j02250k5508P3535N266l0462K8657K5273l4430o2008m727J959K3039
$$ 109014 6764 -18744 54791 60057 29595 58252 83525 49095 -12913 -17640 -15681 7358
6661G358K7871m708M9843r478K7502N101j3145o632l6069m0709P0613p9184Q260
$$ 7358 35229 30521 80364 70886 98388 103489 90344 83712 47643 6934 77547 -1637 6623
6648F623K5250K4682k2135j4134M3710l1114n0001K8620j3287L4000K1450m0747
$$ 6623 31873 56555 34420 20286 63996 32882 -17119 11501 -1786 32214 53664 12917
6636A2917k5264q041M6987J4406j3266k0313N236J1904m2808K3365J2619m7264
$$ 12917 -12347 -20388 26599 41005 27739 7426 12662 24566 -18242 5123 17742 -29522
6624b9522J2392L2650L179j0938O932l9328L2702M3326N811p7181R702M4430J7381
$$ -29522 -17130 15520 18699 7761 14693 -24635 8067 51393 57204 -19977 -10275 34155 51536
6611E1536J461L218m434j8894J7312q601O015K1328k7255k5940K8999J2228j9030
$$ 51536 52997 56215 51781 32887 50199 41598 47613 68941 41686 15746 44745 56973 37943
6598C7943m096L1070r235R067M872n3282K6340M4042j1853n713J2843m616r893
$$ 37943 33847 64917 55682 64749 69621 16339 42679 86721 74868 69155 81998 77382 67489
6585F7489o2451J2985P065m336K4284K5309j9529j4406L7154q3759L9617j4262
$$ 67489 5038 18023 25088 20752 45036 70345 50816 36410 73564 -10195 29422 15160
6573A5160K6253K2025n9755O9576k7807J1999J7217R665k0193k1014k18Q907k622
$$ 15160 41413 63438 3683 73259 45452 57451 74668 84333 64140 43126 42908 51815 49193
6560D9193L8632K0007J5443M648m0672j6476r082j3293J8548j0185j5550L3422
$$ 49193 87825 107832 123275 127923 87251 70775 61693 48400 66948 56763 41213 74635
6548G4635n8k4240q019K5554m2354l9722L437K6550O721N5639M9025q2114j2492
$$ 74635 74577 50337 42318 67872 25518 -14204 -10767 15783 22504 78143 127168 45054 32562
6535C2562o355n7931P6835l0856L91L7172l9037J2324J5506J6012K0466q151N1562
$$ 32562 26207 -31724 45111 14255 14646 51818 12781 25105 40611 56623 77089 68938 120500
6522A20500k7250k4828K668k6321N0323j8091l1116j2178M1419k8462n582N2802
$$ 120500 93250 68422 71090 44769 95092 77001 45885 33707 75126 46664 41082 93884
6510I3884n8851M6778l6050N835j072n071J3757k3998N1593q7467j1064J2856
$$ 93884 35033 81811 45761 51596 50524 45453 59210 35212 86805 -662 -11726 1130
6498A130J244J704L7645K6069k87j5134n00J069J4169l1034M7798K3114m3995
$$ 1130 2374 4078 41723 67792 67505 52371 51871 52940 67109 36075 83873 106987 62992
6485F2992j5221K8222n981P122L3419k3358l7923l3564j9579J850O7699l2435
$$ 62992 47771 75993 70012 77134 110553 87195 49272 15708 -3871 -2021 65678 33243
6473C3243l3280N7884j8278J7185m1231j1998M1771r259J343l717J8471j3560
$$ 33243 -37 57847 39569 56754 15523 3525 45296 36037 37380 33663 52134 38574
6461C8574J8376k8982n9903K0177K6261J9956J9374J297N0776r527l1613n2384
$$ 38574 56950 27968 -31935 -11758 14503 34459 53833 55130 105906 96379 64766 12382
6449A2382L3759O9354j7250m5697K5625r67l5945K5428N539L2739l1194l4417
$$ 12382 46141 115495 98245 52548 78173 77206 41261 66689 72228 104967 73773 39356
6437C9356M3549q0459K1619K0383k9825N2162k1807l7273k305M470L51M0217O5629
$$ 39356 82905 2446 24065 44448 14623 66785 44978 7705 5400 9870 10221 50438 116067
6424A16067j2684r159m7581N4888j6474J0894K0218l4782o3315k0739N3930N8417
$$ 116067 103383 94224 46643 101531 85057 95951 116169 81387 18072 -2667 51263 109680
6412A09680l5978n4944K9876J0746J0690l0617K1595J6238k4754P438J8779k9706
$$ 109680 73702 18758 48634 59380 70070 39453 61048 77286 52532 59970 78749 49043
6400D9043Q6666J3943q6967k2884j1283k9487P8096L7023o9269m3534Q0311M3737
$$ 49043 135709 149652 62685 39801 28518 -969 77127 114150 44881 1347 81658 125395
6388A25395J693J0111o0209J2640J3646J7846K5759q3329K0210L2889j0223J22
$$ 125395 127088 137199 76990 89630 103276 121122 146881 63552 83762 116651 106428 106550
6376A06550k4723K6232K4957k8687J5994J5239k5064o9060l942P8028K9469j6875
$$ 106550 81827 108059 133016 104329 120323 135562 110498 41438 37496 115524 144993 128118
6364A28118M0796K5573K633p5673J3295K0128k6242o2578J1135M5815k5992o5147
$$ 128118 168914 194487 197120 121447 134742 154870 128628 66050 77185 123000 97008 31861
6352C1861j4739J5032q95j2448L5238P9494n1366K2345j9191L2779k1185J0738
$$ 31861 17122 32154 31259 18811 54049 133543 82177 104522 85331 118110 96925 107663
6340A07663J6955j6505o1626L0099K7752r693r905j5155Q6179j6637m0673K0194
$$ 107663 124618 108113 46487 76586 104338 94645 84740 69585 155764 139127 98454 118648
6328A18648N273M852M3431j1387l8091k9680K7195l503J0074M810l028M7892k3573
$$ 118648 123921 128773 172204 160817 122726 93046 120241 116738 126812 131622 128594 176486 152913
6315A52913j2524J1898J2265k0587K5008J9938M6870m6902j1416L9014p858k0146
$$ 152913 140389 152287 164552 143965 168973 188911 235781 188879 177463 216477 208619 188473
6303A88473l8831m4532P142M5950m6487J0981L2019J2244j3212O439l308M5901
$$ 188473 149642 105110 112252 158202 111715 122696 154715 166959 153747 160186 156878 202779
6291B02779k8144r7368O3180Q390p373N8723n5905j6471N3030r272K7574J5144
$$ 202779 174635 77267 140447 148837 141464 200187 144282 127811 180841 171569 199143 214287
6279B14287m6171j5162j3681L2327R021j9568j4561j1474m417L3834M2617j7674
$$ 214287 168116 152954 139273 171600 180621 161053 146492 135018 130601 164435 207052 189378
6267A89378j3580l1008L5409M2708N887L7325K2538m3o9502M10M6015m4710L0258
$$ 189378 175798 144790 180199 222907 228794 266119 288657 288614 219112 219522 265537 220827 251085
6254B51085R436J7473r400J2056L6043j3044K6705K2835J2802n0941P278L2459
$$ 251085 260521 277994 268594 280650 316693 303649 330354 353189 365991 315050 322328 354787
6242C54787M7933p57N9912O0471Q8228K8246K0026Q4297L8571P3443J12481J35769
$$ 354787 402720 401963 461875 522346 610574 638820 658846 743143 781714 855157 967638 1103407
6230A103407M0583m9942n7283k7010j6301p3724n4197j0029N9480R6300M6320
$$ 1103407 1143990 1094048 1036765 1009755 993454 919730 865533 855504 914984 1011284 1057604
6219A057604j0153o9324l9781p0379j04161j31968N030o8828n730N493n2697l4390
$$ 1057604 1047451 978127 938346 867967 763806 631838 636868 568040 562310 567803 515106 480716
6207D80716r4841j464j3462k2397O608l2975q473M0779l5997J5471J4072n7528
$$ 480716 385875 384411 370949 348552 355160 322185 313712 354491 318494 333965 348037 290509
6195B90509k7021K1541K5344k9835j7423L958j1037N239K4442k7926L1721r084
$$ 290509 263488 285029 310373 280538 263115 267073 256036 261275 285717 257791 289512 280428
6183B80428n0903J0001N1845M1620o5156K4154o2129k918L9715K1858P2766N3114
$$ 280428 229525 239526 291371 332991 267835 291989 229860 226942 266657 288515 361281 414395
6171D14395k1505k6734M6482J3830L5559J217l3074L8308J5559r2316m9659L871
$$ 414395 392890 366156 412638 426468 462027 463244 430170 468478 484037 391721 342062 345933
6159C45933J8554p3480r594J387M3958L5217o4333n5793K7478j0182j01778L9697
$$ 345933 364487 291007 281413 282800 326758 361975 297642 241849 269327 259145 157367 197064
6147A97064Q1460l3503J7914M0316J6577j9563p6278M3631K3824K3404P732l551
$$ 197064 278524 245021 262935 303251 319828 300265 223987 267618 291442 314846 322578 319027
6135C19027m2611R105l473j4674k1126M548J6684J9254N2454p7293l7621O299
$$ 319027 276416 285521 282048 267374 246248 250796 267480 286734 339188 261895 224274 230573
6123B30573j4793J4570M0749N0969j8703n5734p858J8643n713O164j4894k7808
$$ 230573 215780 230350 271099 322068 303365 247631 239773 258416 252703 258867 243973 216165
6111B16165K563M6824r492p688J8297j2929j3760n564r392K1095K8600K4332k5330
$$ 216165 218728 265552 256060 248372 266669 253740 239980 234416 225024 246119 274719 299051 273721
6098B73721k7054o787Q023M3987l2671L6288k3618j6020J2281J4481k1j390L7338
$$ 273721 246667 239880 247903 291890 259219 295507 271889 255869 268150 282631 282610 281220 318558
6085C18558j1491j1235M4604K7095n697o5443M33r852J5049n6105k6649K4030
$$ 318558 307067 295832 340436 367531 361834 296391 296824 286972 302021 245916 219267 243297
6073B43297K3470j7K1273J2663k5401L1988N619k6716L072R0703r592P497K8238
$$ 243297 266767 266750 288023 300686 275285 307273 312892 286176 289248 379951 370359 377856 406094
6060D06094K5509M828M719k2467K4910O7503l7814j1716j5487J4939L5686J8434
$$ 406094 431603 436431 441150 418683 443593 511096 473282 461566 446079 461018 496704 515138
6048E15138P7774k9889q4909M6602L9092k7091o327L9573K7552j0886P849P114
$$ 515138 592912 563023 478114 524716 563808 536717 530390 569963 597515 586629 594478 601592
6036F01592k9609r590M6377j681K9466k2047M6214K9369m9588o082m935q371m6518
$$ 601592 571983 562393 608770 607089 636555 614508 660722 690091 640503 634421 629486 621115 574597
6023E74597K9123O853K0028J1735j0115K627J8717j1189J6228j3305m709L1240
$$ 574597 603720 610573 630601 642336 632221 634848 653565 642376 658604 645299 640590 671830
6011F71830L5620k424M1722O314J7957k8039k4780R6746j4740q2388N4732J5919
$$ 671830 707450 705026 746748 753062 771019 742980 718200 814946 800206 717818 772550 788469
5999G88469N1356K7136o46K6828q949N8560j0439R93l3116N4411O8760K293k0210
$$ 788469 839825 866961 866315 893143 884194 942754 932315 933308 900192 954603 1023363 1025656 1005446
5986A005446N0715O177J6029k1876K7086L3635j7730j9091Q6284J5318n801J3258
$$ 1005446 1056161 1062338 1078367 1056491 1083577 1117212 1099482 1080391 1166675 1181993 1176192 1189450
5974A189450Q4148j0575N015m346P1197K5104L6657O388j0331R0192N4835M1009
$$ 1189450 1273598 1263023 1268038 1263692 1334889 1359993 1396650 1403038 1392707 1482899 1537734 1578743
5962A578743M6810k431L047O2145L8826L9526K7664L4302J0164L7931N3775L3727
$$ 1578743 1625553 1623122 1626169 1688314 1727140 1766666 1794330 1828632 1838796 1876727 1930502 1964229
5950A964229P0919J79383J7571N8122O2007O4184M5227N0519J41296J12648J09132
$$ 1964229 2035148 2214531 2232102 2290224 2352231 2416415 2461642 2512161 2653457 2766105 2875237
5939B875237J21971J01638J25817J30954J81204J12355J25277J98008J38734J69744
$$ 2875237 2997208 3098846 3224663 3355617 3536821 3649176 3774453 3972461 4111195 4280939
5929D280939K20912K84003K40945K01258L04461L46555L31087L47873M25646L75009
$$ 4280939 4501851 4785854 5026799 5228057 5532518 5879073 6210160 6558033 6983679 7358688
5919G358688L45490L76992M88373N04388M76569N19598N84454O53802O79045O85890
$$ 7358688 7704178 8081170 8569543 9073931 9550500 10070098 10654552 11308354 11987399 12673289
5909A2673289P46852Q26073Q06456Q78732R37230R79133J051611J147616J308475
$$ 12673289 13420141 14246214 15052670 15931402 16868632 17847765 18899376 20046992 21355467
5900B1355467J493653J666532J890502K243026K477756K762957K867990L064716
$$ 21355467 22849120 24515652 26406154 28649180 31126936 33889893 36757883 39822599
5892C9822599L353231L640211M113793M900172N615289O401350O938007P737833
$$ 39822599 43175830 46816041 50929834 55830006 61445295 67846645 74784652 82522485
5884H2522485Q765816J0008413J1370766J2972974J4556230J5607760N660818
$$ 82522485 91288301 101296714 112667480 125640454 140196684 155804444 161465262
5877A61465262n002880m286240m652471o453496o614345l028181N29543L818194
$$ 161465262 156462382 152176142 147523671 141070175 134455830 131427649 131957192 135775386
5869A35775386O152703Q795313J742510j1009070j2122447j1677865j3646433
$$ 135775386 141928089 150723402 152465912 141456842 129334395 117656530 104010097
5862A04010097j4693889j2742287r844317p750169o238138n244324m429607l630891
$$ 104010097 89316208 76573921 66729604 58979435 52741297 47496973 43067366 39436475
5854C9436475l013777k548812k190251j908501j661881j546686j398954j256336
$$ 39436475 36422698 33873886 31683635 29775134 28113253 26566567 25167613 23911277
5846B3911277j114279j121158r91297r04115q15469p85191p44293o82372n68680
$$ 23911277 22796998 21675840 20684543 19780428 18964959 18179768 17435475 16753103 16184423
5837A6184423m81513n01447m59868m28470l96282l36313l27331l45531l80539
$$ 16184423 15702910 15201463 14741595 14313125 13916843 13580530 13253199 12907668 12527129
5828A2527129l80838m51197l32979k96591k83143k33881k92829k88276k03564
$$ 12527129 12146291 11695094 11362115 11065524 10782381 10548500 10255671 9967395 9763831
5819I763831k56305l01531l08005k96296k66526k45328k79522j99279k77633k05427
$$ 9763831 9507526 9205995 8897990 8601694 8335168 8089840 7810318 7611039 7333406 7127979
5809G127979k02557j26578j77771j74944j73431j32477j38324j00121j07475q8552
$$ 7127979 6925422 6798844 6621073 6446129 6272698 6140221 6001897 5901776 5794301 5705749
5799E705749m1797l6693q0391j65017j12229j5457j04619l9617k2422l7348k8870
$$ 5705749 5663952 5627259 5546868 5381851 5269622 5254165 5149546 5109929 5087507 5050159 5021289
5788E021289r7250l5958j08275o2732n0562q3102m8082o1662j11317p7670j17046
$$ 5021289 4924039 4888081 4779806 4717074 4666512 4583410 4535328 4473666 4362349 4284679 4167633
5777D167633j25299j25090j56621r4015q4021r7984j09581n9508k3076m4322q313
$$ 4167633 4042334 3917244 3760623 3666608 3582587 3484603 3375022 3315514 3292438 3248116 3239803
5766C239803p7847o8052m5518o7677p9520n0992k4178J5517o6602k7786o4236
$$ 3239803 3161956 3093904 3048386 2980709 2901189 2850197 2826019 2841536 2774934 2747148 2682912
5755B682912n0874n9292q4595m2373p3171l7682r0462o2963j1825n5739p7605
$$ 2682912 2632038 2572746 2488151 2445778 2372607 2334925 2244463 2181500 2169675 2113936 2036331
5744B036331o5300l3329p0231m9387L346k8429l9707m2706n1508l6896o2782N5757
$$ 2036331 1971031 1937702 1867471 1818084 1821430 1793001 1753294 1710588 1659080 1622184 1559402 1615159
5732A615159j6354l9867l7651K0616L1917n0941l6503l862J9282J817p9022q3104
$$ 1615159 1598805 1558938 1521287 1541903 1573820 1522879 1486376 1482514 1501796 1503613 1424591 1341487
5720A341487l4760n6805l5361j6662k0238j9004j1036j21j0122p725j1062O538
$$ 1341487 1306727 1249922 1214561 1197899 1177661 1158657 1147621 1147500 1137378 1129653 1118591 1125129
5708A125129L7632L9710m2978q1731K4311j8049n2366M0558J9147k5943j0509
$$ 1125129 1162761 1202471 1159493 1077762 1102073 1084024 1031658 1072216 1091363 1065420 1054911
5697A054911j0375j6294N76N1180k0788k4149K1113q709l5369m7613J5874l474
$$ 1054911 1044536 1028242 1028818 1079998 1059210 1035061 1056174 1047465 1012096 964483 980357 976883
5685I76883k6687k4873o3224n2632k4219k7783p023K5487Q086o523j4281l8703
$$ 976883 950196 925323 862099 809467 785248 757465 750442 775929 784015 777492 763211 724508
5673G24508l0165o574J6846l4828L7667j5420k697j7759j4910k4889p2284M2222
$$ 724508 694343 687769 704615 669787 707454 692034 689337 671578 656668 631779 559495 601717
5661F01717K422j9069L5954k2314p2850j5490J2821n267j9304m1617K521j3571
$$ 601717 604139 585070 621024 598710 525860 510370 523191 517924 498620 457003 459524 445953
5649D45953O399J0200L0299q196L0397J6859l4649l5590J4684M405m2171l355
$$ 445953 452352 462552 492851 484655 515052 531911 497262 461672 476356 480761 438590 435235
5637D35235M403q367J8522N185l9346K144J1013j810o3445L3681K9479J4875j8829
$$ 435235 439638 431271 449793 454978 415632 417776 428789 426979 363534 397215 426694 441569 422740
5624D22740m4590P573J8570j1815P748l045p393l1938M004N0311j0061M851J9993
$$ 422740 378150 385723 404293 392478 400226 397181 389788 357850 361854 412165 402104 406955 426948
5611D26948l0700N0137J6848n2372P129L4135m056N9683j8505N549n305L4069
$$ 426948 396248 446385 463233 410861 417990 452125 448069 507752 489247 494796 489491 523560
5599E23560k2492j4361K2099o0626Q34K1872j5535n2995J0746k336j3140k1209
$$ 523560 501068 486707 508806 448180 449014 470886 455351 402356 413102 410766 397626 376417
5587C76417m0032L2918p026J4805q89J4312l6009R973L3668j767m0942n6140M5678
$$ 376417 336385 369303 362277 377082 376193 390505 354496 364469 398137 396370 355428 299288 344966
5574C44966M1349L6685l8255k9805M1359L0588N0715k7526k4433k5653q3689l7986
$$ 344966 386315 423000 384745 354940 396299 426887 477602 450076 425643 399990 316301 278315
5562B78315O1837q347J0342M228K3476K8626P5186k5235k8399Q565K2779p1156
$$ 278315 340152 331805 342147 346375 369851 398477 473663 448428 420029 428594 451373 380217
5550C80217l7216L1579M132L1107l3447L2938N3921L4536k8362L1770J5262K1787
$$ 380217 343001 374580 378712 409819 376372 409310 463231 497767 469405 501175 516437 538224
5538E38224l7001L4449K0703N7770K9609K308Q3652N492J9426O8191K1779R7340
$$ 538224 501223 535672 556375 614145 643754 646062 729714 735206 754632 822823 844602 941942
5526I41942K3738N0571N8314Q3087J05180K2809j059k0596j1270K0142K308p586
$$ 941942 965680 1016251 1074565 1157652 1262832 1285641 1284582 1263986 1252716 1272858 1275166 1267580
5514A267580m8988J6387L9247O6381J3622o7300o3076o5803j44718k7377n4425
$$ 1267580 1218592 1234979 1274226 1340607 1354229 1286929 1223853 1158050 1013332 985955 931530
5503I31530p5264m3772k5705n9939n7421m127K2306J6743l38m0000M793L4836
$$ 931530 856266 812494 786789 726850 669429 665302 687608 704351 704013 664013 668806 703642
5491G03642m554K2565O385J3825k1367l8933k0809K7166l5257k7709L6596L8240
$$ 703642 699088 721653 728038 741863 720496 681563 660754 687920 652663 624954 661550 699790
5479F99790j505N9493O5094K5480J8535k1972J9033N3025J3160m4355k51j1469
$$ 699790 698285 757778 822872 848352 866887 844915 863948 916973 930133 885778 885527 874058
5467H74058M3133N9067K7536N6438N5612j3622K2212O7440J125J2454Q7785N8377
$$ 874058 917191 976258 1003794 1060232 1115844 1102222 1124434 1191874 1192999 1205453 1293238 1351615
5455A351615M6528L9052N8593O7100J7779N0541Q3179P2775N9042O8657J03091
$$ 1351615 1398143 1437195 1495788 1562888 1580667 1631208 1714387 1787162 1846204 1914861 2017952
5444B017952Q5570L8671J02808P3133J41725J65711P4219J41087K11818J97292
$$ 2017952 2103522 2142193 2245001 2318134 2459859 2625570 2699789 2840876 3052694 3249986
5434C249986K25614L16137K65116K68377L09512L89884M66782M43449N45645N87604
$$ 3249986 3475600 3791737 4056853 4325230 4634742 5024626 5491408 5934857 6480502 7068106
5424G068106N88677O72042Q33947R49773J040335J067537Q34433l9682n50600
$$ 7068106 7656783 8328825 9162772 10112545 11152880 12220417 13054850 13015168 12464568
5415A2464568o29285p31838q37068q11186o84840m55774k60154j35256J6577N5567
$$ 12464568 11835283 11103445 10266377 9455191 8770351 8314577 8054423 7919167 7935744 7991311
5405G991311J72129K45095M29174N01533M69035O11633O89775Q41809Q95615J077027
$$ 7991311 8163440 8408535 8837709 9339242 9808277 10419910 11109685 11951494 12847109 13924136
5395A3924136J204705J396109J541180J612799J870546K130977K477324K831735
$$ 13924136 15128841 16524950 18066130 19678929 21549475 23680452 26157776 28989511
5387B8989511L135332K790841R7223k179647k329111k533279l068652l110077
$$ 28989511 32124843 34915684 35012907 32833260 30504149 27970870 24902218 21792141
5379B1792141k516662j898975j519835j122824q59190n80206l54144j07684O1528
$$ 21792141 19275479 17376504 15856669 14733845 13874655 13294449 12940305 12832621 12894149
5370A2894149J55168K48369L04065N03963N53854O71800Q56551J043901J224465
$$ 12894149 13049317 13297686 13601751 14105714 14659568 15331368 16187919 17231820 18456285
5361A8456285J374908J473174J699589K052505K332562K622034K957929K951812
$$ 18456285 19831193 21304367 23003956 25056461 27389023 30011057 32968986 35920798
5353C5920798P00093k183832k576900k622700l186951l376068k837622k278000
$$ 35920798 36620891 34437059 31860159 29237459 26050508 22674440 19836818 17558818
5345A7558818j744432j313989j093123p99709o05563m99033l09874k01317k00985
$$ 17558818 15814386 14500397 13407274 12607565 12002002 11502969 11193095 10991778 10790793
5336A0790793j31048j01136o4696J1223Q6231J37770K52136L36337L43274M71310
$$ 10790793 10659745 10558609 10493913 10505136 10591367 10729137 10981273 11317610 11660884 12132194
5326A2132194N87359O58517P59043Q38516Q57921J93364p80636j034329j032352
$$ 12132194 12719553 13378070 14137113 14975629 15833550 16026914 15246278 14211949 13179597
5317A3179597j241341j294406j055380r19412o98297n52917m85526m21804l37714
$$ 13179597 11938256 10643850 9588470 8669058 7970761 7417844 6932318 6510514 6172800
5308F172800k92142k04694j80273k20594k37635j68758j37414k24422j68792j02133
$$ 6172800 5880658 5675964 5495691 5275097 5037462 4868704 4731290 4506868 4338076 4235943
5298D235943j41437j17012j09302j23855m9031j08933j07776j59859j20513j01224
$$ 4235943 4094506 3977494 3868192 3744337 3695306 3586373 3478597 3318738 3198225 3097001
5288C097001o4068n4643p5583k8959j08983r403n4418r3527j30083q9398R092
$$ 3097001 3032933 2978290 2902707 2873748 2764765 2755362 2700944 2607417 2477334 2387936 2397028
5277B397028j48l1400J8309n5526l4126k7065k3873o8613p6692q6782p3279L0363
$$ 2397028 2396880 2365480 2383789 2328263 2294137 2267072 2243199 2174586 2097894 2011112 1937833 1968196
5265A968196k6965n6443j3618l9223n0014k6246L7734K6134o1410m2819r0914
$$ 1968196 1941231 1884788 1871170 1831947 1781933 1755687 1793421 1819555 1758145 1715326 1624412
5254A624412J7844L540K9255L1867K5774j6245K7117K1300J1669N485J7046J2836
$$ 1624412 1642256 1645796 1675051 1706918 1732692 1716447 1743564 1764864 1776533 1782018 1799064 1811900
5242A811900J4027Q5193K7357M2230P8478O3695P5717K8546M7953J36107P7725
$$ 1811900 1825927 1911120 1938477 1980707 2059185 2122880 2198597 2227143 2275096 2411203 2488928
5231B488928J11973J98336J64234J71841K44656K50418L17783L02329L35085L89554
$$ 2488928 2600901 2799237 2963471 3135312 3379968 3630386 3948169 4250498 4585583 4975137
5221D975137N43468M43133m0390j47281j42189k24152k72640j79927j01900m551
$$ 4975137 5518605 5961738 5921348 5774067 5631878 5407726 5135086 4955159 4853259 4848708
5211D848708J59880J96832K49756P1490l62405l76108l74783m97637m90257m24583
$$ 4848708 5008588 5205420 5455176 5526666 5164261 4788153 4413370 3915733 3425476 3000893
5201C000893l03712k70312k46601j08982k00262j45040n2347j01843j01095l8777
$$ 3000893 2697181 2426869 2180268 2071286 1871024 1725984 1673637 1571794 1470699 1431922
5191A431922m1689k098j21788q0692j6665l6892o7429K2978K74k8028k4258n1575
$$ 1431922 1390233 1388135 1266347 1185655 1168990 1132098 1064669 1087647 1087921 1059893 1035635 984060
5179I84060k1397l052m2864L4227p447n9934L4198K467q5683j4891N57j5138L7144
$$ 984060 962663 959611 916747 950974 943527 883593 917791 920258 834575 819684 820241 805103 842247
5166H42247l894O968P696k6461N269J1142j5190J9572k6256J1607L2840L8916
$$ 842247 838353 845321 853017 826556 831825 842967 827777 847349 821093 832700 865540 904456
5154I04456k628P7589R16P9213O0346R0334O6656L6819Q8154K4097p3799j01286
$$ 904456 901828 979417 980333 1059546 1119892 1210226 1276882 1313701 1401855 1425952 1352153 1250867
5142A250867o9118q4559j77314l6688o0449j11529n8601N663k35l2803p8518j2610
$$ 1250867 1181749 1097190 919876 883188 822739 711210 652609 658272 658037 625234 546716 534106
5130E34106L2276o3042J312l6143k0538K4031n8391K4173j3783O5174n1859k3723
$$ 534106 566382 503340 504652 468509 447971 472002 413611 437784 424001 489175 437316 413593
5118D13593J5895l7078J8131J8899n374k5365J0621n720k9184p328R131k7080
$$ 413593 429488 392410 410541 429440 424066 398701 409322 403602 374418 367090 376221 349141
5106C49141M7324P711n7588O029K9461L3578m3219m7484K2425p979l5073J7731
$$ 349141 396465 404176 346588 352617 382078 415656 372437 324953 347378 339399 304326 322057
5094C22057M5584o1358K4924l1093J4104N0814l5507n5523K7425n5214J3288M4821
$$ 322057 367641 306283 331207 300114 314218 365032 329525 274002 301427 246213 259501 304322
5082C04322O875J2251K049l3765l3390J2456J3525K7410m3720l2271M3982l6546
$$ 304322 311197 323448 325497 291732 258342 270798 284323 311733 268013 235742 279724 243178
5070B43178j0347p105J820K2181O072J606j4353j1735m647M1703J8188l9073l2999
$$ 243178 232831 225726 227546 249727 255799 257405 243052 231317 226670 268373 286561 247488 214489
5057B14489K1596M2272j1536j4957R274N908l112N5675j589j1194J9536M82M8009
$$ 214489 236085 278357 266821 251864 261138 267046 263934 319609 318020 306826 326362 326844 374853
5044C74853K19k1768Q122J0117P58k8013P936R442r1776q845N5050j2267l1203
$$ 374853 375072 353304 361426 371543 372301 344288 352224 361666 269890 261045 316095 303828 272625
5031B72625K4145r046K7046J0453k4891N760m9427o3133J6831P2035j0539k0786
$$ 272625 296770 287724 314770 325223 300332 306092 256665 193532 210363 282398 271859 251073
5019B51073K5884R168K0377K5322N7552K6918n368L319m6939K7444R671k3539
$$ 251073 276957 286125 306502 331824 389376 416294 410926 414245 367306 394750 404421 380882
5007C80882P5544J9040m7384n2367L8246M1767J1214n852o6002K0684j004k6429
$$ 380882 456426 475466 428082 375715 413961 455728 466942 461090 395088 415772 414768 388339
4995C88339L6922J7634L436m6199n563O3249J5775k3018m474L9983L2117K2448
$$ 388339 425261 442895 446331 400132 394569 457818 473593 450575 446101 486084 518201 540649
4983E40649m0551J1145k6362k3085N2477M6863m7064n3674J1303l3653K5024j1070
$$ 540649 500098 511243 484881 461796 514273 561136 514072 460398 471701 438048 463072 452002
4971D52002k4266L4262L211k7329J0723k6022J491O826J3142L3895N245o620n561
$$ 452002 427736 461998 465209 437880 448603 422581 424072 430898 444040 477935 483180 476560 470999
4958D70999Q1904J8690o4749k536O486l4552m497M9525O1548m3428J1567j4486
$$ 470999 552903 571593 506844 504308 510794 476242 471745 521270 582818 539390 550957 536471
4946E36471l686O9446K2251j5152M2664n9750j8198N3007K3003j2506Q897j9938
$$ 536471 532785 602231 624482 609330 651994 592244 574046 627053 650056 637550 646447 626509
4934F26509m1521P6412L1969m63J4114J8293J7699K9370K3617p4739M1850M7180
$$ 626509 584988 661400 693369 692906 707020 725313 743012 772382 795999 721260 763110 810290
4922H10290l4937M0557K1091N7809r843N8263M3425K8176j1282L4016p687K9174
$$ 810290 775353 815910 837001 894810 884967 943230 986655 1014831 1003549 1037565 1029878 1059052
4910A059052m452L3400O458J6852M3031O0267k2948O8211j3040N6501J0907P4057
$$ 1059052 1054600 1088000 1094458 1111310 1154341 1214608 1191660 1259871 1246831 1303332 1314239 1388296
4898A388296J15143O2361M151R5957L4502J1528J00801M5379O1893Q3097Q6656
$$ 1388296 1503439 1565800 1569951 1665908 1700410 1711938 1812739 1858118 1920011 2003108 2089764
4887B089764P2010J22993J04886J27269Q2101J30510J34352P4936J39823J45272
$$ 2089764 2161774 2284767 2389653 2516922 2599023 2729533 2863885 2938821 3078644 3223916
4877C223916J00056J74619K03714J86762K46855K65660K74439L33131L14212L91976
$$ 3223916 3323972 3498591 3702305 3889067 4135922 4401582 4676021 5009152 5323364 5715340
4867E715340M41072M43903L90937L47167M44045M01410M35297M32666M75238N11901
$$ 5715340 6156412 6600315 6991252 7338419 7782464 8183874 8619171 9051837 9527075 10038976
4857A0038976N82815O35665O25619O91156P01455Q80356Q81511R04668R36776
$$ 10038976 10621791 11257456 11883075 12574231 13275686 14156042 15037553 15942221 16878997
4848A6878997J044581J117072J336093J512971J828415K134469K543409K814095
$$ 16878997 17923578 19040650 20376743 21889714 23718129 25852598 28396007 31210102
4840C1210102L202091L469012L813389L949845M364174N044746O021322O857620
$$ 31210102 34412193 37881205 41694594 45644439 50008613 55053359 61074681 67932301
4832F7932301P870616Q317392R103051J0504186J2336975J4157965J6385267J8703269
$$ 67932301 75802917 84120309 93223360 103727546 116064521 130222486 146607753 165311022
4824A65311022J9573042J135543j5197033j4212096j5727494j9260966k0361156
$$ 165311022 184884064 186019607 170822574 156610478 140882984 121622018 101260862
4817A01260862j6354150j2603689r656714p867864o402260n244557m097213l485686
$$ 101260862 84906712 72303023 62646309 54778445 48376185 43131628 39034415 35548729
4809C5548729k869146k414931k053931j813127j564468j457646j236946j153423
$$ 35548729 32679583 30264652 28210721 26397594 24833126 23375480 22138534 20985111
4801B0985111j057671r40907q72672q45987p43585p02825o47037o04664n21628
$$ 20985111 19927440 18986533 18113861 17267874 16524289 15821464 15174427 14569763 14048135
4792A4048135m83852m85652m43176l98640l95733l27649l54346l33635l53875
$$ 14048135 13564283 13078631 12635455 12236815 11841082 11513433 11159087 10825452 10471577
4783A0471577k75595k13004j99413k47902p0860j44994j11704j10358k21764k73207
$$ 10471577 10195982 9982978 9783565 9535663 9464803 9319809 9208105 9097747 8875983 8602776
4773H602776k41462k93262k97355l40528k06952k20824j97931j93317j92344k24415
$$ 8602776 8361314 8068052 7770697 7430169 7223217 7002393 6804462 6611145 6418801 6194386
4763F194386k00040j37823j77560j77131j44614j15768k04956r4876j47593j58030
$$ 6194386 5994346 5856523 5678963 5501832 5357218 5241450 5036494 4941618 4794025 4635995
4753D635995j13580n0047p2770n3799l0813m3203k9147J125j19245n4707m3862
$$ 4635995 4522415 4472368 4399598 4345799 4314986 4271783 4242636 4243761 4124516 4069809 4025947
4742D025947n4407m7758m0623r7815n7161p1139j8330j01047o0313k6489p4367
$$ 4025947 3971540 3923782 3883159 3785344 3728183 3657044 3638714 3537667 3477354 3450865 3376498
4731C376498q1882k2089p0848n7639p5318r5004l5030m2018j8675k7935l0887
$$ 3376498 3294616 3272527 3201679 3144040 3068722 2973718 2938688 2896670 2877995 2850060 2819173
4720B819173m8417r58l7825j38324m5354N682k270l8125o0372j2236n8444m2606
$$ 2819173 2770756 2769798 2731973 2593649 2548295 2553977 2551707 2513582 2453210 2440974 2382530 2339924
4708B339924l5911r6438n9776k047r8517n6500l019k1830n3399n5994K4850j8809
$$ 2339924 2304013 2207575 2147799 2145752 2047235 1990735 1987716 1965886 1912487 1856493 1881343 1862534
4696A862534m166l9971k9093o1914k4951j6655n3268J4702l710Q33J4028j0255
$$ 1862534 1858368 1818397 1789304 1727390 1702439 1685784 1632516 1647218 1643508 1644341 1658369 1648114
4684A648114n3150l2474K1496n2375j7988j2336l2093q087n3545j3406K3614l2298
$$ 1648114 1594964 1562490 1583986 1531611 1513623 1501287 1469194 1461107 1407562 1394156 1417770 1385472
4672A385472J6005j4743l5236k5260j1467L4J7747j3891r763K1256L7738m6532
$$ 1385472 1401477 1386734 1351498 1326238 1314771 1314805 1332552 1318661 1308898 1330154 1367892 1321360
4660A321360L2073m0989K0684J0134r927l2840r229P090L2222k3822L4167K634
$$ 1321360 1353433 1312444 1333128 1343262 1333335 1300495 1291266 1298356 1330578 1306756 1340923 1343557
4648A343557L8457J1032j9101N0418L7262M8515L1773L6365L8528Q9488Q1057
$$ 1343557 1382014 1393046 1373945 1424363 1461625 1510140 1541913 1578278 1616806 1706294 1787351
4637A787351P0392Q3674P5732J54567J39065J56045J56715J80066J80450J941
$$ 1787351 1857743 1941417 2017149 2171716 2310781 2466826 2623541 2803607 2984057 2985998
4627B985998k16325k45149j47727k22321k22365j68509j28199j41921o6336p5813
$$ 2985998 2769673 2524524 2376797 2154476 1932111 1763602 1635403 1493482 1427146 1351333
4617A351333k6875q1476o0003n0538n7646k1561l3581q8754J3800R994j06197
$$ 1351333 1324458 1242982 1182979 1132441 1074795 1053234 1019653 930899 944699 954693 848496
4606H48496j0523L2672k0582Q044j6405K8197k3894n6469m95N7407k6930n2181
$$ 848496 837973 870645 850063 858107 841702 869899 846005 789536 789041 846448 819518 767337
4594G67337L7173q429n9328K4972k690L3183j4371Q731n196l83J1184l1026j3714
$$ 767337 804510 796081 736753 761725 759035 792218 777847 786578 781382 780999 792183 761157 747443
4581G47443j1272n5372N602R809m1818l4419K9163k5721O3277l8699l1140O944
$$ 747443 736171 680799 686401 696210 654392 619973 649136 623415 686692 647993 616853 623797
4569F23797k2548j726N222J4640L8766l0527r164K2906l0516m3340L4681j571
$$ 623797 601249 599523 604745 619385 658151 627624 618460 641366 610850 567510 602191 600620
4557F00620j9950K8238K1769O2431p107J0355L3235J4203Q151N9415J8304n0828
$$ 600620 580670 608908 630677 693108 686001 696356 729591 743794 751945 811360 829664 778836
4545G78836M8815O0233J7606j6710R421P4847P401j6741O9951M7265p190l509
$$ 778836 827651 887884 905490 888780 898201 973048 980449 963708 1033659 1080924 1073734 1070225
4533A070225K2648K3863m4886p1357J2209L9072L4489O401l2731K6034R73L616
$$ 1070225 1092873 1116736 1071850 1000493 1012702 1051774 1086263 1092664 1059933 1085967 1086940 1090556
4521A090556k7079R848K3397n118J6943J9615P2490Q7094O8112Q9076L4693J8054
$$ 1090556 1063477 1073325 1096722 1091604 1108547 1128162 1200652 1287746 1355858 1444934 1479627 1497681
4509A497681j3715N639M637n2146q696N0080P2454Q5204O1543J16623J62346P6036
$$ 1497681 1483966 1489605 1494242 1442096 1433400 1483480 1555934 1641138 1702681 1819304 1981650 2057686
4497B057686r0173j41589q4231j06493j96271q6228m3759k1789K3667k432L068
$$ 2057686 1967513 1825924 1741693 1635200 1438929 1352701 1308942 1287153 1310820 1308388 1311456
4486A311456m0913m0482J3892J5570R688N8734L1100j4054m4005K4805k8495l7654
$$ 1311456 1270543 1230061 1243953 1259523 1269211 1327945 1359045 1344991 1300986 1325791 1297296 1259642
4474A259642P1056m9408q9057l7019K4497k1507M1950L6546j5545l6161k4443
$$ 1259642 1330698 1281290 1192233 1155214 1179711 1158204 1200154 1236700 1221155 1184994 1160551
4463A160551j1413N2963n8987k933N1016l4567O0287J5579N9619R4864n990P1286
$$ 1160551 1149138 1202101 1143114 1140181 1191197 1156630 1216917 1232496 1292115 1386979 1380989 1452275
4451A452275O1444N4513j2192Q682l1697k8276n5036j7996l9626l4788j8919o763
$$ 1452275 1513719 1568232 1556040 1564722 1533025 1504749 1449713 1431717 1392091 1357303 1338384 1331621
4439A331621J9123m3296l722L8875j240J4261P8799p1271q481L2314L5522O782
$$ 1331621 1350744 1307448 1303726 1342601 1341361 1355622 1434421 1363150 1354669 1386983 1422505 1429287
4427A429287j3905P1460j6514O8030J3342Q0832J08130R9946m916J12452L5158
$$ 1429287 1415382 1486842 1470328 1538358 1551700 1632532 1740662 1840608 1835692 1948144 1983302
4416A983302M1953k0780M2409k5646j04660O6037N3429j6708M2801L594L5365
$$ 1983302 2025255 2004475 2046884 2021238 1916578 1982615 2036044 2019336 2062137 2065731 2101096
4405B101096k5014J0425L0034N8931j115J759Q9746L8874P2090R6104m39M9562
$$ 2101096 2076082 2086507 2116541 2175472 2174357 2176116 2265862 2304736 2376826 2472930 2472491 2522053
4393B522053J15029Q5892J38272M8423J73581P3920P2193J07357J60413P3444
$$ 2522053 2637082 2722974 2861246 2909669 3083250 3157170 3229363 3336720 3497133 3570577
4383C570577J99436J52831J21213J14387J73335J70677J74602K30491K42901K83179
$$ 3570577 3770013 3922844 4044057 4158444 4331779 4502456 4677058 4907549 5150450 5433629
4373E433629J92347K02472K44959K42217L15957L53243L68953L51134M30391N11153
$$ 5433629 5625976 5828448 6073407 6315624 6631581 6984824 7353777 7704911 8135302 8646455
4363H646455N66116N93031O84775O58624O88273Q41663Q84867P75832Q63374P72759
$$ 8646455 9212571 9805602 10490377 11149001 11837274 12678937 13563804 14339636 15203010 15975769
4353A5975769Q11598Q47756R90273R66698J089059J093985J284590J242570J390568
$$ 15975769 16787367 17635123 18625396 19592094 20681153 21775138 23059728 24302298 25692866
4344B5692866J505344J708845J835862J984150J983063K102628K262319K687400
$$ 25692866 27198210 28907055 30742917 32727067 34710130 36812758 39075077 41762477
4336D1762477L101439L725775M318938M995507N651314O469246P066227P678798
$$ 41762477 44863916 48589691 52908629 57904136 63555450 70024696 77090923 84769721
4328H4769721Q027187Q843097R948172J1827168J3573042J5624544J6766712J8139008
$$ 84769721 92796908 101640005 111588177 123415345 136988387 152612931 169379643 187518651
4320A87518651K0459578K4175249K7570552L2110407L5795338L9511471J2180422
$$ 187518651 207978229 232153478 259724030 291834437 327629775 367141246 379321668
4313C79321668k5319589k8568373k9693220l6728488m0689766l4843357k6888146
$$ 379321668 354002079 325433706 295740486 259011998 218322232 183478875 156590729
4306A56590729k0862488j6785751j3791198j1344629r099740p470536o144791
$$ 156590729 135728241 118942490 105151292 93806663 84706923 77236387 71091596
4299G1091596n242510m470202l973602l388781l005187k643292k468775k221946
$$ 71091596 65849086 61378884 57405282 54016501 51011314 48368022 45899247 43677301
4291D3677301k108626j951823j741779j605514j588770j379147j324749j172658
$$ 43677301 41568675 39616852 37875073 36269559 34680789 33301642 31976893 30804235
4283C0804235j076369r79002r58061q72054p37794p47894o71505o17303n71431
$$ 30804235 29727866 28748864 27790803 26918749 26180955 25433061 24761556 24144253 23572822
4274B3572822m72102m46837m66070l59564k87567l07627l55489l11358l99077
$$ 23572822 23100720 22653883 22187813 21828249 21540682 21233055 20877566 20566208 20167131
4265B0167131n47660n76951n46488n73008n03340m68610m29917l94970m57859
$$ 20167131 19619471 19042520 18496032 17923024 17419684 16951074 16521157 16126187 15668328
4256A5668328m10287l25151l72919l50912l03629k22603k21753j48043j79192
$$ 15668328 15258041 14932890 14559971 14209059 13905430 13682827 13461074 13313031 13133839
4247A3133839r5590k9399Q5114l589Q1676J34298K07194K13806J62298J55894
$$ 13133839 13038249 13008850 13093964 13090375 13172051 13306349 13513543 13727349 13889647 14045541
4237A4045541J81044J38871J95775K26706K25605K38393L20188K33449L30097
$$ 14045541 14226585 14365456 14561231 14787937 15013542 15251935 15572123 15805572 16135669
4228A6135669L67155M64491N11790N54869N12244O10990P32845Q23001R48731
$$ 16135669 16502824 16967315 17479105 18033974 18546218 19157208 19890053 20713054 21661785
4219B1661785J283994J397098J777883J940930K234979K447122K649304K764103
$$ 21661785 22945779 24342877 26120760 28061690 30296669 32743791 35393095 38157198
4211C8157198L147382L550940M264146M944809N682374O040630O649153P518488
$$ 38157198 41304580 44855520 49119666 54064475 59746849 65787479 72436632 79955120
4203G9955120Q934610J0231867J1819567J3374452J4075166K280761j0152716
$$ 79955120 88889730 99121597 110941164 124315616 138390782 140671543 130518827
4196A30518827j0436484j1367891j3884832j4805772j2312845r583608p425459
$$ 130518827 120082343 108714452 94829620 80023848 67711003 58127395 50701936
4189E0701936n953978m961762m124314l239235k660248k206389j826815j671011
$$ 50701936 44747958 39786196 35661882 32422647 29762399 27556010 25729195 24058184
4181B4058184j438056j256786j111676r96418r38394q14002p71866p07334o88730
$$ 24058184 22620128 21363342 20251666 19255248 18316854 17502852 16730986 16023652 15334922
4172A5334922o44667n69183n35641m75042l94841l92890m59395m32459l60933
$$ 15334922 14690255 14121072 13585431 13110389 12715548 12322658 11863263 11430804 11069871
4163A1069871l32349k96733l63732k80649k45643k26627k07231j50201k28711
$$ 11069871 10737522 10440789 10077057 9796408 9550765 9324138 9116907 8966706 8737995
4154H737995j54409j41064j76057j46960j33554j46201j57322k63849k01201j97406
$$ 8737995 8583586 8442522 8266465 8119505 7985951 7839750 7682428 7418579 7217378 7019972
4144G019972k27476k39416j69428j56957j36781j74884k03545j76600p6422q8941
$$ 7019972 6792496 6553080 6383652 6226695 6089914 5915030 5711485 5534885 5458463 5369522
4134E369522j33484j51746j48046j26970o0158p9690p1987k5563L7697o2916j01199
$$ 5369522 5236038 5084292 4936246 4809276 4749118 4669428 4597441 4571878 4609575 4546659 4445460
4123D445460r958m8632r3073q3859m9156m4058j5958o2290n0295k4896j02259
$$ 4445460 4435502 4386870 4293797 4209938 4160782 4116724 4100766 4038476 3988181 3963285 3861026
4112C861026r8553o6168q5592q9103q4737l0678p3325m2826j8417o9960n7477
$$ 3861026 3762473 3696305 3610713 3521610 3436873 3406195 3332870 3290044 3271627 3201667 3144190
4101C144190m8620q1106l3181m4133r335r194j597L59J7655k1770l2289j2631
$$ 3144190 3095570 3014464 2981283 2937150 2927815 2918621 2917024 2917383 2935038 2913268 2880979 2868348
4089B868348K4614j6819j8785K0546q7856l0279m8663n5968j5625l1055k0368
$$ 2868348 2892962 2876143 2857358 2877904 2790048 2759769 2711106 2655138 2639513 2608458 2588090
4078B588090L564l7046J8042L9596m9137n4333m9736m9268k7015o5747j0257j6456
$$ 2588090 2591654 2554608 2572650 2612246 2563109 2508776 2459040 2409772 2382757 2317010 2306753 2290297
4066B290297k1933k9559j7376k3811k7156K6233p3071m5574p0734p62J6179L6265
$$ 2290297 2268364 2238805 2221429 2197618 2170462 2196695 2123624 2078050 2007316 2006554 2022733 2058998
4054B058998N13j9k4177Q710P950K4023l8615o607j0567k0591O0974N8538M7072
$$ 2058998 2059511 2059492 2035315 2044025 2051975 2075998 2037383 2030776 2020209 1999618 2060592 2119130 2166202
4041B166202M847O7878R5632K7306Q7785M7670R4262J07113J79271J31857L5775
$$ 2166202 2171049 2238927 2334559 2361865 2449650 2497320 2591582 2698695 2877966 3009823 3045598
4030C045598M2292J1096N0779j1895p2708l267n463L5587N075O2098R815L7417
$$ 3045598 3087890 3098986 3149765 3137870 3065162 3061895 3056432 3092019 3097094 3159192 3169007 3206424
4018C206424P9015N1136J36946K07106J15009J49441J42478J31712K41033J69059
$$ 3206424 3285439 3336575 3473521 3680627 3795636 3945077 4087555 4219267 4460300 4629359
4008D629359K79913K49158L03868K58806L16688L51616L60221L61877M41582M80620
$$ 4629359 4909272 5158430 5462298 5721104 6037792 6389408 6749629 7111506 7553088 8033708
3998H033708N14325M62972M84641K88057L14151L61519L51179L92725N32421O60085
$$ 8033708 8548033 9011005 9495646 9783703 10097854 10459373 10810552 11203277 11735698 12395783
3988A2395783P33670Q54877R51880J059577J185376J379752J617237J827811K160478
$$ 12395783 13129453 13984330 14936210 15995787 17181163 18560915 20178152 22005963 24166441
3979B4166441K364297K614599K990334L448382L829036M271019M913770M372739
$$ 24166441 26530738 29145337 32135671 35584053 39413089 43684108 48597878 52970617
3971E2970617J484687M50571P67643L40174R6643O67820J980080L034489M134306
$$ 52970617 54455304 54905875 55673518 56013692 56110335 56778155 58758235 61792724 65927030
3962F5927030N340298N374158m47636m367528l752427m246742n108079m979650
$$ 65927030 71267328 76641486 76193850 71826322 68073895 63827153 58719074 53739424
3954E3739424l374794j986508p61591P0664O74950j285170l708654l497694l453711
$$ 53739424 50364630 48378122 47616531 47687195 48362145 47076975 43368321 39870627 36416916
3945C6416916l796309l959136l330286k624732k040268j757502j509912j249003
$$ 36416916 32620607 28661471 25331185 22706453 20666185 18908683 17398771 16149768
3937A6149768j079831r10167p41812p46852o57637n31763n22773m46648m19349
$$ 16149768 15069937 14159770 13417958 12671106 12013469 11481706 10958933 10512285 10092936
3928A0092936l55272l56444k91110l21108k99409k58259k40180k27085k93086
$$ 10092936 9737664 9381220 9090110 8769002 8469593 8211334 7971154 7744069 7450983
3919G450983k43850j50725j89358j82047j39939j02718q4059k08590j49493j82443
$$ 7450983 7207133 7056408 6867050 6685003 6545064 6442346 6358287 6149697 6000204 5817761
3909E817761j78452k34899j43468o8771j36761j52776p1827q6498j13549j11784
$$ 5817761 5639309 5404410 5260942 5192171 5055410 4902634 4830807 4744309 4630760 4518976
3899D518976j55754r0987j03307p3548q9954m9775q0347o6046l1639l0691l7112
$$ 4518976 4363222 4272235 4168928 4095380 4005426 3955651 3875304 3809258 3777619 3746928 3709816
3888C709816o9808k634K7005K7644L6020j6462n1224p3753j27817k4450j02876
$$ 3709816 3640008 3637374 3664379 3692023 3728043 3711581 3660357 3586604 3458787 3434337 3331461
3877C331461j54481m4282p2283j25138q4437r1314r1786m1334M031o0500m3128
$$ 3331461 3176980 3132698 3060415 2935277 2850840 2759526 2667740 2626406 2630437 2569937 2526809
3866B526809K4621p8922l7153j0163p1757j0188k2905l020L4152K4532J4893m0766
$$ 2526809 2551430 2472508 2435355 2425192 2353435 2343247 2320342 2317322 2351474 2376006 2390899 2350133
3854B350133j7150n1373m4938P264k5432n0924n0574O964N2938q7250q3717k0958
$$ 2350133 2332983 2281610 2236672 2243936 2218504 2167580 2117006 2123970 2176908 2089658 2005941 1984983
3842A984983m0126l5098m1809n6979k6641J030N924n3562o0661O57J4192j23115
$$ 1984983 1944857 1909759 1867950 1810971 1784330 1785360 1791284 1737722 1677061 1677718 1691910 1568795
3830A568795k3787l8940Q443j9429P955j8782j8852k2874l7823J0924M0106K2953
$$ 1568795 1545008 1506068 1514511 1495082 1503037 1484255 1465403 1442529 1404706 1415630 1455736 1478689
3818A478689J8689j7137k5801l043L558K8296J09271M8313J5031R2269R1085R0743
$$ 1478689 1497378 1480241 1454440 1451397 1454955 1483251 1592522 1640835 1655866 1748135 1839220 1929963
3806A929963L9872J63181J53125J19977J28108L4875j0008j0400R45j3077J4308
$$ 1929963 1969835 2133016 2286141 2406118 2534226 2569101 2559093 2548693 2549638 2536561 2550869
3795B550869L2007J72940J02533J34567K52389L2306j21697j26346j38436j87334
$$ 2550869 2582876 2755816 2858349 2992916 3245305 3277611 3155914 3029568 2891132 2703798
3785B703798j33919j77585o6230K0901J7088M6583L6591n3506j83608j26865j33715
$$ 2703798 2569879 2392294 2326064 2346965 2364053 2410636 2447227 2393721 2210113 2083248 1949533
3774A949533j41654p4362q2614p7985j27172p1335O989l3682J0020k8811j02750
$$ 1949533 1807879 1733517 1650903 1572918 1445746 1374411 1381400 1347718 1357738 1328927 1226177
3763A226177q481K6852j7047k7216J0488n739J1207n1684j8237J0457m332j5041
$$ 1226177 1217696 1244548 1227501 1200285 1210773 1205034 1216241 1164557 1146320 1156777 1152445 1137404
3751A137404Q21k3299J8422j165K3403K376n894P690J5067K0627K7311J2561J0079
$$ 1137404 1138225 1114926 1133348 1132183 1155586 1157962 1152068 1159758 1174825 1195452 1222763 1235324 1245403
3738A245403r934k989o86N0977j034j6640N0030J7119j1387O549j063L0211o414
$$ 1245403 1235469 1232480 1231794 1282771 1281737 1265097 1315127 1332246 1320859 1327408 1326345 1356556 1350142
3725A350142q862O388j227j6256K559M7554k0014P3843R576R776M4321k3105m3449
$$ 1350142 1341280 1347668 1346441 1330185 1332744 1380298 1360284 1434127 1443703 1453479 1497800 1474695 1431246
3712A431246l8856l9350n3942N8534O374K524J313n4515K5893n2953m4878o4151
$$ 1431246 1392390 1353040 1299098 1357632 1364006 1366530 1367843 1313328 1339221 1286268 1241390 1177239
3700A177239N585n4847l2617J980k4047k9818j5185q136m5645l6220k2992J8539
$$ 1177239 1182824 1127977 1095360 1097340 1073293 1043475 1028290 1020154 974509 938289 915297 933836
3688I33836M0092p0529k4298k0874L623J8587m0720K44n0608n9958j3387l7804
$$ 933836 973928 903399 879101 858227 861850 880437 839717 839961 789353 729395 716008 678204
3676F78204J3251K0691n0194k9625r546K1066J2427J582m2468n0006p246K789
$$ 678204 691455 712146 661952 632327 622781 643847 656274 657856 615388 565382 558136 560925
3664E60925k0301l7352k0489J5854n3946K1043K885m7844n563O5990k4913m9214
$$ 560925 540624 503272 482783 498637 444691 465734 468619 420775 415212 481202 456289 407075
3652D07075J4234Q439R181k7568l4496k9223n6706J899K738j7702K9947J8179
$$ 407075 421309 429748 438929 411361 376865 347642 290936 292835 295573 277871 307818 325997
3640C25997j7778j4866M850n0960J0993O8382J5188L0226r8069k6407K3415j9885
$$ 325997 308219 293353 298203 247243 258236 326618 341806 372032 273963 247556 270971 251086
3628B51086l343J5203K4707j7196j786k5262k1743K2940J5629j2285K9397l4189
$$ 251086 247743 262946 287653 270457 268671 243409 221666 244606 260235 247950 277347 243158
3616B43158N036J9596p0823M186N7688N6425k1539k7343l014j3627l3366m9635
$$ 243158 248194 267790 196967 201153 258841 315266 293727 266384 263370 249743 216377 166742
3604A66742J6334K0035K0914J7772J0668M016m1257j7211K10k307L1835k7566
$$ 166742 183076 203111 224025 241797 252465 256481 215224 198013 198223 195916 227751 200185
3592B00185K4771J7942M1898k2043l7596J1081K2049j6408k862L3845J469m0120
$$ 200185 224956 242898 284796 262753 225157 236238 258287 241879 239017 272862 274331 234211
3580B34211M6093j4456n9063L680q19P230k3059q934J0221J8282L5793m0080n2582
$$ 234211 280304 265848 206785 210465 209646 216876 193817 184883 195104 213386 249179 209099 156517
3567A56517r014L7149L5078l1879l3446l6130R678K0545K7222J3436O7592r880
$$ 156517 147503 184652 219730 187851 154405 118275 127953 148498 175720 189156 256748 246868
3555B46868o8977p0507j2458R9628q590q516j8324M4752m480k9784K0843J0345
$$ 246868 177891 107384 94926 194554 185964 177448 159124 203876 199396 169612 190455 200800
3543B00800j4324Q170o308m991L6910P858m6704l3352L6131j1743J2472l6788
$$ 200800 186476 194646 188338 183347 220257 228115 181411 148059 184190 172447 184919 148131
3531A48131M0961J6343o0323k244L9901M9098m4408n893k9518m2940M1917K6881
$$ 148131 189092 205435 145112 142868 182769 231867 187459 181566 152048 109108 151025 177906
3519A77906k4767j3723k010K2169L427k3998K5644k5298j6803L8063j6419L1080
$$ 177906 153139 139416 137406 159575 163002 139004 164648 139350 122547 160610 144191 175271
3507A75271Q003k2527j0310l4288j6831N0346J9521J1689K530m621l2899M7015
$$ 175271 183274 160747 150437 116149 99318 149664 169185 180874 183404 178783 145884 192899
3495A92899l086n5300L4163J5029P058K5024K3087k2370l2967j4600q931n611
$$ 192899 189813 134513 168676 183705 190763 215787 238874 216504 183537 168937 160006 154395
3483A54395O9669J0802j3378J0185M1868K0850l3621m1067L1179K4164m936j2851
$$ 154395 224064 234866 221488 231673 273541 294391 260770 219703 250882 275046 270110 257259
3471B57259J1704l4059k0557K5695k6224j0246N7446k9283R220K9876L9104m3183
$$ 257259 268963 234904 214347 240042 213818 203572 261018 231735 240955 270831 309935 266752
3459B66752m1082K1125J1941n2735J3682J0748L7779k5279j2435J0011m170J3857
$$ 266752 225670 246795 258736 206001 219683 230431 268210 242931 230496 240507 236337 250194
3447B50194p930K4346L7026N8352j3728n7265O770L0565J665L227J3287M7446
$$ 250194 242264 266610 303636 361988 348260 290995 297765 328330 329995 333222 346509 393955
3435C93955K6394n0246K6685L8074J4056q609j0309r1712k1910m165K2383n5200
$$ 393955 420349 370103 396788 434862 448918 440309 430000 338288 316378 312213 334596 279396
3423B79396m8005J5458j961K8358j9723Q152J3410j1205m2758o025J14144j355
$$ 279396 231391 246849 244888 273246 253523 261675 275085 263880 221122 215097 329241 327886
3411C27886l5635L1606m1970K5027m1485Q756j9463N414L1154Q0339K5359j4276
$$ 327886 292251 323857 281887 306914 265429 274185 254722 260136 291290 371629 396988 382712
3399C82712O677O34M6649N8716K1841R517o263K5598L1967M4190R560K4397k1443
$$ 382712 389389 390023 436672 495388 517229 526746 520483 546081 578048 622238 631798 656195 634752
3386F34752M0814Q3828Q8121N2852K0027r501O097K0495O7041j094k2748n4562
$$ 634752 675566 759394 847515 900367 920394 910893 916990 937485 1004526 1003432 980684 926122
3374I26122k1684l6343k2190l7948K1931l9914k8018j1400j6639K0264r613r010
$$ 926122 904438 868095 845905 807957 829888 789974 761956 750556 733917 754181 744568 735558
3362G35558j623J3616P0235J19954M3178P143O3023K1967L0186L2083J7665l5019
$$ 735558 733935 747551 817786 937740 980918 988061 1051084 1073051 1103237 1135320 1152985 1117966
3350A117966r9960o6709m3733q7341m4803p0500m2554J6221r2368m0823k9854
$$ 1117966 1018006 951297 907564 820223 775420 704920 662366 678587 586219 545396 515542
3339E15542K1773k7840m7329l3771K6829l2648l8742L6290k5544j8498K5770K3945
$$ 515542 537315 509475 462146 428375 455204 422556 383814 420104 394560 376062 401832 425777
3327D25777J6483m1578k2121K7361R40n3246L9301J687l915n29l810p404R139
$$ 425777 442260 400682 378561 405922 406862 353616 392917 394604 390689 390160 386350 378946 388085
3314C88085k0128M396J1047J9532j7612j7835j2030K7472j3098p842K4251k8977
$$ 388085 367957 372353 383400 402932 385320 367485 355455 382927 369829 361987 386238 357261
3302C57261l8219j2043M103N227M1708K169o27n6636m051r464k4070L81K9332
$$ 357261 319042 306999 311102 316329 358037 360206 359579 302943 298892 289428 265358 265739 295071
3289B95071K871r441L3432K1284m36l4907k869M0033K4790l6406O699o151L0091
$$ 295071 297942 288501 321933 343217 342781 307874 305005 345038 369828 333422 340121 333970 364061
3276C64061n280O807M2177l6648M5368J719l8150L5839j4978k9998K2400M8988
$$ 364061 358781 365588 407765 371117 416485 418204 380054 415893 400915 370917 393317 442305
3264D42305J0540m6950l3293J3912J8933J3317O81L666j3573q821k4872j6159
$$ 442305 452845 405895 372602 386514 405447 418764 419445 423111 409538 400717 375845 359686
3252C59686N0894L2887J2491K6422q360L8888Q938r271K8681O097j9389N348L4335
$$ 359686 410580 443467 455958 482380 474020 512908 521846 512575 541256 547353 527964 533312 567647
3239E67647l32j881K1540P790r884j1571L217J4574o205k9700l8995K5253K7270
$$ 567647 567315 565434 586974 594764 584880 573309 576526 591100 584895 555195 516200 541453 568723
3226E68723j4679P3754P101l340J8740m4228L1880K2672j4621K4773M1517K6677
$$ 568723 554044 627798 634899 631559 650299 606071 637951 660623 646002 670775 712292 738969
3214G38969l0996j4418O1187j4054n6443L6255O9079K556J3651l4479L9366J9139
$$ 738969 707973 693555 754742 740688 684245 720500 789579 792135 805786 771307 810673 829812
3202H29812J7074K5352J4725q468l2550P654J3876k655l5334J6149M5401j8231
$$ 829812 846886 872238 886963 878495 845945 853599 867475 864820 829486 845635 891036 872805
3190H72805k388M9765J3057L8569o335K5934n3310l4199K5747K9077M2314n436
$$ 872805 870417 920182 933239 971808 965473 991407 938097 903898 929645 958722 1001036 995600
3178I95600J3819k0802k6448L9919j1267n405N574m977k0678l0063L4187K0268
$$ 995600 1009419 988617 962169 1002088 990821 985416 990990 986013 965335 935272 969459 989727
3166I89727J2863J6543J0757k148J7849Q34l2801k2193K6048j2599k8761l5810
$$ 989727 1002590 1019133 1029890 1027742 1045591 1046425 1013624 991431 1017479 1004880 976119 940309
3154I40309L8760J501K2708l6791m2517K3341j6710Q571o5733l9969p772P96P144
$$ 940309 979069 980570 1003278 966487 923970 947311 930601 939172 873439 833470 825698 826494 833638
3141H33638J862n4444l4106P32M7797M627o0150K7467k9600J8768J4584l9937
$$ 833638 835500 781056 746950 747682 795479 800106 739956 767423 737823 756591 771175 731238
3129G31238L035m2607m7428m22L6927J1165k4335r902n5453r61M7214n3498J0214
$$ 731238 734273 691666 644238 643816 680743 691908 667573 657671 602218 601257 648471 594973 605187
3116F05187K1736l2586k8756p658j1815m3324L7551j9478K7483o2520k3566j1519
$$ 605187 626923 594337 565581 557923 546108 502784 540335 520857 548340 485820 462254 450735
3104D50735j5441l8035O4656J2705n5424K1945p229M4277L7008l0392m6901M498
$$ 450735 435294 397259 461915 474620 419196 441141 433912 478189 515197 484805 437904 442402
3092D42402j0430K2079p2275K9770L9759o964j9479m1652N4937j6459M142L4030
$$ 442402 431972 454051 381776 411546 451305 444341 424862 383210 438147 421688 425830 459860
3080D59860n4246j5167N4284M0963k8934q040O0974K4459l6137l6110l8734J28
$$ 459860 405614 390447 444731 485694 456760 448720 509694 534153 498016 461906 423172 423300
3068D23300l9837k6771Q774R470m005k3663m2241K7187M2855l1928Q527j1500
$$ 423300 383463 356692 365466 374936 370931 347268 305027 332214 375069 343141 351668 340168
3056C40168j5836K1627P205j4951L8666J0514M31M5140M4032j7994j7161J0439
$$ 340168 324332 345959 353164 338213 376879 387393 387824 432964 476996 459002 441841 452280
3044D52280L8802O0848L2364K6560l4487l6820P822l8816n5553n3709o6890J2678
$$ 452280 491082 551930 584294 610854 576367 539547 547369 508553 453000 399291 332401 345079
3032C45079j4399o754K5081j6596k6400r614J5450L4197q2034N450O256k8609
$$ 345079 330680 323926 349007 332411 306011 296397 311847 346044 264010 269460 275716 247107
3020B47107J0336M0605l1507J9612j8249O432L7290l644k1379J9521K8865N7860
$$ 247107 257443 298048 266541 286153 267904 274336 311626 307982 286603 306124 334989 392849
3008C92849K48n3614M1325o612j6416k3137j8855m6700m9356J9021o854q2797
$$ 392849 393097 339483 380808 374196 357780 334643 315788 269088 219732 238753 231899 149102
2996A49102J1666L2431K6460O9515l9484j6163K2503N498l3717J0506Q64l7019
$$ 149102 160768 193199 219659 289174 249690 233527 256030 261528 227811 238317 239181 202162
2984B02162O642J0006O568J532L1526J6521m7644m5692K2646M994o543Q147L6390
$$ 202162 208804 218810 225378 226910 258436 274957 227313 181621 204267 209261 202718 210865 247255
2971B47255J6582l8692m9093N1621O451k5729O705R401L2899K3344K6723n9433
$$ 247255 263837 225145 176052 227673 234124 208395 215100 224501 257400 280744 307467 248034
2959B48034k7584P49j2062M3470Q765k8080k4600k6221O95j2385L0595k073q2414
$$ 248034 220450 221199 209137 252607 261372 233292 208692 182471 183166 170781 201376 199303 116889
2946A16889O1520P1008o13j1568j7097K8724k4472p334K748l6854J6979q396K989
$$ 116889 178409 249417 248804 237236 220139 248863 224391 217057 219805 182951 199930 191534 194523
2933A94523r6l3919L8013K9488k1849L6509q985l1860P738P0165k818Q969K35
$$ 194523 194427 160508 198521 228009 206160 242669 233684 201824 209562 279727 276909 285878 286113
2920B86113j8385l965N9358l7752k3620r085j6653J5711J5495q701m0408L1244
$$ 286113 267728 263763 323121 285369 261749 252664 236011 251722 267217 258516 218108 249352
2908B49352M4389l1996j1752q02N130K8992L0282M7551n4366k1459n5851K5504
$$ 249352 293741 261745 249993 249191 254321 283313 313595 361146 306780 285321 229470 254974
2896B54974N4470o7134M0041M9l9611J2864L8207N2371L0219j9796N3237k1124
$$ 254974 309444 242310 282351 282400 242789 255653 293860 346231 376450 356654 409891 388767
2884C88767J3221j0662k5446k897q189n4061R9M2204O2014m6678Q0922K037k721
$$ 388767 401988 391326 365880 362983 354794 300733 300832 343036 405050 358372 439294 441331 438610
2871D38610n831n3091m3355K7236K4431l6355N0684k081j013n923k0197N3917
$$ 438610 432779 379688 336333 363569 388000 351645 402329 400248 399235 393312 373115 427032
2859D27032O7320J10L0424K3712Q256n8615M3859K6963q072M0354P9583l2377
$$ 427032 494352 494462 524886 548598 556854 498239 542098 569061 560989 601343 680926 648549
2847F48549j094L2513Q5221j3102M1449O3407M8740l266l524M5408O6721K8019
$$ 648549 647455 679968 765189 752087 793536 856943 905683 902417 898893 944301 1011022 1039041
2835A039041P7609J4447N1107O8521N9582K2423R9753R8696J27277R1761Q1271
$$ 1039041 1116650 1131097 1182204 1250725 1310307 1332730 1432483 1531179 1658456 1750217 1831488
2824A831488J10185J00934Q3337J29850J44114J32366J42610J23969J63247J93947
$$ 1831488 1941673 2042607 2125944 2255794 2399908 2532274 2674884 2798853 2962100 3156047
2814C156047J65660J93252K08213K15366K35595J72092K97712L82202L22504L42784
$$ 3156047 3321707 3514959 3723172 3938538 4174133 4346225 4643937 5026139 5348643 5691427
2804E691427M88238N20719O19719P09911P55692P78684R17006R64205J099751
$$ 5691427 6179665 6700384 7320103 8030014 8785706 9564390 10481396 11445601 12545352
2795A2545352J292951J444222J595867J643715J874807K115424K399178K804876
$$ 12545352 13838303 15282525 16878392 18522107 20396914 22512338 24911516 27716392
2787B7716392L231486L557622L354129L21552k098153k174339k495012l001379
$$ 27716392 30947878 34505500 37859629 38181181 36083028 33908689 31413677 28412298
2779B8412298l064451k470034j817248j261521q62581n31447l01385K4339K73867
$$ 28412298 25347847 22877813 21060565 19799044 18936463 18405016 18103631 18127970 18401837
2770A8401837M83372P18242R39571J094608J223532J406503J661940J968213K394892
$$ 18401837 18885209 19603451 20543022 21637630 22861162 24267665 25929605 27897818 30292710
2761C0292710K686385K941425L159358L642874M388204M961492N769049O588499
$$ 30292710 32979095 35920520 39079878 42722752 47110956 52072448 57841497 64429996
2753F4429996O804079J470216m252230m758590n361376o561657o916501n885355
$$ 64429996 71234075 72704291 68452061 63693471 58332095 51770438 44853937 38968582
2745C8968582m546010l492486k801777k124431j741396j293182r14209o66837
$$ 38968582 34422572 30930086 28128309 26003878 24262482 22969300 22055091 21388254
2737B1388254m38544j64194j18143P9529J58537L75758O02012P71438R87063J079073
$$ 21388254 20949710 20785516 20667373 20746902 20905439 21281197 21883209 22654647 23641710 24720783
2727B4720783J277860J517649J922528K230057K611294K980575L247045J498597
$$ 24720783 25998643 27516292 29438820 31668877 34280171 37260746 40507791 42006388
2719D2006388j662686k575902k766706l381599l813686l483303k818183k146312
$$ 42006388 40343702 37767800 35001094 31619495 27805809 24322506 21504323 19358011
2711A9358011j811094j539949j205199j026806q35872p11136n78578n89505m58847
$$ 19358011 17546917 16006968 14801769 13774963 12939091 12227955 11649377 11059872 10601025
2702A0601025m38934m12820l58601l53728k86437k67849k52703k26092j79366
$$ 10601025 10162091 9749271 9390670 9036942 8750505 8482656 8229953 8003861 7824495
2693G824495j52139j70969j02903r8865p5873o9560k4812o7265j50879j65922
$$ 7824495 7672356 7501387 7398484 7299619 7223746 7154186 7129374 7062109 6911230 6745308
2683F745308j71360j92262k83636k77931j95424k63149k21398j67452q5969q6295
$$ 6745308 6573948 6381686 6098050 5820119 5624695 5361546 5140148 4972696 4886727 4800432
2673D800432o2072j75869j47772o7141r1322j08752j17843l9667j19046j15998
$$ 4800432 4738360 4562491 4414719 4347578 4256256 4147504 4029661 3989994 3870948 3754950
2663C754950n3287r7717j15693j13044j37953n1280k0374j23838m0802n8814j8390
$$ 3754950 3701663 3603946 3488253 3375209 3237256 3185976 3165602 3041764 3000962 2942148 2923758
2652B923758n2703m1173k4275j0067k4651q2877n3144p6039n7359k4112k181J520
$$ 2923758 2871055 2829882 2805607 2795540 2770889 2688012 2634868 2558829 2501470 2477358 2475177 2476697
2640B476697k3374r3398k1834l4657o1212L1580l4155j1515k9459l8774j3346
$$ 2476697 2453323 2359925 2338091 2303434 2242222 2273802 2239647 2228132 2198673 2159899 2146553
2629B146553l8813j16694j3363L8917j3834j9414q252L791o387k252j06Q859N796
$$ 2146553 2107740 1991046 1977683 2016600 2002766 1983352 1975100 1978891 1972504 1970252 1970146 1979005 1984801
2616A984801J5698K1512j5369N012M868L4457P4444N6182J7543K2478J2618N4220
$$ 1984801 2000499 2022011 2006642 2011654 2016522 2050979 2125423 2181605 2199148 2221626 2234244 2288464
2604B288464M557M0838M4454M5444L565M7994O073J8167J7333o5223n1209m9064
$$ 2288464 2293021 2333859 2378313 2423757 2427322 2475316 2481389 2499556 2516889 2451666 2400457 2351393
2592B351393l4868o2622q1356l7799q63j15779j43361P36N0602J284L8161n1545
$$ 2351393 2316525 2253903 2172547 2134748 2133885 2018106 1874745 1875481 1926083 1927367 1965528 1913983
2580A913983k6069Q8199m873j936K8377L122k682O9744J04519m1023N4381J6623
$$ 1913983 1887914 1976113 1971240 1969304 1997681 2000803 1998121 2067865 2172384 2131361 2185742 2202365
2568B202365N6603m337m067M0648K6531P3796J9334k0682j9307p6725r3272r1518
$$ 2202365 2258968 2254631 2250564 2291212 2317743 2391539 2410873 2390191 2370884 2294159 2200887 2109369
2556B109369o9090o5612j06606o7812l1107m5306q3658j1561m0016r625J2708
$$ 2109369 2040279 1974667 1868061 1800249 1769142 1723836 1640178 1628617 1588601 1578976 1591684
2545A591684m2307m452n623K9861J4979L807M6082N5576l5246M5679J1968j6213
$$ 1591684 1549377 1544925 1539302 1569163 1584142 1587949 1634031 1689607 1654361 1700040 1712008 1695795
2533A695795n1033r764L9521l1529k1601K2421n2582r1063k5252j2100r5546o8608
$$ 1695795 1644762 1634998 1674519 1642990 1621389 1643810 1591228 1500165 1474913 1462813 1367267 1298659
2521A298659n8476o2756o8003k0370K8680l499l7865k2524j522n1280j2044J5311
$$ 1298659 1240183 1177427 1109424 1089054 1117734 1114235 1076370 1053846 1052324 1001044 989000 1004311
2509A004311L7348K6373r504l419L5602K2051J7174k8341j1558k0667n479P66
$$ 1004311 1041659 1068032 1058528 1055109 1090711 1112762 1129936 1101595 1090037 1069370 1063891 1064657
2497A064657k3992j2936M704K256k6594j7j9636J2799j2584m4648l6786j3645
$$ 1064657 1040665 1027729 1032433 1034689 1008095 1008078 988442 1001241 988657 944009 907223 893578
2485H93578M516J7081p1730q70j3296n147m523L5018Q2663J2854m20M8106K1614
$$ 893578 898094 915175 843445 842575 829279 824132 819609 854627 937290 950144 949724 997830 1019444
2472A019444k3342M6265m5377J5333K3024j0279l8783o5337J3343K236L4534n2578
$$ 1019444 996102 1042367 996990 1012323 1035347 1025068 986285 920948 934291 936527 971061 918483
2460I18483k5939L7841q2448l573o160j10794m069K701o8922k656m1289K2299
$$ 918483 892544 930385 847937 844364 838204 727410 723341 726042 657120 654464 613175 635474
2448F35474K5994j9426J8514K0538P714o585J442j2277l3816M2449k2598j9983
$$ 635474 661468 642042 660556 681094 688808 682223 683665 671388 637572 680021 657423 637440
2436F37440K8416j2026k1713k6012l6713O5140l4929J3496K7479n0948o9590j3420
$$ 637440 665856 653830 632117 606105 569392 634532 599603 613099 640578 589630 520040 506620
2424E06620l9365N8539q384o4101k3947j9686k6j1435l7937p6315N8724J6917
$$ 506620 467255 525794 517410 453309 429362 409676 409650 398215 360278 283963 342687 359604
2412C59604J0810r701j3496l1431k7846M8906K3260j7279q612l591k9819l3954
$$ 359604 370414 360713 347217 315786 287940 336846 360106 342827 334215 330624 300805 266851
2400B66851L971J9648j1962M6910r700j0857J483L1949n4091m034K2942n7208
$$ 266851 270822 290470 278508 325418 315718 304861 306344 338293 284202 280168 303110 245902
2388B45902N6584M6173K3810j4194j2979r039p4487L1708N4524m4753j0270r298
$$ 245902 302486 348659 372469 358275 345296 336257 261770 293478 348002 303249 292979 283681
2376B83681K1184Q269K3072k4847R095M0652M6720m2428l409L8020J7544O499
$$ 283681 304865 313134 336206 311359 320454 361106 407826 365398 361989 400009 417553 424052
2364D24052k1705M1077L8050J7934Q2424J3245l6214m6855R4628L6352m4673j555
$$ 424052 402347 443424 481474 499408 581832 595077 558863 512008 606636 642988 598315 596760
2352E96760M3097j868J1966L1792l2018L8154o971L1551p40J4562K9364j2758
$$ 596760 639857 637989 649955 681747 649729 687883 680912 712463 711723 726285 755649 742891
2340G42891p439K3124N687O926K6419k088k151J7107N0635K667l0655J6550N1167
$$ 742891 735452 758576 764263 771189 797608 795520 793369 810476 861111 863778 833123 849673 900840
2327I00840L2479J9603J4946N2571N7992K9155J9967J4797K9525M212k1392K2558
$$ 900840 933319 952922 967868 1020439 1078431 1107586 1127553 1142350 1171875 1176087 1154695 1177253
2315A177253k9547l663k5346n572m0920l3280m290L745m3095O925l8486l9728
$$ 1177253 1147706 1144043 1118697 1113125 1072205 1038925 1034635 1038380 995285 1002210 963724 923996
2303I23996K394p3258N3824k4010R542r875p3787r585q845K697K426M7902L4538
$$ 923996 926390 853132 906956 882946 892488 882613 808826 799241 790396 793093 795519 843421 877959
2290H77959m6877L5885J6155k6829j6955K5773O672m9925R512J9973j8071j9066
$$ 877959 831082 866967 883122 856293 839338 865111 871783 821858 831370 851343 833272 814206
2278H14206l780j3316m5823K087l2853l0000R436Q508l8826l8539J3211l1220
$$ 814206 810426 797110 751287 753374 720521 690521 699957 708465 669639 631100 644311 613091
2266F13091k3413O735l3111j8489k8390k9150q44J4450p0194K0262k4447j4767
$$ 613091 589678 596413 563302 544813 516423 487273 486429 500879 430685 450947 426500 411733
2254D11733L0864n6691l0240N1079M707p6542j4735J3725M0377k1828L1017o1941
$$ 411733 442597 385906 355666 406745 411452 334910 320175 333900 374277 352449 383466 321525
2242C21525k0922J7270l995Q983r404j452L3366j3944k4996N6685K1361j9750
$$ 321525 300603 317873 313878 322861 313457 312005 345371 331427 306431 363116 384477 364727
2230C64727l8364k8644j2292m4695M3227N017l2862L3139j3045P05o732N724k1090
$$ 364727 326363 297719 285427 240732 283959 288976 256114 289253 276208 276913 270181 275905 254815
2217B54815l7177O7219M021l8747K782J0634k1019j0118N064j2499l2534k0993
$$ 254815 217638 284857 288878 250131 252913 263547 242528 232410 237474 224975 192441 171448
2205A71448M8143j2756j0252j8258M044J7964k5657J16J2639l8829N5124l0340
$$ 171448 219591 206835 196583 178325 182369 200333 174676 174792 187431 148602 203726 173386
2193A73386m886J4569J2440j3038m3877J2908n9448K3310L7764K8968l8615l4608
$$ 173386 168500 183069 195509 182471 138594 151502 92054 115364 153128 182096 143481 108873
2181A08873K7031l3674j4880J6223j9628o903N9141k812j3641K8202r444m2411
$$ 108873 135904 102230 87350 103573 83945 77042 136183 133371 119730 147932 138488 96077
2169I6077O535J5752J4474k3164J7034k400q360j9396m3660j3529j8497K3071
$$ 96077 102612 118364 132838 109674 126708 124308 115948 96552 52892 39363 20866 43937
2157D3937K8421J6284j1588k5719N398L52K2074K1480k8144J2887J8053l8333
$$ 43937 72358 88642 77054 51335 56733 57085 79159 100639 72495 85382 103435 65102
2145F5102J2006N0765o7577L016L6407Q048k5456j8692J5026k2947J9177j0395
$$ 65102 77108 127873 60296 63312 99719 107767 82311 63619 78645 55698 74875 64480
2133F4480Q271r15K3537L9234n821J2459J7296n2994K753K9159n2820k1085K2141
$$ 64480 72751 71836 95373 134607 128786 141245 158541 105547 108300 137459 84639 63554 85695
2120H5695m569k3198J4847J401J3954l5278J1189L846l3466p762J3902r614o948
$$ 85695 81126 57928 72775 74176 88130 52852 64041 67887 34421 26659 40561 30947 23999
2107B3999k4602L0606M305k0937L5694L7311k7607k8949L5432k519j1621N2194
$$ 23999 -603 30003 34308 13371 49065 86376 58769 29820 65252 62733 51112 103306
2095A03306k1656r05J4480P532K904j1850j153m8152M138K471k5195M9104J3326
$$ 103306 81650 80745 95225 102757 105661 93811 92658 44506 48644 51115 25920 75024 88350
2082H8350J0347l152K0294j4763n7817m9172K9983J3290J6408J3672j5686k7597
$$ 88350 98697 95545 115839 101076 43259 -5913 24070 37360 53768 67440 51754 24157
2070B4157K022L2034o246N2120J3151p0495m5384M5394K4345o981K2666l0037
$$ 24157 26179 58213 51967 104087 117238 46743 1359 46753 71098 64117 86783 56746
2058E6746K8944K8994K2413l3560O644j8036n7551j5413O081J7442N059O377l5861
$$ 56746 85690 114684 137097 103537 110181 92145 34594 19181 25262 42704 47763 54140 18279
2045A8279k6060m297L1404L667K5044m7399L5597P705K3015o281o2755M5305N3308
$$ 18279 -7781 -12078 19326 22993 48037 638 36235 43940 66955 60674 -2081 43224 96532
2032I6532K1173k9558m3682K0307j0298M1970k0004N6953l7666n9985L772O727
$$ 96532 117705 88147 44465 64772 54474 96444 76440 133393 95727 35742 39514 46241
2020D6241N896K6801k1734j3235L2205O6341j0679K0366l4905M755N1989k7794
$$ 46241 52137 78938 57204 43969 76174 142515 131836 152202 117297 122052 174041 146247
2008A46247k2372L9538r686l600J7430k3466J4819m0149q575M5753R775P748j2266
$$ 146247 123875 163413 153727 150127 167557 144091 158910 118761 110186 155939 165714 173462 161196
1995A61196j124L9563l4737K8577L8184m3535J3631k537j9106m4919L9059P6910
$$ 161196 160072 199635 164898 193475 231659 188124 201755 199218 180112 135193 174252 251162
1983B51162m6812k3540M0191N5855O6565m8000l9921J2066m0438M672o314k21
$$ 251162 204350 180810 221001 276856 343421 295421 255500 267566 227128 231800 225486 225265
1971B25265K9684M2795p383L1370J263R185l2895M9257n1609k0555J0609L6588
$$ 225265 254949 297744 290361 321731 322994 332179 299284 348541 296932 276377 286986 323574
1959C23574L2546j9734j1396p307j5106M4713j0465l9104M2476k6424j6292n756
$$ 323574 356120 336386 324990 317683 302577 347290 336825 297721 340197 313773 297481 291725
1947B91725p483K2370m099Q82R6616j1133J7255P501J5488l6040j01L592p5516
$$ 291725 284242 306612 302513 303395 400011 388878 406133 413634 429122 393082 392981 396573 321057
1934C21057Q1484l8995K3203j9514o3244K1076K2705J1662K6132l9791k1598l6056
$$ 321057 402541 363546 386749 367235 303991 325067 347772 359434 385566 345775 324177 288121
1922B88121O2543Q149n2959l1502L9903k5944K1859J6248j0389k8626j0931q514
$$ 288121 350664 358813 305854 274352 314255 288311 310170 326418 316029 287403 276472 267958
1910B67958J310r715N7946N1899q669l2714n7446J1930K7307k139l8782q708J5612
$$ 267958 269268 259553 317499 369398 360729 328015 270569 282499 309806 307667 268885 260177 275789
1897B75789l2826n3962N8057k9685k3997P3867k5061o9150K1045m608k884k6191
$$ 275789 242963 189001 247058 217373 193376 267243 242182 173032 194077 189469 186585 160394
1885A60394L273k9733k1947k4172Q1798J0940L2161j9994o6165m2502L5360K3173
$$ 160394 163667 133934 111987 87815 169613 180553 212714 192720 126555 84053 119413 142586
1873A42586L420j6468k6933K0007L9812j1716n7502J4694J3212m4230j7628j0744
$$ 142586 146006 129538 102605 122612 162424 150708 93206 107900 121112 76882 59254 48510
1861D8510K2495K8423q993O733J8690k0328J8907J4342J1197p4621o774N1359
$$ 48510 71005 99428 90435 97168 115858 95530 114437 128779 139976 65355 58581 109940
1849A09940m7321O349k6285l1872K8668L0765j1076M672k3793m3781k6962M4113
$$ 109940 62619 68968 42683 10811 39479 70244 59168 63840 40047 -3734 -30696 13417
1837A3417N7051j1555n314o4470Q1155m4154k8611j2768L2022j6143L6516L6620
$$ 13417 70468 58913 53599 -10871 70284 26130 -2481 -15249 16773 630 37146 73766
1825G3766o6654o802l6290K0676P7454k2421P95L5666j0457o2138l6088L9530
$$ 73766 7112 310 -35980 -15304 62150 39729 40524 76190 65733 3595 -32493 7037
1813G037J0431m904k537Q054l3405M797Q013K3656n336M8158j5869P245j0838
$$ 7037 17468 12564 10027 18081 -15324 -10527 -2514 21142 15806 63964 48095 55340 44502
1800D4502J5012K5096K0893n6314l6155O841M0849L8170k2731r0757J5848O2841
$$ 44502 59514 84610 105503 49189 13034 19875 60724 98894 76163 -14594 1254 64095
1788F4095j1014k4131l7772L8392k4376K777J7763j1848L1121K2157j2018o4806
$$ 64095 53081 28950 -8822 29570 5194 7971 25734 13886 45007 67164 55146 -9660
1776i660L9040N057L3819k1689o3528K4149o783Q878j5853l4295N4502j7197N6501
$$ -9660 29380 34437 68256 46567 -16961 7188 405 9283 -6570 -40865 13637 -3560 52941
1763E2941k337l6116q224j0233j1494M1132k2218O215l008m246j0873J2796N0626
$$ 52941 50604 14488 6264 -3969 -15463 25669 3451 9666 6658 2412 -8461 4335 54961
1750E4961o4481K1680P876K4037K9372l9040J2095J3746k5560j2104l0601L6506
$$ 54961 -9520 12160 20036 44073 73445 34405 46500 60246 34686 22582 -8019 28487
1738B8487J874L23j9103j1163L6585P387l3205M075J1637L6714K739K4126N707
$$ 28487 30361 30684 11581 418 37003 44390 11185 15260 26897 63611 66350 90476 96183
1725I6183J6922k4260n4438J1055J7491J1954m7562K2134L578k6547K372K7431
$$ 96183 113105 88845 34407 45462 62953 74907 27345 49479 53057 26510 28882 56313
1713E6313p4283N077O5277j1637m5874K689O2244l661j2026k8881j1465M2705
$$ 56313 -17970 -12893 52384 40747 -5127 -2438 59806 56145 44119 15238 3773 46478
1701D6478K2270m2851J8105L6420L7697p3683r52j4678K6656R410P92k8643j2856
$$ 46478 68748 25897 44002 80422 118119 44436 43484 28806 55462 64872 65664 37021 24165
1688B4165l4690q907N1097j7708M761j2676k6146Q48R2930j8232j8070k3415r628
$$ 24165 -10525 -19432 31665 13957 18718 6042 -20104 -19256 73674 55442 37372 13957 4329
1675D329K630j4582j8239L3641K016J9854l8388K3550M8433o8027j5265p061N5200
$$ 4329 6959 -7623 -25862 7779 9795 29649 -8739 14811 63244 -4783 -20048 -27109 28091
1662B8091J9226j8996l0053K7270J4263l6465J7662K7115p0251j0157q365L4052
$$ 28091 47317 28321 -1732 25538 39801 3336 20998 48113 -22138 -32295 -40660 -6608
1650f608L0684L182r559N923N366k7227p568K3779k4805k3170M2849J5581j6826
$$ -6608 24076 27258 17699 23622 28988 1761 -5807 17972 -6833 -30003 12846 28427 11601
1637A1601n430M535J5415k9190J0264P660m4176M121K4303p956j6846k1631P038
$$ 11601 6171 10706 26121 -3069 7195 14855 -29321 -25200 -897 -8853 -25699 -47330 -40292
1624d0292M9522J6485k979q870M4176j7640Q8284o2298k668n391p341k4616l8305
$$ -40292 9230 25715 22736 13866 58042 40402 128686 66388 63720 58329 50988 26372 -11933
1611a1933O3028J9458m6873j5529L8695l1346m7995J9267R410J0640Q977k8898
$$ -11933 51095 70553 23680 8151 46846 15500 -32495 -13228 -3818 6822 15799 -13099
1599a3099L4451K0811o5887l652N4492n2799M4505M0373j3433n555k0245o9131
$$ -13099 21352 42163 -23724 -27376 27116 -25683 18822 59195 45762 40207 19962 -49169
1587d9169p598n11J0151k3731P6049j2967j4041K7497m3635K4585L2737K9440
$$ -49169 -56767 -57278 -47127 -70858 5191 -7776 -21817 5680 -37955 -13370 19367 48807
1575D8807N7871j0321q6483m1201K6532N1590M2919k003n2283M4740N3876o5444
$$ 48807 106678 96357 9874 -31327 -4795 46795 89714 87711 35428 80168 134044 68600
1563F8600o1394L8348J8839l3540K8518k940p053K5658n7559J6377K8624j9875
$$ 68600 7206 45554 64393 30853 59371 56431 49378 75036 17477 33854 62478 42603
1551D2603O9791l2514Q499N3207p1119j2018l2875K248j935p084k4572J7361M8240
$$ 42603 112394 79880 88379 141586 70467 58449 25574 27822 25887 18803 -5769 11592 59832
1538E9832j8858K7281J6161K167M6838q0507j3126M1730N869r304P160m829K0135
$$ 59832 40974 68255 84416 86583 133421 52914 39788 81518 87387 78083 85243 80414 100549
1525A00549J5455J4173J4205l824K1730J1137k3634K2456J4196n0313L675K5798
$$ 100549 116004 130177 144382 140558 162288 173425 149791 172247 186443 136130 139805 165603
1513A65603L4243m2094l2133N0476J1606J9280K6263K5442L8503N9689M3186P511
$$ 165603 199846 157752 125619 176095 187701 206981 233244 258686 297189 356878 400064 407575
1501D07575L8040Q6958L591o434P7361P040J867L3743M7858N1405M8613O6909
$$ 407575 445615 532573 536164 529730 607091 614131 615998 649741 697599 749004 797617 864526
1489H64526J651J02908M1360M3083R9925J11007R8093R9194J61982J74536J28921
$$ 864526 866177 969085 1010445 1053528 1153453 1264460 1362553 1461747 1623729 1798265 1927186
1478A927186J50355K21645K94629L07047J88514K54606K90269L86563M17949N30919
$$ 1927186 2077541 2299186 2593815 2900862 3089376 3343982 3634251 4020814 4438763 4969682
1468D969682M95181O01784O73251Q13704R01035J070264J207597J453070M76539
$$ 4969682 5464863 6066647 6739898 7553602 8454637 9524901 10732498 12185568 12662107
1459A2662107q73606r03778r49422j283721j366545j083401q24412o42947o15034
$$ 12662107 11788501 10884723 9935301 8651580 7285035 6201634 5377222 4734275 4119241
1450D119241m38248l28005k82966k84084k08638j31561j86587j17631j14156r3487
$$ 4119241 3680993 3352988 3070022 2785938 2577300 2445739 2259152 2141521 2027365 1933878
1440A933878j11033q7545j16234j51796j8674p2100q0873k6891p4200j02897j5052
$$ 1933878 1822845 1735300 1619066 1467270 1448596 1376496 1295623 1268732 1194532 1091635 1076583
1429A076583p9562l1725k6701J2297j4651l1798l3184r2367Q960p100L0553k0772
$$ 1076583 997021 965296 938595 950892 936241 904443 871259 778892 787852 780752 811305 790533
1417G90533Q355j8662o8479j0533o3886O253m1336m9505K4185k2486k3065K8655
$$ 790533 798888 780226 711747 701214 637328 643581 602245 552740 576925 554439 531374 560029
1405E60029l6064J6474m6601k375P145j11629L391N0401P731r23j1491o4113j3567
$$ 560029 523965 540439 493838 491463 498608 386979 390370 440771 448502 447579 436088 371975 358408
1392C58408M0957q1303l2970K9370L0814j2446j7203J1117K0109j2835l7186j4239
$$ 358408 399365 318062 285092 314462 345276 332830 315627 326744 346853 334018 296832 282593
1380B82593J6898K993l5701k0640l8582J2429O3J9923j1093M7391M7647o0678
$$ 282593 299491 302484 266783 246143 207561 219990 220053 239976 228883 276274 323921 263243
1368B63243k3017N429o9845Q0430K6437m9540J063p721m5723m8500k3610N4036
$$ 263243 240226 245655 175810 256240 282677 233137 234200 226479 180756 132256 108646 162682
1356A62682j8306J694N65m764L6870j7623j0995k5122l4413N9537J9158J5623
$$ 162682 144376 146070 146635 141871 178741 161118 150123 125001 90588 150125 169283 184906
1344A84906j4130k0716K5474k7411j2490k8024J629k516o7357L8941K4663O451
$$ 184906 170776 150060 175534 148123 135633 107609 109238 106722 39365 78306 102969 109420
1332A09420N4358J6200n8305Q984p779n6274K1201K1412O083k5311J3545j8932
$$ 109420 163778 179978 121673 130657 122878 66604 87805 109217 115300 89989 103534 84602
1320H4602l8753L8696M7079k2340P365j0746k1065J1495n7441k8730N6505l2087
$$ 84602 45849 84545 131624 109284 116649 105903 84838 96333 38892 10162 66667 34580
1308C4580J3009q771J0612r28N3794j0988j1577K6071p1586j294J2078o609N5413
$$ 34580 47589 38818 49430 48502 102296 91308 79731 105802 34216 32922 45000 38391 93804
1295I3804m8885L0972k3029J5123K8812l8807L8733k4037p499L3384k9189L2786
$$ 93804 44919 75891 52862 67985 96797 57990 96723 72686 65187 98571 69382 102168
1283A02168N4003q020q8484j4127O993j8750L2108l5514J7031N0096m9988o107
$$ 102168 156171 148151 59667 45540 52533 33783 65891 30377 47408 97504 47516 41409
1271D1409l2755j0889J970N565P0817j4040n704O331p898L4327K2574m3601J6635
$$ 41409 8654 -2235 -265 5300 76117 62077 56373 62704 54806 89133 111707 68106 84741
1258H4741p92o0423m887M5944j2627O72r838j6287j2734M120J1279j2384k4854
$$ 84741 83949 23526 18639 64583 51956 52628 42790 26503 13769 17889 29168 16784 -8070
1245h070P073K5271N5354n9649m0856Q6956J1664l4948p782J340N846J1400M0079
$$ -8070 -997 24274 79628 19979 -20877 66079 77743 42795 35013 36353 42199 53599 93678
1232I3678L210j7518m280m678k8761k295l8476J0909N5375J854J7346p27k5710
$$ 93678 96888 79370 75090 70412 41651 39356 880 11789 67164 69018 86364 85637 59927
1219E9927o0224k941L2811J2087J8517K0820m4j9362k4426k0748L2118K2181j8951
$$ 59927 -297 -3238 29573 41660 60177 80997 80953 61591 37165 16417 48535 70716 51765
1206E1765k5576j9130J8402J9604l8718J7388q222L0849J3143J061K5704m0876
$$ 51765 26189 7059 25461 45065 6347 23735 15513 46362 59505 60566 86270 45394
1194D5394m7174M7877M8958l800N3258m1114k4476K970m4495R870j6393N2345
$$ 45394 -1780 46097 95055 91255 144513 103399 78923 81893 37398 47268 30875 83220
1182H3220J0402k2235j8382O547n129O00J7394J334j4436n9534M1416L4240k3664
$$ 83220 93622 71387 53005 59552 54423 55023 72417 73751 59315 -219 41197 75437 51773
1169E1773l8316K3611J1447m3164J8443M836j9954K030L0066k072j5687M8139
$$ 51773 13457 37068 48515 5351 23794 28630 8676 10706 40772 38700 23013 71152
1157G1152l7636k9602K6630J4772l9317K2361l677l47j2621K3021l2773m2620
$$ 71152 33516 3914 30544 45316 5999 28360 24683 24336 11715 34736 1963 -40657
1145d0657J4243R141n8413M9044J9003l0942K2945O9198J5116M062R35q9922n0225
$$ -40657 -26414 -17273 -75686 -26642 -7639 -38581 -15636 53562 68678 72740 73675 -16247 -66472
1132f6472O4508M3977m8045N083L092M0173J6221k4936L69M0116n3175J7630q541
$$ -66472 -1964 42013 -6032 -949 2143 42316 58537 33601 33970 74086 20911 38541 30000
1119C0000K3479l7419M0715P498m1179M4983j3593l2691M3129m565P588j4979
$$ 30000 53479 16060 56775 64273 23094 68077 54484 21793 64922 60357 67945 52966
1107E2966m1757r0209K845L592K0047Q1105n564j8898m2859K6448O330l0011j3859
$$ 52966 11209 -79000 -76155 -72563 -52516 28589 23025 4127 -38732 -12284 -5954 -35965 -49824
1094d9824M9808J6488K3273k3144k3458j8280M192j8533J0839J2947j9963M7261
$$ -49824 -16 16472 39745 16601 -6857 -25137 -20945 -39478 -28639 -15692 -35655 11606
1082A1606L159k5996K6670O432P898m0043l3826m5787K4787L2511k8806N2947
$$ 11606 14765 -11231 15439 21871 29769 -10274 -44100 -89887 -65100 -32589 -61395 -8448
1070h448N8465l7915j1194j2476Q170P671q182J3220O2935r162n9295J2082k2107
$$ -8448 50017 12102 908 -11568 -3398 4273 -3909 9311 72246 63084 3789 15871 -6236
1057f236l1396k8825m341L0033K5902J8732P6430m9755K4624k448k0402L0649
$$ -6236 -37632 -66457 -70798 -40765 -14863 3869 80299 30544 55168 52720 32318 62967
1045F2967o509l23m1318J1303n6776j1624L7868J6984k3526n5846n2682K7416
$$ 62967 56458 56135 14817 26120 -30656 -42280 -4412 12572 -10954 -66800 -119482 -92066
1033i2066P5344M8502m5954n0320N5396M553J6637J7575P184j9342l5077J2183
$$ -92066 -16722 31780 -14174 -64494 -9098 -4545 12092 29667 36851 17509 -17568 -5385
1021e385J0649l7034M5711J91l1782j2663K5046J3185K7905r57m3656K2181l4857
$$ -5385 5264 -31770 13941 14132 -17650 -30313 -5267 7918 35823 34866 -8790 13391 -21466
$$ [...]
##END NTUPLES=NMR SPECTRUM
##END=
