##TITLE=1H_CA-9265-1
 DMSO
 8 sc, 
 6.5.2024
##JCAMPDX= 6.0         $$ Bruker NMR JCAMP-DX V2.0
##DATA TYPE= NMR SPECTRUM
##DATA CLASS= NTUPLES
##ORIGIN= UXNMR, Bruker Analytische Messtechnik GmbH
##OWNER= root
$$ XWIN-NMR		Version 3.5
$$ Mon May  6 15:33:06 2024 Russian Standard Time (UT+4h)  she@DPX200
##.OBSERVE FREQUENCY= 200.1309
##.OBSERVE NUCLEUS= ^1H
##.ACQUISITION MODE= SIMULTANEOUS
##.ACQUISITION SCHEME= undefined
##.AVERAGES= 8
##.DIGITISER RES= 18
##SPECTROMETER/DATA SYSTEM= spect
##.PULSE SEQUENCE= zg30
##.SOLVENT NAME= CDCl3
##.SHIFT REFERENCE= (INTERNAL, CDCl3, 0, 16.4631)
##AUDIT TRAIL= $$ (NUMBER, WHEN, WHO, WHERE, WHAT)
$$ ##TITLE= Audit trail, XWIN-NMR		Version 3.5
$$ ##JCAMPDX= 5.01
$$ ##ORIGIN= Bruker BioSpin GmbH
$$ ##OWNER= she
$$ F:/spectra/data/she/nmr/H-F/1/pdata/1/auditp.txt
$$ ##AUDIT TRAIL=  $$ (NUMBER, WHEN, WHO, WHERE, WHAT)
(   1,<2024-05-06 15:32:01.42 +0400>,<she>,<DPX200>,
      <created by zg, POWCHK disabled, PULCHK disabled
       configuration hash MD5:
       00 E9 B6 7A A2 85 ED C7 34 08 36 98 17 FE 4E 26
       data hash MD5: 16K
       43 0F 6C D7 BD 99 56 60 74 63 C3 BA E0 DF 07 6F>)
(   2,<2024-05-06 15:32:04.07 +0400>,<she>,<DPX200>,
      <Start of raw data processing
       efp BC_mod = 2 LB = 0.24 FT_mod = 6 PKNL = 1 PHC0 = -25293.55 PHC1 = 4.587494 SI = 16K 
       data hash MD5: 16K
       EF D4 4B 02 7F 98 4B 41 8B F2 8B 59 AA 86 17 C1>)
(   3,<2024-05-06 15:32:24.79 +0400>,<she>,<DPX200>,
      <pk PHC0 = -86.63046 PHC1 = 6.2 
       data hash MD5: 16K
       1B 68 3F A5 8E 55 44 27 53 E5 35 95 A8 51 7C 6A>)
(   4,<2024-05-06 15:32:28.09 +0400>,<she>,<DPX200>,
      <abs ABSG = 5 
       data hash MD5: 16K
       9B 10 6D E0 C2 06 D0 32 03 7F CD F7 B1 4E D8 9F>)
$$ ##END=
$$ 
$$ hash MD5
$$ 45 3F 33 EE E6 37 37 BC 28 F5 21 CE E2 1E B1 F0
##$RELAX= 
##$RELAX= 
##$RELAX= 
##$RELAX= 
##$RELAX= 
##$RELAX= 
$$ Bruker specific parameters
$$ --------------------------
##$DU= <F:/spectra>
##$EXPNO= 1
##$NAME= <H-F>
##$PROCNO= 1
##$TYPE= <nmr>
##$USER= <she>
##$AMP= (0..31)
100 100 100 100 100 100 100 100 100 100 100 100 100 100 100 100 100 100 
100 100 100 100 100 100 100 100 100 100 100 100 100 100 
##$AQSEQ= 0
##$AQ_mod= 1
##$AUNM= <au_zg>
##$AUTOPOS= <>
##$BF1= 200.13
##$BF2= 200.13
##$BF3= 200.13
##$BF4= 200.13
##$BF5= 200.13
##$BF6= 200.13
##$BF7= 200.13
##$BF8= 200.13
##$BYTORDA= 1
##$CFDGTYP= 0
##$CFRGTYP= 5
##$CHEMSTR= <none>
##$CNST= (0..31)
1 1 145 1 1 1 1 1 1 1 1 1 1 1 1 1 1 1 1 1 1 1 1 1 1 1 1 1 1 1 1 1 
##$CPDPRG= <>
##$CPDPRG1= <>
##$CPDPRG2= <>
##$CPDPRG3= <>
##$CPDPRG4= <mlev>
##$CPDPRG5= <mlev>
##$CPDPRG6= <mlev>
##$CPDPRG7= <mlev>
##$CPDPRG8= <mlev>
##$CPDPRGB= <>
##$CPDPRGT= <>
##$D= (0..31)
0 1.2 0 0 0 0 0 0 0 0.06 0 0.03 0 0 0 0 0.0002 0 0 0 0 0 0 0 0 0 0 0 0 
0 0 0 
##$DATE= 1714995120
##$DBL= (0..7)
120 120 120 120 120 120 120 120 
##$DBP= (0..7)
150 150 150 150 150 150 150 150 
##$DBP07= 0
##$DBPNAM0= <>
##$DBPNAM1= <>
##$DBPNAM2= <>
##$DBPNAM3= <>
##$DBPNAM4= <>
##$DBPNAM5= <>
$$ [...]
##$SUBNAM3= <"">
##$SUBNAM4= <"">
##$SUBNAM5= <"">
##$SUBNAM6= <"">
##$SUBNAM7= <"">
##$SUBNAM8= <"">
##$SUBNAM9= <"">
##$SW= 18.0517689322627
##$SWIBOX= (0..15)
0 0 2 0 0 0 0 0 0 0 0 0 0 0 0 0 
##$SW_h= 3612.71676300578
##$TD= 16384
##$TD0= 1
##$TE= 0
##$TE2= 300
##$TE3= 300
##$TEG= 300
##$TL= (0..7)
0 120 120 120 120 120 120 120 
##$TP= (0..7)
150 150 150 150 150 150 150 150 
##$TP07= 0
##$TPNAME0= <>
##$TPNAME1= <>
##$TPNAME2= <>
##$TPNAME3= <>
##$TPNAME4= <>
##$TPNAME5= <>
##$TPNAME6= <>
##$TPNAME7= <>
##$TPOAL= (0..7)
0.5 0.5 0.5 0.5 0.5 0.5 0.5 0.5 
##$TPOFFS= (0..7)
0 0 0 0 0 0 0 0 
##$TUNHIN= 0
##$TUNHOUT= 0
##$TUNXOUT= 0
##$USERA1= <user>
##$USERA2= <user>
##$USERA3= <user>
##$USERA4= <user>
##$USERA5= <user>
##$V9= 5
##$VALIST= <valist>
##$VCLIST= <CCCCCCCCCCCCCCC>
##$VD= 0
##$VDLIST= <DDDDDDDDDDDDDDD>
##$VPLIST= <PPPPPPPPPPPPPPP>
##$VTLIST= <TTTTTTTTTTTTTTT>
##$WBST= 1024
##$WBSW= 4
##$XGAIN= (0..3)
0 0 0 0 
##$XL= 0
##$YL= 0
##$YMAX_a= 277691
##$YMIN_a= -254487
##$ZGOPTNS= <>
##$ZL1= 120
##$ZL2= 120
##$ZL3= 120
##$ZL4= 120
##$ABSF1= 16.46311
##$ABSF2= -1.588793
##$ABSG= 5
##$ABSL= 3
##$ALPHA= 0
##$AQORDER= 0
##$ASSFAC= 0
##$ASSFACI= 0
##$ASSFACX= 0
##$ASSWID= 0
##$AUNMP= <proc_1d>
##$AZFE= 0.1
##$AZFW= 0.1
##$BCFW= 0
##$BC_mod= 2
##$BYTORDP= 0
##$COROFFS= 0
##$CY= -3
##$DATMOD= 1
##$DC= 0
##$DFILT= <>
##$DTYPP= 0
##$F1P= 0
##$F2P= 0
##$FCOR= 1
##$FTSIZE= 16384
##$FT_mod= 6
##$GAMMA= 0
##$GB= 0
##$INTBC= 1
##$INTSCL= 3.70164e-10
##$ISEN= 128
##$LB= 0.24
##$LEV0= 0
##$LPBIN= 0
##$MAXI= 10000
##$MC2= 0
##$MEAN= 0
##$ME_mod= 0
##$MI= 1.114404
##$NCOEF= 0
##$NC_proc= -8
##$NLEV= 6
##$NOISF1= 3.799351
##$NOISF2= 2.8
##$NSP= 0
##$NTH_PI= 0
##$NZP= 0
##$OFFSET= 16.46311
##$PC= 1
##$PHC0= -25380.18
##$PHC1= 10.78749
##$PH_mod= 1
##$PKNL= yes
##$PPARMOD= 0
##$PSCAL= 0
##$PSIGN= 0
##$REVERSE= no
##$SF= 200.129411606066
##$SI= 16384
##$SIGF1= 3
##$SIGF2= 2
##$SINO= 5.538805
##$SIOLD= 16384
##$SREGLST= <1H.CDCl3>
##$SSB= 0
##$STSI= 16384
##$STSR= 0
##$SW_p= 3612.71676300577
##$SYMM= 0
##$S_DEV= 0
##$TDeff= 16384
##$TDoff= 0
##$TI= <>
##$TILT= no
##$TM1= 0
##$TM2= 0
##$TOPLEV= 0
##$USERP1= <user>
##$USERP2= <user>
##$USERP3= <user>
##$USERP4= <user>
##$USERP5= <user>
##$WDW= 1
##$XDIM= 16384
##$YMAX_p= 478449012
##$YMIN_p= -515062
$$ End of Bruker specific parameters
$$ ---------------------------------
##NTUPLES= NMR SPECTRUM
##VAR_NAME=  FREQUENCY,     SPECTRUM/REAL,   SPECTRUM/IMAG
##SYMBOL=    X,             R,               I
##VAR_TYPE=  INDEPENDENT,   DEPENDENT,       DEPENDENT
##VAR_FORM=  AFFN,          ASDF,            ASDF
##VAR_DIM=   16384,         16384,           16384
##UNITS=     HZ,            ARBITRARY UNITS, ARBITRARY UNITS
##FACTOR=    0.220516191357247, 1,           1
##FIRST=     3294.75251152063, 0,            0
##LAST=      -317.964251485145, 0,           0
##MIN=       -317.964251485145, -515062,     0
##MAX=       3294.75251152063, 478449012,    0
$$ Real data points
##PAGE= N=1
##DATA TABLE= (X++(R..R)), XYDATA
$$ [...]
9633 1024850 1034843 1051488 1057574 1069489 1088470 1140824 1137725 1116523 1108162 1122227 1126331 1139973
9621 1139973 1175710 1179238 1179993 1208332 1207607 1220006 1246173 1248757 1255769 1245929 1263808 1281703 1297187
9608 1297187 1314206 1337324 1351670 1323303 1325131 1339169 1359513 1376600 1383285 1397204 1406964 1414006
9596 1414006 1448664 1462420 1469031 1478956 1480461 1502138 1514786 1534667 1534970 1538396 1546048 1572727 1588904
9583 1588904 1612942 1629120 1628748 1612455 1613331 1635942 1670679 1660832 1679126 1691222 1673388 1683435
9571 1683435 1708495 1728093 1707719 1724388 1711096 1725667 1747635 1766473 1759139 1770708 1787338 1766011
9559 1766011 1776705 1805869 1831529 1824734 1827762 1822419 1838193 1848649 1856629 1879045 1871806 1858057
9547 1858057 1863431 1871973 1855900 1841228 1858915 1889769 1886573 1872000 1890395 1884049 1877410 1916394
9535 1916394 1913970 1902101 1897643 1905355 1909593 1908418 1915126 1936141 1938629 1942243 1960636 1964325 1929348
9522 1929348 1940198 1942361 1938046 1945052 1945501 1936710 1933505 1949296 1952794 1950745 1935409 1912709 1919343
9509 1919343 1922981 1918270 1907063 1887628 1878451 1872697 1858320 1857810 1863862 1866513 1857614 1844319 1830122
9496 1830122 1809575 1800747 1808080 1787356 1799816 1788090 1749584 1731832 1708252 1710803 1692622 1679661
9484 1679661 1666121 1660394 1658187 1646682 1644693 1623107 1608607 1580663 1559491 1556291 1540481 1526011
9472 1526011 1529934 1494635 1481355 1486280 1448225 1410541 1424205 1420549 1401941 1404924 1392219 1380916
9460 1380916 1354250 1320611 1318406 1314481 1294734 1290063 1286659 1252369 1234989 1223536 1234025 1241204
9448 1241204 1224813 1184789 1178425 1178702 1156017 1138732 1132542 1118453 1099498 1086756 1072986 1086592
9436 1086592 1050276 1058965 1058144 1042135 1057394 1045565 1022881 1019860 997988 1011708 986963 996876
9424 996876 987555 954091 964885 965415 950715 957245 924292 921551 912776 897861 895429 871271 830989
9411 830989 849735 879339 867763 858011 862834 867954 852456 864657 864234 827824 806993 814952 802659
9398 802659 787091 799794 808594 796888 773460 778221 780991 732470 729785 739760 720949 723168 717349
9385 717349 717862 706897 705695 684253 677411 706203 711973 707927 698298 683947 675209 669235 684608
9372 684608 677172 679617 677282 656311 648855 683798 684779 668720 667909 685524 634426 579626 586258
9359 586258 605704 616052 609268 627131 619642 610475 589101 577340 575266 595256 599432 624674 601712
9346 601712 605993 598123 585693 592069 587338 595015 591071 603269 574253 558675 586424 609843 588345
9333 588345 578952 599684 587824 592503 601627 627448 644822 716557 364498 318538 448931 488048
9321 488048 523038 504637 511120 538789 538825 513532 547602 517294 542786 541298 535197 513676 544647
9308 544647 537100 545111 541073 552519 534029 521513 534969 550475 530409 518690 520919 539297
9296 539297 516654 517664 515234 528021 506618 502673 506479 505899 512535 515747 513301 510333 508014 519870
9282 519870 491870 485654 511010 503275 526847 532561 507279 506009 517409 512287 524022 549578 525240
9269 525240 517560 508268 500178 530646 529322 510544 495620 516853 510902 503661 514021 517596 526522
9256 526522 529090 510374 524204 517979 512043 523861 543868 523556 505832 513155 521336 515735 531424
9243 531424 531395 512724 536600 502329 505018 500854 513139 532369 504378 496277 500137 485992 481640
9230 481640 512526 499040 499028 510695 518337 513028 520431 516221 519417 524742 526143 528396 524172 502124
9216 502124 506008 524434 523096 523488 508553 507806 530897 514862 509325 494328 485136 509768 491014
9203 491014 497258 487842 506726 511945 487613 499274 509810 505758 492866 526173 525468 525712 517657
9190 517657 501090 513958 492744 508831 488023 481224 493850 482036 498776 497500 486142 481365
9178 481365 501988 474151 468242 467591 463704 467922 467884 476732 501930 508706 506018 510561 489817 495239
9164 495239 486244 508699 507247 499024 496944 484115 466201 469473 456321 467816 485455 513984 530699
9151 530699 510336 508779 494690 485495 499275 492722 486507 481776 479434 475086 474824 482260 465936 484846
9137 484846 511713 487194 477930 473702 480349 476220 514336 509156 468076 466111 474491 475773 482791
9124 482791 482061 466347 493387 504638 504667 503309 499992 488385 493368 502038 504804 511767 520526 492365
9110 492365 498888 496458 505401 500660 486343 485427 513564 530111 520434 520581 530161 536402 509964 490728
9096 490728 508152 499735 508504 485447 485194 526405 547056 526913 521801 524492 523235 539396 558258
9083 558258 551258 536308 563769 576877 547374 536360 548292 556277 559892 571665 591442 591505 583711
9070 583711 569858 565015 566592 569570 587482 589035 598708 619631 600336 586845 578336 593344 605425
9057 605425 602216 605636 606580 589897 587297 588133 611520 627005 619253 609623 639367 645875 625079 625243
9043 625243 648356 647553 672781 659135 650082 672732 659686 647606 656697 659450 678914 675302 679770
9030 679770 682062 687883 705777 702683 682024 675806 691660 675728 686168 695724 710696 696943 666815
9017 666815 682776 689517 693635 711875 732566 707788 691916 709383 710477 699644 731497 703834
9005 703834 713804 731486 729506 727030 732288 756263 760877 755795 761842 762134 763246 761903 768925 767838
8991 767838 750125 782374 762929 760861 763631 794173 782701 754569 760810 774675 777412 777875 779590
8978 779590 778548 772101 798466 778806 789988 773349 778705 808822 805419 813387 819009 819412 822230
8965 822230 816520 803221 770393 800306 829935 834800 831118 805115 770262 781273 799963 812033
8953 812033 809053 784490 785897 807986 801497 785295 796388 808851 825915 822558 804719 800642 817780
8940 817780 810952 800501 791823 801768 792405 822695 842856 824412 808331 820410 830173 824034 825048
8927 825048 831462 842997 828869 832214 824101 822038 819512 836209 827533 805451 842822 840560 826686
8914 826686 852023 857976 867745 874411 854735 850324 872123 876152 860410 848997 861530 846521 861218
8901 861218 881196 889990 904379 882021 892414 894213 914577 898578 901203 894280 926512 924542 899344
8888 899344 936743 946687 944679 940298 942866 954606 966106 971196 972476 988073 994884 983332 985460
8875 985460 1018592 1000327 1027209 966121 977563 1035227 1043482 1042319 1056242 1075648 1065852 1052109
8863 1052109 1068127 1069950 1076635 1095913 1087756 1111457 1120553 1148247 1132958 1112079 1119085 1149711
8851 1149711 1175967 1183888 1196479 1236792 1221006 1219113 1247815 1260623 1264527 1279486 1305704 1316100
8839 1316100 1298325 1301891 1358877 1383142 1377337 1376563 1361682 1381607 1401727 1392557 1394274 1430372 1453166
8826 1453166 1450554 1465984 1486808 1478192 1503722 1517877 1533761 1554594 1556419 1572171 1598288 1625941
8814 1625941 1642350 1662879 1654889 1679665 1691885 1703087 1703433 1721892 1767182 1763647 1778666 1786819
8802 1786819 1804932 1800557 1840058 1893852 1893777 1894537 1922170 1954777 1966934 1998017 2013757 2057658 2063624
8789 2063624 2066332 2092382 2094287 2095303 2104289 2138942 2154764 2168642 2189188 2220683 2206304 2221490
8777 2221490 2253003 2279138 2297647 2327865 2381027 2398258 2419060 2453553 2462562 2469282 2482701 2519818
8765 2519818 2558406 2567234 2581710 2593409 2602266 2631295 2658549 2683174 2659158 2671768 2702482 2716472
8753 2716472 2748478 2771988 2820832 2853321 2866443 2871248 2904124 2925212 2934125 2934560 2967715 2977085
8741 2977085 2992189 2991434 3022910 3031078 3048158 3083400 3106446 3133613 3152420 3146650 3144966 3174273
8729 3174273 3189279 3220762 3235378 3268485 3271510 3270902 3286185 3302622 3308886 3332284 3349198 3368408
8717 3368408 3373319 3380940 3360138 3375430 3394761 3416928 3454284 3464850 3471401 3462105 3481878 3504754
8705 3504754 3486002 3470577 3496375 3525020 3534977 3527594 3530882 3515517 3504599 3523465 3520307 3542114
8693 3542114 3582357 3590055 3550623 3559042 3572378 3568898 3571386 3542766 3537587 3537130 3543886 3559803 3538165
8680 3538165 3534124 3518485 3528662 3514579 3495213 3473555 3473903 3467139 3461814 3456757 3456552 3455306 3444637
8667 3444637 3436463 3409302 3404176 3396836 3359221 3330670 3331591 3308294 3299409 3274843 3246460 3243272 3233857
8654 3233857 3204733 3199685 3150277 3132536 3116296 3101187 3096373 3083724 3051715 3031877 3045619 2996855
8642 2996855 2958136 2931503 2939672 2923133 2901904 2868360 2815834 2791607 2807106 2786311 2733287 2740118
8630 2740118 2685395 2665736 2671211 2637751 2612328 2583942 2576939 2557851 2516137 2500984 2465337 2448652
8618 2448652 2424742 2403947 2416775 2397071 2338614 2341931 2333517 2315923 2283035 2260560 2244596 2236491
8606 2236491 2246179 2242968 2182333 2185189 2146535 2144121 2096296 2110061 2083306 2072488 2097736 2053974
8594 2053974 2021634 2004747 1986500 2013686 1990943 1997744 1950084 1987887 1937987 1982424 1959512 2072418
8582 2072418 2083041 2533622 2275305 1453694 1566979 1516529 1579853 1575498 1622227 1561425 1571491
8571 1571491 1537717 1554322 1514425 1523566 1523245 1506263 1471894 1495778 1486979 1488578 1480501 1455989 1401303
8558 1401303 1382341 1419788 1432086 1391350 1389646 1384361 1387826 1379013 1381663 1348754 1347579 1354062 1283964
8545 1283964 1299403 1309590 1287789 1289503 1259084 1223079 1237385 1226824 1194314 1180381 1197638 1197570
8533 1197570 1192404 1183135 1166826 1171977 1154491 1136398 1124730 1098820 1088734 1102661 1092839 1069897
8521 1069897 1057658 1071211 1047042 1043725 1037873 1019862 1059181 1053267 1025082 1006822 997568 961393
8509 961393 978043 984554 965007 955006 933986 920426 893540 883935 894962 902857 883668 871514
8497 871514 894112 879810 858391 829240 823463 841627 863108 888176 895122 861246 842360 820077
8485 820077 789253 803995 799658 803969 841301 835960 818508 767531 761022 777172 763168 766529 756464
8472 756464 757238 738793 737189 761319 747473 764877 738206 757510 723624 723566 710256 712710 707230
8459 707230 720561 719141 722584 731272 719101 690851 685369 701582 693260 665786 661095 660042 646867
8446 646867 664889 672487 684045 692377 686579 651161 632511 644037 665175 650116 639599 654657
8434 654657 653757 636956 648577 666125 646922 626965 628040 596088 588794 625121 623451 618882 604062
8421 604062 608619 641697 645826 607514 599908 584058 586677 596955 613971 595442 589592 597999 568073
8408 568073 566851 574245 597568 603792 583373 588725 568985 558811 570805 575772 559212 561352 561993
8395 561993 535093 554733 601975 595548 591269 562116 576371 547120 520194 575638 537539 528494
8383 528494 562893 584039 587480 571188 533658 509363 527482 557305 531982 539131 519485 531584
8371 531584 509633 519937 523410 508208 514033 523810 529034 529948 517019 482922 479550 500575 491681
8358 491681 483563 497342 502041 492016 495167 486240 528373 525065 502488 497159 505620 501720 465739
8345 465739 448042 414574 444331 503090 470914 458033 446645 431788 433805 461600 439864 403450
8333 403450 401951 416247 406015 434976 428152 447120 433304 397575 401479 419560 433001 410260
8321 410260 419363 398033 357361 379812 401554 380091 352015 397132 413969 417115 402858 358960
8309 358960 387651 363714 331237 325723 337089 337973 333028 319219 296740 296889 310174 259765 301499
8296 301499 303453 336508 322169 314064 355164 358644 345219 313952 290051 329364 318335 316707
8284 316707 307745 314657 289804 249302 278883 293423 307285 284879 271197 259158 278350 272638
8272 272638 243735 254504 271640 306147 303064 251423 247979 265839 241339 222126 225135 238308
8260 238308 227943 223658 226162 213641 231786 232661 218826 219628 210283 238672 229278 211005 236502
8247 236502 189750 195172 149516 203213 189354 185511 245969 220399 225653 270037 306514 190265
8235 190265 188300 229960 213467 168063 125631 163970 168958 181299 176048 178646 191429 190600 144652
8222 144652 105605 106894 216976 222149 191794 138983 196136 236020 212879 163972 137770 243715
8210 243715 244270 275637 273365 299169 308607 314107 224443 292884 338519 319197 253515 340813 406008
8197 406008 475076 334381 399118 254615 634626 624992 71145 70881 -150315 -87020 -85575
8186 -85575 -110851 -125324 25229 14464 -2996 -23902 -55500 -154446 -38631 94119 132277
8175 132277 43864 46815 31084 32952 63808 84318 125744 119985 97599 20145 62851 87525
8163 87525 68571 70485 107932 45680 13658 70224 56267 -15130 -33249 -37683 65493 69480
8151 69480 97552 133965 94692 73397 66662 53473 32155 36033 67823 71247 46875 34505
8139 34505 7643 26583 61093 22272 9549 39081 68821 54216 10983 15785 60633 58570
8127 58570 97743 65743 50598 40977 19917 35494 34002 36252 42217 41794 11756 52503 73741
8114 73741 124710 76175 53097 81681 58338 42337 37710 41840 23913 46133 31355 51795
8102 51795 48394 52192 51832 36085 63239 87071 95866 63765 82528 63290 47880 61321 74392
8089 74392 58703 36687 49582 35887 17577 49404 23317 4000 31911 50966 33445 61183
8077 61183 40230 71323 50952 38380 19009 8288 38311 -521 -20621 10307 17094 15168
8065 15168 13158 -1334 48675 44731 435 -19232 16855 -1105 23648 7312 18111 20259
8053 20259 17617 3195 348 15662 29051 9790 44850 75082 45581 27619 7341 17382
8041 17382 -9891 38964 60006 42869 47666 24216 15465 36085 17826 29469 18066 43437
8029 43437 49360 5914 -1169 15248 17245 -11026 -9160 16863 -10978 -16384 672 759 -1348 7400
8015 7400 -5163 2239 22144 21300 13852 3846 -3808 17584 40197 -329 3851 53459 51843
8002 51843 -2675 -1372 16851 24583 18554 13727 16990 26504 -9629 -14388 -31065 -11383 -10381
7989 -10381 -22493 -35180 -33215 -4810 14964 43465 33219 40452 32434 31233 37337 7971 -14009
7976 -14009 7239 28960 17055 51 -9553 8470 13669 22841 3988 -22013 -646 10951
7964 10951 -8546 10694 -21848 -7905 19432 13343 30685 19968 20298 -4000 -4598 -13183 -4490
7951 -4490 -6977 -35141 -29290 -2865 9409 -3312 -3790 29003 37141 20207 1274 18552 15135
7938 15135 -20221 -31154 25079 36800 7611 -15530 -23095 22754 12269 36354 29646 17189
7926 17189 11075 13422 19516 29289 13052 1663 38919 29931 -6344 -24359 -15899 -12586 -30535
7913 -30535 3539 1180 -24498 -35143 8012 4958 -19577 -1475 -5767 -1424 -5696 -22330 -37793
7900 -37793 -31423 3256 320 -25421 -39302 -42586 -25051 4683 -18378 -14889 -26510 -35565 -19376
7887 -19376 -6052 -10598 -40602 2854 2189 -20181 -7508 11217 -471 -1140 -7022 -38854 -20558
7874 -20558 -15281 -34125 -18968 -22702 6642 4519 17769 14884 -948 3734 38619 24455 18134
7861 18134 11688 -5209 -28537 -33224 -29629 -1513 16365 13087 1247 -15047 -87 -5146 -5187
7848 -5187 -5849 -21446 -28758 -49897 -22143 -6002 -5964 -12556 -38948 -40727 -33572 -24798 -12554 -23101
7834 -23101 -24579 -12553 -3094 -18707 -29933 -38364 -38456 -48011 -41266 -19911 -10169 -53621 -18650 -31338
7820 -31338 101 -26269 -8787 4407 8053 -17866 -20652 -32175 117 -26510 -32287 -45633
7808 -45633 36808 18545 41239 -99229 123103 405207 65209 48149 -19574 -3158 -12708
7797 -12708 -1264 -15159 11412 -8896 -10689 -9118 11792 3114 11055 -18630 -32460 -46475 -12548
7784 -12548 -38822 -25368 -4489 4679 -45523 -31147 -35628 -43797 -12894 -1951 -30436 -37125 -35357
7771 -35357 -41610 -23713 2627 -5869 -185 30285 14277 4652 -36268 -38192 -41300 -33792 -47218
7758 -47218 -46477 2805 -6489 -14076 -47013 -11390 -2464 -31854 -25584 -32158 -17529 -33074 -34268
7745 -34268 -25862 -11427 -18067 -19791 26032 7186 -21979 -16093 -38991 -32680 -38813 -12301 16325
7732 16325 14275 1659 9802 -6931 -3947 -18160 -28905 -25756 -23048 -19519 -30959 -29921 -32750
7719 -32750 -34061 -38195 -52816 -34649 -34592 -40083 -41537 -34041 -18971 -20583 -33189 -57986 -55811 -51535
7705 -51535 -44054 -39551 -47585 -11476 -6600 -18158 -48353 -31388 -27205 -16873 -21883 -24991 -8974
7692 -8974 -18758 -18788 -92 -7549 -23285 -30768 -26436 -26061 -40951 -20213 -7986 -16531 -3796 4039
7678 4039 -6349 -16965 -23610 2472 -5833 -6924 -15512 -27155 -33863 -38071 -44332 -63915 -42633
7665 -42633 -34817 -10455 -31919 -58560 -57747 -33618 -33865 -51257 -45571 -16485 -35486 -23617 -27904
7652 -27904 -36428 -56159 -57410 -21796 -13793 -19039 -15424 -18884 -24364 -32557 -9733 15856 26727
7639 26727 2809 -6008 -13368 -11668 -167 -21534 -9876 9882 -24810 -44420 -22929 -25170 -10055
7626 -10055 -14070 -9273 -17696 -16497 1973 -5090 -17474 8233 22420 -18684 -20912 -32959 -46785
7613 -46785 -45233 -3644 -3294 -20953 -16832 -49957 -43602 -26971 11937 -18811 -19039 -16383 -2961
7600 -2961 12728 21074 16881 21653 22252 12560 5331 -13575 -12612 -399 2794 -49139 -61525 -31121
7586 -31121 13285 -14139 4576 17208 3570 3527 -23613 -6348 -29132 -26718 -18349 -7218 -21388
7573 -21388 -15488 -1883 12254 -3455 -34835 -16862 -21225 -29461 -4410 -18456 -17411 13618 7125
7560 7125 -4790 -18792 -33010 -23231 -19594 -26816 -39359 -20474 -22350 9406 12633 -22827 -1509
7547 -1509 22714 18021 -14406 108 -4088 -12209 -9707 -8811 14537 13231 4290 -13208 -13797 10978
7533 10978 -4499 -144 -8600 5893 -14511 -9361 6684 -5833 -9277 -12125 -8379 20008 43056
7520 43056 33330 21544 25083 39315 21048 5304 3381 -45200 -295194 -151670 -56417 -32538
7508 -32538 -4774 -15408 -19453 -28527 -10317 23770 22404 -19988 -5358 -12234 -14094 -18286 1093
7495 1093 15705 13879 -1054 -556 -30018 -25242 -6339 -11508 -19895 -18760 -25596 -26829 -8468 13451
7481 13451 3616 -16368 -12293 3861 -4154 15878 12877 15318 -18872 -34841 -35716 -25067 -27721
7468 -27721 -21110 -8614 13056 -22 6651 -4427 15530 2190 -22560 6158 20171 11336
7456 11336 17509 27124 15884 -10151 36170 37341 13178 9619 -15959 -42436 -39456 -389 27695
7443 27695 1917 -13834 -23077 2285 4963 10836 6408 13943 19211 37867 32019 23688 17711 19907
7429 19907 543 13542 11668 16429 -1041 -14969 25616 15944 3367 733 11701 8658 13132
7416 13132 6237 9713 19989 29052 3897 5120 13427 26044 24735 4028 3566 34420 34513 20189
7402 20189 3901 15834 22182 17305 32738 25650 18329 5943 25330 8363 -25859 9176 13528
7389 13528 16507 10470 6118 22111 53792 45572 49810 59167 32211 -1027 11869 -1744 223
7376 223 -1368 5850 1154 18805 27969 29128 14697 -11510 -1996 20546 16242 28812 37287 51699
7362 51699 41799 31009 33396 194 -19464 -11661 -14184 -15778 -3157 -11366 8625 24229 18519
7349 18519 17062 39192 67166 57441 62972 25271 11624 20211 2572 12516 17564 32970 24460
7336 24460 34162 26622 11275 18865 9481 31757 25762 32424 41228 44793 52581 46161 56470 37560
7322 37560 33966 27401 16612 20218 36545 33729 10163 40456 33249 21722 31981 22012 15038
7309 15038 19062 11758 18026 46479 50005 63899 60434 58434 33220 12581 33316 52235 33747
7296 33747 46577 33951 30042 35905 25318 11641 27737 10456 44248 29183 59933 40890
7284 40890 20222 58061 50405 39013 11078 24789 22870 32749 25754 28707 16880 56113 68930
7271 68930 57873 37948 49217 55692 75771 55989 28812 37339 48611 73741 76566 58512
7259 58512 78216 59419 52188 45860 39840 30555 36655 23926 25939 35508 31676 60336 52239 48439
7245 48439 49714 57366 64429 47483 6604 26350 53281 46481 30518 61624 48367 62316 50748
7232 50748 33438 47832 31288 33846 67304 78158 50548 45704 55748 51046 38804 72743
7220 72743 76744 48169 80589 77697 68814 86299 71364 50266 18461 33181 75331 78380 80037
7207 80037 57737 52389 57679 66956 74242 56080 46424 66616 61226 64924 67022 54822 69033
7194 69033 69432 64031 86767 81796 81471 69787 51880 62127 67574 61915 58696 44570 63440 73310
7180 73310 81265 78342 60691 71407 54250 61920 54608 65084 45240 57105 59211 70024 88109
7167 88109 86010 75015 64651 60593 77373 84077 74800 50125 75654 105930 73842 71167 73393
7154 73393 93920 67885 112063 106499 106256 86734 68600 54081 58003 68888 47855 49858 52116
7141 52116 83024 82478 80233 75356 69640 75793 71176 61079 73481 58237 83601 80967 91515
7128 91515 96100 93104 110506 87733 74458 72262 90526 90870 66592 88577 105575 68908 64068
7115 64068 51085 56714 60296 54684 72281 104084 103767 88632 76515 71404 82886 79242 72805
7102 72805 89541 99873 68729 88399 89845 83405 73961 85180 80708 97571 97655 73890 76732
7089 76732 38948 53284 104442 92337 58342 54018 81032 85147 64599 92111 82868 71593
7077 71593 62922 56070 112323 114477 106766 115925 119060 92721 92984 69668 74723 99942 88842 103691
7063 103691 112164 127953 108848 154121 168993 92625 80236 78182 90037 79671 88211 89272
7051 89272 95159 90303 86271 91439 89912 97723 94943 85971 91426 75043 77097 116656 111157 87564
7037 87564 104240 125379 102504 92710 98810 96288 111707 107733 102100 139302 136369 131103 127396
7024 127396 112352 87911 98465 104356 115542 118327 107621 103453 108470 121108 116289 135376 146402
7011 146402 120247 113715 100108 114932 118160 140052 124849 121637 121211 125926 139928 145794 162098
6998 162098 133523 90258 76759 98012 100775 120082 111460 105516 118087 103782 92137 122454
6986 122454 96832 80294 103719 116593 123410 131378 128878 146011 137559 120904 126229 121066 139965
6973 139965 114708 117215 127280 120899 111995 134825 145871 161656 173248 156714 152297 139670
6961 139670 145172 149794 136121 138239 134838 116113 118142 113181 116526 145446 156945 154470 130619
6948 130619 132716 149564 107312 102895 122009 162344 149610 135935 134215 151564 144562 118561
6936 118561 133953 145516 158842 159698 150982 148155 185471 177089 160906 134261 132967 138371 136339
6923 136339 143486 144939 136736 147496 161790 167323 184451 188621 177668 162626 177671 199902 185245
6910 185245 189481 179026 187391 193194 200676 173580 150455 156545 156827 134098 131637 159710 188620
6897 188620 187634 174019 208568 182115 182063 181340 154233 162201 146954 154712 156146 164724 156524 171232
6883 171232 160701 153658 162841 175484 176633 177545 163899 163797 176719 184561 203181 190816 177020
6870 177020 169612 158723 137846 148747 157225 182313 186602 204658 189157 171874 167744 150771
6858 150771 105137 129950 156899 162952 188664 193848 166406 167686 182471 195047 217104 187108
6846 187108 167480 183763 188878 186442 164565 155288 168799 172470 158725 165985 186191 179222 173458
6833 173458 191581 189306 193584 188196 181066 166122 169794 181105 187929 167681 180814 184750 199903
6820 199903 192930 193503 212523 214843 170723 180436 197880 200658 186769 192814 178167 179646 188824
6807 188824 185981 199926 222052 208851 200363 179449 190637 190459 180639 198680 179170 178513 176222
6794 176222 197740 193754 186115 196484 197792 200190 214842 199239 202569 208213 210172 201387 205729
6781 205729 204557 224489 229196 254084 205670 211792 235583 225468 232769 225054 201748 204402 225973
6768 225973 235161 233581 254157 241919 237674 217426 246692 226989 207520 217770 203278 225539
6756 225539 238713 240697 232031 254845 231760 211245 236699 253003 276458 221811 221483 264455
6744 264455 235836 239093 280618 268236 282113 279003 268024 253608 255502 272023 289651 259056
6732 259056 264790 271800 263285 254402 244532 261844 264342 263632 253988 246048 257449 271967 277497 275172
6718 275172 268978 286574 295081 292390 272299 271726 287381 293726 253601 258098 277725 286157 260261
6705 260261 240917 273395 271426 280405 287764 300078 294551 282641 316671 322413 324858 316775 316161
6692 316161 310173 287891 295605 276524 285332 315429 318480 340238 298624 281477 303130 315577
6680 315577 337904 332763 315372 325070 334423 324797 296129 338165 371744 376283 332565 348705 344502
6667 344502 321295 342582 329875 355259 372594 349851 326202 311014 319622 311250 342295 347342
6655 347342 353536 355696 345529 347666 352225 343804 341137 335785 342435 354425 340586 365280 361419
6642 361419 392077 372152 393085 386050 376580 378883 389584 387204 350108 351444 346465 359634 348322
6629 348322 359731 367409 370178 383189 365397 379050 400950 394895 406249 401054 411215 409734 431762
6616 431762 419870 399173 416630 429977 409687 416627 402240 403200 388556 406643 396454 378160
6604 378160 418271 412782 424426 413195 411773 427409 433916 421461 427190 451490 439825 442625 461884
6591 461884 432066 437489 449933 445629 469627 468037 470902 468962 467083 472510 455184 493274 500133
6578 500133 478707 451694 445656 468735 473486 477050 476658 446349 426257 444961 475814 475528 466820
6565 466820 480234 472336 460584 448126 479511 503465 484417 474071 464588 468850 445607 433166
6553 433166 459790 480290 474475 473620 464776 458108 495588 499265 512272 532638 507000 484679 492704
6540 492704 492393 488744 500202 505832 505409 505219 497335 515069 523045 519668 498404 498776 495898 525291
6526 525291 513987 497022 520819 525584 567314 528097 525500 529461 501958 473771 492997 456851
6514 456851 454280 491928 501286 487381 482474 483747 487177 491659 488397 477192 495640 510339 513817
6501 513817 492776 467853 474569 484365 505562 528854 513624 515271 516299 512613 513827 522124 519666
6488 519666 511791 506690 536504 530001 516468 532811 500006 492058 495148 508619 524701 532638 543457
6475 543457 508891 525970 519759 523868 519715 500321 482108 448356 488975 506560 505673 527462 529642
6462 529642 507970 515144 489368 486220 510710 518331 520810 509127 514063 519299 508162 504437 493762
6449 493762 518957 520660 533918 522211 502442 513076 505667 505538 511915 495379 504400 537817 538621
6436 538621 533228 561188 522690 508364 517264 534207 521948 551271 569414 561946 524088 506532
6424 506532 488484 497965 523196 510975 520536 536882 523568 517757 530462 535573 523184 507732
6412 507732 531695 541476 519667 535873 543767 538766 545331 557965 535750 533029 549246 556281 574955
6399 574955 565305 522028 534708 552777 560381 559492 539474 534343 523866 528911 533003 544381 539906
6386 539906 525592 530707 551350 555118 577984 560459 561373 551438 570193 570892 577903 567251 548015
6373 548015 548392 539586 550483 555881 546474 566839 576969 581141 573299 558876 567557 578931 590293
6360 590293 565487 578771 589965 583555 568664 587000 585394 593255 571212 562630 580564 568493
6348 568493 609861 619778 594552 579976 586262 588235 579190 588559 580145 564815 574560 578132 575667
6335 575667 592167 609187 622714 625134 622456 616477 598386 624256 605532 612824 628351 621789 632745
6322 632745 642007 626663 613172 619961 605495 598997 609134 629534 640678 629596 646641 640729
6310 640729 636755 639084 642223 647784 660325 631246 638847 633734 650261 634494 632200 648635 659975
6297 659975 674359 662536 659751 660760 660867 644735 628352 610608 632117 648489 641859 638098 662225
6284 662225 645692 651661 665269 632175 642479 662692 649294 647097 662704 679648 675294 648015
6272 648015 645436 673474 645406 658919 666406 674573 682896 667531 651582 665548 693081 684912 697948
6259 697948 681654 678481 690281 686912 687359 683820 683433 671397 663865 669015 701763 689611 670888
6246 670888 654231 648000 665666 680703 708044 703325 682007 685848 686403 723871 723112 688187 664722
6233 664722 675972 692033 711716 712989 689633 698870 703710 716962 701723 695859 693360 684779 662502
6220 662502 676142 704891 705988 698955 696274 713996 720147 711286 692567 700267 728132 721463 715959
6207 715959 729956 716498 713980 714986 721671 711331 692656 695232 689778 700016 721387 717948 725915
6194 725915 733446 746912 760411 748547 735247 730930 732976 730975 736415 745743 751637 757387 742856
6181 742856 742758 763138 746469 734731 717690 738197 742779 717111 732212 737826 731413 724034 752196
6168 752196 740899 744723 728179 735608 756164 738565 732627 742039 746407 755356 753795 745005 741528
6155 741528 745060 758658 790522 807564 768716 759890 731326 743679 741919 740667 728944 721918 730754
6142 730754 747625 742417 736338 739308 750773 741619 732821 731799 751381 753267 733542 723894 731514
6129 731514 724013 715872 726579 731666 751471 760301 744879 755969 760265 766729 773500 745822 761037
6116 761037 762858 773348 778194 782989 774918 765730 751310 768259 778341 771670 775318 797995 791630
6103 791630 789538 790814 793107 800074 793046 783392 779596 788033 778926 786443 775063 787491 790513 788029
6089 788029 799060 810636 826374 775608 803547 822859 804004 806527 820703 820856 834653 826712
6077 826712 802448 807739 816328 810643 800974 785710 824754 859699 826785 819957 814507 815310 796093
6064 796093 809702 818102 817738 838189 866074 836859 845699 843683 853699 845200 832588 847258 847519
6051 847519 850957 815497 829772 858484 834380 816659 832215 846694 841009 862596 878784 868192
6039 868192 872909 858691 874329 858847 845407 876273 873642 885867 898156 891528 876217 867345
6027 867345 867615 861630 850170 865382 855505 860817 880635 882157 894693 899576 898622 887303 868713
6014 868713 888302 902278 902474 902926 877930 868270 891505 880648 898827 913987 909299 929504 922242
6001 922242 908645 919320 931636 915632 923545 926111 935118 934468 956843 951134 941229 945290 969031
5988 969031 960397 969596 951379 929196 922630 911913 939201 950238 977178 976103 960988 953699 941611
5975 941611 944244 970125 986880 997136 978336 975538 974021 981111 976316 985424 983606 968343 973001
5962 973001 969662 976697 975318 997970 990286 994246 991745 987462 1004529 1005289 1010372 1037049 1036875 1027267
5948 1027267 1034201 1016890 1053919 1057961 1023052 1020499 1049904 1042553 1048629 1026548 1033026 1028344 1018828
5935 1018828 1035859 1052449 1070270 1050589 1060672 1074477 1076361 1077429 1069642 1077201 1088556 1076207
5923 1076207 1077152 1068400 1071030 1075751 1043959 1067473 1103215 1096633 1103128 1087606 1081224 1083674 1113491
5910 1113491 1102945 1096422 1099926 1098709 1093459 1072190 1080967 1121264 1140787 1110423 1119239 1104400 1108264
5897 1108264 1148562 1140760 1159196 1145020 1138134 1142190 1133836 1134531 1171342 1165695 1140829 1147036 1148788
5884 1148788 1137323 1135544 1164343 1173663 1176892 1182608 1170568 1160492 1161761 1182981 1197449 1197005 1193906
5871 1193906 1186906 1175282 1147718 1172045 1178648 1177133 1171121 1170681 1188949 1191425 1203208 1230200 1243878
5858 1243878 1211717 1223050 1217508 1231212 1233537 1224070 1207468 1207571 1198274 1200809 1226562 1226433 1242432
5845 1242432 1241103 1228043 1241161 1256957 1248074 1231149 1246577 1249337 1246716 1245129 1265740 1273268 1253416
5832 1253416 1252796 1235348 1235200 1256894 1272425 1267189 1251886 1255515 1261637 1271512 1310320 1291385 1274801
5819 1274801 1283587 1286644 1292024 1307403 1300831 1289294 1303702 1287527 1274523 1297673 1311821 1313680
5807 1313680 1303829 1308744 1325901 1354900 1351528 1323492 1306112 1308587 1292094 1308305 1316344 1314158 1314382
5794 1314382 1314088 1316351 1317971 1341604 1354800 1331876 1341490 1337228 1341121 1351343 1346847 1357579 1381800
5781 1381800 1389349 1399027 1405831 1409686 1372700 1362764 1396669 1387704 1388552 1389265 1358818 1386067 1391615 1382336
5767 1382336 1388486 1400689 1411011 1407861 1411200 1418438 1424641 1432827 1415034 1401059 1416909 1421018 1387575
5754 1387575 1404620 1436969 1442031 1417447 1417229 1429737 1451886 1460662 1431556 1430685 1460050 1456122 1455340
5741 1455340 1455501 1432598 1451664 1461682 1450886 1446205 1462598 1452117 1462008 1461607 1476703 1483992 1498775
5728 1498775 1476894 1489643 1476121 1498297 1505155 1486924 1493133 1486970 1496391 1511735 1517984 1514102 1510872
5715 1510872 1561307 1543811 1511712 1543613 1532563 1545412 1550579 1551025 1537444 1554728 1547364 1578614
5703 1578614 1580336 1583068 1582439 1632580 1717978 1600511 1572629 1588504 1561749 1564900 1587016 1594731
5691 1594731 1606378 1603630 1613964 1622373 1624485 1602971 1589098 1597186 1593306 1581290 1615446 1626973
5679 1626973 1627930 1628035 1637957 1657579 1676767 1648723 1656491 1667947 1651995 1665591 1703402 1693047 1679473
5666 1679473 1690678 1679562 1667342 1675514 1687994 1687252 1684890 1671531 1695561 1712632 1731578 1726568
5654 1726568 1732116 1724272 1742155 1753265 1747858 1742189 1723091 1735886 1741523 1772258 1784732 1768557
5642 1768557 1770918 1775123 1789183 1790403 1771937 1784743 1800435 1811614 1806084 1788762 1812929 1795725
5630 1795725 1817181 1829994 1842197 1824446 1819707 1843977 1846693 1858815 1849915 1856675 1872656 1890024
5618 1890024 1868561 1859985 1856111 1854231 1851933 1872891 1879310 1868278 1879020 1900031 1902643 1904959 1920914
5605 1920914 1936401 1951585 1946869 1948339 1920313 1942497 1946198 1938233 1944625 1973524 1976464 1993831 1997580
5592 1997580 1987126 1997558 2001263 2004465 2000240 1987772 2014997 2002099 2012445 2006651 2031185 2029520
5580 2029520 1998422 2004731 2019949 2039032 2046296 2063866 2069007 2079635 2075107 2077954 2089180 2084372 2084914
5567 2084914 2100216 2103816 2089677 2087785 2092043 2109413 2110203 2114732 2120590 2123381 2141126 2153723 2158787
5554 2158787 2161931 2183676 2190066 2157436 2170687 2167805 2168506 2195541 2190602 2207333 2205347 2216957 2226005
5541 2226005 2211788 2232670 2254835 2266431 2266646 2265280 2270646 2272492 2284668 2295304 2301977 2295461 2303172
5528 2303172 2310733 2312066 2333663 2330579 2331505 2322744 2322496 2327520 2310858 2320525 2346746 2342957 2342077 2362345
5514 2362345 2343749 2372766 2407181 2431062 2428847 2449654 2411052 2434159 2447528 2451779 2472390 2482106
5502 2482106 2468288 2477843 2497600 2517107 2537684 2516521 2520272 2525944 2551658 2547951 2560055 2570259
5490 2570259 2567417 2577522 2550710 2568824 2595628 2582572 2603640 2616546 2616410 2626015 2609581 2596324
5478 2596324 2623678 2650747 2664976 2659401 2635887 2649476 2658683 2665709 2690742 2698289 2704444 2710185 2721795
5465 2721795 2749175 2753152 2754758 2774988 2788479 2801328 2797698 2797803 2812911 2814627 2825655 2825124 2824067
5452 2824067 2852752 2855246 2858532 2875973 2865001 2876099 2897305 2910836 2921646 2925072 2918483 2935508
5440 2935508 2954057 2971542 2957491 2957595 2975755 2974854 2951348 2989101 2998320 3003038 3032700 3030298 3048552
5427 3048552 3085002 3091815 3109634 3116694 3106736 3117902 3119421 3135768 3120562 3138222 3169955 3188570
5415 3188570 3182249 3192877 3210124 3209523 3217171 3220814 3229273 3243432 3272232 3264480 3274189 3291338 3292350
5402 3292350 3288209 3327790 3360722 3359440 3350593 3341684 3383087 3401282 3431306 3412828 3425160 3427587
5390 3427587 3454326 3480498 3502188 3490464 3498010 3516583 3531078 3580242 3554527 3564026 3596008 3627394
5378 3627394 3644280 3658032 3661891 3664146 3674775 3662653 3682733 3702370 3716491 3724341 3761195 3765798
5366 3765798 3776230 3794149 3835338 3854847 3844262 3865932 3886361 3888438 3907449 3925147 3950725 3945870
5354 3945870 3968086 3969238 3992455 3999141 3995553 4008276 4044650 4087028 4093367 4098940 4122389 4141912
5342 4141912 4154245 4178820 4210093 4220283 4251925 4265161 4268807 4280886 4282709 4318002 4334680 4364212
5330 4364212 4373175 4393276 4413443 4437517 4453318 4454422 4472362 4495323 4519202 4522063 4529411 4565867
5318 4565867 4594862 4611697 4649027 4680882 4671057 4715251 4701975 4717775 4758967 4782236 4811550 4834070
5306 4834070 4854274 4870848 4879385 4918081 4954157 4963505 4978345 4996282 5028342 5050833 5092837 5128192
5294 5128192 5125441 5142770 5173243 5194537 5235074 5249932 5262266 5304386 5336796 5362238 5370057 5408798
5282 5408798 5431908 5459023 5480693 5501532 5546772 5558476 5580871 5632262 5678711 5704848 5701187 5742693
5270 5742693 5762335 5792196 5856251 5869094 5899324 5931229 5941819 5981848 6024186 6047363 6067570
5259 6067570 6104464 6153797 6205063 6243245 6258150 6289040 6314020 6387849 6413079 6436988 6491260
5248 6491260 6524380 6559800 6561995 6635442 6689783 6734051 6753055 6790606 6851591 6919874 6977163 6996030
5236 6996030 7008806 7028017 7062642 7131496 7181272 7234666 7270517 7293815 7353838 7410123 7465770
5225 7465770 7516059 7566666 7614965 7621711 7700706 7766817 7809751 7880299 7917072 7948428 7987398 8063431
5213 8063431 8129360 8178439 8242817 8291408 8358912 8413436 8450375 8522232 8575617 8637500 8689058
5202 8689058 8760693 8850533 8901093 8959650 9017651 9085715 9163655 9234350 9312248 9342609 9431121
5191 9431121 9520678 9579332 9655948 9719740 9804643 9888124 9951728 10046150 10149554 10217238 10264029
5180 10264029 10332537 10420297 10492716 10568882 10648061 10757509 10863750 10934137 10989724 11075260 11191459
5169 11191459 11276316 11363049 11446079 11532386 11598236 11721896 11808360 11899826 11993816 12077532 12176614
5158 12176614 12273853 12364996 12467522 12568718 12694664 12780648 12874621 12976315 13087283 13194021
5148 13194021 13289595 13400201 13496079 13615235 13714370 13833892 13946379 14045209 14182803 14285576
5138 14285576 14383041 14482350 14612647 14719716 14817031 14943702 15062021 15132774 15250065 15385360
5128 15385360 15476320 15588114 15707257 15812755 15927665 16041122 16170236 16293587 16396616 16504245
5118 16504245 16604820 16703949 16829331 16963899 17070910 17164322 17284220 17428347 17517465 17620015
5108 17620015 17707584 17819948 17918911 18023556 18123003 18211571 18309417 18431770 18535469 18626504
5098 18626504 18703481 18783819 18865413 18964684 19055114 19139411 19212803 19279583 19366374 19440099 19529220
5087 19529220 19622477 19697052 19769473 19850103 19949962 20019976 20087500 20140923 20205707 20267146 20325490
5076 20325490 20371748 20451565 20529545 20591292 20646518 20690731 20738888 20776177 20843910 20887949 20957794
5065 20957794 21000265 21051217 21077226 21120436 21164653 21203888 21254216 21303806 21339514 21388850 21413090
5054 21413090 21393599 21408060 21411792 21427697 21429585 21389335 21378572 21383089 21352821 21325701 21303115 21250872
5042 21250872 21203467 21173412 21076838 21003109 20931062 20853731 20759361 20691815 20625163 20544204 20468028
5031 20468028 20371448 20268799 20156651 20047302 19966813 19857360 19715146 19610759 19490051 19366352
5021 19366352 19244552 19102596 18958796 18852375 18738462 18607550 18507532 18376673 18231819
5012 18231819 18095235 17982398 17870518 17775163 17662340 17534893 17426848 17312008 17200639 17113361
5002 17113361 17007321 16883806 16792640 16675428 16579179 16488935 16394995 16316236 16235454 16146024 16051724
4991 16051724 15965700 15851870 15761529 15668744 15558568 15466926 15395262 15291294 15186986 15130491
4981 15130491 15073835 14994778 14902755 14831474 14756937 14671918 14590493 14521684 14451203 14403122 14334720
4970 14334720 14263154 14187645 14101898 14039156 13987316 13943943 13870276 13813453 13759830 13715803 13678434
4959 13678434 13598336 13536742 13484703 13423257 13391877 13344377 13262153 13209004 13163136 13098560 13055155
4948 13055155 13017097 12976769 12930087 12848493 12830754 12782527 12720718 12692776 12649874 12593211 12562248
4937 12562248 12520088 12480630 12450045 12416741 12372863 12356202 12315037 12282364 12246632 12210520 12194429
4926 12194429 12141277 12123682 12083515 12052861 12041652 12006964 11973867 11943531 11919471 11912638 11867414
4915 11867414 11841879 11830178 11807818 11791523 11770254 11736705 11712045 11713192 11699548 11680490 11670295
4904 11670295 11683824 11640295 11591317 11581059 11594705 11570925 11530008 11521784 11485728 11492344 11473273 11457435
4892 11457435 11456546 11427898 11415780 11441277 11454775 11446542 11426237 11426728 11410858 11383288 11397496 11388554
4880 11388554 11367536 11365271 11378847 11362222 11357263 11351214 11346895 11334750 11344415 11341992 11312345 11327326
4868 11327326 11317379 11318975 11335077 11304916 11296197 11294352 11312446 11296026 11298238 11318817 11322326 11344583
4856 11344583 11352416 11362028 11358849 11344971 11349632 11356641 11344005 11356762 11357814 11368864 11393746 11414692
4844 11414692 11390433 11412520 11450032 11438092 11455898 11473724 11454838 11460634 11478284 11494622 11506857
4833 11506857 11487108 11501815 11550816 11572039 11568775 11579024 11600000 11627641 11653383 11669871 11676475 11692776
4821 11692776 11716543 11713553 11737737 11743633 11757497 11767148 11805371 11826517 11814239 11856006 11894519 11897429
4809 11897429 11885902 11898447 11905834 11944011 11941490 11974072 12006471 12040180 12050590 12085599 12090277 12099442
4797 12099442 12142812 12157703 12207523 12213407 12235497 12268020 12309069 12327830 12351899 12363557 12399441
4786 12399441 12427288 12448705 12486753 12509672 12542203 12592519 12600771 12616567 12680442 12702039 12734975
4775 12734975 12740834 12772327 12809758 12854878 12894428 12915277 12952959 12992081 13052800 13089234 13096805 13123505
4763 13123505 13154768 13187114 13212855 13237680 13288209 13319690 13353570 13399431 13430498 13456979 13510161
4752 13510161 13530294 13576104 13639628 13663084 13698207 13746233 13772666 13800622 13853119 13903468 13940480
4741 13940480 13971014 14017988 14084097 14100964 14147607 14200513 14260152 14302976 14336161 14362826 14407545
4730 14407545 14480665 14530679 14560484 14606706 14657345 14711327 14727315 14795328 14833535 14893972 14957118
4719 14957118 15010667 15056474 15092251 15153088 15222450 15300936 15358309 15377390 15406044 15450551 15502890
4708 15502890 15551074 15602833 15659284 15750566 15809283 15836157 15889928 15954758 16026641 16065517 16150284
4697 16150284 16197130 16226992 16284701 16381344 16434434 16537346 16592872 16618669 16684707 16733824 16795774
4686 16795774 16878364 16957780 17009296 17070402 17151760 17233749 17301401 17354092 17449551 17526004 17615535
4675 17615535 17662686 17728951 17799537 17888809 17939223 17997713 18045850 18133828 18226462 18308431 18377727
4664 18377727 18452003 18525814 18596578 18675775 18781999 18853472 18936987 19019054 19099495 19181759 19264719
4653 19264719 19360614 19441155 19521854 19616840 19711066 19800089 19873645 19975205 20074132 20132677 20231302
4642 20231302 20306754 20416414 20515930 20614447 20711840 20797491 20890646 21001845 21102479 21198345 21299645
4631 21299645 21400464 21505047 21604953 21698836 21820727 21927668 22037345 22138579 22221991 22318088
4621 22318088 22441058 22562349 22673888 22775250 22919937 23047121 23134894 23241868 23350660 23490181
4611 23490181 23616777 23731619 23831865 23948154 24083630 24198218 24332462 24464497 24581035
4602 24581035 24688604 24814026 24944887 25068709 25196529 25341437 25483058 25623790 25746992
4593 25746992 25872703 26022906 26160417 26307558 26460708 26607119 26737077 26857936 27003576
4584 27003576 27130268 27305670 27446161 27587722 27721259 27882841 28050813 28208997 28346404
4575 28346404 28503879 28681679 28827410 28979020 29144821 29282846 29442608 29635451 29789083
4566 29789083 29969616 30137415 30284144 30477601 30643876 30813573 30999741 31172938 31343152
4557 31343152 31514511 31687229 31859450 32030974 32224875 32385508 32569138 32744134 32952374
4548 32952374 33119035 33304921 33502744 33702049 33898595 34063223 34258444 34464103 34653781
4539 34653781 34874734 35080670 35278349 35464442 35681131 35889862 36072007 36300584 36514268
4530 36514268 36734576 36946402 37152552 37361264 37607021 37805917 38064247 38290722 38496114
4521 38496114 38709975 38946868 39165940 39390418 39603959 39851467 40125127 40368663 40603411
4512 40603411 40871489 41096782 41347608 41568624 41835634 42098497 42354235 42604436 42854706
4503 42854706 43125213 43388090 43658275 43933853 44211706 44452964 44734841 45028142 45301813
4494 45301813 45586167 45875524 46168386 46437085 46709394 47013637 47307320 47599524 47857696
4485 47857696 48168847 48457926 48766637 49059207 49366837 49680716 49971697 50290398 50603080
4476 50603080 50926001 51237292 51583234 51924627 52230330 52558629 52898592 53239002 53576646
4467 53576646 53923016 54291286 54637905 54991324 55346424 55709285 56084659 56451280 56833285
4458 56833285 57219867 57604901 57993481 58391542 58779246 59187281 59615254 60022132 60448367
4449 60448367 60893190 61310390 61722779 62189061 62634663 63078683 63510670 63951374 64443285
4440 64443285 64915152 65377153 65861700 66380263 66880647 67373055 67897394 68402462 68906451
4431 68906451 69421596 69958636 70519312 71053714 71593974 72157924 72742287 73315790 73867653
4422 73867653 74448487 75046473 75650522 76256980 76873616 77467714 78103515 78766880 79423456
4413 79423456 80024808 80690759 81358642 82015855 82739990 83429108 84125930 84830803 85543865
4404 85543865 86260014 87010349 87744294 88512051 89278602 90035396 90797341 91595806 92395966
4395 92395966 93195709 94012690 94823752 95679736 96540376 97414324 98265737 99143459 100053524
4386 100053524 100965269 101881375 102825427 103765870 104700745 105670027 106657297 107629673 108643518
4377 108643518 109668174 110659853 111697059 112758284 113809544 114865751 115946600 117051985
4369 117051985 118163438 119282702 120447948 121593416 122755436 123930304 125122319 126331242
4361 126331242 127575186 128827947 130091318 131348405 132641604 133957134 135270228 136598760
4353 136598760 137944291 139337099 140717223 142117023 143536935 144946606 146402143 147883106
4345 147883106 149383973 150925160 152453880 153976862 155506943 157095342 158729110 160339361
4337 160339361 161988721 163635350 165309502 166991130 168696441 170444996 172183581 173946861
4329 173946861 175736323 177570873 179414501 181265810 183117369 185007359 186912627 188838632
4321 188838632 190809156 192790889 194804041 196834682 198878343 200923391 203004860 205105794
4313 205105794 207232696 209400447 211570485 213777124 216011270 218251992 220535105 222813465
4305 222813465 225133348 227469768 229824120 232196406 234604315 237038435 239489811 241968254
4297 241968254 244452729 246937535 249487226 252055651 254634256 257214611 259803043 262444906
4289 262444906 265082468 267717308 270384291 273057512 275762956 278484200 281204709 283950083
4281 283950083 286713135 289487692 292260802 295055474 297840576 300641712 303493202 306311235
4273 306311235 309122527 311959587 314784380 317624918 320508919 323392630 326252001 329151295
4265 329151295 332049921 334948699 337839034 340742018 343630445 346508977 349382061 352220883
4257 352220883 355080351 357895404 360705360 363497344 366253996 369030753 371751257 374454942
4249 374454942 377152183 379867446 382525826 385146665 387742472 390337964 392915306 395439158
4241 395439158 397942450 400427633 402842818 405273933 407666752 410020297 412348710 414617021
4233 414617021 416852983 419039544 421201123 423349235 425441341 427473805 429466290 431465122
4225 431465122 433400050 435280442 437118820 438894242 440635354 442332209 443991872 445643450
4217 445643450 447232060 448769318 450278677 451705222 453119522 454502727 455851937 457171085
4209 457171085 458468383 459738510 460978955 462236990 463437620 464631342 465832169 467005280
4201 467005280 468121515 469181749 470288846 471391003 472465320 473473531 474468201 475420230
4193 475420230 476267486 477023770 477644273 478072012 478325115 478449012 478431719 478287438 477998144
4184 477998144 477571586 476963229 476268971 475511575 474610933 473545743 472355699 470944483 469351128
4175 469351128 467562907 465618175 463535166 461339838 459067478 456718352 454288868 451764882
4167 451764882 449156193 446488216 443685372 440798920 437803570 434654191 431458653 428146126
4159 428146126 424791201 421419736 418024635 414618352 411207689 407739977 404189288 400532161
4151 400532161 396862229 393156581 389415586 385667541 381979858 378300210 374681381 371104640
4143 371104640 367580586 364140921 360754125 357424540 354179563 350953752 347727776 344558516
4135 344558516 341434930 338335072 335277625 332243355 329203429 326196755 323207486 320202072
4127 320202072 317200598 314169440 311172688 308234744 305340741 302475292 299650160 296842521
4119 296842521 294048050 291306215 288614127 285956609 283345908 280709228 278093079 275520658
4111 275520658 272952134 270440501 267975578 265537550 263149599 260760010 258427160 256106743
4103 256106743 253765224 251454788 249179148 246935014 244694668 242452224 240257017 238073844
4095 238073844 235905029 233783566 231661222 229576949 227475640 225419453 223375122 221347482
4087 221347482 219346237 217338247 215377262 213433044 211495266 209563921 207670657 205805361
4079 205805361 203953852 202127872 200304923 198479823 196707965 194943561 193187148 191480242
4071 191480242 189776940 188080355 186428187 184770265 183119342 181522192 179958723 178409743
4063 178409743 176851047 175350174 173867892 172382516 170914596 169413170 167968940 166549584
4055 166549584 165128236 163752845 162372799 161016625 159645139 158330188 157019632 155699936
4047 155699936 154426508 153150203 151895431 150646681 149378780 148161333 146952763 145733260
4039 145733260 144544844 143381032 142228797 141090688 139952103 138813267 137679584 136561674
4031 136561674 135468337 134411074 133333832 132257932 131215131 130198915 129184741 128164039
4023 128164039 127168322 126168237 125182498 124222476 123258151 122290988 121345364 120397820 119476953
4014 119476953 118575485 117663363 116780985 115914826 115043162 114162148 113315186 112478986 111648035
4005 111648035 110791389 109990690 109169081 108338419 107545438 106756144 105970243 105202222 104434760
3996 104434760 103656653 102904483 102151438 101418530 100690626 99953749 99235168 98534599 97838893
3987 97838893 97123113 96430548 95754701 95091108 94425795 93757700 93080509 92448784 91795818
3978 91795818 91160563 90532437 89907516 89302496 88708439 88114747 87521218 86901664 86302521
3969 86302521 85717183 85151946 84562329 83980636 83452389 82893225 82357106 81787800 81247176
3960 81247176 80730169 80191623 79666918 79125792 78632938 78116654 77599403 77112313 76606678
3951 76606678 76121247 75637276 75161496 74693284 74206465 73713790 73247251 72769503 72338935
3942 72338935 71897857 71462305 71010677 70549956 70124020 69722966 69289044 68852066 68428057
3933 68428057 67997422 67575520 67185244 66763380 66365272 65970984 65561715 65167154 64795971
3924 64795971 64392690 64000273 63645371 63276192 62897163 62549731 62187102 61819674 61432463
3915 61432463 61102910 60758861 60405286 60022280 59676643 59337434 58987891 58670902 58303644
3906 58303644 57969891 57658038 57309466 56983193 56677806 56352463 56026141 55715026 55405511
3897 55405511 55095490 54788008 54473121 54154371 53855435 53546213 53256345 52959931 52674467
3888 52674467 52386412 52100810 51813752 51518320 51228346 50952447 50686675 50415591 50139771
3879 50139771 49842544 49579233 49330211 49052869 48796528 48516594 48263622 48017656 47731128
3870 47731128 47512839 47253132 46996726 46746899 46461796 46173503 45923369 45677289 45416859
3861 45416859 45168512 44927862 44688662 44425741 44176708 43932579 43670385 43438770 43198776
3852 43198776 42952157 42682766 42451036 42226452 41976117 41730673 41506564 41276373 41064558
3843 41064558 40807721 40568021 40340267 40120127 39911801 39694032 39452213 39220772 38992895
3834 38992895 38771130 38559473 38336912 38118934 37914059 37701431 37475845 37274192 37077014
3825 37077014 36873358 36694429 36510400 36313170 36130955 35924089 35701211 35518136 35310795
3816 35310795 35112867 34928227 34754187 34590293 34391933 34217733 34039033 33837270 33672950
3807 33672950 33503044 33301234 33132801 32947857 32792692 32607820 32454595 32298609 32105424
3798 32105424 31939607 31762936 31631906 31432433 31275618 31128718 30933125 30774142 30613406
3789 30613406 30469586 30316457 30136555 29996529 29857685 29707260 29555047 29406415 29292409
3780 29292409 29121457 28946502 28802608 28642301 28505415 28344850 28196625 28094055 27940363
3771 27940363 27805274 27671032 27522586 27405941 27249713 27115976 26972057 26838703 26731675
3762 26731675 26576917 26416730 26285338 26189541 26053377 25918503 25797925 25664713 25551105 25400578
3752 25400578 25278592 25172009 25069873 24944172 24824654 24692209 24584318 24470060 24349183
3743 24349183 24260266 24137503 24028335 23912022 23798522 23668867 23533400 23431043 23330546 23242004
3733 23242004 23141149 23032204 22925688 22819451 22694912 22588907 22488320 22363062 22276772 22177431
3723 22177431 22091592 21970368 21889688 21771137 21663354 21546866 21457118 21381131 21281077 21178860
3713 21178860 21100362 20982843 20889163 20803782 20694714 20595215 20503028 20423214 20339254 20251047 20171280
3702 20171280 20070337 19977256 19896545 19801484 19738654 19658582 19558261 19466330 19352577 19273194 19208960
3691 19208960 19125272 19040917 18973241 18908747 18833253 18758263 18639184 18559286 18500389 18413453 18336439
3680 18336439 18263492 18192094 18103380 18008076 17943191 17871944 17798650 17727893 17639224 17570081 17485556
3669 17485556 17387076 17332621 17245452 17185248 17111797 17056340 16996427 16948975 16876252 16778534 16725121
3658 16725121 16656278 16575430 16525902 16456584 16381362 16303184 16257094 16198479 16135225 16070254 16007937
3647 16007937 15933523 15856145 15834911 15767293 15681304 15608478 15557399 15482337 15412960 15364531 15304336
3636 15304336 15240671 15170043 15115584 15056250 15005469 14932312 14850603 14791416 14781550 14724494 14665137
3625 14665137 14581784 14528438 14504164 14443534 14382036 14309458 14264112 14229445 14137769 14065059 14035781
3614 14035781 13973516 13952619 13902389 13837367 13764301 13714280 13643036 13593779 13555213 13503186 13452742
3603 13452742 13410503 13316673 13264816 13232987 13189071 13169760 13106927 13053806 13000706 12952089 12913321
3592 12913321 12878454 12817065 12768517 12735698 12667834 12615568 12585137 12536323 12478895 12443579 12388247
3581 12388247 12326215 12284629 12244697 12208285 12181089 12102368 12049067 12009137 11968723 11917161 11884592
3570 11884592 11844057 11816508 11772225 11721602 11664924 11629571 11606436 11536873 11480628 11452456 11417089
3559 11417089 11375706 11335829 11299863 11285806 11239178 11197730 11131088 11087322 11048990 11022718 10984566
3548 10984566 10936268 10876097 10852424 10830400 10790256 10772242 10737566 10684157 10647531 10588254 10567031
3537 10567031 10524078 10469515 10431241 10382805 10335810 10328049 10282877 10265416 10232015 10202308 10154659
3526 10154659 10116916 10079030 10053673 10035492 9979132 9958811 9919083 9883324 9849887 9804318 9767682
3515 9767682 9724914 9698631 9697755 9650589 9606001 9596032 9553676 9532110 9483614 9446886 9418473 9380914
3503 9380914 9346110 9269800 9259937 9265824 9236622 9192135 9172796 9123356 9094770 9065355 9028448 8990106
3491 8990106 8981575 8955142 8931684 8884433 8824401 8816985 8797637 8742524 8725729 8736849 8721550 8675404
3479 8675404 8637137 8599056 8588164 8553814 8525042 8501520 8453586 8423499 8385343 8363311 8333548
3468 8333548 8314450 8296241 8274001 8223208 8201150 8200494 8171318 8123039 8082884 8052935 8003781 8001061
3456 8001061 7998646 7996390 7975353 7924279 7882355 7859946 7840666 7814634 7812843 7778195 7746949 7706581
3444 7706581 7674596 7652642 7644638 7627038 7597528 7582403 7521232 7508358 7502235 7480503 7439795 7409313
3432 7409313 7384171 7362738 7347610 7338794 7307306 7298703 7291556 7265846 7215903 7190807 7155929 7112759
3420 7112759 7102125 7079971 7068067 7051467 7017086 7015106 7009444 6978146 6977036 6947676 6930355 6903672
3408 6903672 6854973 6846356 6830728 6815414 6800372 6776353 6752248 6744592 6691595 6662808 6638761 6603545
3396 6603545 6607961 6589642 6575546 6533983 6518782 6496849 6483262 6464846 6422251 6430457 6402580 6379702
3384 6379702 6361542 6313523 6338374 6318969 6292350 6267335 6260618 6245415 6202401 6206381 6181705 6158772
3372 6158772 6150793 6134758 6110434 6082652 6074623 6046198 6031911 6009743 5990070 5976060 5980352 5966470
3360 5966470 5950860 5921088 5922870 5891656 5865185 5836494 5818735 5828589 5820424 5800606 5754259 5737926
3348 5737926 5701516 5676535 5655058 5675939 5653515 5642400 5641705 5615913 5591020 5567557 5546647 5538212
3336 5538212 5525050 5475963 5465626 5475927 5449590 5441819 5430275 5424241 5390765 5353951 5345735 5327072
3324 5327072 5346821 5312161 5302676 5295065 5284117 5234791 5231551 5211282 5187452 5179865 5182758 5181802 5182946
3311 5182946 5154118 5122810 5116265 5109148 5086848 5062727 5071617 5037392 5031561 5033737 5006740 5013128 4999313
3298 4999313 4988859 4958441 4932364 4920811 4916068 4929284 4884805 4863657 4852411 4835153 4807921 4805033
3286 4805033 4770325 4769530 4768601 4778739 4769750 4713241 4702747 4710064 4682078 4695803 4670085 4639900 4635738
3273 4635738 4636129 4631468 4604927 4583694 4581935 4564130 4570948 4550844 4542851 4517228 4499116 4497028 4481748
3260 4481748 4490587 4488380 4456467 4414981 4418269 4403294 4395510 4380707 4396871 4387572 4367891 4358541 4342674
3247 4342674 4328308 4303038 4274287 4252761 4247698 4241771 4245180 4240979 4239485 4213499 4194761 4193614 4177600
3234 4177600 4160184 4170112 4154953 4132680 4090323 4085012 4096974 4088688 4067105 4060304 4071800 4071613 4054382
3221 4054382 4037241 4009346 4005767 4023081 3998659 3995374 3974279 3970332 3967673 3952746 3929030 3909801
3209 3909801 3888743 3895306 3896661 3892773 3877756 3851055 3835173 3845980 3823394 3807904 3800311 3788674
3197 3788674 3798189 3775200 3730136 3731414 3737895 3748782 3744205 3720180 3700905 3697219 3695596 3667182 3651987
3184 3651987 3639768 3635078 3624948 3606070 3610615 3581810 3561802 3568236 3560190 3553938 3566426 3562100 3535095
3171 3535095 3521418 3521461 3509673 3498629 3495541 3481021 3468629 3453757 3467768 3434638 3431261 3422121 3421634
3158 3421634 3416068 3423242 3414102 3386095 3380721 3371079 3356611 3340775 3328716 3343473 3338173 3314877 3310927
3145 3310927 3304244 3297280 3283434 3260198 3251060 3244659 3230539 3228834 3239361 3241185 3219270 3226749 3210551
3132 3210551 3193337 3191350 3173378 3155013 3139869 3127277 3145750 3133806 3112792 3116368 3129467 3100714
3120 3100714 3084918 3088855 3047884 3042095 3054146 3061189 3069014 3036041 3021952 2984273 2980679 2977582 2993244
3107 2993244 2991627 2997782 2987055 2972789 2950317 2929147 2949828 2954775 2954504 2942092 2935220 2922867 2903994
3094 2903994 2897145 2908199 2897423 2885256 2868474 2866184 2840876 2852636 2842217 2843779 2838000 2837244 2836127
3081 2836127 2824344 2809513 2805330 2795065 2779008 2791576 2787651 2775343 2749059 2745547 2762049 2766889
3069 2766889 2744287 2719393 2718826 2718497 2686054 2657355 2696107 2698273 2677970 2673690 2659453 2651927 2641733
3056 2641733 2643415 2621198 2611119 2631494 2633064 2639593 2635786 2600899 2600836 2623732 2608738 2562661 2537980
3043 2537980 2539489 2551325 2560765 2558960 2547536 2544713 2500752 2507834 2499345 2512985 2490452 2492727 2477910
3030 2477910 2453831 2454429 2438913 2437747 2462204 2461500 2442191 2452655 2428462 2429592 2403654 2413665 2408205
3017 2408205 2387613 2388399 2383591 2364893 2368828 2352813 2341732 2338812 2369093 2365374 2344788 2327928 2311545
3004 2311545 2314526 2319781 2328179 2323035 2300656 2300913 2309918 2297857 2298583 2298460 2279016 2275985 2287862 2264738
2990 2264738 2257819 2262648 2231410 2237271 2254531 2247367 2226486 2227201 2234508 2227113 2183343 2179962 2216575
2977 2216575 2207499 2205529 2194999 2183525 2173163 2156861 2170367 2166521 2159650 2143615 2124989 2128132
2965 2128132 2127472 2109033 2086222 2063471 2083346 2083389 2082489 2081734 2080305 2064988 2063820 2075972 2080068 2057241
2951 2057241 2057048 2034365 2014818 2028143 2030898 2040771 2005906 2020193 2017146 2009342 2005410 2024057 1997703
2938 1997703 1987418 1989413 2005065 1983806 1985440 1996229 1989998 1949994 1948810 1958995 1948026 1943139
2926 1943139 1920807 1918753 1929454 1938852 1939096 1911860 1874284 1920301 1921468 1885358 1885832 1889816 1896454
2913 1896454 1905006 1888131 1893464 1893323 1900121 1893032 1867641 1867576 1866334 1854555 1843689 1811073 1801174 1812509
2899 1812509 1824532 1829918 1813906 1842379 1821701 1784290 1805293 1779010 1729687 1747898 1754542 1756632
2887 1756632 1756602 1773449 1759112 1756019 1774012 1741978 1748009 1733096 1746171 1755483 1744614 1739562 1725613
2874 1725613 1716496 1693812 1701155 1699019 1685157 1672038 1681244 1666099 1665712 1652992 1659158 1649646 1651324
2861 1651324 1666994 1694836 1676861 1651618 1651841 1624779 1614928 1620249 1635993 1625657 1623803 1608715
2849 1608715 1602755 1601175 1580334 1583893 1590858 1610420 1613859 1595179 1616716 1586645 1583526 1573813 1583701
2836 1583701 1591803 1579115 1585730 1557725 1546270 1547229 1542645 1562960 1564431 1533652 1526347 1539339 1528356
2823 1528356 1521541 1487008 1485617 1501181 1489468 1482188 1463890 1476221 1493517 1499984 1481624 1450926
2811 1450926 1472767 1451309 1446687 1456074 1463102 1469260 1455158 1452273 1442513 1431359 1445497 1447183 1466592
2798 1466592 1468153 1446600 1425714 1419273 1415971 1397840 1406821 1413704 1408286 1396153 1402509 1400713 1370514
2785 1370514 1375297 1392314 1375080 1360316 1375558 1373226 1372139 1383088 1402218 1390682 1380698 1378589
2773 1378589 1353820 1363386 1371629 1371738 1349782 1341407 1325986 1322912 1315985 1300591 1303395 1326312 1320928
2760 1320928 1303945 1297992 1302327 1295021 1296420 1281064 1299510 1300101 1279221 1262299 1264428 1271375 1260553
2747 1260553 1268352 1260518 1261476 1265702 1269373 1265523 1276289 1270187 1269529 1242862 1232241 1254745 1247699 1239216
2733 1239216 1237300 1235390 1237053 1251865 1257960 1232899 1216963 1223800 1225603 1205778 1216093 1222356 1213214
2720 1213214 1206020 1193226 1213135 1231324 1204186 1171208 1172407 1180103 1152619 1152442 1178140 1184932 1171087
2707 1171087 1176740 1181059 1144521 1124896 1129801 1141000 1136107 1129208 1136419 1126118 1129289 1145085 1136064
2694 1136064 1119353 1133382 1131820 1101504 1105214 1085948 1095719 1090390 1096392 1097452 1117944 1100828 1097138
2681 1097138 1109892 1084077 1078850 1093192 1109245 1090776 1085244 1065749 1051644 1069507 1072573 1061447
2669 1061447 1060261 1072175 1077038 1088435 1074091 1048371 1032389 1039464 1049602 1032190 1003517 1030002
2657 1030002 1037253 1029316 1025907 1018127 1047503 1032388 1018968 1033959 1024116 1017800 1019866 1002093 1002607
2644 1002607 994155 1008128 1016721 991258 979016 985325 983443 1009631 1004906 990626 972201 990673
2632 990673 988773 987324 984688 970171 972218 985436 967004 941599 923300 942878 945794 964441 985713
2619 985713 953452 920888 921780 938346 920681 944510 953191 931494 902643 910164 907374 899929 899189
2606 899189 920862 919880 926936 917118 900413 900651 912523 922062 909022 905814 888133 897299 918482
2593 918482 908402 916537 915605 879202 865948 864846 886843 898688 881295 855922 846483 809442 827406
2580 827406 843841 828893 862830 837041 823445 812343 833583 840120 839206 866431 862216 868430 844020
2567 844020 838464 869898 854646 845415 847817 836873 838103 847378 821953 829918 798408 798542 794603
2554 794603 792565 807800 824066 846862 804960 798617 809459 808246 789768 806336 818875 806198
2542 806198 797832 782760 782881 797066 769134 764777 764447 769612 784492 782537 769859 769662 753667 764339
2528 764339 744689 745975 750887 762579 755124 751100 755109 758106 767070 759587 750786 747657 744932 748447
2514 748447 744874 721802 724240 737723 726094 728490 724267 705115 715672 726488 732193 730520 715468
2501 715468 716330 718514 708736 717182 693112 702809 734548 731126 700784 696723 712635 711425 683214
2488 683214 691420 693299 690492 696676 685661 679487 656754 664823 659838 662972 669288 663164 668658 661343
2474 661343 658762 647467 653344 662140 663042 653255 653641 656555 658453 659216 651159 651054 645587 648281 676263
2459 676263 673914 658692 619511 628859 634886 626339 618761 636804 645297 625724 614376 632454 623853
2446 623853 611630 622066 631553 638723 634321 607656 601672 595188 591828 594435 594442 604003 601825 582355
2432 582355 608743 622243 630334 620984 591621 597794 611709 603035 582326 584914 594409 606278 599942
2419 599942 591188 592223 561231 553861 570103 565185 585656 569994 576201 587673 584925 567242 590861
2406 590861 577797 561270 555947 551836 567271 559557 554715 566424 557022 558697 564039 545654 559014
2393 559014 577770 565430 575776 546211 524899 514548 515363 556697 549670 532280 537902 559739
2381 559739 555851 553361 533394 530424 553847 522177 508064 504382 540242 533655 535356 528394 515130
2368 515130 516632 509037 511482 514468 518294 484725 496943 490816 514111 533136 520707 501577 507550
2355 507550 521153 495355 519148 509027 497707 491488 490866 486380 485648 502183 508303 456179 473062
2342 473062 511424 503884 494609 493083 477502 480177 483147 468305 461517 456868 455705 464191 456838 449733
2328 449733 464400 471682 472506 468540 468219 455178 448856 459888 490496 456250 467574 457609 477249
2315 477249 491111 477055 448112 426750 455423 448014 459151 456074 456936 438946 445190 452048 435696
2302 435696 445343 431187 411415 421427 434388 425639 411651 411644 418316 408514 424525 402792 411381
2289 411381 414166 442129 437131 438099 422420 418133 431881 400618 404382 424194 412649 381797 393934
2276 393934 394597 400252 422411 411875 413009 409592 394918 382146 393977 424194 396968 363980 349764
2263 349764 357026 338712 344190 354627 357963 365700 362631 380072 414841 405153 386588 354835 335098
2250 335098 354315 370440 354901 361617 378451 352948 347901 375542 372916 361909 368152 372275 361053
2237 361053 360138 378665 367486 352682 372724 362342 335640 338114 332930 346659 343483 371928 381580
2224 381580 394515 369696 350495 337904 344010 343644 347637 357008 373709 363783 347966 326873 333527
2211 333527 352951 335782 333828 325746 317260 322215 329398 334809 337727 353915 360906 359947 371325 339793
2197 339793 338401 337525 340126 323462 319011 324898 335084 327266 348461 308195 303954 310833 300462
2184 300462 305436 332530 357565 330521 304956 290479 298229 292411 310926 315801 303775 310725 309739
2171 309739 316084 296232 289769 296237 310880 304230 302703 326346 312470 296392 288405 290046 283096
2158 283096 270729 280397 309426 290926 286851 282755 294438 328718 320930 300753 293324 297266 304204
2145 304204 304419 285195 270753 276616 285760 279485 275902 274022 279831 278245 295887 268057 248973
2132 248973 272202 291796 298428 307692 297955 281761 276771 260968 260501 292063 305520 299171 275728
2119 275728 272365 276763 258008 272455 294133 270620 231543 245455 265391 253643 253751 285219
2107 285219 295899 270478 264997 245678 254062 257244 289159 290883 283831 249285 257044 263425 244605
2094 244605 242178 241343 226387 205413 220449 224511 239317 207232 232286 229425 251053 250708 220329
2081 220329 227213 245156 256754 239926 248437 252330 217764 232645 224853 220957 212187 235955 221403
2068 221403 226866 234546 239596 228940 226002 235834 233173 227718 210050 213672 213453 223790 229893 229079
2054 229079 230779 237445 220324 182362 195008 219960 236687 234524 199274 188039 194899 204415 206489
2041 206489 213964 215030 218115 222145 217537 201794 198223 218138 195747 220634 212116 202666 216877
2028 216877 186138 196108 211302 208107 211828 220791 214642 195048 195416 187666 170706 194448 191959
2015 191959 177081 196668 212418 207082 202220 195438 195266 178840 195493 189160 190417 179244 173146
2002 173146 198391 199286 190555 182285 187534 181356 158853 159470 156067 166130 182064 178474 176608 165142
1988 165142 178256 182394 183880 208982 184369 150370 149693 151384 181457 186128 211439 207654 182483
1975 182483 164597 184723 158979 152292 183889 165560 160366 165932 185231 171138 169231 170433 186719
1962 186719 196361 175758 155476 174415 165450 159941 162590 163755 146841 151354 157278 168447 177453
1949 177453 166336 161066 160349 180047 178631 155111 150504 153370 164032 143817 147390 130473 152679
1936 152679 156520 127554 129587 165230 128326 131979 138016 143548 142995 136624 144858 129172 128493 131921
1922 131921 144988 150920 133559 116371 139182 137402 142015 148089 158489 147477 132990 140873 151671
1909 151671 132421 140915 123154 101626 129288 143417 151345 148655 165376 146389 123776 119416
1897 119416 119669 125326 126813 135269 119183 111774 124914 117862 103691 127832 136309 141144 141309 126115
1883 126115 97610 101169 105773 111603 110111 102097 124552 138352 123364 141297 122210 125826 122610
1870 122610 118752 116684 107944 120012 132319 114800 116302 113590 122989 109513 129103 118557 130255
1857 130255 112252 93514 95559 107039 112068 116790 128708 118417 112117 140532 139294 99490 117059
1844 117059 86374 96661 86718 91452 129294 116947 118075 112691 91276 91299 102693 91514 94602
1831 94602 101904 92518 115377 110623 106216 91303 70325 76063 86618 93330 100796 73164 82934
1818 82934 87885 88107 65909 84307 87372 49505 66085 89523 100510 75259 74886 74603 89946
1805 89946 93971 78667 93141 94149 92119 93299 89784 62030 68779 81146 71062 84653 72636
1792 72636 66478 72371 79215 104926 113735 90074 79237 83799 78802 68209 70565 78294 65146
1779 65146 55710 54111 63562 66436 59626 57267 63950 70117 71270 90782 74963 61114 85057 69850
1765 69850 65349 61619 68894 54889 45747 50638 54420 69160 69536 66788 49495 68313 62850 58828
1751 58828 65637 56371 62041 55710 53082 69082 54952 59148 80937 88970 79211 77642 74334 66225
1737 66225 54391 42731 36916 24984 33320 56177 92152 98095 97922 67210 64564 69945 56274
1724 56274 52080 60858 32592 39224 34597 40337 55915 61934 38410 42251 53598 54944 54630 53177
1710 53177 58716 61129 34976 31872 33104 41746 45731 42343 36180 33268 32603 43743 56167 63720
1696 63720 41657 26101 29689 23459 57031 52989 48949 58136 57044 35695 37147 36049 31507 36553
1682 36553 35524 16559 8758 16711 22953 -6016 4444 29286 50284 46244 54881 60202 74360
1669 74360 52501 44960 32616 19425 9770 -1201 18560 36084 57340 41497 44293 24816
1657 24816 34939 62726 38566 41828 51300 67681 56814 46386 28863 31678 35659 19472 18650
1644 18650 -2807 2735 26752 -10584 7866 16968 20284 10828 -1261 2219 3180 11777 15055 31697
1630 31697 48070 58241 67008 38274 21531 30366 8014 4272 32367 21108 2954 18008
1618 18008 36591 37438 18440 -2869 -5437 63 -5121 -10004 9820 26634 16867 19941 26695 8048
1604 8048 -6215 -4423 11816 16757 21320 26014 22788 16288 6643 7147 801 12387 33965 33233
1590 33233 40163 38750 34529 27778 38767 30786 17511 26364 -4839 17465 24044 16035 21224 2170
1576 2170 -8351 1026 21747 11746 -17903 -10121 -27294 -25513 -29819 -1349 -4192 6940 26046
1563 26046 25526 -8536 -1556 14469 17379 -5628 -5949 2988 11389 -6541 -27811 -16276 -16042 1720
1549 1720 16185 18994 6415 458 -12534 -6412 2011 18781 11106 30685 41731 17980 -27599
1536 -27599 -30914 -17512 6139 29305 33722 19769 1232 28587 9553 7649 21714 -3725
1524 -3725 -11824 4921 11871 7263 7129 15356 -16938 -6728 5754 -29425 -25192 -10416 -17389 -19846
1510 -19846 16481 24234 -3994 -19438 -12834 -893 -19225 -18436 -22341 -20093 3832 4561 66 2792
1496 2792 13300 4347 355 -7866 -23904 -29176 -41511 -11919 -8334 -11382 -11211 -11030 -30507 -34201
1482 -34201 -26769 -9603 -9229 -24742 -26277 -23063 -18368 -6968 6278 -6439 -4492 -18223 -11653
1469 -11653 7370 16095 6275 7894 6168 5340 305 -12812 -11282 2481 4127 6755 6190 3922
1455 3922 -18493 -23313 -27127 -7510 -13071 -32160 -15566 -4923 -15102 -19552 -19460 -7657 -7213 -1924
1441 -1924 -924 6109 -2754 -8392 -14446 -2476 7238 4233 -22040 -39298 -45553 -39106 -30560 -19200
1427 -19200 -23576 -32443 -20662 6188 -20527 -15887 -14945 -1610 8521 -30806 -29467 -20014 -21561
1414 -21561 -12326 -11624 -86 12868 -3465 -7051 -21780 -20601 -32428 -35222 -36192 -26500 -16904 -12037
1400 -12037 -21208 -18392 -32905 -30011 -29497 -25589 665 8033 -14437 -29590 -27379 -25078 -39299 -24233
1386 -24233 -42800 -40349 -47876 -48812 -27080 -18830 -42325 -42666 -18219 -6571 -4248 -151 -728 -28978
1372 -28978 -40623 -37440 -24621 -39209 -41203 -48291 -54288 -23154 -9733 -19385 -29520 -40608 -57219
1359 -57219 -48065 -50576 -46740 -43358 -42519 -25734 -29671 -14799 -19129 -10597 -27135 -57800 -56678 -25968
1345 -25968 -7889 -26934 -51375 -50691 -29657 -12263 -30206 -23926 -18627 -38785 -20983 -34708 -22764
1332 -22764 -37145 -13813 1487 -22500 -21842 -13951 -14509 -9790 -26226 -53703 -45929 -14452 -11544
1319 -11544 -32044 -28161 7224 32836 1548 -8880 405 -7841 -31145 -41744 -32736 -19747 -21806
1306 -21806 -3611 -44999 -26662 -21082 -41973 -31869 -36189 -12549 -29472 -31970 -38375 -62446 -31616
1293 -31616 -37593 -69098 -39078 -29403 -41726 -29883 -29084 -21447 -48057 -25853 -12214 -32677 -21953
1280 -21953 -23189 -29797 -37682 -18880 -42274 -30811 -10257 -16159 -22143 -20901 -22838 -23834 -35038 -68624
1266 -68624 -54211 -24811 -26032 -31408 -53875 -29398 -38634 -31720 -41587 -19408 12900 -15159 -20071
1253 -20071 -21932 -65014 -59798 -29642 -26549 -23512 -31669 -24464 -37357 -26268 -30218 -20962 -16647 -19446
1239 -19446 -35955 -31554 -48430 -44721 -22808 -36852 -36192 -31474 -48022 -39810 -29903 -8618 -28726
1226 -28726 -41127 -24741 -21632 -30989 -49531 -49262 -39468 -49692 -71106 -78162 -55701 -58914 -45936
1213 -45936 -32636 -53997 -54337 -38641 -66462 -62157 -50889 -17637 -34516 -57464 -27242 -23845 -27089
1200 -27089 -40276 -41486 -57956 -55780 -49608 -44565 -40604 -28014 -38608 -47495 -32898 -32709 -50514
1187 -50514 -38248 -50662 -66703 -75990 -32812 -49698 -68476 -56862 -43395 -39907 -32465 -49350
1175 -49350 -55118 -42193 -45240 -34640 -42372 -49998 -68890 -49729 -45435 -56659 -41917 -43338 -10456
1162 -10456 6034 -13927 -13758 -13139 -14843 -18933 -35310 -28627 -40260 -55793 -32417 -19372 -33473
1149 -33473 -49418 -28852 -36679 -56708 -55353 -55763 -51799 -79532 -65747 -42170 -58219 -48225 -49605
1136 -49605 -54290 -43004 -20754 -44120 -71575 -52939 -55251 -38644 -25646 -25848 -32871 -35466 -41016
1123 -41016 -54327 -46937 -36249 -38264 -41602 -45706 -58995 -45656 -52073 -48438 -16043 -2284 -20953
1110 -20953 -18119 -37161 -46174 -73208 -63704 -50054 -46448 -26781 -35001 -56811 -51843 -55954 -42270
1097 -42270 -47067 -52421 -71902 -54088 -17902 -15129 -23202 -64385 -67708 -54824 -78030 -78231 -72473
1084 -72473 -61042 -47330 -59145 -67820 -60941 -54544 -67013 -59957 -84399 -66468 -68536 -77252 -73946
1071 -73946 -42141 -44219 -63848 -38154 -35890 -34740 -24227 -22863 -26630 -45642 -34123 -12804 -46855
1058 -46855 -51987 -36221 -29615 -29180 -35061 -20030 -36664 -40862 -37952 -32930 -32147 -55306 -40763 -18176
1044 -18176 -19404 -35093 -39436 -29690 -24776 -30655 -43273 -18902 -17387 -15457 -23067 -37912 -31613 -2333
1030 -2333 -14208 -38473 -55766 -61782 -58789 -36074 -46865 -57629 -42682 -22961 -28664 -40895 -32054
1017 -32054 -56240 -40630 -44575 -40177 -27940 -22503 -17291 -39154 -25850 -33006 -35911 -7172 -11273
1004 -11273 -39775 -32436 -28140 -22922 -37127 -43214 -49902 -34672 -11690 -15213 -3180 -21316 -20891
991 -20891 -24250 -27287 -48705 -33959 -26998 -10353 -15758 -9225 -22249 -24501 -22416 -28973 -16880 -26929
977 -26929 -28234 -52734 -70185 -37955 -40285 -38340 -32785 -34650 -28119 -9376 -7700 79 -12038 -42049
963 -42049 -45238 -53810 -50150 -38893 -52433 -51135 -42724 -46540 -36489 -34869 -25695 -13274 -26173 -43334
949 -43334 -33201 -37480 -11525 -18543 -29228 -47133 -34125 -42906 -51419 -40776 -24162 -28226 -21505
936 -21505 -30162 -27462 -24821 -36394 -39585 -42460 -21044 -25625 -39708 -62421 -50882 -62548 -79253
923 -79253 -68941 -43221 -55306 -44582 -45406 -43245 -41325 -34122 -32582 -36634 -43394 -36345 -30794 -35887
909 -35887 -39655 -43615 -56988 -34357 -64631 -80051 -54977 -45328 -41517 -49160 -40668 -37242 -27187
896 -27187 -33564 -35853 -29646 -35910 -34263 -6789 -28966 -32862 -37053 -35108 -46108 -52869 -47356 -60409
882 -60409 -18459 -36732 -49134 -22020 -21842 -5173 5866 -7274 -40476 -45740 -44615 -38098 -52380
869 -52380 -47210 -17818 -6196 -8984 -2671 -26115 -31965 -26558 -23913 -25060 -27781 -26129 -11543 -24026
855 -24026 -29919 -36063 -47362 -51556 -47799 -33403 -30604 -47648 -18858 -19536 -19734 -13581 -13656 84 -20150
840 -20150 -18865 -21590 -24406 -19458 -7025 -935 170 -28035 -7832 -12854 -5782 -15946 -17734 -14383
826 -14383 -27357 -33297 -35773 -23385 -45374 -40637 -30809 -22074 -36404 -18166 -3329 -3909 -7741 -15632
812 -15632 -8325 -11808 -15568 1987 19709 10049 -9017 -24252 -1778 -3461 -7916 -16057 -45890
799 -45890 -56444 -11742 -3066 -13139 -6980 -20542 -36915 -11861 -24306 1604 18147 -4790
787 -4790 -9051 -24865 -16619 -4772 -21829 -29833 -24084 -15919 -11707 15213 13631 -5768 1129 -24500
773 -24500 -25357 -3125 15450 -3530 -21770 -14591 -13899 -21868 -11731 -22159 -26798 -15795 -22236 -27094
759 -27094 8533 4175 -18358 -28012 -3392 -14974 -14688 -28089 -19591 -10980 3773 -11863 -25509
746 -25509 -22430 -37435 -14880 -23841 -46181 -49137 -44981 -57787 -66531 -41951 -18350 -19203 -25061 -23105
732 -23105 -34432 -18324 -6577 -5676 -9039 6290 29193 -2591 -1130 3074 -17940 -30663 -4669
719 -4669 22595 -200 -15233 -23231 -20781 -23528 -26247 -2162 5979 4215 9132 -6297 -15796 -19052
705 -19052 -18321 2262 -16914 11688 1802 -13267 -4034 9107 20772 9078 -15951 -6663 35383
692 35383 35828 -4951 -27356 -32062 287 -7555 -24382 -22064 -9516 -23345 -25689 -18679 18006
679 18006 -4754 -12404 -2834 -21990 -9646 582 785 1670 -4043 7208 1940 -2673 3843 18498
665 18498 19757 -2034 -8933 -12455 -4522 9677 49736 19373 -7857 -11081 -20306 -748 -12948
652 -12948 -12724 -19096 -16556 -15285 -7821 -7740 -14324 -14572 -11004 17467 22532 21593 -4808 10933 9984 334
636 334 12533 16709 15910 26870 21411 33285 18814 35157 40184 38435 34234 28695 13086 5472
622 5472 20206 11344 11839 25855 13397 -7911 -19837 4173 99 5016 22379 13243 15130 17851
608 17851 22009 17782 26297 17493 13189 19983 27956 20896 20246 5565 -20039 -18844 -15439 7582
594 7582 14243 4638 -3175 32472 15276 -647 13411 15223 23262 -9327 5904 -3481 -14943
581 -14943 -176 -13069 1163 8851 -12932 -18136 16116 26870 13606 14146 -17128 -24708 1753
568 1753 6370 -6734 10952 45434 19564 -7014 -9048 8624 8271 14830 7417 13154 20743 6355
554 6355 13389 7969 11237 23714 30701 29479 31632 23556 13459 12813 11111 16301 6562 7603 14922
539 14922 14311 15069 27293 31664 30691 33751 -3291 -23903 -15851 -9086 -2151 10940 23900 22892
525 22892 31665 20147 18986 23816 -6731 7819 20583 13545 6583 11253 20863 39789 25121
512 25121 18823 22891 24900 19609 48769 55039 29968 4977 17067 26745 26027 37802 2654 7778
498 7778 24322 16083 9907 27394 43823 33718 29379 26398 27451 39099 43224 19445 2020
485 2020 -4218 -7671 24782 22171 36063 38999 32427 28063 15601 24468 24584 14789 13303 32281
471 32281 37354 63778 60797 33428 15572 21130 21084 23021 12034 16813 17657 25464 28398 23188 25404
456 25404 28135 14814 -3446 -8771 -902 13644 31358 35380 34884 18462 39040 55677 50472
443 50472 35138 27752 32386 34318 45821 61537 55288 42952 44163 52791 49996 32321 20911
430 20911 20121 27784 21344 48062 20496 28930 56240 73283 67926 47529 28850 38105 38668 40289
416 40289 37712 23222 7661 39569 50192 49415 55266 21311 25610 43284 37936 35407 54740
403 54740 54018 52162 54891 48078 47855 62446 23554 8965 32985 43398 49128 51687 37219 30327
389 30327 37669 57346 50944 34969 55295 57832 70518 55255 57927 44387 50093 55676 61278
376 61278 60047 67708 87950 63335 41925 25612 52703 59443 73539 70093 75774 79835 54320
363 54320 46473 61202 59691 30372 46119 27182 10139 28234 46720 52245 60352 38453 58269
350 58269 82560 66754 65910 91547 95201 69145 77992 70307 66791 80395 51639 43246 57699
337 57699 75140 61508 74187 86690 86334 72567 107716 62325 59427 50514 38866 75818 69897
324 69897 73110 76874 74556 46993 58397 50344 63766 43531 34833 40942 45210 27970 16319
311 16319 35191 55954 60458 56359 83078 101032 55737 43667 44136 35421 54542 48149 71564
298 71564 72279 62647 65061 65290 75757 59249 77703 70499 82315 68941 68665 49895 60261 62886
284 62886 48172 56675 73785 60081 58173 60063 77129 59502 52157 66849 60742 61551 66806 64829
270 64829 60439 53986 71999 78988 61877 65971 69283 54255 53206 66798 65793 59451 58693 85376
256 85376 84662 59297 67078 76508 55312 54029 71646 64186 55283 74593 51303 37359 30861 53941
242 53941 64111 64320 67206 66477 47274 49279 59934 43859 49994 46907 41894 44934 60592 61511
228 61511 59881 71979 65241 72699 63775 45102 49189 43666 62581 46499 57533 76666 64447
215 64447 42850 36152 42985 41412 44875 38650 52453 59384 60975 56930 52838 24805 5529 18044
201 18044 48035 28633 14841 1542 19841 42210 23304 22671 19762 3227 -1153 8969 -473
188 -473 20545 27089 7664 34323 1481 -6612 28174 30341 17052 10515 -5315 -23587 -12558
175 -12558 -14391 -3752 14818 -421 14881 -1869 22533 -920 -9125 6333 -3996 -6924 -20359
162 -20359 -8627 -35277 -37766 -19059 -9424 -23465 -48267 -47715 -32304 -38458 -57743 -45087 -31943
149 -31943 -54135 -45914 -40038 -37395 -23847 -33818 -60398 -67938 -59256 -38955 -41572 -47097 -51737 -61124
135 -61124 -74848 -81637 -76910 -76518 -87986 -84040 -91075 -86060 -66858 -86977 -107699 -127100 -137791
122 -137791 -127360 -127839 -123455 -110442 -115329 -132761 -137011 -119447 -120776 -132753 -125109 -125242 -140004 -154751
108 -154751 -152140 -137409 -139012 -132505 -138377 -137626 -154295 -162417 -162812 -151045 -146081 -176803 -171010 -154768
94 -154768 -148789 -156195 -172423 -192425 -181227 -185649 -193114 -211037 -209371 -221627 -217728 -223016 -228836 -201791
80 -201791 -213561 -229803 -214765 -212646 -233544 -246982 -259392 -254198 -243035 -257685 -255267 -266639 -280701
67 -280701 -267256 -278068 -280967 -285786 -289094 -287915 -281274 -260826 -255967 -262301 -262628 -273269 -291428 -299622
53 -299622 -293920 -308609 -317954 -311923 -315767 -313193 -325312 -332201 -334972 -350577 -336851 -343508 -340581 -349426
39 -349426 -366974 -382322 -374493 -383528 -384107 -379750 -377769 -381570 -400974 -402427 -404531 -419990 -426979 -406882
25 -406882 -421504 -431947 -423953 -424123 -419232 -428391 -423858 -437505 -446634 -457283 -476944 -472532 -477818 -461535
11 -461535 -472527 -489012 -481377 -472694 -498476 -513969 -514664 -507263 -505837 -496025 -515062
0 -515062
$$ Imaginary data points
##PAGE= N=2
##DATA TABLE= (X++(I..I)), XYDATA
16383 -3520482 -3479392 -3421281 -3381086 -3345909 -3290116 -3240545 -3197091 -3148454 -3092547 -3035584 -2995719
16372 -2995719 -2929102 -2872054 -2814996 -2775259 -2745825 -2682837 -2627175 -2589222 -2540177 -2505330 -2443832
16361 -2443832 -2388636 -2340843 -2274757 -2232585 -2185349 -2137896 -2103672 -2055925 -2009755 -1947311 -1910286
16350 -1910286 -1856673 -1794248 -1754240 -1723472 -1675685 -1641314 -1584499 -1523374 -1477902 -1449484 -1404700
16339 -1404700 -1347368 -1308460 -1254159 -1188061 -1150699 -1103665 -1051726 -1020241 -977465 -920681 -883053
16328 -883053 -843131 -792544 -755529 -725848 -675400 -615945 -559905 -519447 -498207 -468726 -398470
16317 -398470 -349796 -324957 -269358 -219200 -183289 -143510 -100992 -76847 -36439 15094 49643
16306 49643 96918 140002 180188 226126 245275 297577 333844 373706 407846 453716 503876 525832
16294 525832 586055 639803 670671 695692 709503 758685 806194 857017 904772 951475 985140
16283 985140 997365 1018336 1047729 1088573 1138967 1162769 1184622 1233618 1269773 1297253 1342312
16272 1342312 1378183 1413946 1456064 1491634 1520542 1567260 1610135 1605201 1644554 1689811 1718046
16261 1718046 1749072 1769913 1803892 1817016 1829958 1874455 1904462 1947768 1994538 2033904 2062629
16250 2062629 2092669 2117431 2141343 2183099 2206606 2217418 2236711 2265972 2300320 2322628 2325402
16239 2325402 2352909 2380557 2426803 2461384 2472603 2475884 2514154 2553465 2569406 2596156 2645079
16228 2645079 2674327 2692780 2700622 2720879 2736675 2762063 2780973 2793625 2823986 2859612 2879386
16217 2879386 2897103 2919617 2935731 2949568 2970565 2984913 3005534 3041695 3054520 3101242 3111904
16206 3111904 3123432 3151074 3137274 3175568 3193251 3214778 3223539 3247579 3275674 3275459 3286044 3306731
16194 3306731 3332453 3341637 3353708 3380170 3387770 3400387 3439212 3432210 3445301 3477311 3492292 3511095
16182 3511095 3505763 3507986 3522812 3521197 3579167 3605044 3601088 3607301 3611076 3625395 3639232 3647894 3672674
16169 3672674 3691000 3706478 3710438 3735623 3753094 3773176 3784923 3766603 3776934 3796593 3788852 3771114
16157 3771114 3787459 3823587 3835414 3826586 3843645 3863444 3871783 3875613 3915255 3907226 3904982 3913560
16145 3913560 3930111 3944188 3937279 3950893 3972015 3980878 3993133 3990768 3980900 3979255 3981333 4002966
16133 4002966 4016357 4026317 4013774 4061311 4062396 4060702 4069753 4084864 4072981 4072729 4063190 4068680 4091380
16120 4091380 4107510 4122681 4132640 4122674 4128955 4140530 4141754 4123799 4143719 4153969 4165257 4157650
16108 4157650 4152415 4158840 4151200 4170948 4188743 4202644 4192192 4206581 4215866 4229291 4219976 4207267
16096 4207267 4193521 4208402 4227660 4222810 4234461 4248130 4244388 4243503 4229910 4234870 4236220 4245264 4247706
16083 4247706 4259840 4246321 4239921 4260626 4272053 4253843 4247648 4259748 4258563 4266737 4264880 4266448
16071 4266448 4267404 4269182 4283337 4290552 4299068 4294814 4292051 4297887 4287724 4300282 4302023 4285167 4288016
16058 4288016 4317504 4321363 4320180 4316203 4316308 4307168 4313647 4306773 4303359 4336482 4317556 4304063 4288467
16045 4288467 4322234 4326215 4314502 4331457 4322887 4320928 4320696 4316421 4327371 4342296 4328933 4338425 4338867
16032 4338867 4343803 4337604 4300687 4295787 4313770 4314059 4340876 4382436 4347769 4339426 4318242 4317161 4317741
16019 4317741 4319584 4328639 4324617 4332401 4350668 4340643 4339079 4353504 4360776 4338814 4337030 4341532 4354502
16006 4354502 4359052 4355946 4374351 4372343 4368380 4360496 4377600 4371211 4347378 4383658 4374981 4364763 4362234
15993 4362234 4352552 4385845 4369498 4367563 4346996 4355119 4346502 4353144 4366646 4374792 4352405 4354168 4367956
15980 4367956 4359811 4368851 4374725 4390312 4357788 4367222 4356618 4361176 4354006 4327043 4331596 4347668 4341419
15967 4341419 4333321 4380729 4377083 4358439 4364897 4373068 4379923 4377722 4348710 4363998 4388340 4410533
15955 4410533 4397731 4403979 4391173 4367126 4375419 4372772 4357396 4354246 4358481 4356326 4362382 4381355 4400495
15942 4400495 4370453 4378483 4368473 4396586 4377098 4380166 4383055 4356433 4363405 4368926 4357969 4375575
15930 4375575 4375402 4375615 4397245 4397559 4409432 4409703 4393940 4380479 4379383 4382055 4380326 4384552 4409420 4389472
15916 4389472 4384576 4385092 4381028 4371294 4374852 4376304 4387222 4381354 4402897 4414251 4397141 4391999 4393704
15903 4393704 4412511 4419054 4396598 4402212 4399425 4399549 4396546 4422218 4395120 4380179 4396191 4406364
15891 4406364 4410239 4399177 4406135 4391115 4397482 4412069 4405941 4401121 4398105 4417670 4397737 4389809 4398777
15878 4398777 4407733 4417795 4395342 4407899 4420877 4437334 4413259 4396137 4403616 4402654 4397436 4391048
15866 4391048 4405011 4431932 4440124 4427749 4417713 4425941 4414492 4402398 4410652 4409993 4401218 4386748
15854 4386748 4394571 4393940 4403906 4407434 4389988 4381459 4392300 4422233 4413168 4419671 4406626 4415351 4412484
15841 4412484 4376128 4380474 4392401 4410405 4406576 4414537 4425486 4402337 4404167 4422436 4409248 4414020
15829 4414020 4432303 4440420 4434690 4410604 4400336 4390982 4383181 4393989 4425322 4433618 4426159 4436050 4442154
15816 4442154 4416691 4413433 4390824 4380194 4416649 4410473 4419958 4434817 4436720 4453892 4450232 4422464
15804 4422464 4392107 4411698 4417793 4406005 4420169 4431549 4413981 4431950 4413172 4413821 4429389 4431898
15792 4431898 4413849 4408603 4427308 4432579 4408221 4417649 4421022 4437246 4454150 4450807 4450200 4437635 4450378
15779 4450378 4452427 4449125 4433718 4426470 4417000 4445261 4459737 4463413 4468191 4460282 4456384 4451520 4430645
15766 4430645 4437814 4455242 4445986 4431815 4442145 4459451 4463561 4457826 4450530 4448944 4469312 4442843
15754 4442843 4417580 4451677 4477532 4464971 4465752 4453936 4460346 4442400 4464151 4470165 4456614 4447270
15742 4447270 4460777 4477134 4469882 4469973 4474201 4474960 4448111 4453878 4452292 4458505 4462438 4451625 4438229
15729 4438229 4436249 4458419 4487181 4483533 4470969 4458560 4455075 4469981 4489453 4489731 4481044 4473787 4480775
15716 4480775 4455980 4461929 4470605 4462838 4464672 4469139 4470019 4475799 4482241 4470464 4460600 4455921 4447070 4458131
15702 4458131 4455499 4446963 4439559 4467040 4492251 4491060 4491706 4486362 4479953 4460901 4456027 4455935 4474509 4501400
15688 4501400 4474045 4476383 4485419 4478192 4482751 4485465 4479877 4472856 4472880 4496587 4508475 4500327 4491994 4462915
15674 4462915 4482454 4503882 4495979 4491127 4484118 4498068 4512541 4512989 4499970 4495813 4477657 4463343
15662 4463343 4473150 4475051 4475250 4474311 4470615 4472051 4466364 4467006 4481857 4476044 4511850 4517505 4498964 4465493
15648 4465493 4490144 4496038 4503613 4501313 4504683 4508151 4503116 4488647 4484145 4482258 4476268 4489539 4499226
15635 4499226 4485104 4482923 4484548 4485611 4484770 4480591 4463378 4459187 4468179 4492161 4467304 4485353 4504320
15622 4504320 4499692 4496500 4513120 4524805 4501177 4486562 4476231 4477099 4497627 4497931 4491941 4489101 4499123
15609 4499123 4515666 4503916 4497364 4491998 4489932 4483506 4485177 4496642 4501180 4507088 4538681 4529457 4519526
15596 4519526 4513364 4497050 4503507 4513459 4508038 4513733 4509751 4510762 4487619 4498093 4505449 4545406 4511969
15583 4511969 4519346 4513337 4499636 4499062 4510829 4501601 4514527 4539972 4550573 4545383 4531206 4516899
15571 4516899 4520880 4520723 4514392 4530056 4528903 4534835 4553613 4525967 4528480 4550284 4532881 4528086 4538212
15558 4538212 4542491 4534477 4545902 4542337 4560683 4554555 4547495 4512322 4500256 4511748 4513308 4534778
15546 4534778 4535017 4527302 4522277 4532134 4530633 4516030 4516808 4550319 4547050 4543785 4529367 4506194 4527679
15533 4527679 4511639 4497709 4524821 4544925 4560566 4541842 4522317 4506468 4522882 4535835 4543067
15522 4543067 4535327 4529633 4523257 4539488 4559496 4557745 4564475 4540742 4537670 4540715 4553533 4527219 4546069
15509 4546069 4575740 4599694 4564504 4566619 4554495 4541919 4534793 4555464 4567519 4553531 4547039 4564520
15497 4564520 4566576 4546708 4561313 4551187 4546123 4565043 4570291 4569758 4565447 4586206 4594361 4576245 4572402
15484 4572402 4580066 4569009 4564977 4552566 4550792 4562158 4547334 4562464 4566543 4572057 4571232 4562059 4561728
15471 4561728 4564252 4545153 4571632 4558683 4580001 4574898 4580013 4570902 4556412 4563020 4546747 4559490
15459 4559490 4576584 4571541 4563117 4568430 4551980 4534978 4529170 4529821 4556502 4557614 4545026 4555386 4549769
15446 4549769 4575697 4583470 4579414 4561000 4564269 4587975 4592076 4562718 4562328 4565004 4603347 4597020 4578751
15433 4578751 4564360 4551118 4574790 4594053 4570611 4563848 4583283 4583785 4623184 4616840 4570869 4576719
15421 4576719 4600475 4589949 4581766 4613051 4625570 4604710 4598534 4599163 4603053 4622837 4619329 4599670
15409 4599670 4594457 4623989 4592388 4596818 4595380 4591423 4587435 4572492 4578361 4578390 4606220 4605349 4593390
15396 4593390 4595507 4591449 4594934 4589362 4582009 4602456 4613412 4585640 4576870 4595169 4594009 4588107 4608785
15383 4608785 4627150 4611885 4600634 4586100 4590274 4609687 4621141 4595813 4603290 4605420 4611325 4627049
15371 4627049 4640936 4627729 4621052 4615795 4604632 4606290 4617495 4626830 4612053 4606743 4619768 4616301
15359 4616301 4605472 4584257 4604781 4617483 4612854 4617626 4589896 4600875 4611925 4610103 4603879 4580219
15347 4580219 4589087 4612855 4639914 4592705 4603732 4622869 4613551 4611989 4628648 4640799 4642778 4634105
15335 4634105 4628117 4610812 4625984 4619270 4614038 4633285 4648805 4649094 4647573 4650591 4647043 4609683 4600669
15322 4600669 4616627 4623072 4618690 4598369 4608583 4607990 4620751 4623777 4623413 4645413 4637540 4615437 4621515
15309 4621515 4626390 4645819 4651677 4626699 4637923 4661760 4636829 4617340 4636235 4637639 4631660 4616921
15297 4616921 4613930 4628118 4631795 4622528 4613386 4642135 4632250 4630757 4628458 4641058 4650878 4633375 4613526
15284 4613526 4599272 4616533 4635233 4639471 4640968 4648061 4638831 4616695 4651938 4633922 4642218 4621543
15272 4621543 4627067 4663679 4657370 4640133 4655151 4657272 4686033 4682004 4665972 4653894 4667799 4677977
15260 4677977 4655562 4643979 4644740 4681650 4688723 4660829 4651214 4665873 4643181 4643674 4659464 4651453 4657459
15247 4657459 4658004 4659190 4674545 4681207 4672684 4677555 4705359 4700746 4682382 4668712 4654818 4670190 4677798
15234 4677798 4650575 4646085 4688057 4673105 4657172 4670799 4651828 4671506 4666515 4660015 4652918 4641253
15222 4641253 4653532 4679257 4684964 4688816 4708366 4687005 4698018 4697952 4675291 4686272 4691321 4682462 4681244
15209 4681244 4670464 4676611 4683976 4674429 4661744 4673011 4695687 4692600 4706080 4692345 4676110 4679820
15197 4679820 4694931 4676596 4683365 4680547 4678587 4701214 4701656 4688880 4669829 4683700 4703691 4697258
15185 4697258 4689956 4693971 4693186 4701193 4720251 4714270 4696275 4690040 4712664 4719301 4700188 4684094 4676285
15172 4676285 4697085 4694883 4717398 4707334 4685521 4695122 4682103 4673733 4679689 4696355 4713004 4707395
15160 4707395 4694555 4679598 4662382 4696684 4707788 4706232 4698233 4704364 4696815 4717354 4711471 4712034 4701637
15147 4701637 4720429 4707146 4685770 4705570 4722226 4738625 4724989 4706548 4716180 4716528 4714244 4725028
15135 4725028 4712313 4692184 4690728 4680039 4683120 4706280 4710105 4692945 4694962 4715430 4700549 4702689
15123 4702689 4699695 4719081 4691954 4696274 4720876 4708821 4710221 4714185 4724476 4735439 4760855 4749490
15111 4749490 4735655 4733954 4717613 4719033 4727222 4724344 4718563 4731917 4726668 4739223 4737468 4746141 4742859
15098 4742859 4722393 4727198 4741771 4728602 4724066 4749195 4725026 4714151 4729543 4762461 4739770 4733497
15086 4733497 4763501 4755703 4774993 4743243 4733688 4738685 4712856 4711821 4723067 4758970 4768456 4751210
15074 4751210 4775502 4757829 4736764 4751587 4752252 4744504 4769691 4744743 4723637 4704870 4717205 4726307
15062 4726307 4733460 4738412 4751042 4748750 4718961 4730651 4745747 4754028 4754677 4755586 4727354 4720736 4711634
15049 4711634 4722434 4751804 4758511 4743043 4776284 4769842 4738481 4747595 4736954 4733690 4740756 4758597
15037 4758597 4779947 4764464 4748557 4739772 4738132 4759624 4757927 4776307 4761542 4750269 4759190 4759025
15025 4759025 4728583 4696480 4731312 4754958 4778097 4771702 4771328 4751283 4751585 4752867 4736739 4751367
15013 4751367 4780382 4766651 4763292 4784952 4782329 4806317 4776442 4761438 4752275 4752257 4782843 4766913
$$ [...]
##END NTUPLES=NMR SPECTRUM
##END=
