##TITLE=1H_CA-9264-2
 DMSO-d6
 8 sc, 
 3.5.2024
##JCAMPDX= 6.0         $$ Bruker NMR JCAMP-DX V2.0
##DATA TYPE= NMR SPECTRUM
##DATA CLASS= NTUPLES
##ORIGIN= UXNMR, Bruker Analytische Messtechnik GmbH
##OWNER= root
$$ XWIN-NMR		Version 3.5
$$ Fri May  3 14:36:34 2024 Russian Standard Time (UT+4h)  she@DPX200
##.OBSERVE FREQUENCY= 200.1309
##.OBSERVE NUCLEUS= ^1H
##.ACQUISITION MODE= SIMULTANEOUS
##.ACQUISITION SCHEME= undefined
##.AVERAGES= 8
##.DIGITISER RES= 18
##SPECTROMETER/DATA SYSTEM= spect
##.PULSE SEQUENCE= zg30
##.SOLVENT NAME= CDCl3
##.SHIFT REFERENCE= (INTERNAL, CDCl3, 0, 15.9926)
##AUDIT TRAIL= $$ (NUMBER, WHEN, WHO, WHERE, WHAT)
$$ ##TITLE= Audit trail, XWIN-NMR		Version 3.5
$$ ##JCAMPDX= 5.01
$$ ##ORIGIN= Bruker BioSpin GmbH
$$ ##OWNER= she
$$ F:/spectra/data/she/nmr/H-F/1/pdata/1/auditp.txt
$$ ##AUDIT TRAIL=  $$ (NUMBER, WHEN, WHO, WHERE, WHAT)
(   1,<2024-05-03 14:35:35.25 +0400>,<she>,<DPX200>,
      <created by zg, POWCHK disabled, PULCHK disabled
       configuration hash MD5:
       00 E9 B6 7A A2 85 ED C7 34 08 36 98 17 FE 4E 26
       data hash MD5: 16K
       58 71 EA 0D A4 81 9E 4A D5 BA DA 4F FA 71 5C 72>)
(   2,<2024-05-03 14:35:38.76 +0400>,<she>,<DPX200>,
      <Start of raw data processing
       efp BC_mod = 2 LB = 0.24 FT_mod = 6 PKNL = 1 PHC0 = -25299.18 PHC1 = 7.787311 SI = 16K 
       data hash MD5: 16K
       69 49 3A D2 BE B3 F4 79 9C A6 9C 51 75 95 3E 4A>)
(   3,<2024-05-03 14:35:50.43 +0400>,<she>,<DPX200>,
      <pk PHC0 = -1.230265 PHC1 = 0 
       data hash MD5: 16K
       DD 97 F9 53 25 B2 37 4B 04 9E D4 00 4F B1 7F 71>)
(   4,<2024-05-03 14:35:54.32 +0400>,<she>,<DPX200>,
      <abs ABSG = 5 
       data hash MD5: 16K
       DD C6 B8 95 8B 5B 05 39 54 B6 F5 9A 73 19 CE 33>)
$$ ##END=
$$ 
$$ hash MD5
$$ EE 0A 6A 2B C3 8C 82 7F E5 85 41 EF DE DE A6 CF
##$RELAX= 
##$RELAX= 
##$RELAX= 
##$RELAX= 
##$RELAX= 
##$RELAX= 
$$ Bruker specific parameters
$$ --------------------------
##$DU= <F:/spectra>
##$EXPNO= 1
##$NAME= <H-F>
##$PROCNO= 1
##$TYPE= <nmr>
##$USER= <she>
##$AMP= (0..31)
100 100 100 100 100 100 100 100 100 100 100 100 100 100 100 100 100 100 
100 100 100 100 100 100 100 100 100 100 100 100 100 100 
##$AQSEQ= 0
##$AQ_mod= 1
##$AUNM= <au_zg>
##$AUTOPOS= <>
##$BF1= 200.13
##$BF2= 200.13
##$BF3= 200.13
##$BF4= 200.13
##$BF5= 200.13
##$BF6= 200.13
##$BF7= 200.13
##$BF8= 200.13
##$BYTORDA= 1
##$CFDGTYP= 0
##$CFRGTYP= 5
##$CHEMSTR= <none>
##$CNST= (0..31)
1 1 145 1 1 1 1 1 1 1 1 1 1 1 1 1 1 1 1 1 1 1 1 1 1 1 1 1 1 1 1 1 
##$CPDPRG= <>
##$CPDPRG1= <>
##$CPDPRG2= <>
##$CPDPRG3= <>
##$CPDPRG4= <mlev>
##$CPDPRG5= <mlev>
##$CPDPRG6= <mlev>
##$CPDPRG7= <mlev>
##$CPDPRG8= <mlev>
##$CPDPRGB= <>
##$CPDPRGT= <>
##$D= (0..31)
0 1.2 0 0 0 0 0 0 0 0.06 0 0.03 0 0 0 0 0.0002 0 0 0 0 0 0 0 0 0 0 0 0 
0 0 0 
##$DATE= 1714732534
##$DBL= (0..7)
120 120 120 120 120 120 120 120 
##$DBP= (0..7)
150 150 150 150 150 150 150 150 
##$DBP07= 0
##$DBPNAM0= <>
##$DBPNAM1= <>
##$DBPNAM2= <>
##$DBPNAM3= <>
##$DBPNAM4= <>
$$ [...]
##$SUBNAM3= <"">
##$SUBNAM4= <"">
##$SUBNAM5= <"">
##$SUBNAM6= <"">
##$SUBNAM7= <"">
##$SUBNAM8= <"">
##$SUBNAM9= <"">
##$SW= 18.0517689322627
##$SWIBOX= (0..15)
0 0 2 0 0 0 0 0 0 0 0 0 0 0 0 0 
##$SW_h= 3612.71676300578
##$TD= 16384
##$TD0= 1
##$TE= 0
##$TE2= 300
##$TE3= 300
##$TEG= 300
##$TL= (0..7)
0 120 120 120 120 120 120 120 
##$TP= (0..7)
150 150 150 150 150 150 150 150 
##$TP07= 0
##$TPNAME0= <>
##$TPNAME1= <>
##$TPNAME2= <>
##$TPNAME3= <>
##$TPNAME4= <>
##$TPNAME5= <>
##$TPNAME6= <>
##$TPNAME7= <>
##$TPOAL= (0..7)
0.5 0.5 0.5 0.5 0.5 0.5 0.5 0.5 
##$TPOFFS= (0..7)
0 0 0 0 0 0 0 0 
##$TUNHIN= 0
##$TUNHOUT= 0
##$TUNXOUT= 0
##$USERA1= <user>
##$USERA2= <user>
##$USERA3= <user>
##$USERA4= <user>
##$USERA5= <user>
##$V9= 5
##$VALIST= <valist>
##$VCLIST= <CCCCCCCCCCCCCCC>
##$VD= 0
##$VDLIST= <DDDDDDDDDDDDDDD>
##$VPLIST= <PPPPPPPPPPPPPPP>
##$VTLIST= <TTTTTTTTTTTTTTT>
##$WBST= 1024
##$WBSW= 4
##$XGAIN= (0..3)
0 0 0 0 
##$XL= 0
##$YL= 0
##$YMAX_a= 225619
##$YMIN_a= -219230
##$ZGOPTNS= <>
##$ZL1= 120
##$ZL2= 120
##$ZL3= 120
##$ZL4= 120
##$ABSF1= 15.99263
##$ABSF2= -2.059265
##$ABSG= 5
##$ABSL= 3
##$ALPHA= 0
##$AQORDER= 0
##$ASSFAC= 0
##$ASSFACI= 0
##$ASSFACX= 0
##$ASSWID= 0
##$AUNMP= <proc_1d>
##$AZFE= 0.1
##$AZFW= 0.1
##$BCFW= 0
##$BC_mod= 2
##$BYTORDP= 0
##$COROFFS= 0
##$CY= -3
##$DATMOD= 1
##$DC= 0
##$DFILT= <>
##$DTYPP= 0
##$F1P= 0
##$F2P= 0
##$FCOR= 1
##$FTSIZE= 16384
##$FT_mod= 6
##$GAMMA= 0
##$GB= 0
##$INTBC= 1
##$INTSCL= 3.70164e-10
##$ISEN= 128
##$LB= 0.24
##$LEV0= 0
##$LPBIN= 0
##$MAXI= 10000
##$MC2= 0
##$MEAN= 0
##$ME_mod= 0
##$MI= 1.114404
##$NCOEF= 0
##$NC_proc= -5
##$NLEV= 6
##$NOISF1= 3.799351
##$NOISF2= 2.8
##$NSP= 0
##$NTH_PI= 0
##$NZP= 0
##$OFFSET= 15.99263
##$PC= 1
##$PHC0= -25300.41
##$PHC1= 7.787311
##$PH_mod= 1
##$PKNL= yes
##$PPARMOD= 0
##$PSCAL= 0
##$PSIGN= 0
##$REVERSE= no
##$SF= 200.129505760751
##$SI= 16384
##$SIGF1= 3
##$SIGF2= 2
##$SINO= 5.538805
##$SIOLD= 16384
##$SREGLST= <1H.CDCl3>
##$SSB= 0
##$STSI= 16384
##$STSR= 0
##$SW_p= 3612.71676300577
##$SYMM= 0
##$S_DEV= 0
##$TDeff= 16384
##$TDoff= 0
##$TI= <>
##$TILT= no
##$TM1= 0
##$TM2= 0
##$TOPLEV= 0
##$USERP1= <user>
##$USERP2= <user>
##$USERP3= <user>
##$USERP4= <user>
##$USERP5= <user>
##$WDW= 1
##$XDIM= 16384
##$YMAX_p= 294435799
##$YMIN_p= -173512
$$ End of Bruker specific parameters
$$ ---------------------------------
##NTUPLES= NMR SPECTRUM
##VAR_NAME=  FREQUENCY,     SPECTRUM/REAL,   SPECTRUM/IMAG
##SYMBOL=    X,             R,               I
##VAR_TYPE=  INDEPENDENT,   DEPENDENT,       DEPENDENT
##VAR_FORM=  AFFN,          ASDF,            ASDF
##VAR_DIM=   16384,         16384,           16384
##UNITS=     HZ,            ARBITRARY UNITS, ARBITRARY UNITS
##FACTOR=    0.220516191357247, 1,           1
##FIRST=     3200.59713869175, 0,            0
##LAST=      -412.119624314016, 0,           0
##MIN=       -412.119624314016, -173512,     0
##MAX=       3200.59713869175, 294435799,    0
$$ Real data points
##PAGE= N=1
##DATA TABLE= (X++(R..R)), XYDATA
$$ [...]
8468E48530n2903m5132J796L7130K2541N2850k0130m2245m034M0188N5708p3132
8456E21167J2513O660K0681J0174J8183o7424n0861O2875N1147J0803L1099L5385
8444F62402P09L057M6768M550M1294J6738J9266L7683k7229P6476J9481Q1927
8432I83122L5539J22425Q5487j9819l2573j1259l091L4004R996r6894M9698L5442
8420A192077k5656k0934n0892N0936P8100L2487P4884M4461P1603J00092J04017
8409A651175R5057R2977J88621O8075M8710O3059q862K9464m8268o0698n1558
8398B067752m9500L6247j5858m1063j07751M136L1607l3043k4479j27486j32659
8387A607903O154o4817m3654K67j5011Q6474M0642J16340J25631J62201J75411
$$ plain form
8468 548530 495627 450495 452291 489421 511962 564812 544682 502437 498403 538591 594299 521167
8456 521167 533680 540340 561021 571195 589378 521954 471093 533968 585115 595918 627017 662402
8444 662402 663111 666168 712936 717486 758780 775518 794784 832467 805238 881714 901195 983122
8432 983122 1018661 1141086 1226573 1206754 1174181 1162922 1159831 1193835 1203831 1106937 1156635 1192077
8420 1192077 1166421 1145487 1094595 1145531 1223631 1256118 1331002 1375463 1447066 1547158 1651175
8409 1651175 1746232 1839209 2027830 2095905 2144615 2207674 2198812 2228276 2180008 2119310 2067752
8398 2067752 2018252 2054499 2038641 1997578 1889827 1893963 1925570 1892527 1868048 1740562 1607903
8387 1607903 1614057 1549240 1505586 1505853 1490842 1577316 1617958 1734298 1859929 2022130 2197541
8376B197541J08059J10158J58767J19819O9594p23p9905p5462k2180l2522j06255
8365B446891j88138j24463j71382j21544j50034l5985q4828j32781n2060j16383
8355A269293p8535l5273n8757r0744M7717k3859M1365l8917K1881Q546m4061J02631
8343A121287J37414J13099j9937K8730l8213o8352k28K9138k8374m6788m6232
8332A181544j12464j17933n2508J485K4598n4926m4719J2504o5973p192o4064
8321G00352m7647M7887n762q7413k4590q9256O606J4930p2454j2307p0093L617
8309C63870j604k5256p2676q9543Q8993N4233k1167J7396k022m0837o588J2029
8297B76828p8751Q8436R103o3602K7812K4879j9412j9530K4719m690M2797l7279
$$ plain form
8376 2197541 2305600 2415758 2574525 2694344 2763938 2763215 2683310 2607848 2585668 2553146 2446891
8365 2446891 2258753 2134290 1962908 1841364 1691330 1655345 1570517 1437736 1385676 1269293
8355 1269293 1190758 1155485 1096728 1005984 1053701 1029842 1071207 1032290 1054171 1062717 1018656 1121287
8343 1121287 1258701 1371800 1351863 1380593 1342380 1274028 1273800 1302938 1274564 1227776 1181544
8332 1181544 1069080 951147 898639 900124 924722 869796 825077 837581 771608 764416 700352
8321 700352 652705 700592 694830 607417 582827 493571 500177 515107 442653 430346 360253 363870
8309 363870 362266 337010 264334 174791 263784 318017 296850 314246 312224 271387 264799 276828
8297 276828 198077 286513 295616 232014 259826 284705 265293 245763 270482 265792 308589 271310
8285B71310j897j790N163o5815j3743Q1889j6842m3102n6742j9967j4831j6909
8273A06724J3342m7953J8034K0467q767J3967k0509J1604L0364l5048J067O312
8261A09604p1689M2846L1117k4318k6159K1487L5721J4544o2161q6593J5891K0912
8249B1202L6778N382k0392k340j0174J755k2600J6067L5315m881k204L6442n7440
8236C2910m7807k5814k3990R3350K6574l6244N47j9769j4727l4222l0485L0941
8224d8736k5479L8893K2254O876N216l6327M0716J26j735k1757J3065k4902K7274
8211d516r735l3041L2829P1969L406l8802l5792j8224k450k7781M5054K1502n741
8198a322K559J9731p9386N8520j523M5501O381j01433N483j4917j3815j7985j0603
$$ plain form
8285 271310 269413 267623 272786 206971 193228 275117 258275 215173 158431 138464 123633 106724
8273 106724 120066 72113 90147 110614 101847 115814 95305 106909 137273 102225 103292 109604
8261 109604 37915 80761 111878 87560 61401 82888 118609 133153 70992 -15601 290 21202
8249 21202 57980 63362 42970 40630 30456 32211 9611 25678 60993 56112 53908 90350 32910
8236 32910 -14897 -40711 -64701 28649 55223 18979 19526 -243 -14970 -49192 -79677 -48736
8224 -48736 -74215 -35322 -13068 -6192 -976 -37303 3413 3539 1804 -19953 -6888 -31790 -4516
8211 -4516 -14251 -47292 -14463 57506 60912 22110 -13682 -31906 -34356 -62137 -17083 4419 -1322
8198 -1322 1237 20968 -58418 102 -1421 44080 50461 -50972 -45489 -60406 -74221 -92206 -102809
8185a02809N4548N4615K7848n6279p784k4224l6257l4506N6491P6151J0142j4774
8173C162l0272k4494l6690R068l3055Q1619J4152l2886J8488J2222k7579m4560
8161i0825J8813O1750L1190n1128n4015n701L849M4027k3343K855K2928j4747
8149e4347k9558K5696N238j7234K8826K5781O2104j8031n9638q1874m717J5850
8137a01904l2866M6955j9473L0226j7132J2325n9313M6517N0456M4307L0987l4617
8125c532K6962m3625k6715M3232k9753r5966K1500n576J4553R555M3391K1254
8113b4720k028r09j7770L0286J1154p1422O8543L3125j1859l9832k5049l8039
8101h8520l0238j0971J9699O1303Q143N5143k2873k6770j18850o22M7670P6560
$$ plain form
8185 -102809 -48261 6354 34202 -22077 -29861 -54085 -90342 -124848 -68357 7794 17936 3162
8173 3162 -27110 -51604 -88294 -79226 -112281 -30662 -16510 -49396 -30908 -18686 -46265 -90825
8161 -90825 -72012 -10262 20928 -30200 -84215 -89916 -86067 -42040 -65383 -62528 -39600 -54347
8149 -54347 -83905 -58209 -52971 -70205 -41379 -15598 46506 28475 -31163 -113037 -117754 -101904
8137 -101904 -134770 -87815 -107288 -77062 -94194 -81869 -141182 -94665 -44209 98 31085 -3532
8125 -3532 23430 -20195 -46910 -3678 -33431 -129397 -107897 -113473 -98920 -89365 -45974 -24720
8113 -24720 -26748 -27657 -45427 -15141 -3987 -75409 -6866 26259 14400 -25432 -50481 -88520
8101 -88520 -118758 -129729 -110030 -48727 -40584 14559 -8314 -35084 -153934 -154556 -106886 -30326
8089c0326p656q750m8512K5918J8038n4028M3943k6854L7578q332O25J7163M080
8076c7113p0145J1471J266L2026M235k4932j8225o993p230P7567J3282j8524k9458
8063g2773o819l9998j6483M0561O7098m373j137J8750l9965L3054l4082k7474
8051h3641O2723J5219p92J1336n1036l7994J0224N3462l1615l4228J5552M807
8039f5983m7726l6088j1530J0921M8164P2028l4466L2103J0629K522m5937q756
8027g4119M3114Q4062k6208n5827N4788l9183k6595j3150K6279M1215N7230J3099
8015H4705k8234o3618q643J1994k0342J3840N4996q644q1134q1242J6739Q3632
8003b5951l535j6249j605m5164Q2778m4821m6680j6687J8232R333N8416q105n4536
$$ plain form
8089 -30326 -37982 -46732 -95244 -69326 -51288 -105316 -61373 -88227 -50649 -58981 -58356 -41193 -37113
8076 -37113 -107258 -95787 -94521 -62495 -58260 -83192 -101417 -108410 -115640 -38073 -24791 -43315 -72773
8063 -72773 -79592 -119590 -136073 -95512 -28414 -32787 -33924 -15174 -55139 -22085 -56167 -83641
8051 -83641 -20918 -5699 -6491 4845 -46191 -84185 -73961 -20499 -52114 -86342 -70790 -65983
8039 -65983 -113709 -149797 -161327 -150406 -102242 -30214 -64680 -32577 -21948 -19426 -65363 -74119
8027 -74119 -31005 53057 26849 -28978 25810 -13373 -39968 -53118 -26839 14376 71606 84705
8015 84705 56471 -7147 -15790 -3796 -24138 -10298 44698 36054 -45080 -126322 -109583 -25951
8003 -25951 -29486 -45735 -47340 -92504 -9726 -54547 -101227 -117914 -99682 -90349 -31933 -40038 -94574
7990i4574K9962L8554P8364j9525j2840l0297M4379l7407o7208J7677M8711R415
7978E211n8848J146k7838n299M8291j5316J6816M151j2666p9554O0629k8475M7767
7965d3985o6080M4047P3366j9189j5338K2928n876o9716l2618R148N7239j2820
7953e8894j3932j12K780q6605M4253J2935J0183J0284j2869J4619J6819l1058
7941i1597L3323L2962O8301J997q0616l7451q946n08N8922J4121J3928l2688K2601
7928e651m1233p6214k8895M1249R0136K0825o6720n3890O7045j4590M978o024
7916f8984L0303N6629r466p4129J2830J8298m690m3357J4613l0494k6213L8915
7904h5745k4602j6077m0326J6623P4201L4125J3896k8799m1536J3612k4108J8149
$$ plain form
7990 -94574 -64612 -26058 52306 32781 19941 -10356 34023 -3384 -70592 -52915 -4204 5211
7978 5211 -53637 -52491 -80329 -85628 -37337 -52653 -35837 -31686 -44352 -123906 -63277 -91752 -43985
7965 -43985 -110065 -66018 7348 -11841 -27179 -4251 -10127 -79843 -112461 -103313 -46074 -58894
7953 -58894 -72826 -72938 -70158 -156763 -112510 -99575 -89392 -79108 -91977 -77358 -60539 -91597
7941 -91597 -58274 -25312 42989 44986 -35630 -73081 -82027 -82535 -23613 -9492 4436 -28252 -5651
7928 -5651 -46884 -123098 -151993 -110744 -20608 217 -66503 -120393 -53348 -67938 -62960 -68984
7916 -68984 -38681 17948 8482 -65647 -52817 -34519 -39209 -82566 -67953 -98447 -124660 -85745
7904 -85745 -110347 -126424 -166750 -150127 -75926 -41801 -27905 -56704 -98240 -84628 -108736 -90587
7892i0587K3904M4966l8537j1754j5254p4356J0839O7540k0102k65L828L0687
7880f9091L5561j7814N3546l0700J6581k4451j0377k0227n7256K2922P2899Q5689
7868E7282J1069l2565n8120J4048J6922l0563m7918K9838l1905L4001n2759m2783
7856a33453L2100L1293R0497m64o955k0436p2071j3351Q7380M5140j03483l7954
7844a01757L3663K7003k5695n3341j341K3641P9928j402l1630N0567J7202r9166
7832h2328J2134j8609M8485P9305k4197l946k8592j10697L4555M351N2596k6761
7820f3704m1014K6116K0433k0395J0878M9753J9099Q25N4932q982r5803j4193
7808f2055K4866m7128K4738l631K0233K3512l9273K8368R184k5622l4044M9799
$$ plain form
7892 -90587 -66683 -21717 -60254 -72008 -87262 -161618 -150779 -83239 -103341 -103606 -99778 -69091
7880 -69091 -33530 -51344 2202 -28498 -11917 -36368 -46745 -66972 -124228 -101306 -28407 57282
7868 57282 68351 35786 -22334 -8286 8636 -21927 -69845 -40007 -71912 -37911 -90670 -133453
7856 -133453 -101353 -70060 20437 19973 13018 -7418 -79489 -92840 -5460 39680 -63803 -101757
7844 -101757 -68094 -41091 -66786 -120127 -121468 -97827 -17899 -19301 -50931 -364 16838 -82328
7832 -82328 -70194 -88803 -40318 38987 14790 10844 -17748 -128445 -93890 -89539 -36943 -63704
7820 -63704 -104718 -78602 -58169 -78564 -67686 -17933 1166 1991 56923 47941 -47862 -62055
7808 -62055 -37189 -84317 -59579 -63210 -42977 -19465 -58738 -30370 -21186 -46808 -80852 -31053
7796c1053Q607p0511J3855J1327k5239N7687j8137J2208j3921n1311o7024N1482
7784a22030k5195L1884R693R043L3627q575j4762K2654J5527l4560r601l3246
7772a25541O0888k8160K1207L0782n6496L5088M0217j5194Q710O1333p2560j8955
7760e8681o0557J648N9376O6120K7802l1752q4864l156j0692N3859M2791j6576
7748a4682O908o0826l72K9686L5534j12985J3768N3549R588K6455l2432k601m8691
7735i7101J804M6467K7168l1422l5770K905k2366K2038N6145L3958j6813o7550
7723h0537K1418M5796n257N0864j8776L1911k5951q1849k487M424J4208l6968
7711h3204R508Q6234k6575o4133l5714L3313K2114L548p809k1565K462j5961J3978
$$ plain form
7796 -31053 -22446 -92957 -79102 -67775 -93014 -35327 -53464 -41256 -55177 -106488 -173512 -122030
7784 -122030 -147225 -115341 -105648 -96605 -62978 -71553 -86315 -63661 -48134 -82694 -92295 -125541
7772 -125541 -64653 -92813 -71606 -40824 -97320 -62232 -22015 -37209 -28499 32834 -39726 -58681
7760 -58681 -119238 -117590 -58214 7906 35708 3956 -80908 -84064 -94756 -40897 1894 -14682
7748 -14682 -7774 -68600 -68972 -39286 -3752 -116737 -102969 -49420 -39832 -13377 -45809 -48410 -97101
7735 -97101 -95297 -48830 -21662 -53084 -88854 -85949 -108315 -86277 -30132 3826 -12987 -80537
7723 -80537 -59119 -13323 -18580 32284 13508 45419 19468 -62381 -64868 -60444 -46236 -83204
7711 -83204 -73696 12538 -14037 -78170 -113884 -80571 -58457 -54909 -62718 -84283 -81821 -97782 -83804
7698h3804L4773J8899L8472j12323L3213K6714m2629m90l4233K8906K0948J0707
7686f0847Q730o9888J0790P392K5270J9279J1567O8352m976r9202l284L3919M1108
7673a1790K2745m4423Q345m1917J708K824r2159N0336M0404L5707J6590N8218
7661D6588J1567r0889j7786j3123l0382J7480K5825J1340M3442n2500K1432J0291
7649a6715O065o4873j2305N4640L8315M733j4076k6739M1962j8537J8197L5899
7637D6566o8390q0530J09805O8848j4481r0078j7558l9531l2831K9018L7193N7855
7625E886L1189l6542l5485P2782n9750l1943l9785J6269K1622m8829L849L8377
7613f2360J4512M3207O977l3307K9740N1670j2036n8955j9731m8395O2891K2867
$$ plain form
7698 -83804 -49031 -30132 8340 -103983 -70770 -44056 -86685 -87175 -121408 -92502 -71554 -60847
7686 -60847 -52117 -122005 -111215 -103823 -78553 -59274 -47707 20645 15669 -83533 -86817 -52898 -11790
7673 -11790 10955 -33468 -25123 -67040 -65332 -62508 -154667 -104331 -63927 -28220 -11630 46588
7661 46588 58155 -32734 -50520 -63643 -94025 -76545 -50720 -39380 4062 -48438 -27006 -16715
7649 -16715 -10650 -75523 -87828 -33188 5127 9860 -4216 -30955 11007 -7530 10667 46566
7637 46566 -21824 -102354 7451 76299 61818 -28260 -45818 -85349 -118180 -89162 -51969 5886
7625 5886 37075 533 -34952 37830 -21920 -53863 -93648 -77379 -55757 -104586 -100737 -62360
7613 -62360 -47848 -4641 2336 -30971 -1231 50439 38403 -20552 -40283 -88678 -25787 -2920
7601b920k0510m3674j0342N7097j3031l7185k176J1523l367J924l9600O8835k4550
7588e7976K354K2442K609J4567N9203K579o2377m2479M3720L347p4156k0802j456
7575a08425j7649K8812O1741n9451J3708P9786j0180j0335o9699K76M5565J4834
7563c1017o0631k9068L3973j1509K2312n2243N6889O3367m9603o289n9544O4727
7551e8636L3082K4674Q554l006M427q4004J1336L93J8595k0635K5r848L8342M4324
7537G623O3249q3932k9077M5235L8609j2917R741o538p0736m8508K4242j0925
7525g3934j413L8219M8767n1647o2941L6688k2233M859J8176P5884j3876j8410
7513b1861m0838p7990l1822R5833O3040J2083n4756O528K3488M607l6780J4246
$$ plain form
7601 -2920 -23430 -67104 -77446 -20349 -33380 -70565 -72741 -61218 -64585 -62661 -102261 -33426 -57976
7588 -57976 -55622 -33180 -30571 -16004 43199 45778 -16599 -59078 -15358 -12011 -86167 -106969 -108425
7575 -108425 -126074 -97262 -35521 -94972 -81264 -1478 -11658 -21993 -91692 -91416 -45851 -31017
7563 -31017 -91648 -120716 -86743 -98252 -75940 -128183 -71294 -7927 -57530 -63819 -123363 -58636
7551 -58636 -25554 -880 7674 4668 9095 -74909 -63573 -63180 -44585 -65220 -65195 -75043 -36701 7623
7537 7623 70872 -13060 -42137 3098 41707 28790 38531 31993 -38743 -87251 -63009 -73934
7525 -73934 -75347 -37128 11639 -40008 -102949 -66261 -88494 -83635 -65459 10425 -3451 -21861
7513 -21861 -62699 -140689 -172511 -76678 -13638 -1555 -56311 -49783 -26295 -21688 -58468 -44222
7501d4222J7422J8421p9511J7154M7125p7347j265L4005Q848n442N225l843J944
7488f1486j5561O3293p408o984O768o2377J7018M7577m9388K5330J0286R386L656
7475a9890J9449J117l5268o2130o566O8735j4045j9164M8176j9080M314J1491
7463b2861l998J039O6670P088o1993N0728n3832p2245L8047Q2667k6154m1912
7451c6756m5096K6714j9871q045N7832J1330n1254J1662J1389R165m1600K617
7439g1913Q944L8030K0695p960O406p2689J3311l663O3697N6685m7557K0603l970
7426B0619l3392n9017j1589K9558M3350M663l098o535l4002P1803J1220P414o5699
7413b4705l0710L5732N7028o1310k95J2298j3327K6998m2229k7130o2148O4299
$$ plain form
7501 -44222 -26800 -8379 -87890 -70736 -23611 -100958 -102223 -68218 -59370 -64812 -59587 -63430 -61486
7488 -61486 -77047 -13754 -21162 -28146 -21378 -83755 -66737 -19160 -68548 -43218 -32932 -23546 -19890
7475 -19890 -441 676 -34592 -96722 -103288 -34553 -48598 -67762 -19586 -38666 -34352 -22861
7463 -22861 -26859 -25820 40850 47938 -14055 36673 -17159 -89404 -51357 31310 5156 -36756
7451 -36756 -81852 -55138 -75009 -83054 -25222 -13892 -65146 -53484 -42095 -32930 -74530 -71913
7439 -71913 -62969 -24939 -4244 -12204 -5798 -78487 -65176 -68839 -5142 51543 3986 24589 20619
7426 20619 -12773 -71790 -83379 -53821 -10471 -5808 -8906 -15441 -49443 22360 33580 40994 -24705
7413 -24705 -55415 -19683 37345 -23965 -24260 -11962 -25289 1709 -40520 -67650 -129798 -65499
7401f5499k7141N0429L8438m1106k9381M622J645j4176K2574M958J4645o0131
7389a00123j9882O9583K1715q2020K3443j6215L4837K30j1364l1921K4705k9728
7377a16740Q1255j4752Q211K8043o021m5758l0485K4414Q4004P3826o4553r0192
7365f8748j132Q2210L2615l4538j715j751n7398J8708J9085P7194P997n1492N7244
7352G8279k7559o3248J952p6917p4423m597N4759p978Q4294J5046Q193l4850P9008
7339C1959k4954r374N9700K4185o844k0360q3993n4211O6148K1924R014J0454
7327B3648m7897l2032N3251m8159N575Q1852J0330m7303k9197K1347o525O103
7315i007L3575o25k245k9069m9855N3768j9705m3744K9642L8722K1051n21m3682
$$ plain form
7401 -65499 -92640 -42211 -3773 -44879 -74260 -69638 -67993 -82169 -59595 -54637 -39992 -100123
7389 -100123 -120005 -50422 -28707 -110727 -87284 -103499 -68662 -68432 -79796 -111717 -87012 -116740
7377 -116740 -35485 -50237 -42026 -13983 -20004 -65762 -96247 -71833 12171 85997 21444 -68748
7365 -68748 -69880 12330 44945 10407 8692 6941 -50457 -31749 -12664 64530 72527 21035 78279
7352 78279 50720 -12528 -10576 -87493 -161916 -166513 -111754 -119732 -35438 -20392 -12199 -47049 31959
7339 31959 7005 -2369 57331 81516 74672 54312 -29681 -83892 -17744 4180 13194 23648
7327 23648 -24249 -56281 -3030 -51189 -45614 36238 46568 -735 -29932 -8585 -15110 -9007
7315 -9007 24568 23943 21698 -7371 -57226 -3458 -23163 -66907 -37265 1457 22508 21987 -21695
7302b1695q4991j2319K5008K6011L7414J4070m2196P343N0218k7136o5137Q6317
7290g093L1597m7035j5090j2661J549M7283j4997j31M8580n8442k4977k2144N1412
7277b2149L9555N1787Q400n6275j2559o268j2220m8384L7660L8335m925j2988
7265c1k630j7553P787n077l6412N4206O253l5776o8140N408P2528m105K41m7896
7251g1197K954J5132N5151M1734k6651k1558l6961K6404J4082p3956m1897l7227
7239a53990L8809J19912Q155n9729k6568J8723O0316L5248r488k6918o021J9318
7227A7767k4812p965l1832j12N2152L6485r538o3096q7849K3519O0208N871Q1899
7214E2697L973m4380q843j2860n4482K0290O5398j927m7082L4853n3252l1736
$$ plain form
7302 -21695 -106686 -119005 -93997 -67986 -30572 -16502 -58698 -51355 -1137 -28273 -93410 -7093
7290 -7093 24504 -22531 -37621 -50282 -48733 -1450 -16447 -16578 32002 -26440 -51417 -73561 -22149
7277 -22149 17406 69193 77593 21318 8759 2491 -9729 -58113 -20453 17882 12957 -31
7265 -31 -2661 -20214 -12427 -17504 -53916 290 6543 -29233 -97373 -91965 -19437 -23542 -23301 -71197
7251 -71197 -68243 -53111 2040 43774 17123 -4435 -41396 -14992 -910 -74866 -116763 -153990
7239 -153990 -115181 4731 12886 -46843 -73411 -54688 5628 40876 31388 4470 -1551 17767
7227 17767 -7045 -15010 -46842 -46954 5198 41683 32145 -30951 -118800 -95281 -35073 -29202 52697
7214 52697 56670 12290 3447 -9413 -63895 -43605 21793 19866 -27216 7637 -45615 -77351
7202g7351M2009L1377O0892Q278l0959n5321m8176k2444K0612K9918O5904k7825
7190c086k1224r902j5870j7378j013N6185J2591q417k980O360m2110K5232n705
7177b7317l3656M2565K7059J6354j9776L3352n0470l1476M2358k9917n0635k8622
7165a10181L2883L8049k8019M6367K4738K3515J2376J8420n6918l906N673q705
7153e708O908K660P671p4772l6360M3259O3662l1632K8405l5815L2882M564j7977
7140a2253m7802Q275L7534n2621L5838k4947j9883K095K2670K9482r033m8157
7128g8802N1240J194k1691L1984j6153J262r375P7803o25J1786l3378n7317n8529
7115a00601K0725L032R0738J1529n4451n282m564K7825j9945k796o583k3999L1507
$$ plain form
7202 -77351 -35342 -3965 56927 65205 34246 -21075 -69251 -91695 -71083 -41165 24739 -3086
7190 -3086 -24310 -34212 -50082 -67460 -68473 -12288 303 -8114 -11094 -4734 -46844 -21612 -27317
7177 -27317 -60973 -18408 8651 25005 5229 38581 -11889 -43365 -1007 -30924 -81559 -110181
7165 -110181 -77298 -39249 -67268 -20901 3837 27352 39728 58148 1230 -2676 2997 -5708
7153 -5708 1200 3860 11531 -63241 -99601 -56342 7320 -24312 4093 -31722 1160 5724 -12253
7140 -12253 -60055 -51780 -14246 -66867 -31029 -55976 -75859 -73764 -51094 -21612 -30645 -78802
7128 -78802 -27562 -26368 -48059 -16075 -32228 -30966 -40341 37462 36837 48623 15245 -42072 -100601
7115 -100601 -79876 -76844 13894 25423 -29028 -34310 -38874 -11049 -30994 -33790 -40373 -64372 -32865
7102c2865p8966L8409L2780L2084p353L8185o5499j7185L9453m0149j437l0479
7090i3022Q4954q053M5782m1247o7661N003M0954N8252L2391k4093n6792m7659
7078g1191R1091M707R615l7604Q865m8753L5405j0244j6673j4469k6378L5131
7066d0498k445m6619O6082K6298M243M6898n1381K2943m322n0484k7810J6530
7054d0565M8953j7433J9206j1629j5238l8129K5278L5722L0602k1492l9408K6967
7042B834M828j9244l4738M736N4061j1959K0001K8442n7338l4335J2117L1688
7030A093O5420m801q6014k5260k9316M279R966L7503M3244j4267l7868n9559K2306
7017g3274J5892M3114M490o904O1753l1293n7277j5494N1545M1393J3677j6090
$$ plain form
7102 -32865 -111831 -73422 -40642 -8558 -15911 22274 -43225 -60410 -20957 -61106 -62543 -93022
7090 -93022 -8068 -16121 29661 -11586 -79247 -74244 -33290 24962 57353 33260 -23532 -71191
7078 -71191 19900 24607 34222 -3382 5483 -43270 -7865 -18109 -34782 -49251 -75629 -40498
7066 -40498 -42943 -89562 -23480 2818 7061 53959 2578 25521 21199 -29285 -57095 -40565
7054 -40565 8388 -9045 10161 -1468 -16706 -54835 -29557 6165 36767 15275 -24133 2834
7042 2834 7662 -11582 -46320 -41584 12477 518 20519 48961 -8377 -42712 -30595 1093
7030 1093 66513 61712 -24302 -49562 -78878 -74599 -64633 -27130 16114 1847 -36021 -95580 -73274
7017 -73274 -57382 -14268 -9778 -16682 45071 13778 -43499 -58993 -7448 33945 47622 31532
7005C1532N8179m7569k5688L3646j2760K7777L2885r7842m6389p496K5854J2875
6993a4996l618l5642K0717p754j8683p4956L8572P1811L7583N1076K34l6699p6521
6980d8876L1689J461K9984J7219J5951n1078l4052J8l4524L5237L8924R800j0172
6967A581J9593k7442o738k628J2531m2422N3594N923j3639m1562l8590P944j5822
6954h7677R2574O0240k4512j3998M53o3899l019R729K4217L6605n6121m8152k5319
6941i8879O2188L9253K371K0717r060m146p2310N7830k4157J1002K3528n392L2994
6928C5939r1517k7648L102J051M3850Q0051o9875p3078j0669K8842K9968K3820
6916b6164O0240J0068m0656L0319n8613k081m2822L1770O8513J0k0300q9177N51
$$ plain form
7005 31532 89711 42142 16454 50100 37340 65117 98002 160 -46229 -53725 -27871 -14996
6993 -14996 -18614 -54256 -33539 -41293 -59976 -134932 -96360 -24549 13034 64110 64344 27645 -48876
6980 -48876 -17187 -15726 14258 31477 47428 -3650 -37702 -37684 -72208 -36971 1953 11753 1581
6967 1581 21174 -6268 -13006 -15634 -3103 -45525 8069 13992 353 -41209 -79799 -71855 -87677
6954 -87677 4897 65137 40625 26627 27080 -36819 -39838 -30109 -5892 30713 -25408 -73560 -98879
6941 -98879 -36691 2562 4933 25650 16590 12444 -59866 -2036 -26193 -15191 8337 2945 35939
6928 35939 -55578 -83226 -80124 -79073 -35223 44828 -25047 -98125 -108794 -79952 -49984 -26164
6916 -26164 34076 44144 3488 33807 -24806 -26887 -69709 -37939 30574 30584 10284 -78893 -78342
6903g8342J0901L127K3822j428L6908J6232j7541k4358p00J9242K8455m5230J8026
6890a0886L6779n4749L8579o9149P0070O4332k1824n9560l3251q0504N9106L7323
6878b3734N5230M5110P182m1647J5713l8160j0832L5581k547l7080J9812r5750
6866g1122k0991N6618O5858M0374n477n0756j1532j0003l6825k557J7165j4041
6854d3289O3526N9767j28609j0267M3101L3758L4638N2423J1980j7234n3872m2384
6842C538J5529j689M0204m883n3300l312k5757k2014K5284L8663M5424j8578o0369
6829b1260o8292K8811P6415L03L9517k7652l9978p002K1773j6399R044J8956R240
6816B3476j003p790j2882k7397J3174K7418k8016J3506N7412J3270o7923J6401
$$ plain form
6903 -78342 -67441 -64314 -40492 -41920 -5012 11220 -6321 -30679 -31379 -12137 16318 -28912 -10886
6890 -10886 25893 -28856 9723 -59426 10644 74976 53152 -6408 -39659 -120163 -61057 -23734
6878 -23734 31496 76606 83788 42141 57854 19694 8862 44443 41896 4816 24628 -71122
6866 -71122 -92113 -35495 30363 70737 65260 14504 2972 -7031 -43856 -46413 -29248 -43289
6854 -43289 20237 80004 -48605 -58872 -15771 17987 52625 105048 117028 99794 45922 3538
6842 3538 19067 17378 57582 52699 -601 -3913 -29670 -51684 -26400 12263 57687 39109 -21260
6829 -21260 -89552 -60741 15674 15977 55494 27842 -12136 -19138 2635 -13764 -4720 14236 23476
6816 23476 22473 14683 1801 -25596 -12422 14996 -13020 486 57898 71168 3245 19646
6804A9646n9656O31L8861L2555l3181j004j2477J081j7449M3819P0769k2313o3700
6791b418p597j2798M260K7350K389L1831p1518n2633J15579K878r322k2974K5258
6778C0285Q147j3291k5310m6680n409K5472M8634J8068l174m0581j9109K2103
6766h45M8393K3403K1869o2509J5673o7456l6759J7975J13139O1154p7253L5694
6754I2478m8237l0576l2656k3368L4209J8480K4922p345j0215k3197J9391l2751
6742a8865J02733k0393o1174k885n0146j2808K6769N4353K0796J8205k9723m5504
6730a8642m728O1896J2221J8961L454j6105m8466Q68m267N865L2800O3527l777
6717A03607l673n5439q2426N379l7724N7415J19564k8626o3675q85m4161j6659
$$ plain form
6804 19646 -40010 -39379 -518 32037 -1144 -2148 -14625 -13544 -30993 12826 83595 61282 -2418
6791 -2418 -10015 -22813 -18553 8797 11186 43017 -28501 -81134 34445 37323 28001 5027 30285
6778 30285 38432 25141 -169 -46849 -52258 -26786 21848 39916 36742 -3839 -22948 -845
6766 -845 47548 70951 92820 30311 45984 -21472 -58231 -40256 72883 134037 56784 92478
6754 92478 44241 13665 -18991 -42359 -8150 10330 35252 27907 17692 -5505 13886 -18865
6742 -18865 83868 63475 2301 -584 -50730 -63538 -36769 17584 38380 56585 26862 -18642
6730 -18642 -23370 38526 50747 69708 73162 57057 8591 9459 5192 11057 43857 107384 103607
6717 103607 99934 44495 -37931 -32552 -70276 -12861 106703 78077 14402 13517 -30644 -47303
6705d7303M1353K3730J2321O4937r6000n7441J07432k9686O6486j2225j23969
6694e0365j0712l1376M0025j8671M1213N0097P924K9757q592k4425l511l4213
6682a2849N3591J6112m433j7642l5287L6040p770j439P8987K6718m076J1581k94
6669A39239j06944l0287P2201r116M3086l9301o8017M8126o45K0632k8052K7392
6657F8314m144m0429n0737J963j9176M5159N5955l514L9415n2172M142j4226P9153
6644A09703l0352n6137J6569l3954O043o261j8376K1002N4634l4074J7891J9905
6632F6593n2203l9470n147Q1348J7552J6951j03371j4956R2738J2166M8738l3707
6620H7232M3989k7888p6958m9632K0794J7217K0569O0842m0719L3103k232n5888
$$ plain form
6705 -47303 -5950 17780 30101 95038 -962 -58403 49029 19343 85829 73604 -50365
6694 -50365 -61077 -92453 -52428 -71099 -29886 20211 28135 57892 49300 24875 21364 -12849
6682 -12849 40742 56854 52421 34779 -508 35532 27762 26323 105310 132028 127952 139533 139239
6669 139239 32295 2008 74209 65093 108179 68878 861 48987 48342 68974 40922 68314
6657 68314 64170 23741 -26996 -25033 -44209 950 56905 53391 92806 40634 44776 30550 109703
6644 109703 79351 23214 39783 5829 11872 5611 -12765 8237 62871 28797 46688 66593
6632 66593 14390 -25080 -30227 51121 68673 85624 -17747 -32703 60035 72201 120939 87232
6620 87232 131221 103333 26375 -23257 -2463 14754 35323 96165 55446 88549 86317 30429
6608C0429k796Q5777M1770k6627j4412l6013j9442l9063J4648M1148o996L944
6596G2367J3058m7288m6747N6619j1190M8906K5157L2406k2610n3388M9122j9349
6584I7063p344O2940K9261m7555n1865m0975m5236R9528P6195q8915j8045M0945
6572A05997j5632J3406l8392P6470l0485n5618k2536L1236J3997m6476K1438q87
6560E2518L7033l3554K1778J8418j7517K2055l6106O500K4558q9376K4376l6098
6548e415J7510R7507l7923Q672l3745p9543r937o0553Q6403L6493P3631L1326
6536A24426p2299p0989j2201J7009M5297J14419n4265o3974j02277J05283N4698
6525H5127m6066J2712K9243J7529m5537m3622R896K4050O6136O7554l7092m6955
$$ plain form
6608 30429 27633 113410 155180 128553 114141 78128 58686 19623 34271 75419 68423 72367
6596 72367 85425 38137 -8610 48009 36819 85725 110882 143288 120678 67290 116412 97063
6584 97063 89719 152659 181920 134365 82500 41525 -3711 95817 172012 83097 65052 105997
6572 105997 90365 103771 65379 141849 111364 55746 33210 64446 78443 31967 53405 52518
6560 52518 89551 55997 77775 96193 78676 100731 64625 71125 95683 6307 30683 -5415
6548 -5415 12095 109602 71679 80351 46606 -32937 -42874 -103427 -17024 19469 93100 124426
6536 124426 52127 -18862 -31063 -14054 31243 145662 91397 27423 -74854 30429 85127
6525 85127 39061 51773 81016 98545 53008 9386 19282 43332 109468 177022 139930 92975
6513I2975n9429o3891j7129M0436K3658P760J01801k256n3553j03947M0966N7791
6501F5182Q337J6689J3998n1973l6719J0744p5L0472m9807M5333m902j3003l7343
6488c067m5345R9440K2818n393J1833k47o4551l2796K847P9331l0888J0643K5313
6475F9938j1805j0450j6617J05089o1605k9084K0128j7543o8053M287K986O8724
6463E5995M1831o6959n8152L9945J5773L6062k0369j7948j0975j7793j9438m4460
6451f6488J2475Q3108J5614K1273j7237n0474l7178K9341J9644Q0486O4398k736
6439A52226q0034p1119R604o060N2061O1704o9694k3091m0962N2728J3730j6919
6427C4174J8824M3301l980n0058l1051L6417M7859J0339K4349k774p4867q0997
$$ plain form
6513 92975 33546 -30345 -47474 -7038 16620 24380 126181 123925 70372 -33575 7391 65182
6501 65182 73519 90208 104206 52233 15514 26258 26183 56655 6848 52181 47279 34276 -3067
6488 -3067 -48412 51028 73846 68453 80286 80039 15488 -17308 -14461 64870 33982 44625 69938
6475 69938 58133 47683 31066 136155 74550 45466 65594 48051 -20002 -15715 -12729 55995
6463 55995 97826 30867 -27285 12660 28433 64495 44126 26178 15203 -2590 -22028 -66488
6451 -66488 -54013 29095 44709 65982 48745 -1729 -38907 -9566 10078 90564 154962 152226
6439 152226 72192 1073 10677 4617 56678 118382 48688 25597 -15365 37363 51093 34174
6427 34174 52998 96299 92319 42261 11210 47627 95486 105825 130174 127400 52533 -28464
6415b8464M002M4141O2202J2601Q878J0962l5083m0237J8675M381n169J08819
6403A65708P4017p5969m8617l0525j0771K2192k090R210J8851j7957K9381k4305
6391A09125M114L9063L2156j8275l0306r257R0696L338j3308r9718R7606j32o2996
6378A42106j2918P4103J0800k0394P7650n707k4413k497o62k2321L9691P0486
6366C25924l3223K0259o590n0563K3878L9558o883k5270P899m436J0664L495j6558
6353B88154J6163L5905M8119j3052k0716p8924M14R9728M560L2800q039k8811
6341C76301K1370J0125O3000l1069j8060L4814m3171p0712q5913L9936m438k8140
6329B64043L7347p6342j1551J6697o5790J29187L733o8738L0073l2260l6165M179
$$ plain form
6415 -28464 -24462 19679 81881 94482 103360 114322 79239 39002 57677 62058 56889 165708
6403 165708 239725 163756 115139 84614 73843 96035 93945 103155 122006 104049 133430 109125
6391 109125 113239 152302 184458 166183 135877 126620 217316 220654 207346 107628 205234 205102 142106
6378 142106 129188 203291 214091 193697 271347 265640 241227 238730 238068 215747 255438 325924
6366 325924 292701 312960 306370 255807 279685 319243 312360 287090 294989 290553 301217 304712 288154
6353 288154 304317 340222 388341 375289 354573 275649 276063 375791 380351 413151 405112 376301
6341 376301 397671 407796 470796 439727 421667 456481 413310 342598 256685 296621 292183 264043
6329 264043 301390 225048 213497 230194 164404 293591 297324 228586 258659 226399 190234 194413
6317A94413P2283P200j3562L9663K1478o7308l8538k1809P639L2208j5509j2381
6305B05777l3880j0058M606j2852m982M2937o3510m7613J471j971L7038L3076
6293A50039J8668l4123o1241K3482n8537P320J0902N4624O021J2885K7573l5872
6281A21741p2120L8391N5106L1740l5821j2642n0419m3201P0590Q1192J9784K581
6269B06922n0484l6846p5337j7362J05026P5572M2364o1600j12321n181N2867
6258A23620L1845K0602l1560J8930M2596p751n3320r871P5343j7880l74P5343
6246B67523r9336j12716P9954K5528L2196K3350q1671O6749o7974m9992K3801
6235A07412N5578R297L8221l8595k7050j6181j1430K2948J5120J6488j1332j2300
$$ plain form
6317 194413 266696 273896 260334 299997 321475 254167 215629 193820 201459 233667 218158 205777
6305 205777 171897 161839 166445 153593 148611 191548 128038 80425 81896 79925 116963 150039
6293 150039 168707 134584 73343 96825 38288 45608 56510 111134 117155 130040 157613 121741
6281 121741 49621 88012 143118 174858 139037 126395 75976 32775 103365 184557 204341 206922
6269 206922 156438 119592 44255 26893 131919 207491 249855 188255 75934 70753 123620
6258 123620 155465 176067 144507 163437 206033 198282 144962 135091 210434 192554 192180 267523
6246 267523 168187 55471 135425 160953 193149 216499 134828 201577 133603 83611 107412
6235 107412 162990 172287 210508 171913 144863 128682 117252 140200 155320 171808 160476 148176
6223A48176O584j2748K5733J1178L6228k6342o5055k4495L0062K6586j8529K1291
6211A58669L0182O7280q4760J2960l7087k1401L8205K6143N8943L220l3743r1439
6199A27172K8932L1527M2351m3297n0169m1020n3225L1943M3379Q5674L3154o1931
6187A74490l4399k6251N89P288M6551L5942r1240j19388N6931L4001j948P0855
6175A53421K6415m0596m2991J9431L777l3628K6925J05393m9446j8091n4817l4938
6163F0855j6492J9573J04165n0788j3689L2576m0453J1136L7483L5402K71o2841
6151A17198j0222p13k3588N1365L5241n9035K0070L6310o8510q506L1213r271
6139A11552J8406L278l9414l7008r822K844M9749N4384K0948p2195m6659L0860
$$ plain form
6223 148176 154760 142012 167745 178923 215151 188809 123754 99259 129321 155907 137378 158669
6211 158669 188851 256131 171371 184331 147244 125843 164048 190191 249134 252354 218611 127172
6199 127172 156104 187631 229982 186685 136516 95496 42271 74214 117593 203267 236421 174490
6187 174490 140091 113840 114429 121717 168268 204210 112970 -6418 50513 84514 82566 153421
6175 153421 179836 139240 96249 115680 119457 85829 112754 218147 168701 150610 95793 60855
6163 60855 44363 63936 168101 117313 103624 136200 95747 106883 144366 179768 180039 117198
6151 117198 106976 106263 82675 134040 169281 110246 130316 166626 98116 89610 120823 111552
6139 111552 129958 133236 93822 56814 46992 49836 99585 153969 174917 102722 56063 86923
6127H6923j9639r648J9219j0899l0222K9287J6713L5808o344j789k8874j9043
6115F1492L8137R962l1911K2316m238M4415N3704o7505m7242m7311J9247O7792
6103A18858N5300K3664j2804k2602m0843k4520J303P3342N0236n5563k1253q0766
6091F4352k8682R3058O381k4767Q8352O44r8908K1397m1478j441R5681l402k4349
6078A46838p4724k7001m1528P0215R7171K9939R459j07409k4730m925l0366L8715
6066H1654L3148L552j5408J9728N3520Q40j4594N821K4290k8436n9579N1852J6064
6053A72452J0240k8384l0787j0832m7590J759R467L9227O1396K5364n8313J6737
6041A60736l6250p5755j0058L6917L9594J3696O5819p9099n0559L3785M2015k7274
$$ plain form
6127 86923 67284 57636 76855 65956 35734 65021 81734 117542 111198 109409 80535 61492
6115 61492 99629 109591 77680 99996 95758 140173 193877 126372 79130 31819 51066 118858
6103 118858 174158 197822 185018 162416 121573 97053 98356 171698 221934 166371 145118 64352
6091 64352 35670 128728 135109 110342 198694 199338 100430 121827 80349 78908 174589 171187 146838
6078 146838 72114 45113 3585 73800 170971 200910 210369 102960 78230 73305 42939 81654
6066 81654 114802 118354 102946 122674 176194 177034 162440 168261 192551 164115 104536 156388 172452
6053 172452 182692 154308 123521 112689 65099 66858 76325 115552 176948 202312 143999 160736
6041 160736 124486 48731 38673 75590 115184 128880 194699 115600 65041 98826 140841 113567
6029A13567J2228L2596j0121n7221m8548M2095M1890L0634K4472J9846l3618l1600
6017A36220O1751L7285p6119J15995m2093n3562k0470M7011M2159j9136k3189
6006B05852q514m4969n4575O1026J2054k4992j935k2031r989O332k4629O7288
5994A60918R6651K3768p7619m655P206m8706P865Q2635M2993p5349j10533k1322
5982H3852j6859O4962R542M7577L3231p3518k7238M2227O3648J5196K9016J170
5970B72806l5066m4846o1197N8731M1133J6721M7847j8213j37707n3632Q4245
5959A70822N6186K0551k8023N9824l1948k9860n814L6982P9633j3842j2601j5476
5947B86434o3114M6610P0809k3698K3471K527J8753J3035l7066J1725L5814K4471
$$ plain form
6029 113567 125795 158391 148270 91049 42501 84596 126486 157120 181592 201438 167820 136220
6017 136220 197971 235256 159137 275132 233039 179477 159007 206018 248177 229041 205852
6006 205852 197338 152369 97794 158820 170874 145882 143947 121916 111927 118259 93630 160918
5994 160918 257569 281337 203718 199063 206269 157563 165428 248063 291056 215707 105174 83852
5982 83852 66993 131955 141497 189074 222305 148787 121549 163776 227424 242620 271636 272806
5970 272806 237740 192894 131697 190428 231561 248282 296129 277916 140209 86577 170822
5959 170822 227008 247559 219536 279360 247412 217552 211738 248720 328353 314511 301910 286434
5947 286434 223320 269930 340739 317041 340512 343039 361792 374827 337761 349486 385300 409771
5935D09771k5126l2979J2401L2210M0229M5555N5420j7242K0955l7133j03586
5924D00475J73751O330j028L6674J8303j0881p57P4364M4292O0916K5533p3118
5912G54854l7533N1972M7869J01483J63717J00779N4418o8812j50247N720l1619
5901I92601M3149k8369N7141l4855J1456j4494m776L1279K4263K70l6935L3629
5889A074359R193O4687M0028j9709o487j09922j30592o8333O649o0291l3198m812
5877G61572o4032k0295k0939m476K1507Q935l5311L9230r1857p4614o130L6659
5865E50249l7482l9625J9169n1698r2122j9369k7878M6106j819l0820L189p7286
5853B40614l4436K8919P0782J0555j5902n6623K2676o572P740j3946j3828K4042
$$ plain form
5935 409771 384645 351666 364067 396277 436506 482061 537481 520239 541194 504061 400475
5924 400475 574226 580556 579528 616202 634505 623624 622867 697231 741523 802439 827972 754854
5912 754854 717321 769293 817162 918645 1082362 1183141 1237559 1168747 1018500 1024220 992601
5901 992601 1035750 1007381 1064522 1029667 1041123 1026629 1021853 1053132 1077395 1077665 1040730 1074359
5889 1074359 1083552 1148239 1188267 1168558 1162071 1052149 921557 853224 859873 799582 766384 761572
5877 761572 697540 677245 656306 651830 673337 682272 646961 686191 594334 519720 513590 550249
5865 550249 512767 473142 492311 440613 348491 329122 301244 347350 345531 314711 317900 240614
5853 240614 206178 235097 305879 316434 300532 243909 266585 260013 267753 253807 239979 264021
5841B64021j9511q47m6888M7698N2941j0047m3806r9365o6630N2338j7206O9613
5829A82311O8403r638k8021M513K3825M059L9085J6269J969q1905o6643p48k697
5816A50782N4744p220P6435r431k6121n2702K1625n2925J1261O8024l0043m0204
5804A64225j0482K9938n631O6812l7092r2013J3109j1264o647P0792L5521N7481
5792B74749p6569n850l6539L3568L5768n6865k0230P886l0879N9409m8022K8806
5780A65232L9209k9010m1877J273J9307m002q393J04974m164m8639k0509m5514
5768A27887Q666L5892P7097J6905J989q768l3657o834l7331J3848K1396J9562
5756B36652k2930o5840m1826O4454Q8260l1618M2153k1365J3433J971p4693j7245
$$ plain form
5841 264021 244510 243663 196775 244473 297414 287367 243561 144196 77566 129904 112698 182311
5829 182311 250714 241076 213055 217568 241393 245452 284537 300806 302775 220870 154227 153479 150782
5816 150782 205526 198306 274741 265310 239189 186487 208112 155187 166448 234472 204429 164225
5804 164225 153743 183681 178050 244862 207770 115757 128866 117602 110955 181747 217268 274749
5792 274749 198180 192330 155791 189359 225127 168262 148032 155918 125039 184448 136426 165232
5780 165232 204441 175431 133554 134827 154134 150132 141739 246713 242549 193910 173401 127887
5768 127887 136553 172445 249542 266447 268436 259668 226011 219177 181846 195694 217090 236652
5756 236652 213722 147882 106056 170510 258770 227152 269305 247940 261373 263344 188651 171406
5744A71406N5163K9515j5235o3362q6j9149j3599O4352K6119L474o3710o4402
5732A10486j0660l1751O5332J1560M9258p288N8298O500j0390N143N77k9912m1943
5719A75210m8126M6209J07613M2742k6012m395j14717p0727J4477N7470Q4942
5708B64686K1030m8589n6829M662j3927K5743O9365L6602j12878R937k7742P418
5696A79478r124P3694J0877l5155p1444k5424R0867M6557O495L341M3014l9055
5684B74121p1931j1781K6469Q2619L2577n1229n1544n1859r370R68O8889K6557
5672B64486n8112l079p3366l1147O9521N1501J1292k1777N017m1960n2129R1140
5660B11387M6855p679k3398n7946j498l7365O461P2560M6768m4205q1543K1965
$$ plain form
5744 171406 226569 256084 240849 177487 177401 158252 144653 209005 235124 238598 174888 110486
5732 110486 99826 68075 133407 144967 194225 186937 245235 251735 241345 246488 247065 217153 175210
5719 175210 127084 173293 280906 323648 297636 293241 178524 107797 122274 179744 264686
5708 264686 285716 237127 180298 184960 171033 196776 266141 302743 189865 199802 172060 179478
5696 179478 170354 244048 254925 219770 148326 122902 213769 260326 266821 270162 313176 274121
5684 274121 202190 190409 216878 299497 332074 280845 229301 177442 168072 169040 237929 264486
5672 264486 206374 203295 129929 98782 168303 219804 231096 209319 214336 172376 120247 211387
5660 211387 258242 250563 227165 169219 167721 130356 136817 209377 256145 211940 130397 152362
5648A52362R2835l509O1590J4414n9543l6554l7054m2905j0926Q5182R4179l9360
5636B70711l8741Q570o8444K6777M9979l041n9833j6843m4271P559J25098K1068
5624B78589L3039L479l6716n3394p7185K7043R9428K9862k6075q9894J1681L6688
5612B36545K662R4811j9945k5634l4026l1364N3991K2439j5634L0455N372j04943
5600B14729k7610P2478P3031j1422k2668l8694o5455l5797j820J6594O9901M0724
5588B83991L2975L502m2367l8812K8505O7651o542l2319j06854k7963M2271M6034
5576B50072L8059R0019l0501r8674l4034N1880M0312k9357l0440k7290k2989M8226
5564B45283K8748J5438M5623l0502n9473k6256K7220P5763K0955J9853r676j52376
$$ plain form
5648 152362 245197 241688 303278 317692 258149 221595 184541 141636 130710 215892 310071 270711
5636 270711 231970 240540 172096 198873 248852 245811 185978 169135 124864 132423 257521 278589
5624 278589 311628 315107 278391 224997 147812 174855 274283 304145 278070 188176 199857 236545
5612 236545 239207 334018 314073 288439 254413 223049 277040 299479 283845 314300 319672 214729
5600 214729 187119 259597 332628 321206 298538 259844 194389 158592 156772 173366 243267 283991
5588 283991 316966 320468 278101 239289 267794 335445 328903 296584 189730 161767 204038 250072
5576 250072 288131 378150 347649 248975 214941 266821 307133 277776 247336 220046 197057 245283
5564 245283 274031 289469 335092 304590 245117 218861 246081 321844 342799 362652 352976 200600
5552B00600m3683P2068N5908K7169k4415J1847m4480j5847K3210Q3970j2519N9169
5540C92997p9596r0474L5656M0421k1136j9432R6518q720j060o2517R464R6770
5528C88891k0891j4797q7984p2160R2073j0867J0932L1969m358J3j9995o2757
5516B30069Q8352M2673q296J5516L3386j29550o0021J01179O4939J0764K309o9927
5504C21393r86n043O405N217L9598Q2610r7959m7030Q5564N1142n6052L9105n7926
5491C66038m2445K8788K5185K9630L3955l1880m8178k2210l8895j4798M9355Q5160
5479D19705P827n5636k9210O4232l7023M6624M1802K0592q5972n0463p73J3663
5467C55368R7939J9730l4449m7280l8736K6777j4916L6103n345l2677N677n8252
$$ plain form
5552 200600 156917 228985 284893 312062 287647 299494 255014 239167 262377 346347 333828 392997
5540 392997 313401 222927 258583 299004 277868 258436 354954 346234 345174 282657 292121 388891
5528 388891 368000 353203 265219 193059 285132 274265 285197 317166 312808 312821 292826 230069
5516 230069 318421 361094 352798 368314 401700 272150 212129 313308 378247 389011 391320 321393
5504 321393 320407 315364 321769 326986 366584 449194 351235 304205 389769 440911 384859 423964 366038
5491 366038 323593 352381 377566 407196 441151 409271 361093 338883 299988 285190 334545 419705
5479 419705 427532 371896 342686 406918 369895 416519 458321 478913 392941 342478 341705 355368
5467 355368 453307 473037 438588 391308 352572 379349 364433 400536 395191 362514 368191 309939
5455C09939J3272R9703J6115K4684J73o9028n0749J838N298N3202M6533Q963k7485
5442D32458o9314K3495P5461M6883l8771L269k0157l0046L7536N1444L3651J8657
5430E64566m1223m0139J6262N0266J776L6901r0440q3906l1641L5475Q3116Q2138
5418E83151L4449n6583o1634k4638J8420M5953N0419N1757n4407j01023k9522
5407D56342P7811L8816j287J1095j0675K2978n870P307M5438J4559Q257j38764
5395E26007m6830K6179N3528O6743P075J2893k7672k8592O4384O038N2213M3138
5383G55104m4193j8628J7812M248L7837K3177k4680p6580O805Q998Q4905N2658
5371H27463o2393o5653n020O7198l2664R8187J2107k6180l1649j3046N9691K7670
$$ plain form
5455 309939 323211 422914 439029 463713 463886 394858 344109 345947 351245 404447 450980 459943 432458
5442 432458 363144 386639 462100 508983 470212 473481 453324 423278 460814 512258 545909 564566
5430 564566 523343 483204 499466 549732 551508 588409 497969 414063 382422 417897 501013 583151
5418 583151 617600 561017 499383 474745 493165 539118 589537 641294 586887 485864 456342
5407 456342 534153 572969 571682 582777 572102 595080 589210 596517 641955 656514 664771 526007
5395 526007 479177 505356 558884 625627 632702 645595 617923 589331 653715 659753 711966 755104
5383 755104 710911 692283 710095 714343 752180 775357 750677 674097 680902 689900 774805 827463
5371 827463 765070 699417 694397 761595 728931 827118 839225 813045 781396 768350 828041 855711
5359H55711R4881K3461O459m8985k7604K8079N6733m6311j5465O1524p3197n0653
5347H64633J8070J05428N6655n8026n7977L3189J0702J10600L4020M3467L0039
5336A190800k2662m1965j2217O4970J59670q42n6374l4864J3785M0051Q6829k5813
5324A361368J2502r2100q6302P9986J12378p206n6837m8890o0859J10701K7474
5313A352215R6070l0796J0513l1808M3202J03601L270N2732M6185k0159o9002
5302A556023r128Q336J31481K9840q2252j09146r8369L1017P4618J1986l3807
5291A510599o1368l7679K9772L0911J2195J13879O9370m5063j54105k0335P2463
5280A520639R3175O5120q6230o6982j0004P320q3409M3145L6863p9886p6064j2205
$$ plain form
5359 855711 950592 974053 980512 931527 903923 932002 988735 942424 926959 988483 915286 864633
5347 864633 882703 988131 1044786 986760 928783 961972 972674 1083274 1117294 1160761 1190800
5336 1190800 1168138 1126173 1113956 1178926 1338596 1337754 1281380 1246516 1260301 1300352 1387181 1361368
5324 1361368 1373870 1281770 1195468 1275454 1387832 1380626 1323789 1274899 1214040 1324741 1352215
5313 1352215 1448285 1417489 1428002 1396194 1439396 1542997 1546267 1598999 1645184 1625025 1556023
5302 1556023 1546895 1555231 1686712 1716552 1634300 1525154 1426785 1457802 1532420 1544406 1510599
5291 1510599 1449231 1411552 1441324 1472235 1484430 1598309 1667679 1622616 1468511 1448176 1520639
5280 1520639 1613814 1678934 1592704 1525722 1515718 1523038 1439629 1482774 1519637 1439751 1363687 1351482
5268A351482O0949N5009L2444o9317m0128j9951N642N8945N0935K3886n3704p4660
5256A381532L2719L1682Q0754K1412l6492l8199o4816J2271K8891N0919K31n5369
5244A445535k959K2937J0443M2632n0927k181p8280k0628L8411R6757Q4934n6754
5232A529920n9063P411J0891O0408J18796J7320p8844J8303j8804Q2780K3549
5221A712667p491m3926p2146J7516n3108R8834J26633m9832j1096n0754k7380
5210A639917R7473M9872M5920m1285r7249j6991O5397O6903K843k4323p767p0667
5198A710043R189N4984J02769P0621k5074j45850q1510Q8447J25001L3759j01102
5187A841277o5289j594j2766J34425J30007M2671M020J6543J91448J58058L0288
$$ plain form
5268 1351482 1412431 1467440 1499884 1430567 1390439 1370488 1376130 1435075 1486010 1509896 1456192 1381532
5256 1381532 1414251 1445933 1526687 1548099 1511607 1473408 1408592 1420863 1449754 1500673 1500904 1445535
5244 1445535 1442576 1465513 1475956 1518588 1467661 1465480 1387200 1366572 1404983 1501740 1586674 1529920
5232 1529920 1470857 1478268 1489159 1549567 1668363 1685683 1606839 1625142 1606338 1689118 1712667
5221 1712667 1705176 1661250 1589104 1606620 1553512 1652346 1778979 1729147 1718051 1667297 1639917
5210 1639917 1737390 1787262 1833182 1791897 1694648 1677657 1743054 1809957 1812800 1788477 1780710 1710043
5198 1710043 1719232 1774216 1876985 1947606 1922532 1776682 1695172 1783619 1908620 1942379 1841277
5187 1841277 1775988 1774394 1761628 1896053 2026060 2068731 2072751 2089294 2280742 2438800 2469088
5176B469088J0363n0466m1456k0618J02520J45662M9762m1796k2783L3970K1077
5165B655323R8816L0113j6041l3009K2688K3810J39660J02631O1410n6757l9984
5154B988660L7503J01656J13248M7598o840p5459R8J31567J09130J2428K1705
5143C481294n4001L8588Q0024J08642J57636l0953j6658J14774J40484J53303
5133D173133Q4852J3394O4q626J33777J48399L9339O9837m3953O2159J25138J22930
5121D920443J38634Q9588M4598L2590M4933J15593K04518J35281j1258N0954J77153
5110E943027K15314J24494J27946N9488L6182J27225K43462L07629Q1929N5367
5100G322063O9759J63311K69765K77611J34249J6668J30610J42257K98784K49839
$$ plain form
5176 2469088 2479451 2428985 2387529 2366911 2469431 2615093 2664855 2623059 2600276 2634246 2655323
5165 2655323 2754139 2784252 2768211 2735202 2757890 2781700 2921360 3023991 3085401 3028644 2988660
5154 2988660 3026163 3127819 3241067 3288665 3281825 3206366 3206464 3338031 3447161 3459589 3481294
5143 3481294 3427293 3465881 3545905 3654547 3812183 3781230 3764572 3879346 4019830 4173133
5133 4173133 4257985 4271379 4271443 4262817 4396594 4544993 4584332 4654169 4610216 4672375 4797513 4920443
5121 4920443 5059077 5148665 5193263 5225853 5270786 5386379 5590897 5726178 5714920 5765874 5943027
5110 5943027 6158341 6282835 6410781 6470269 6506451 6633676 6877138 7184767 7266696 7322063
5100 7322063 7391822 7555133 7824898 8102509 8236758 8253426 8384036 8526293 8825077 9074916
5090I074916K13117J04046J11275K20142L34974L01619J82353K17372J81671K80949
5080A1222434M23692L68360L57797K36622K45503M19638N68259M79498L25617
5071A4647420M26636M72080N28870O43526N56518M72114M32979M83539O48544
5062A9312226P02967O84741N36059N20748N72017N96499N76563N87942N07273
5053B4597035N71913P48994P18146P57528O31398O07036Q06314R21711J022433
5044C1382508J065893R88106J136154J405369J576427J689126J684810J716292
5036D2644685J873469K214110K229550K239513K425407K853159L501240M111766
5028F4092899M533645M961534N893661P179337Q446314R818257J1722658J4581655
$$ plain form
5090 9074916 9288033 9392079 9503354 9723496 10058470 10360089 10542442 10759814 10941485 11222434
5080 11222434 11646126 12014486 12372283 12608905 12854408 13274046 13842305 14321803 14647420
5071 14647420 15074056 15546136 16075006 16718532 17275050 17747164 18180143 18663682 19312226
5062 19312226 20015193 20699934 21235993 21756741 22328758 22925257 23501820 24089762 24597035
5053 24597035 25168948 25917942 26636088 27393616 28025014 28632050 29438364 30360075 31382508
5044 31382508 32448401 33436507 34572661 35978030 37554457 39243583 40928393 42644685
5036 42644685 44518154 46732264 48961814 51201327 53626734 56479893 59981133 64092899
5028 64092899 68626544 73588078 79481739 86661076 95107390 104925647 116648305 131229960
5020A31229960J8621728K3493150K8223400L2121856L3406191K5767323J572191
5013B94435799k2362443k9752217k9146756k7355817k4507829k0913427j7810783
5006A22586527j5079336j2602882j0257938q480291p213892o327191n686240n001514
4998E1937243m326693l626554l103657k695718k407467k146834j888777j665687
4990C0075856j552816j425715j447880j390747j240153j217669j046695q28639
4982A9925542q64915q38005p32310o97881o29614o42715o15012n85141m04486
4973A3915463m66005n08990m40837m92724m99312m05966l92033l48820k98862
4964A0061914l91505k83015k77523l01249k26585k55072k12510k58172j85552
$$ plain form
5020 131229960 149851688 173344838 201568238 233690094 267096285 292863608 294435799
5013 294435799 272073356 242321139 213174383 185818566 161310737 140397310 122586527
5006 122586527 107507191 94904309 84646371 76166080 68952188 62624997 56938757 51937243
4998 51937243 47610550 43983996 40880339 38184621 35777154 33630320 31741543 30075856
4990 30075856 28523040 27097325 25649445 24258698 23018545 21800876 20754181 19925542
4982 19925542 19060627 18222622 17490312 16792431 16162817 15520102 14905090 14319949 13915463
4973 13915463 13449458 12940468 12499631 12006907 11507595 11101629 10709596 10360776 10061914
4964 10061914 9670409 9387394 9109871 8808622 8582037 8326965 8114455 7856283 7670731
4955G670731k28111k55148j57787j87797k36889j29096j93506j53293k11822j25972
4945E791310p4898j81405j79094k11490j28743n8309j03870j72294r6252p6948
4935D508007j77283j90084l8590n9411n4523j79500j26814j32868j61752j62070
4925C225112r2865p0118R070k8585q8681r4946j49649q3585r3597J178p3327j20921
4913B339086r4607k7067k2900j00711q6352J1056l7365m1439o9304q1406q8182
4902A700809J0548O025m3572l1594j1164q660k9539m7967o5532N6841J0948n7971
4890A489172p0469q0378m7632k4606M1504L9993j05135m5233J2575l9806j8308
4879A151677m7185l5987k6719O756l9877k3972J7252j4939J1167k3133j725P880
$$ plain form
4955 7670731 7442620 7187472 7029685 6841888 6604999 6475903 6282397 6129104 5917282 5791310
4945 5791310 5716412 5535007 5355913 5144423 5015680 4957371 4853501 4681207 4584955 4508007
4935 4508007 4330724 4140640 4102050 4042639 3988116 3808616 3681802 3548934 3387182 3225112
4925 3225112 3132247 3062129 3071199 3042614 2953933 2858987 2709338 2625753 2532156 2533334 2460007 2339086
4913 2339086 2244479 2217412 2194512 2093801 2007449 2018505 1981140 1939701 1870397 1788991 1700809
4902 1700809 1711357 1717382 1673810 1642216 1631052 1622392 1592853 1544886 1479354 1536195 1547143 1489172
4890 1489172 1418703 1338325 1290693 1266087 1307591 1347584 1242449 1197216 1209791 1169985 1151677
4879 1151677 1104492 1068505 1041786 1048542 1008665 984693 1001945 987006 998173 975040 973315 981195
4867I81195p6274m2735k3268L2610P358n0570q589j0210J0128L1574j432K7793
4855H77580J2264o8061m3727l5301J7372Q1825L034o279R206O8003O4174L2871
4843A012961L3051J7p3984o3966N1117m1369m0347m1575m1239o4099m5533l0286
4831F54748L216J6389r743q6823L767n9158K6811K3817n7340m2340k403j9910
4819D51031N1861O7531k1348p3056k7867l9850k7366l4815L7630K6286J5435j244
4807D24228q0920N3919p785M162L6030m9783m1820J7390n3910O1731Q819K8598
4795D00659j6674m1021K9943q9871o5619J28588M6329r3032p285J8714l1852O949
4783B85828n0397K7256m4260o4061Q6179M923J4453p357j0916J1249k9299k4100
$$ plain form
4867 981195 904921 862186 838918 871528 878886 828316 819727 809517 819645 851219 849787 877580
4855 877580 889844 821783 778056 742755 760127 841952 844986 838707 847913 915916 980090 1012961
4843 1012961 1046012 1046029 972045 908079 959196 917827 877480 835905 794666 730567 685034 654748
4831 654748 657964 674353 664610 577787 581554 522396 549207 573024 515684 473344 470941 451031
4819 451031 502892 570423 549075 476019 448152 408302 380936 346121 383751 410037 425472 424228
4807 424228 343308 397227 389442 393604 429634 379851 338031 355421 301511 363242 372061 400659
4795 400659 383985 342964 372907 283036 217417 346005 392334 299302 292017 310731 278879 285828
4783 285828 235431 262687 218427 154366 240545 245468 259921 252564 241648 252897 223598 199498
4771A99498K4214M8348m6721l7785q931j1178P1698r8385k3632N9452L6294j2352
4759B00520n3019o75K6803M7784j7030l0128m0790N3746R43K7956K5968p9410
4747A62668n0384P0470J6371j7914j1551k7500q676M5608j8108l814j3705j6870
4735A26595N6952m242p3064K3099k5149o794k7443m0133L3868q611r103P4679
4723A20654j5283l5072K1527K3155j5142J4073K382l6421q819N3278l0632J2847
4711A06547J725j5694P5085l6246p3819m3465L4044L253P1305n6876J5534J8515
4699I9908l4881n52O2082m5231j9387j2355j5111M3352K7653p5P753m6077k5924
4686D1155M4290K1002n4694p5121K3261N23L9005M5414K0545J2124k5463k4948
$$ plain form
4771 199498 223712 272060 225339 187554 178623 167445 239143 140758 117126 176578 212872 200520
4759 200520 147501 146826 173629 221413 204383 174255 133465 187211 188154 216110 242078 162668
4747 162668 112284 182754 199125 181211 169660 142160 133484 179092 160984 157170 143465 126595
4735 126595 183547 179305 106241 129340 104191 97397 69954 29821 63689 55078 45975 120654
4723 120654 105371 70299 91826 114981 99839 113912 116294 79873 71054 124332 93700 106547
4711 106547 108272 92578 167663 131417 57598 14133 48177 51430 122735 65859 81393 99908
4699 99908 65027 64475 126557 81326 61939 49584 34473 77825 105478 105403 113156 67079 41155
4686 41155 85445 106447 51753 -23368 -107 416 39421 84835 105380 117504 92041 67093
4674F7093q020j9066J8010N1115m772J6028Q892o3711q6j4162N6010N8467j31968
4661C3830K933K5498n65k6175k7170J9285l0327p802J6048J8708Q473p833L0388
4648E5291L8244n463P032J3333r7760K0614L2553K2902n9072K2676m177M9382
4636I5555J6832o6084M0244K2402l8492k5101N0286m6599l9626N463L0304R40
4624D6124N1694P632k4948k4747L3945k1192n2921K5073K366l4569L3778K5372
4612F7607N6682k2651p1504l7023R397J3118j10k1676j3516R8756K9496n4478
4600E4098l1849O7820O0414q9581m9477l736Q0917o0250m7004L5462K8323L3627
4588G8764r1998M3296J4215o534Q068p079p002J5750M7495l0925n3925r330J3698
$$ plain form
4674 67093 59073 40007 58017 109132 104360 120388 129280 65569 65483 51321 107331 165798 33830
4661 33830 36763 62261 61696 35521 8351 27636 -2691 -10493 5555 24263 32736 24903 55291
4648 55291 93535 88072 95104 108437 10677 31291 63844 86746 27674 50350 46173 95555
4636 95555 112387 46303 86547 108949 70457 45356 95642 49043 9417 14880 45184 46124
4624 46124 97818 105450 80502 55755 89700 68508 15587 40660 43026 8457 42235 67607
4612 67607 124289 101638 30134 -6889 2508 15626 15516 -6160 -19676 79080 108576 54098
4600 54098 22249 90069 150483 60902 11425 7689 88606 28356 -18648 16814 45137 78764
4588 78764 -13234 30062 44277 37743 45811 38732 31730 47480 94975 64050 10125 795 14493
4575A4493J0113K7678k6773J1812q084l8010J6865J1227N7280L7039L6774m5174
4563A05240n6086k3325k4156m0601o411M1175K3261O9022m4648j7849k962O4938
4551H7598N6559j5717K3816k0811j2731j2356q3991N3530p946q960l3152M8533
4539G4372K8230m3773L0132P9212m9332J0682m9680N5751m0147j6735J4794j1444
4527H2062J9867J2422J572l6263M9416m2292Q2204l3351l6061k3590P338N1347
4515A34671O5067k3878M6263M5719m771j4277K4291l378J7902R7981K1156R1242
4503D97988N8882M5405L6591N1028M7158j05219l0707q2236k1329j5602l5435
4492D46524m989m5437j38569n0804M5905N7045o286l0209j6399K4855n2860Q4832
$$ plain form
4575 14493 24606 52284 25511 37323 29239 -8771 8094 19321 76601 113640 150414 105240
4563 105240 49154 25829 1673 -38928 -45339 -4164 19097 88119 43471 25622 22660 87598
4551 87598 144157 128440 152256 131445 118714 106358 22367 75897 67951 58991 25839 74372
4539 74372 102602 58829 88961 168173 118841 129523 79843 135594 95447 78712 93506 82062
4527 82062 101929 114351 115923 79660 129076 86784 168988 135637 99576 75986 83324 134671
4515 134671 199738 175860 222123 267842 263071 248794 273085 269707 287609 385590 406746 497988
4503 497988 556870 602275 638866 689894 737052 631833 601126 518890 497561 481959 446524
4492 446524 441535 396098 257529 206725 252630 309675 303389 273180 256781 281636 228776 313608
4480C13608k017o1664O754k3986q862L8990p2182J3862N2056o3280L6179J968
4468B31426M170J8410l5302j0243K4178n3107J4252K6358q3550P417l6735K6290
4456A33564L0572j5141n772o1237l8224L471L8694Q304K8437M5046p0765Q746
4444A05695L5376j44283K3456P0254N0954n7574r812k3110J2827n138l8690N1613
4432G1568L0125K3605n4931O2397K6013k8975L7598K5679o714p5292o234N1779
4420A56618K1138q0017L4317k626k0755N5127n453j2099j3053n626J0497n8195
4408G9873R063Q2631M9107j3502L4759m0290k0067m0492j4016P7141n4411n405
4396A44391l119O1161N669j0949n7445M5073L1128o7872L6915o864L5641P4605
$$ plain form
4480 313608 311591 249927 256681 232695 223833 262823 190641 204503 256559 193279 229458 231426
4468 231426 235596 254006 218704 208461 232639 179532 193784 220142 136592 144009 107274 133564
4456 133564 164136 148995 143223 81986 43762 47233 85927 94231 122668 167714 96949 105695
4444 105695 141071 -3212 20244 90498 141452 83878 74066 50956 63783 58645 19955 71568
4432 71568 101693 125298 70367 132764 158777 129802 167400 193079 186365 111073 104839 156618
4420 156618 177756 97739 132056 129430 108675 163802 158349 146250 133197 127571 138068 79873
4408 79873 88936 171567 220674 207172 241931 201641 181574 141082 127066 204207 149796 144391
4396 144391 141272 202433 208102 197153 139708 184781 215909 148037 184952 178088 213729 288334
4384B88334j8789l0254k8427K4724L0403m976M0359J0344p834j5509P8912L2856
4372D00143M5328J7635N9773J5357L0728O0102N4702Q8983k9326n6015J4286q243
4360F93453p6154p8011j5486m7534m0341l9908o9107L399M3637l3493k4196l1106
4348B85153L8859l2415j814l4086L6406N5624k6683n7836j5360N0000J3214l8511
4336B72551m8886M3546L9723J1591M009L1710o9976J5854K8486j9340p398J4082
4324C15952l9726L4514L5948k443k4305O3445j6840k8101N5356m0126j0282Q469
4312C51861l251K1378K9099L057P80q184p3N533K3190J6815l8921M9176O8017
4299E18477J5419o4430m9164M4816Q4306M5939N091p5991J0412O7749K539L8467
$$ plain form
4384 288334 269545 239291 210864 235588 265991 261015 301374 311718 303884 288375 367287 400143
4372 400143 445471 463106 522879 538236 568964 629066 683768 772751 743425 687410 701696 693453
4360 693453 617299 539288 523802 476268 435927 396019 326912 330311 373948 340455 316259 285153
4348 285153 324012 291597 289783 255697 292103 347727 321044 263208 247848 297848 311062 272551
4336 272551 223665 267211 306934 318525 322534 354244 284268 300122 328608 309268 301870 315952
4324 315952 276226 310740 346688 344245 319940 383385 366545 338444 393800 353674 343392 351861
4312 351861 348610 369988 399087 402144 402924 394740 394667 400200 423390 440205 401284 450460 518477
4299 518477 533896 469466 420302 465118 549424 595363 600454 524463 534875 602624 605163 643630
4287F43630n7298J0340J8063P1853J1548n819Q238m7876p852j5993M7450O222
4275F82506r2K8943Q7897K1716J3872l0809K5232L868M5065k0842j1636l0357
4263H15363l192K9650N3991L5156N6305r878K3234L2266j0733p478O0919n410
4251A070193n3983R4038N0177K1892K7107N648L7525Q7382L5586L6391K1159n949
4239A427166O2499L8154O0246N6711p1301K7031J03238P5692N8374O3991P3592
4228A975393J21328J8777m341M6963P2868Q6458J14045N4210Q576J02866J00791
4217B697934K7838Q4270R5297R5206N8081J42436P3094R0220Q6395P9757P9104
4206C609632J31401J31924J40998J55607J90755J13642J60412J28756J65899J53628
$$ plain form
4287 643630 586332 596672 614735 686588 698136 692317 700555 652679 644827 628834 676284 682506
4275 682506 682414 711357 799254 820970 834842 804033 829265 833133 878198 857356 845720 815363
4263 815363 812171 841821 895812 930968 987273 977395 1000629 1032895 1022162 1014684 1075603 1070193
4251 1070193 1016210 1110248 1160425 1182317 1209424 1215072 1252597 1339979 1375565 1411956 1433115 1427166
4239 1427166 1489665 1527819 1588065 1644776 1573475 1600506 1703744 1779436 1837810 1901801 1975393
4228 1975393 2096721 2115498 2111157 2158120 2230988 2317446 2431491 2485701 2494277 2597143 2697934
4217 2697934 2725772 2810042 2905339 3000545 3058626 3201062 3274156 3364376 3450771 3530528 3609632
4206 3609632 3741033 3872957 4013955 4169562 4360317 4473959 4634371 4763127 4929026 5082654
4196E082654K07449K69303K49783L13169K69481L41142M55044M04721N47222N92542
4186H732510O95623Q22754Q81001Q45296P87576P30576O01786O22816P58399R99461
4176A6477798J076415J123392J031567O56033K74133J63064L34789M39679O22504
4167B2199374P72055O80002L09651l51650o93496p98567p02623n18326l99413
4158B0497007l29692m20792p60502j028796j193117j077424j004731q19348p56607
4149A3105998o89431q12784q88819q87703r42094q27026p22553o58261n85328
4140F091999n20298m59857m09270l03669k88155j80644k30738k33624k38437j50981
4130C076326j40917j14895j33810j93078p8864j20058j07943q0882l2140q6423
$$ plain form
4196 5082654 5290103 5559406 5809189 6122358 6391839 6732981 7188025 7592746 8139968 8732510
4186 8732510 9428133 10250887 11131888 11977184 12764760 13495336 14097122 14719938 15478337 16477798
4176 16477798 17554213 18677605 19709172 20365205 20639338 20802402 21137191 21576870 22199374
4167 22199374 22971429 23651431 23961082 23609432 22915936 22117369 21414746 20896420 20497007
4158 20497007 20167315 19746523 18986021 17957225 16764108 15686684 14681953 13862605 13105998
4149 13105998 12416567 11603783 10714964 9827261 8885167 8058141 7335588 6677327 6091999
4140 6091999 5571701 5111844 4702574 4398905 4110750 3930106 3699368 3465744 3227307 3076326
4130 3076326 2935409 2820514 2686704 2493626 2414762 2294704 2186761 2105879 2073739 1987316
4120A987316p5609j11395n4530m5374n9145n3150n8630k0126l3683q1532q3486
4109A310656P086p3352n0943l5843o0922J0581k109p4328l4033n7467k7951K4399
4097I35774p2340K4549Q365q5195l7289N104l6528k0361n9084j2095K3189j042
4085F73047j3639o9022m8214k004L0664k0148k8127l9102p2282J7326J662K7789
4073D57950K7014K7096q1690p3852k1073R084J0956N825p0208j8810J4078L119
4061B89489n2248l9123m203J200Q888k8180L4008M4192k6669m9892J5356q072
4049A84746k3858J4869m3033m175K9520K7036Q088l1704o7235n0219N053J8705
4037F7793O2817l8665l5163J09773L8874J563m257j7476o078n5934j8031j4139
$$ plain form
4120 1987316 1911707 1800312 1745782 1700408 1641263 1588113 1529483 1509357 1475674 1394142 1310656
4109 1310656 1317742 1244390 1193447 1157604 1096682 1107263 1105154 1030826 996793 939326 911375 935774
4097 935774 863434 887983 896348 811153 773864 778968 742440 722079 662995 650900 674089 673047
4085 673047 659408 590386 542172 540168 570832 550684 522557 483455 411173 428499 430161 457950
4073 457950 484964 512060 430370 356518 335445 344529 355485 361310 291102 272292 286370 289489
4061 289489 237241 198118 193915 195115 204003 175823 209831 254023 227354 177462 192818 184746
4049 184746 160888 175757 132724 128549 158069 185105 193193 161489 94254 44035 49088 67793
4037 67793 130610 91945 56782 166555 205429 206992 202735 185259 179181 123247 105216 91077
4025I1077P281l2513o881P782J6171L3836l42p6953l2638N0999J7408N6167l1101
4012A00293r8483k9768L0944M2139j9642K97k9272J4405J0569j9565j54M8066
4000D9829k4383N9189l981j6007l6478J1988L0509J4015j2052N89r883m0696L6988
3987E9627o564J0467m6198k573J8613q342J0729k3306J2948L9445K8129M6291
3975A39266k2433m1477K8967k3630k3127L1239p6631o4231o460M5839N2669l7837
3963B154J0619O483l5261j6774R761R298M252Q6356m8647q3076Q945K6667J4456
3950d767N7389o3404N6023M8211m0962k713k3623L8532l3449m3684L4928l4138
3938a1657J217L0779L9858L3447o0218j7810n1931K1619p586J5794m7913l9943
$$ plain form
4025 91077 98358 65845 58964 66746 82917 116753 116411 39458 6820 57819 75227 131394 100293
4012 100293 1810 -27958 2986 45125 25483 25780 -3492 10913 21482 1917 1763 49829
4000 49829 25446 84635 80654 64647 28169 40157 70666 84681 72629 73218 63335 22639 59627
3987 59627 53063 63530 17332 14759 33372 25030 35759 12453 25401 64846 92975 139266
3975 139266 116833 75356 104323 80693 57566 88805 12174 -52057 -58517 -12678 39991 2154
3963 2154 12773 19256 -16005 -32779 -23018 -13720 -9468 76888 28241 -54835 -45890 -19223 -4767
3950 -4767 52622 -10782 45241 93452 52490 49777 26154 64686 31237 -12447 22481 -11657
3938 -11657 -10440 20339 60197 93644 33426 15616 -36315 -14696 -22282 -6488 -54401 -94344
3926i4344M1194J6177J9085p608k1479J4761K0342l4025L0433N2173l0315Q662
3914A5056m7645k8809L5621K6298N8352l367r211J039O943n907n0100p0557L611
3901f8676P8147j2622M2171j930q7901k9447Q0457K7196j0507n516J9763R062
3889D0197j26851N5047m0749O3291R5036K792j65k8495l2722m5316J5899R2881
3877I0845l2101J1750m5382j2578l6382j9329K7373L2710R676l284J7055J7769
3865E8122q447J052J6856q7897K3411O2218L2650L0037k9688M125P8145L021k8970
3852A54635k8653j8144k4310K7176J3195l0775n0906j2142k8957M1443M727M5875
3840I3164l4931k2760j6195n9645N7575J5412p0472m594m651L8476j3974l1093
$$ plain form
3926 -94344 -53150 -36973 -17888 -25496 -46975 -32214 -11872 -45897 -15464 36709 6394 15056
3914 15056 -32589 -61398 -25777 521 58873 55506 46295 47334 54277 48370 -1730 -72287 -68676
3901 -68676 9471 -3151 39020 37090 -50811 -80258 199 27395 16888 11372 31135 40197
3889 40197 -86654 -31607 -72356 -9065 85971 88763 88598 60103 27381 -17935 -2036 90845
3877 90845 58744 70494 25112 12534 -23848 -43177 -15804 16906 26582 23298 40353 58122
3865 58122 49675 50727 67583 -20314 3097 65315 97965 128002 98314 102439 180584 183605 154635
3852 154635 125982 107838 83528 110704 123899 93124 42218 30076 1119 42562 47289 93164
3840 93164 58233 35473 19278 -40367 17208 32620 -37852 -42446 -47097 -8621 -22595 -53688
3828e3688n616N7597j7534l6079Q8605p8826L1046J8893p6375o0708K9687K4165
3816g8833Q059M4913p37m9902k7189P1M3050j1690K411L2613o576M0848n7539
3803f0501k9025Q6372l5906j10703L6992M4305J0252K6879o9595j8053K5764j333
3791i4552l9590K0055N590j3433N6881l72K7801k8051l5704M7973R6178o9766
3779b6990o7365j1819M0635o026o784K0789K173l2084M177N4410k9308N4435p7156
3766h0913r054P4214j9422j605Q340j5136N4065N5006q9540L480q9699P1672n79
3753c9171l5788R4991m9017n1088j4302J0080K6265J6058N7932K4263j9399k8507
3741g683k1291k4143j6177l5073K201J3660p097l1701L9129P4388o443n0245j6143
$$ plain form
3828 -53688 -59304 -1707 -19241 -55320 33285 -45541 -14495 4398 -71977 -132685 -102998 -78833
3816 -78833 -70774 -25861 -26598 -76500 -103689 -103618 -60568 -72258 -69847 -37234 -43810 -2962 -60501
3803 -60501 -89526 -3154 -39060 -149763 -112771 -68466 -58214 -31335 -100930 -118983 -93219 -94552
3791 -94552 -134142 -114087 -108497 -121930 -65049 -65421 -37620 -65671 -101375 -53402 42776 -26990
3779 -26990 -94355 -106174 -65539 -71565 -78349 -57560 -55387 -87471 -83294 -28884 -58192 -3757 -80913
3766 -80913 -89967 -15753 -35175 -36780 -28440 -43576 10489 65495 -24045 -20565 -110264 -38592 -39171
3753 -39171 -74959 20032 -28985 -80073 -94375 -84295 -58030 -41972 15960 40223 20824 -7683
3741 -7683 -28974 -53117 -69294 -104367 -102166 -88506 -95603 -127304 -88175 -13787 -20230 -70475 -86618
3728h6618L7008k8171k7873q470M6568J6728m7642P3166K6140m3270R816l2492
3716f5110M0209o463j6875K4804o0114M276J1047M139J4372l0600Q313n5682L0385
3703i7299N25J1722m2806P547N7289k1112L5627J4681m4550J7303k0983K1597
3691f0459L0338k0396J2090N333L9387J6175j36778M5992K5505K0909p7823K2230
3679g7497L6994J7591p192n3845N8162K8408n1920m3417L9254l4810Q833J9322
3667f0117o514M1507K521L8182l9943k008j7919L0689L2804l9674l5974k7724
3655h4170K6073j1322p810j9443J5082N6185L0749j8427k8622m5615K8858k5543
3643h4005K2988N4081J1660r4565J4630M520J9683O7241l2905L3962J1742p4151
$$ plain form
3728 -86618 -49610 -77781 -105654 -114124 -67556 -50828 -98470 -25304 836 -42434 -32618 -65110
3716 -65110 -24901 -31364 -48239 -23435 -83549 -79273 -68226 -64087 -49715 -80315 -72002 -127684 -97299
3703 -97299 -96774 -85052 -127858 -120311 -63022 -84134 -48507 -33826 -78376 -61073 -82056 -60459
3691 -60459 -30121 -50517 -38427 -33094 6293 22468 -114310 -68318 -42813 -21904 -99727 -77497
3679 -77497 -40503 -22912 -30104 -83949 -25787 2621 -49299 -92716 -53462 -88272 -79439 -60117
3667 -60117 -66631 -25124 -22603 15579 -24364 -26372 -44291 -13602 19202 -20472 -56446 -84170
3655 -84170 -58097 -69419 -77229 -96672 -81590 -25405 5344 -13083 -41705 -87320 -58462 -84005
3643 -84005 -61017 -6936 4724 -89841 -75211 -70691 -51008 16233 -16672 17290 29032 -45119
3631d5119M949K7378l1820o3856j4734L8860k5682m4140N4812N4702l8835m6611
3619a30096L6100M5348M8049o072m3645l6960O0195o4804L6199j0787L5960K0049
3607a0464P966k035k9209j6238j6925j6832j959L20k9823N8401l1289k5999J6557
3594i7529K468N434N8796M2320m7847Q071J1772k8094l3181l2151k963R031L0344
3581g3529K7076K0882k3998K575l5745J5557N1012k6206n2728j6345N2277N299
3569e3873l5648j899J463L5499m5082p920n531k1347L8746L3047K5343p657O1084
3556A6225P3095n4704q4991o281l019k218k6857l6096L52N6093J9747p197K3607
3543c2244K426l6557m8328R771o8000O8601J05315Q061k6696n4001l4071J4247
$$ plain form
3631 -45119 -40170 -12792 -44612 -108468 -123202 -84342 -110024 -154164 -99352 -44650 -83485 -130096
3619 -130096 -93996 -48648 -599 -6671 -50316 -87276 -27081 -91885 -55686 -66473 -30513 -10464
3607 -10464 -2498 -4533 -33742 -49980 -66905 -83737 -85696 -85376 -115199 -56798 -88087 -114086 -97529
3594 -97529 -95061 -89627 -30831 11489 -36358 -28287 -16515 -44609 -77790 -109941 -112904 -103873 -73529
3581 -73529 -46453 -25571 -49569 -46994 -82739 -67182 -16170 -42376 -95104 -111449 -59172 -53873
3569 -53873 -89521 -91420 -89957 -54458 -99540 -107460 -112991 -134338 -95592 -62545 -37202 -44859 16225
3556 16225 89320 34616 -50375 -56656 -59675 -61893 -88750 -124846 -124494 -68401 -48654 -55851 -32244
3543 -32244 -29818 -66375 -114703 -104932 -172932 -104331 984 9045 -17651 -71652 -105723 -91476
3531i1476K0948r100n1452L3103N282J1088Q6306R368n6782l2215L2298k1179
3519f3811P664J2709R198L97l3685P141m633j002N7744M7819n2624j6001L218
3506b5866n8826O1993O6575m866q5108k8986J1387J220N1414o5800l6938M0421
3494g3380N3820q5408N135L8995j3300L7380k3543O3304p1294K5925j6228l4197
3482i2791P8456l0405L0560k4230m8707O0005L8240o3932j4610l1718j2884k2374
3470a34390M5520K3861K6861m684j0301l804J778L6166l0183l0680j8270N8236
3458c9890N2782l1088j7128o5324j1496N2084J3030j9187K1472Q784j5891m4015
3446i5867p7155P3844O3132n0826K8586N4422n0846j016J9949J6580o3164L9915
$$ plain form
3531 -91476 -70528 -79628 -131080 -97977 -92695 -81607 4699 14067 -42715 -74930 -42632 -63811
3519 -63811 -56147 -43438 -34240 -33843 -67528 -60387 -65020 -66022 -8278 39541 -13083 -29084 -25866
3506 -25866 -84692 -22699 43876 39010 -46098 -75084 -63697 -62477 -11063 -76863 -113801 -73380
3494 -73380 -19560 -104968 -99833 -60838 -74138 -36758 -60301 3003 -68291 -42366 -58594 -92791
3482 -92791 -14335 -44740 -14180 -38410 -87117 -27112 11128 -52804 -67414 -99132 -112016 -134390
3470 -134390 -88870 -65009 -38148 -42832 -53133 -56937 -55159 -18993 -49176 -79856 -98126 -39890
3458 -39890 12892 -18196 -35324 -100648 -112144 -60060 -47030 -66217 -44745 -35961 -51852 -95867
3446 -95867 -173022 -99178 -36046 -86872 -58286 -3864 -54710 -55726 -35777 -19197 -82361 -42446
3434d2446k8865j4951L6293n9311J13144k2004L1539j2394o5661l837l1244J3594
3422h6143M7634J8097J3089p4670m0958P3567l0562J9508l9636J6929m789L2441
3410e5493M286J4110k697J6163l0248j6816n838M7192K9290Q1569k42n5457j2746
3397A3073p1671j9782l3371N1221N5752M4698n2450k8564j4756L5018O844p671
3385b1659q122m8634J8458k6075j1479K3383j8248P2663J1092n1419L8443k3912
3373d5509J9564M1448J2500L5570R147k121n0920j3024l5586m1458K0561L1569
3361a8259J057j6797M8206k8034m9130M0569k2794k9548N491K1144n0921N5511
3349d3505M4054r5778M6566K5615N1161P8897q4559j08491M1019K8623k5027L3091
$$ plain form
3434 -42446 -71311 -86262 -49969 -109280 3864 -18140 13399 1005 -64656 -68493 -99737 -86143
3422 -86143 -38509 -20412 -7323 -81993 -122951 -49384 -79946 -60438 -100074 -83145 -87934 -55493
3410 -55493 -51207 -37097 -39794 -23631 -53879 -70695 -76533 -29341 -51 81518 81276 25819 13073
3397 13073 -58598 -78380 -111751 -60530 -4778 39920 -12530 -41094 -55850 -20832 -13988 -21659
3385 -21659 -29781 -78415 -59957 -86032 -97511 -74128 -92376 -19713 -8621 -60040 -21597 -45509
3373 -45509 -25945 15503 28003 63573 72720 70599 19679 6655 -28931 -70389 -49828 -18259
3361 -18259 -17202 -33999 14207 -13827 -62957 -22388 -45182 -74730 -69239 -48095 -99016 -43505
3349 -43505 549 -95229 -48663 -23048 28113 107010 22451 -86040 -45021 -16398 -41425 -8334
3337h334p230J4429k6680k5653L1086l431k1698l2666M6307K8844L631j9303k580
3324b3278M4433n9018M5546n5799J8217N6685j7606J9734L3483n3631k9574j0679
3312c1487k4576L1292l1258J5258K0387O2121l9410p905l1985L6427K3721l1722
3300i137R12P023K327O653Q884J8550J1130J8883l9785n3096L0633j6141l1407
3287d4571P2527O8572m1104o3375K3640m886j5068o1500L2937K9515J87m6944
3275e0070J7096M8513L415K872m7225j2376K5052M7560m680l3593L0787J6405
3263D3756k7649K0079m5394l0423l2798N7480M6077m5892l138P1962n7185l9869
3251d2994M3516k9633j6879L6971n4716p369R4704M8959l2121M7183j9124m9599
$$ plain form
3337 -8334 -15564 -1135 -27815 -53468 -22382 -25813 -47511 -80177 -33870 -5026 -1395 -20698 -23278
3324 -23278 21155 -37863 7683 -48116 -29899 26786 9180 28914 62397 8766 -20808 -31487
3312 -31487 -56063 -24771 -56029 -40771 -20384 41737 2327 -5578 -37563 -1136 22585 -9137
3300 -9137 -8225 -1202 1125 7778 16662 35212 46342 65225 25440 -27656 2977 -13164 -44571
3287 -44571 27956 96528 55424 -7951 15689 10803 -4265 -65765 -32828 -3313 -3126 -50070
3275 -50070 -32974 15539 18954 21826 -25399 -37775 -12723 34837 30157 -3436 27351 43756
3263 43756 16107 36186 -9208 -39631 -72429 -14949 31128 -14764 -17902 54060 -3125 -42994
3251 -42994 522 -29111 -45990 -9019 -63735 -71104 23600 72559 40438 87621 68497 18898
3239A8898r048O4436R457n6323n3816J5967O136K6759m3935J1825j4208J5263
3227h589k7089l611L8332J1104j1720l4925r405O1813k6585J7213j7323m811K8590
3214A2994q6997j636j6479M1595M5129j3654M8314J8147o0272L7850q0668N2627
3202c050o2245k7310K9637j0542J2460R6626k3484l9348n6083K2621O3113n941
3190c546k6482M3790j2660m8578l126j24M5331j3104p006J6805K776l6450J2855
3177b9519L5930k4857l537K8268p129r7938j2466J00802j1984n1876M3593M2016
3165A1303L8715o4952l6118N8976Q185L614m85M0317j0456m2586k6596n4597L3984
3152d0696l298k9297N6702q050j6922K4131O4403l92j1137o2442j2034M894K5329
$$ plain form
3239 18898 9850 74286 83743 27420 -26396 -10429 -4293 22466 -21469 -9644 -23852 -8589
3227 -8589 -35678 -39289 -957 10147 -1573 -36498 -45903 15910 -10675 6538 -10785 -15596 12994
3214 12994 -74003 -75639 -92118 -50523 -5394 -19048 29266 47413 -12859 24991 -55677 -3050
3202 -3050 -65295 -92605 -62968 -73510 -61050 35576 12092 -27256 -83339 -60718 2395 -3546
3190 -3546 -30028 13762 1102 -47476 -50602 -50726 -5395 -18499 -25505 -8700 -5924 -42374 -29519
3177 -29519 6411 -18446 -21983 6285 -844 -98782 -111248 -10446 -22430 -74306 -30713 11303
3165 11303 50018 -14934 -51052 7924 16109 19723 19238 59555 49099 6513 -20083 -74680 -40696
3152 -40696 -43994 -73291 -16589 -24639 -41561 -17430 46973 46581 35444 -26998 -39032 -34138 -8809
3139h809p3415k2254M2008K0950j6422J5436J05201R327k7288n5141O518K9949
3127B6060l3571l763L9780o9616l6057J2638Q9120j0809n6605P734k8742L6663
3115b7168N3545N91O932j6493j1380Q7416m7075r2737O977j1609L683M1235K9642
3102B3559J4122m7951r42K4604q967L3295k5089j2549L7694n071j1428j5721k2959
3089a7403r278O83j8767K776K87J5380O8094J260K1765o6720p5304Q2300K6218
3076C1291P61l1736l669l9306M0635L4097q005K1946l8817M1146M5091m3187k2623
3063B7624K3709L263l6512k1174J1483J6837J3815l6276j5808M0401K5709j9433
3051C3638o3458R7912j9354m8847M3614l0647M0714l5675k3032K0190J2687R487
$$ plain form
3139 -8809 -82224 -104478 -62470 -41520 -57942 -42506 62695 72022 44734 -10407 -3889 26060
3127 26060 -7511 -11274 28506 -41110 -77167 -64529 24591 13782 -42823 -35089 -63831 -27168
3115 -27168 26377 26968 33900 17407 6027 93443 46368 -46369 -39392 -51001 -47318 -6083 23559
3102 23559 37681 -10270 -11212 13392 4425 37720 12631 82 37776 32705 21277 5556 -17403
3089 -17403 -26681 -25998 -44765 -41989 -41702 -26322 41772 43032 64797 -1923 -77227 5073 31291
3076 31291 32052 316 -3353 -42659 -2024 32073 24068 46014 7197 48343 93434 50247 27624
3063 27624 51333 54596 18084 -3090 8393 25230 39045 2769 -13039 27362 53071 33638
3051 33638 -29820 68092 48738 -109 43505 12858 53572 17897 -5135 15055 27742 37229
3039C7229p298K4271k391P853m7708L8513J675m9434R488J1544j4604K4573J1620
3026D5331l6540J1061L4294j3485O6843M0065m3343n1035m1313K9102K660P0319
3014A13959l3479q4264J3007Q6459l6416j4006N9020P9692k6475k9446j1995j1996
3002A04060M0157J128p0543L7899J9694l3082n2809J6584O3961o037m4789k451
2990G3772k4027M5779J0317k4777N2707M3954k3067m3270K641J2086Q293O841
2978A41249m9339n3074L8967K7775L2433K089L2900L4710m6767k4396K1618q82
2966A57283m9442l6788N6577P5357p231l5307J2254j6860K0569M5725J22l0891
2954A91368K0621L8397k0098j880M6772l8280M795m3607K6092J3496K9620Q137
$$ plain form
3039 37229 29931 54202 51811 59664 11956 50469 52144 2710 12198 23742 9138 33711 45331
3026 45331 8791 19852 54146 40661 107504 147569 104226 53191 11878 40980 43640 113959
3014 113959 80480 -3784 9223 95682 59266 45260 104280 183972 157497 128051 116056 104060
3002 104060 144217 145345 74802 112701 132395 99313 46504 63088 127049 121012 76223 73772
2990 73772 49745 95524 105841 81064 133771 177725 154658 111388 114029 126115 134408 141249
2978 141249 91910 38836 77803 105578 138011 140100 173000 207710 160943 136547 158165 157283
2966 157283 107841 71053 127630 202987 195756 160449 172703 155843 176412 222137 222259 191368
2954 191368 211989 250386 230288 228408 275180 236900 241695 198088 224180 237676 267296 275433
2942B75433j1023l2576K5328M4135N3743L8932j4695k7257J3889K0195j9221k7267
2930C39616J1533K7534O3947P0525p3784m2594n442q281K600k6488m1149o014
2918C12003k6L2644k0460j3433O3172l4799k3988n0655k6863l07L8151j1690k6440
2905B37309K6408K5205r319k5722K3217M822K9309L4952k0329L2971M656J4135
2893C77614l3168P661k0391l9475J07110m495j6828K0991l6245n6957K3534p910
2881C21441J05662R247J5208j7639N9304N9052K289j5833K0591l8697Q6483M2362
2869F49470n7756K895N8809J6670j1938K7886R4496Q2076k2446N2207R7773J4164
2857A004306J8298Q2196J05318J08636J45650J02197J58326K13744L61238M02614
$$ plain form
2942 275433 264410 231834 257162 301297 355040 393972 379277 352020 365909 386104 366883 339616
2930 339616 351149 378683 442630 513155 439371 396777 391335 383054 385654 359166 318017 312003
2918 312003 311977 344621 324161 310728 373900 339101 315113 264458 237595 237288 275439 263749 237309
2905 237309 263717 288922 279603 253881 277098 281920 311229 346181 325852 358823 363479 377614
2893 377614 344446 352107 331716 292241 399351 394856 378028 399019 362774 305817 329351 321441
2881 321441 427103 436350 451558 433919 493223 552275 554564 538731 559322 520625 607108 649470
2869 649470 591714 594609 653418 670088 658150 686036 780532 862608 840162 892369 990142 1004306
2857 1004306 1022604 1104800 1210118 1318754 1464404 1566601 1724927 1938671 2299909 2702523
2847B702523M91579N30008L2705l09736l74793k93304l51975l07294k71895j65192
2837A682626r6808q9260r9507m4361J0232m6420m3958K5297L9173L3877K1661
2826A392552R5471N8318J34246J83900K58062K78151L17204L81597L38335l2447
2816C405389l81819l92831l72959l20982k53826j41858k17893j58766j09363j19922
2806I35170p7617p0781l4397r8307p4794n5416K4278P347q0408j0015n7486n3580
2794C53994o94k5379j9550N378j7588L3859j4978j9215j21747M786O2396j4496
2782B26766K6729q627k4157J0066j6432k1152m049R820k7069l2379K1513k9175
2770A31854L9012k2531k611m3966N8654n3356j9953L6044P44M830r662L4160J3463
$$ plain form
2847 2702523 3194102 3724110 3756815 3447079 3072286 2778982 2427007 2119713 1847818 1682626
2837 1682626 1585818 1496558 1397051 1352690 1362922 1316502 1272544 1297841 1337014 1370891 1392552
2826 1392552 1488023 1546341 1680587 1864487 2122549 2400700 2717904 3099501 3437836 3405389
2816 3405389 3023570 2630739 2257780 1936798 1682972 1541114 1323221 1164455 1055092 935170
2806 935170 857553 786772 752375 654068 579274 523858 548136 555483 475075 465060 407574 353994
2794 353994 353300 327921 308371 313749 296161 330020 315042 295827 174080 178866 241262 226766
2782 226766 253495 244868 220711 230777 214345 193193 189144 198964 171895 139516 161029 131854
2770 131854 170866 148335 145724 101758 160412 107056 87103 123147 123891 128721 119059 153219 166682
2757A66682k5109R58n6856J4380K0626M5647p5222k9360k3380l7204O9800k9809
2745D1153m0549J5349O3104j858L3906o7591L7326K1104n0505K8948j9418j1478
2733D9491K0378J387k5693p241k9408m3214L9176J0183J5547j3827r90J5276m487
2720B6578r242J2883m2355R3744m6842J0888J7382j6661J2614l1339p2589j1167
2708e6106K4494p9982P6333M3533L991L1630k1749P3902l1423o3820N9486j5954
2696D4335p02k6989k7345L7480j9266L1269N676k1207m3629k0087L5328J7896
2684A2759k4400K7871R6714n5322m0038K8527l242k5255p298K425J1217l6332
2672a2374k197j7274J60L816J2161N3694N9927l0870n8075m3060K9011M8212P489
$$ plain form
2757 166682 141573 142531 85675 100055 120681 166328 91106 61746 38366 1162 70962 41153
2745 41153 604 15953 79057 77199 111105 43514 80840 101944 51439 80387 60969 49491
2733 49491 69869 71256 45563 38322 8914 -34300 4876 15059 30606 16779 15789 31065 26578
2720 26578 17336 30219 -12136 81608 34766 45654 63036 46375 58989 27650 -44939 -56106
2708 -56106 -31612 -111594 -35261 8272 12263 43893 22144 96046 64623 803 60289 44335
2696 44335 43633 16644 -10701 26779 7513 38782 44458 23251 -20378 -40465 -5137 12759
2684 12759 -11641 16230 112944 57622 17584 46111 42869 17614 10316 12741 23958 -12374
2672 -12374 -14571 -31845 -31685 -27869 -15708 37986 97913 67043 8968 -34092 -5081 43131 50620
2659E0620L1254M6662k9716l4682m0761j311K6128j7097j2447k406j3135m641
2647a532K3028J7111j9236o6135J3705J3897P6099P6864j04077K9674J2064J4190
2635H5652j0104J4154r251p3538k1240j7106N4062K6336j3904l1089K7112k949
2623B8135L7650K5651o1236j9324l2268m233P9298K5898J5848j5732L1673m8251
2611F3109j2380J2496K6142m0790j17182j297J4112Q2173j6499J0874M1187p6698
2599a4753M7016k2297K3321K5209m9326L7293L3855M462j8232K1336q396q3195
2587c707k4453J8713j5762L4813K0387J5685m8897L069J0512n3881K8510l2811
2575d7822l4491J4087J6454K9034K508m0767Q192L5658K1352j5492L0189m1444
$$ plain form
2659 50620 81874 128536 98820 64138 23377 22066 48194 31097 18650 16244 3109 -1532
2647 -1532 21496 38607 19371 -46764 -33059 -19162 56937 133801 29724 59398 71462 85652
2635 85652 75548 89702 80451 6913 -14327 -31433 22629 48965 35061 3972 31084 28135
2623 28135 65785 91436 30200 10876 -21392 -25625 53673 79571 95419 79687 111360 63109
2611 63109 50729 63225 89367 48577 -68605 -69902 -55790 26383 9884 20758 61945 -14753
2599 -14753 32263 9966 33287 58496 9170 46463 80318 84780 66548 87884 79488 -3707
2587 -3707 -28160 -9447 -25209 9604 29991 45676 -3221 -152 10360 -43521 -15011 -47822
2575 -47822 -82313 -68226 -51772 -22738 -20230 -60997 -52805 -17147 4205 -11287 18902 -22542
2563b2542o088O005M926J1516l637j4679P060M789l232N3267K4159n4791L5048
2550D1801l6030j5005M9321j4217o5345p817O3064j3192o9732M470Q2746l0084
2538a0020k7715K7175M4732p4411L0239O2419m955j6491J0209p5010R3265K208
2526F1645m9192j3955k4936l1881K9142o356K952L371r415P9053l2923n8554L3043
2513a8006k7351M3510r115l2182J3800k3512O1440M5139l6032n4806N4588K1938
2501C9411p0978J9416N1035Q339r5317p0672n0604O8726O2633m9892M194O4912
2489a8797M5837n5627O811k3354K8045K1317l3384m2743K2176L9457k538L0993
2477A8193j5930l2649m1775K2752M5168K0895J1485m0965K4283m4720l4486K2001
$$ plain form
2563 -22542 -28630 -22625 -17699 -6183 -9820 -24499 -17439 -12650 -15882 37385 61544 6753 41801
2550 41801 5771 -9234 40087 25870 -39475 -47292 15772 2580 -67152 -62682 20064 -10020
2538 -10020 -37735 -10560 34172 -40239 -10000 52419 47464 30973 41182 -33828 59437 61645
2526 61645 12453 -1502 -26438 -58319 -29177 -35533 -32581 -29210 -38625 40428 7505 -51049 -18006
2513 -18006 -45357 -1847 -10962 -43144 -29344 -52856 8584 53723 17691 -37115 17473 39411
2501 39411 -31567 -12151 38884 47223 -48094 -118766 -169370 -100644 -38011 -87903 -83709 -18797
2489 -18797 27040 -28587 -21776 -45130 -17085 4232 -29152 -71895 -49719 -10262 -12800 18193
2477 18193 2263 -30386 -72161 -49409 -4241 16654 28139 -12826 11457 -33263 -67749 -45748
2465d5748M3815M1068l4398k9965j3888l9905P6270o1885J0412O4314q275q667
2453f852L82o1932J4541j028l237J9751m0432L4774L2549q69p1716l7242K8031
2440i3280j0571N8537l0406K5545N2484l4478j721k380m3428l1538K8975n922
2428h8183q034M1029L2988rk4471O229K4738n395j6723L058q620q168L8527J2032
2414a002O810l097l1944K5875m2824J2121Q948m0281K0603Q0294R021J5183k8938
2401C0769q6724M1083L315J7519L368l2893j7701J7260j0112Q9834k9157k9343
2389b782m2104K0424L3505K3892l5587m3529K0399K8411m0333j048M9423L5017
2377D5688p3757j1290n2923l1200R4848J3720k2376m3343k617L7567j390p459
$$ plain form
2465 -45748 -1933 39135 4737 -25228 -39116 -79021 -2751 -64636 -54224 10090 1815 -6852
2453 -6852 -6470 -68402 -53861 -54889 -58126 -38375 -78807 -44033 -11484 -12353 -84069 -121311 -93280
2440 -93280 -103851 -45314 -75720 -50175 2309 -32169 -33890 -36270 -79698 -111236 -82261 -88183
2428 -88183 -96217 -55188 -22200 -22209 -46680 -40451 -15713 -21108 -37831 -34773 -43393 -51561 -13034 -1002
2414 -1002 5808 2711 -29233 -3358 -46182 -34061 -25113 -65394 -44791 35503 44524 59707 30769
2401 30769 -55955 -14872 -11557 5962 9330 -23563 -41264 -24004 -34116 55718 26561 -2782
2389 -2782 -44886 -24462 9043 32935 -2652 -46181 -25782 2629 -37704 -38752 10671 45688
2377 45688 -28069 -39359 -92282 -123482 -28634 -14914 -37290 -80633 -83250 -45683 -47073 -54532
2365e4532n352J6614N0618N5911J3249m4958K3504r0323J7575O6142J0866n7131
2353B183j5153P3346M6452m7379q7843O0466J5914p2171l4898Q6757M0778m8027
2341B0425J5949L6235q1707n1176P003K4450N9870J8170m4067n0388M9630L187
2329G581j9478O591m7991l9377K9622O3236K3844l4459J7097m8832p067K2793
2317b6440J5491k9709K4202j4232M8366N593m1622O542k8806K2396k4251J4579
2305b7891L2182j7764L0437k6899p8337K5296q152N0079l6248L712O5429k860
2293H984k0621p859oM9268J4427o9830M2390m8506M8575n937p824M4545m6805
2280H01k5468o4254J5122J5567K5126k5517j626r29L4195L970o1193L5520R411
$$ plain form
2365 -54532 -59884 -43270 7348 63259 76508 31550 55054 -35269 -17694 48448 59314 2183
2353 2183 -12970 60376 106828 59449 -28394 32072 47986 -24185 -59083 27674 68452 20425
2341 20425 36374 72609 -9098 -60274 -53271 -28821 31049 49219 5152 -45236 4394 7581
2329 7581 -11897 -5306 -53297 -92674 -63052 184 24028 -10431 6666 -42166 -49233 -26440
2317 -26440 -10949 -40658 -16456 -30688 17678 23271 -18351 -11809 -40615 -18219 -42470 -27891
2305 -27891 4291 -13473 16964 -9935 -88272 -62976 -71128 -21049 -57297 -53585 11844 8984
2293 8984 -11637 -19496 -19502 29766 44193 -25637 16753 -31753 16822 10885 3061 47606 801
2280 801 -24667 -88921 -73799 -58232 -33106 -58623 -60249 -61178 -26983 -23013 -84206 -48686 -39275
2267c9275j3792K3481r322m688K0788j6037p571K3260L8903j9175k8973j4204
2255d6605M325j6308J4407m7691K859Q699j182R0484n4844o7244K7302M7491k1166
2242e9473q508N4124l7502j9468M4769j5700M1156m000j1186N5849k957p7157
2230d0053J517K0830l555k5825l0121l4618J18664O940m1010k472K8607M873l5837
2217c2060O6494k0873k8747n6044K2292L5248m7716o5415Q0505m06j824p571L9585
2204a6532j6472m6113P5000K4959n036m0427L1608j3336o634j4661J1326j8443
2192c4761K7192l698k4422l3219J01637j2179N7K3983p935K0539m7469M6411j9625
2179C6511L3948o5963j3266K1140J2488n0051k8879M5035k371l1390j6571k037
$$ plain form
2267 -39275 -53067 -29586 -38908 -43596 -22808 -38845 -46416 -23156 15747 -3428 -32401 -46605
2255 -46605 -42280 -58588 -44181 -91872 -89013 -80314 -81496 8988 -45856 -113100 -85798 -38307 -59473
2242 -59473 -67981 -13857 -51359 -70827 -26058 -41758 -602 -4602 -15788 40061 37104 -40053
2230 -40053 -38536 -17706 -21261 -47086 -77207 -111825 6839 13779 -27231 -29703 -1096 3777 -32060
2217 -32060 34434 13561 -15186 -71230 -48938 -13690 -61406 -126821 -46316 -46722 -48546 -56117 -16532
2204 -16532 -33004 -79117 -4117 20842 15806 -24621 6987 -6349 -12983 -27644 -16318 -34761
2192 -34761 -7569 -11267 -35689 -68908 32729 20550 20607 44590 36655 57194 9725 56136 36511
2179 36511 70459 4496 -8770 12370 24858 -25193 -54072 -9037 -11408 -42798 -59369 -61406
2167f1406R758L9240o9302K913L5003L4683K1575K2770j7214n8673J2645n054
2155c3062O4427o335l5035o5080k1339O0204J7904P0146M5356o7130l0901l0440
2143c1285r26p14J5551M3625N011k4137m594l2280L4122N644P811P8850p3942
2130B2736o8500L6433k2963k2827m0053N1929K0328r236m989N799J8817J6000
2118C474L2631l7887j8391j2238q240N6863J2697k7874K1243k2416l6356J1899
2106b4595k858N3519l1478L7496k3835o5860O8160l3733L1836n658J4268J9265
2094C6527j2293l8402m640O2871j5111l9484P054k4473m6561J1310J0726k4280
2082g6756N0381k6365O3608o3552k0985K723J9679j2177J5178N1395l1072j7879
$$ plain form
2167 -61406 -51648 -12408 -81710 -78797 -43794 -9111 12464 35234 18020 -40653 -28008 -33062
2155 -33062 31365 25030 -10005 -75085 -96424 -36220 -18316 51830 97186 30056 -845 -31285
2143 -31285 -32211 -32925 -17374 26251 31262 7125 2531 -29749 4373 10017 17828 96678 22736
2130 22736 -45764 -9331 -32294 -55121 -95174 -43245 -22917 -32153 -37142 -31343 -12526 3474
2118 3474 36105 -1782 -20173 -32411 -40651 16212 28909 1035 22278 -138 -36494 -24595
2106 -24595 -27453 26066 -5412 32084 8249 -57611 10549 -23184 8652 2994 17262 36527
2094 36527 24234 -14168 -18808 44063 28952 -10532 -3478 -27951 -74512 -63202 -52476 -76756
2082 -76756 -26375 -52740 10868 -52684 -73669 -70946 -51267 -63444 -48266 3129 -27943 -45822
2070d5822M1501l9068L6536P6854j766k7332k7492Q218J2250J8947o8687j9893
2058c5754O055K3938J708j1999j686M2590K4028l8212j8048J8190p5739R3692
2046B8763j477l3189J7371o861J2268l5391J2230J8423k3860O1554q16k8059n3907
2033c2951N046J13242m6766p5369J0790O3797m0696K7682O456r103L854K9522
2021E5504L656L5552k7041m5515K5684m2294O226q586m8285J0589K7794O5080
2009E8364J0207m3102J0141L0086k0553o405m3669Q812N5425j3845M334J1589
1997F1384j5490l9874j0060L8524Q0594r75m1438j49o8108j4515M4305k5320K0001
1984B8879n6200P3273M6601M9062l7766j5666J7844l436M7154k3037n7765N867
$$ plain form
2070 -45822 -4321 -43389 -6853 70001 68235 40903 13411 21629 33879 52826 -15861 -35754
2058 -35754 -29699 -5761 -4053 -16052 -17738 24852 48880 10668 -7380 10810 -64929 28763
2046 28763 27286 -5903 11468 4607 16875 -18516 -6286 12137 -11723 49831 49015 20956 -32951
2033 -32951 -27905 85337 38571 -36798 -26008 37789 -2907 24775 31231 22128 25982 55504
2021 55504 59160 94712 67671 22156 47840 5546 11772 3186 -45099 -34510 -6716 58364
2009 58364 68571 25469 35610 65696 45143 38738 -4931 3881 59306 45461 49795 61384
1997 61384 45894 6020 -4040 34484 115078 114103 72665 72516 4408 -10107 34198 8878 28879
1984 28879 -27321 45952 92553 141615 103849 88183 106027 102591 149745 126708 68943 74810
1972G4810M4477j4884n4385L4988L3988J0979l9861m028N205J5311J8294J3973
1960A38867P4167n1197p263M7110m9059p7341P0760n4L1149j6486L2030M9408
1948B42091K85m7309L2877J3660m3907m90N2400M7539j3842p0484P492L9658l1404
1935B28566P251J2807O1091J9968k3586l2933M2961n1292M747P3123Q1331m3844
1923C80190l1891r758Q5842N8039j4375l6427M76L7930l6318Q8391M490Q26j9157
1910E08258P2357k159m237q238k2200N2339N4653m6697P0673M3239n740R148L4174
1897G55570N8222L0332L1997K1486J14366j0791Q5557N4287K2448L5279R6017
1886A294770N5307J58042k2649J12464J53049R1450J02905J42200J85378K04370
$$ plain form
1972 74810 119287 104403 50018 85006 118994 129973 90112 86084 91289 106600 124894 138867
1960 138867 213034 161837 154574 201684 152625 75284 146044 145990 177139 160653 192683 242091
1948 242091 242376 195067 227944 241604 197697 197207 249607 297146 283304 212820 220312 259970 228566
1935 228566 235817 248624 309715 329683 306097 273164 316125 264833 269580 342703 424034 380190
1923 380190 348299 338541 424383 482422 468047 431620 432096 470026 433708 522099 526589 527415 508258
1910 508258 580615 578456 574219 565981 543781 596120 650773 604076 674749 717988 712248 721396 755570
1897 755570 813792 844124 876121 897607 1011973 1001182 1086739 1141026 1163474 1198753 1294770
1886 1294770 1350077 1508119 1485470 1597934 1750983 1842433 1945338 2087538 2272916 2477286
1876B477286K45080L39270L93152N94971P38539R69171J036553R95129K03149
1867G992300q81988r39478p89307p78984p23592n22464m34661l63864l35428j80481
1857B042053j85948j48944j96601o598j23737j33554j36824m7681m0732j19759
1847I01675j08101k3331j4415o3760j2014J335j9378p4013n5322m6661q991j0262
1835D66762j00509N6197K7204m1803q8498k5151k5800J5384J9069o3864M1970
1824B80961K8863L8237l3874j03013R018M464L4466k8792m7026k4835K5254q49
1812A82874j6099K3436p1317j9607L7620J9530n8543n666K7847k5871n5776P101
1800D5529O0342N4954k706l8348q333K3424K3241o4062k3929Q5141n2298p8500
$$ plain form
1876 2477286 2722366 3061636 3454788 4049759 4788298 5757469 6794022 7789151 7992300
1867 7992300 7110312 6170834 5381527 4602543 3878951 3356487 2921826 2557962 2222534 2042053
1857 2042053 1856105 1707161 1510560 1503962 1380225 1246671 1109847 1062166 1021434 901675
1847 901675 793574 770243 755828 692068 680054 681389 662011 587998 532676 486015 477024 466762
1835 466762 366253 422450 449654 407851 319353 294202 268402 283786 302855 238991 280961
1824 280961 309824 348061 314187 211174 220192 224656 259122 230330 183304 158469 183723 182874
1812 182874 166775 190211 118894 99287 136907 156437 97894 92228 120075 94204 38428 45529
1800 45529 105871 160825 158119 119771 111438 134862 158103 94041 70112 155253 102955 24455
1788B4455O1027j7463M4333K5806m5896p257m7295R638M5495k2727p0394k0074
1776b0352N3422K0809J0172l3428O292k4195l6901N8819O2227l4918n5588R603
1764A5962l5762L4440p767N6913k9624K1641n7270L591j21739J8445M5938N3261
1752a971J3459j8454M7101l0730M9043K8130m2995q9180J1719J675J2152o0057
1740h0108M7443Q2496j9314k9737k4863l8624K3091J6860k3012O5289o998j849
1728A0674M0878p0021j6200j3480M0397j6397m5394K5690N1901J4826k7150O962
1716B686K2240J1237k6433k3124n009o6794L9446M7910m6787N0640N1203K7755
1704H4970l7955M56J1167j0930j13591J0456L4306J4173O423K5818J6911J298
$$ plain form
1788 24455 85482 68019 112352 138158 92262 85005 37710 47348 92843 70116 -278 -20352
1776 -20352 33070 53879 64051 30623 36915 12720 -24181 34638 96865 61947 6359 15962
1764 15962 -19800 14640 6873 63786 34162 55803 -1467 2124 -119615 -101170 -55232 -1971
1752 -1971 11488 -6966 40135 9405 58448 86578 43583 -45597 -33878 -32203 -20051 -80108
1740 -80108 -32665 49831 30517 780 -24083 -62707 -39616 -22756 -45768 19521 12523 10674
1728 10674 51552 -18469 -34669 -48149 -7752 -24149 -69543 -43853 8048 22874 -4276 2686
1716 2686 24926 36163 9730 -13394 -18403 -85197 -45751 2159 -44628 6012 57215 84970
1704 84970 47015 47471 58638 47708 -65883 -55427 -21121 -6948 -525 25293 42204 43502
1692D3502n2651J2543N4530l5295m9943N036p7424Q7097N9444n1898k4540k9563
1680e9162J3496m466N8532k1079N2215l6055m4411N2034l0830n0798M2745j1707
1668c9486J008m2295r749L4021K8616j9952J5606L1079l250J9200M2797j127j4597
1655D1871J2823J3892q731j4052j5491k4325K4346l8836j6955M0333m0049k6424
1643e1598k9592N6318Q44j311J4347l3094J9774j9364Q0157J2401J7255k2971
1631D3166o8083O793L5306l9932J0587L4061j11346K5184n987M7428P3640m259
1619D6558j8930J5497K1663j3301n9783J5209m3605J4708k8619N3748o115q4660
1607h7630K4912K5591q5961n564M6946N8583k094L0465q998K6779M3726j6179
$$ plain form
1692 43502 -9149 3394 57924 22629 -27314 -22278 -99702 -12605 46839 -5059 -29599 -59162
1680 -59162 -45666 -50132 8400 -12679 39536 3481 -40930 11104 -19726 -70524 -27779 -39486
1668 -39486 -38478 -80773 -90522 -56501 -27885 -47837 -32231 -1152 -4402 14798 57595 56468 41871
1655 41871 54694 68586 59855 45803 30312 5987 30333 -8503 -25458 14875 -25174 -51598
1643 -51598 -81190 -24872 -24028 -25339 -10992 -44086 -24312 -43676 36481 48882 66137 43166
1631 43166 -24917 -18124 17182 -22750 -12163 21898 -89448 -64264 -70251 -22823 50817 46558
1619 46558 27628 43125 64788 51487 -8296 6913 -36692 -21984 -50603 3145 -2970 -87630
1607 -87630 -62718 -37127 -123088 -128652 -81706 -23123 -25217 5248 -3750 23029 66755 50576
1595E0576J9696q023l1270J9575L7445j01269o6068R736L5231J4312m3087M6992
1583a6154O7321o5805J435J6504L2894l3722O441j9413J955k0068l2823L8890
1571b2545N7585p5566p242M5896J0602m0805N806O88l1029M7227N6213K1044j4758
$$ plain form
1595 50576 70272 62249 30979 50554 87999 -13270 -79338 -69602 -34371 -20059 -63146 -16154
1583 -16154 51167 -14638 -13203 3301 36195 2473 8914 -10499 -8544 -28612 -61435 -22545
1571 -22545 35040 -40526 -47768 -1872 8730 -32075 -26269 -25581 -56610 -9383 46830 67874 53116
$$ [...]
##END NTUPLES=NMR SPECTRUM
##END=
