##TITLE=1H_CA-9264-1
 DMSO
 8 sc, 
 2.5.2024
##JCAMPDX= 6.0         $$ Bruker NMR JCAMP-DX V2.0
##DATA TYPE= NMR SPECTRUM
##DATA CLASS= NTUPLES
##ORIGIN= UXNMR, Bruker Analytische Messtechnik GmbH
##OWNER= root
$$ XWIN-NMR		Version 3.5
$$ Thu May  2 14:01:08 2024 Russian Standard Time (UT+4h)  she@DPX200
##.OBSERVE FREQUENCY= 200.1309
##.OBSERVE NUCLEUS= ^1H
##.ACQUISITION MODE= SIMULTANEOUS
##.ACQUISITION SCHEME= undefined
##.AVERAGES= 8
##.DIGITISER RES= 18
##SPECTROMETER/DATA SYSTEM= spect
##.PULSE SEQUENCE= zg30
##.SOLVENT NAME= CDCl3
##.SHIFT REFERENCE= (INTERNAL, CDCl3, 0, 16.4234)
##AUDIT TRAIL= $$ (NUMBER, WHEN, WHO, WHERE, WHAT)
$$ ##TITLE= Audit trail, XWIN-NMR		Version 3.5
$$ ##JCAMPDX= 5.01
$$ ##ORIGIN= Bruker BioSpin GmbH
$$ ##OWNER= she
$$ F:/spectra/data/she/nmr/H-F/1/pdata/1/auditp.txt
$$ ##AUDIT TRAIL=  $$ (NUMBER, WHEN, WHO, WHERE, WHAT)
(   1,<2024-05-02 14:00:15.81 +0400>,<she>,<DPX200>,
      <created by zg, POWCHK disabled, PULCHK disabled
       configuration hash MD5:
       00 E9 B6 7A A2 85 ED C7 34 08 36 98 17 FE 4E 26
       data hash MD5: 16K
       17 96 6D DA 89 2B 00 14 D2 BE AB 58 4A 13 10 B6>)
(   2,<2024-05-02 14:00:17.85 +0400>,<she>,<DPX200>,
      <Start of raw data processing
       efp BC_mod = 2 LB = 0.24 FT_mod = 6 PKNL = 1 PHC0 = -25383.12 PHC1 = 12.58731 SI = 16K 
       data hash MD5: 16K
       B2 86 82 B7 50 BF 86 3B 14 4B 22 FC FD 90 C8 35>)
(   3,<2024-05-02 14:00:21.81 +0400>,<she>,<DPX200>,
      <abs ABSG = 5 
       data hash MD5: 16K
       58 F4 80 98 D5 D5 79 EE 55 DE F6 8B 8B 18 5C 5E>)
(   4,<2024-05-02 14:00:40.32 +0400>,<she>,<DPX200>,
      <pk PHC0 = 1.202146 PHC1 = -1.4 
       data hash MD5: 16K
       1B 7F 69 16 76 C5 C0 1A 81 7A 85 65 A6 6D AF 1C>)
(   5,<2024-05-02 14:00:43.50 +0400>,<she>,<DPX200>,
      <abs ABSG = 5 
       data hash MD5: 16K
       7A 59 73 5B 8A A7 29 DE 8B 43 B9 24 A5 7A 4A 0A>)
$$ ##END=
$$ 
$$ hash MD5
$$ ED 6E 2A 29 09 FD 4C FD 50 9A E9 DC AD FF 8B D9
##$RELAX= 
##$RELAX= 
##$RELAX= 
##$RELAX= 
##$RELAX= 
##$RELAX= 
$$ Bruker specific parameters
$$ --------------------------
##$DU= <F:/spectra>
##$EXPNO= 1
##$NAME= <H-F>
##$PROCNO= 1
##$TYPE= <nmr>
##$USER= <she>
##$AMP= (0..31)
100 100 100 100 100 100 100 100 100 100 100 100 100 100 100 100 100 100 
100 100 100 100 100 100 100 100 100 100 100 100 100 100 
##$AQSEQ= 0
##$AQ_mod= 1
##$AUNM= <au_zg>
##$AUTOPOS= <>
##$BF1= 200.13
##$BF2= 200.13
##$BF3= 200.13
##$BF4= 200.13
##$BF5= 200.13
##$BF6= 200.13
##$BF7= 200.13
##$BF8= 200.13
##$BYTORDA= 1
##$CFDGTYP= 0
##$CFRGTYP= 5
##$CHEMSTR= <none>
##$CNST= (0..31)
1 1 145 1 1 1 1 1 1 1 1 1 1 1 1 1 1 1 1 1 1 1 1 1 1 1 1 1 1 1 1 1 
##$CPDPRG= <>
##$CPDPRG1= <>
##$CPDPRG2= <>
##$CPDPRG3= <>
##$CPDPRG4= <mlev>
##$CPDPRG5= <mlev>
##$CPDPRG6= <mlev>
##$CPDPRG7= <mlev>
##$CPDPRG8= <mlev>
##$CPDPRGB= <>
##$CPDPRGT= <>
##$D= (0..31)
0 1.2 0 0 0 0 0 0 0 0.06 0 0.03 0 0 0 0 0.0002 0 0 0 0 0 0 0 0 0 0 0 0 
0 0 0 
##$DATE= 1714644015
##$DBL= (0..7)
$$ [...]
##$SUBNAM3= <"">
##$SUBNAM4= <"">
##$SUBNAM5= <"">
##$SUBNAM6= <"">
##$SUBNAM7= <"">
##$SUBNAM8= <"">
##$SUBNAM9= <"">
##$SW= 18.0517689322627
##$SWIBOX= (0..15)
0 0 2 0 0 0 0 0 0 0 0 0 0 0 0 0 
##$SW_h= 3612.71676300578
##$TD= 16384
##$TD0= 1
##$TE= 0
##$TE2= 300
##$TE3= 300
##$TEG= 300
##$TL= (0..7)
0 120 120 120 120 120 120 120 
##$TP= (0..7)
150 150 150 150 150 150 150 150 
##$TP07= 0
##$TPNAME0= <>
##$TPNAME1= <>
##$TPNAME2= <>
##$TPNAME3= <>
##$TPNAME4= <>
##$TPNAME5= <>
##$TPNAME6= <>
##$TPNAME7= <>
##$TPOAL= (0..7)
0.5 0.5 0.5 0.5 0.5 0.5 0.5 0.5 
##$TPOFFS= (0..7)
0 0 0 0 0 0 0 0 
##$TUNHIN= 0
##$TUNHOUT= 0
##$TUNXOUT= 0
##$USERA1= <user>
##$USERA2= <user>
##$USERA3= <user>
##$USERA4= <user>
##$USERA5= <user>
##$V9= 5
##$VALIST= <valist>
##$VCLIST= <CCCCCCCCCCCCCCC>
##$VD= 0
##$VDLIST= <DDDDDDDDDDDDDDD>
##$VPLIST= <PPPPPPPPPPPPPPP>
##$VTLIST= <TTTTTTTTTTTTTTT>
##$WBST= 1024
##$WBSW= 4
##$XGAIN= (0..3)
0 0 0 0 
##$XL= 0
##$YL= 0
##$YMAX_a= 305943
##$YMIN_a= -281797
##$ZGOPTNS= <>
##$ZL1= 120
##$ZL2= 120
##$ZL3= 120
##$ZL4= 120
##$ABSF1= 16.42344
##$ABSF2= -1.628462
##$ABSG= 5
##$ABSL= 3
##$ALPHA= 0
##$AQORDER= 0
##$ASSFAC= 0
##$ASSFACI= 0
##$ASSFACX= 0
##$ASSWID= 0
##$AUNMP= <proc_1d>
##$AZFE= 0.1
##$AZFW= 0.1
##$BCFW= 0
##$BC_mod= 2
##$BYTORDP= 0
##$COROFFS= 0
##$CY= -3
##$DATMOD= 1
##$DC= 0
##$DFILT= <>
##$DTYPP= 0
##$F1P= 0
##$F2P= 0
##$FCOR= 1
##$FTSIZE= 16384
##$FT_mod= 6
##$GAMMA= 0
##$GB= 0
##$INTBC= 1
##$INTSCL= 3.70164e-10
##$ISEN= 128
##$LB= 0.24
##$LEV0= 0
##$LPBIN= 0
##$MAXI= 10000
##$MC2= 0
##$MEAN= 0
##$ME_mod= 0
##$MI= 1.114404
##$NCOEF= 0
##$NC_proc= -5
##$NLEV= 6
##$NOISF1= 3.799351
##$NOISF2= 2.8
##$NSP= 0
##$NTH_PI= 0
##$NZP= 0
##$OFFSET= 16.42344
##$PC= 1
##$PHC0= -25381.92
##$PHC1= 11.18731
##$PH_mod= 1
##$PKNL= yes
##$PPARMOD= 0
##$PSCAL= 0
##$PSIGN= 0
##$REVERSE= no
##$SF= 200.129419543727
##$SI= 16384
##$SIGF1= 3
##$SIGF2= 2
##$SINO= 5.538805
##$SIOLD= 16384
##$SREGLST= <1H.CDCl3>
##$SSB= 0
##$STSI= 16384
##$STSR= 0
##$SW_p= 3612.71676300577
##$SYMM= 0
##$S_DEV= 0
##$TDeff= 16384
##$TDoff= 0
##$TI= <>
##$TILT= no
##$TM1= 0
##$TM2= 0
##$TOPLEV= 0
##$USERP1= <user>
##$USERP2= <user>
##$USERP3= <user>
##$USERP4= <user>
##$USERP5= <user>
##$WDW= 1
##$XDIM= 16384
##$YMAX_p= 387182282
##$YMIN_p= -66149
$$ End of Bruker specific parameters
$$ ---------------------------------
##NTUPLES= NMR SPECTRUM
##VAR_NAME=  FREQUENCY,     SPECTRUM/REAL,   SPECTRUM/IMAG
##SYMBOL=    X,             R,               I
##VAR_TYPE=  INDEPENDENT,   DEPENDENT,       DEPENDENT
##VAR_FORM=  AFFN,          ASDF,            ASDF
##VAR_DIM=   16384,         16384,           16384
##UNITS=     HZ,            ARBITRARY UNITS, ARBITRARY UNITS
##FACTOR=    0.220516191357247, 1,           1
##FIRST=     3286.81370087751, 0,            0
##LAST=      -325.903062128256, 0,           0
##MIN=       -325.903062128256, -66149,      0
##MAX=       3286.81370087751, 387182282,    0
$$ Real data points
##PAGE= N=1
##DATA TABLE= (X++(R..R)), XYDATA
$$ [...]
8382c511M28K731j327k457K412l884K211j708j325J071J822K428K50m041k848
8367g748K366p43Q75K233J203k069j083K611k820j935k301p86J591o35L184K112
8351c945R9J191p40N95j20m177k328J812M432J691P23j786l86k900j158P71L871
8334b355p03n344J093R83r3J026j827j579K612j46L808J33M93k330J250q15j005
8317d799N4m149J707K710J834j270j236q7j622k278R104q77M92k843J116k297
8301d441l517L485N1n25k845J657P03l507J891j974N01R78J49J972M840k142o218
8284h942k139j503N327O104Q02o184L000j172j041L5J95J719L35n304K044K932
8268c792l679m135k289P134k39L185n682j418O338J51k224O390O386m345o453
$$ y = [-3511, -3083, -352, -1679, -4136, -1724, -5608, -3397, -5105, -6430, -5359, -3537, -1109, -859, -4900, -7748, -5382, -6125, -5250, -3017, -1814, -3883, -4966, -2355, -5175, -7110, -9411, -10197, -8606, -9241, -6057, -3945, -3846, -2655, -3395, -2800, -2920, -7097, -9425, -7613, -3181, -1490, -767, -2553, -2939, -5839, -6997, -6226, -2355, -3058, -8402, -7309, -6326, -6419, -5393, -7220, -8799, -6187, -6333, -2525, -2392, -1899, -4229, -2979, -3794, -4799, -4745, -8894, -7187, -4477, -2643, -3913, -5149, -5236, -6858, -9136, -32, -909, -417, -3260, -2144, -4441, -7958, -4473, -4422, -4947, -7792, -6135, -5432, -8939, -7048, -9022, -8521, -7543, -7394, -5422, -582, -2724, -8942, -11081, -12584, -7257, -1153, -351, -6535, -3535, -4707, -5748, -5713, -5518, -3799, -3464, -8768, -6724, -3792, -7471, -11606, -13895, -6761, -7000, -3815, -9497, -10915, -4577, -4426, -6650, -260, 6126, 1781, -4672]
8253d672M341J060J693k09K5n846k573L961j532K845m196m359l597P162K740J642
8237a515m51L8k224L074o934j0439L371N312M747k010m182k912J0602o48k778
8222f949Q23j830j0240J564L707N92l844m172J2920M642K887j45m108J569j628
8207d212l49K126N836L757N911K013n283j24J0707q598l450J0622k0346k8814
8193c0204Q200J5193j3262P416K0859K4229k3495k668r475p888J9703n00j2228
8180d120K707n641L670R94n556O341q432o09k112O256R230l033n213o80j554J048
8164f704l15N735j810O747Q74K119q130J736m433k088M476n122P07J785q22k922
8148h167L878k222m722K867K445J130l772k558J086L890J831M536n100j695M100
$$ y = [-4672, -331, 729, 2422, 2213, 2238, -3608, -6181, -2220, -3752, -907, -5103, -9462, -13059, -5897, -3157, -1515, -1966, -1928, -4152, -1078, -8012, -18451, -15080, -9768, -5021, -7031, -11213, -14125, -3523, -4171, -6949, -6126, -7956, -18196, -16632, -12925, -12333, -16177, -20349, -7429, -2787, 100, -45, -4153, -2584, -4212, -4561, -2435, 3401, 7158, 13069, 15082, 9799, 9675, 20382, 11784, 8334, 18956, -1390, -30204, -22004, -6811, -20073, -12657, 8202, 32431, 8936, 6268, -3207, -11095, 8608, 8108, -4120, -1413, -7054, -3384, -2390, -7946, -1605, -10037, -10646, -12758, -6502, 2728, -305, -5518, -6198, -7752, -6704, -7019, -1284, -3094, 3653, 4527, 6646, -1484, 252, -4181, -6269, -1793, -6915, -6208, -4423, -5245, -8167, -4289, -6511, -11233, -8366, -5921, -4791, -8563, -11121, -10035, -6145, -4314, 222, -4878, -6573, -2473]
8133b473Q857J399j917m842o669K956m94L516l56k598K179o822p457K44O988J854
8117e635j054O421k821j996k792K713j803N348j566l000j55j60L632J184m549
8102f233K993m755l058K956L804k770K255M306J093m806k161j59n166M852o69
8087g518J73O245k695k349O61K265L500n097k48R23K546o91L587j246o970j673
8071h587L443Q69J024L664k246l378m176k741R92L421L576J710k918k421K091
8056e677k221L566k301j205j659J659K531r16K918j833k99J679r93K251R97K9
8040a474K401j46k696L74j609l62J074j470m80l23L95L463L9l570l845m22L842
8023d809j095L98m02J254Q9k945K384J646K249m47j737q0j089r10m503J562K666
$$ y = [-2473, 6384, 7783, 5866, 1024, -5645, -2689, -3183, 333, -23, -2621, -442, -7264, -14721, -14477, -7489, -5635, -6689, -268, -3089, -5085, -7877, -5164, -6967, -1619, -3185, -6185, -6340, -6500, -2868, -1684, -6233, -3240, -7995, -11053, -8097, -4293, -7063, -4808, -502, 591, -4215, -6376, -6535, -11701, -6849, -7518, -7345, -1100, -3795, -6144, -5483, -3218, 282, -4815, -5063, -4140, -1594, -2285, 1302, 56, -6914, -8587, -5144, -4275, -3251, 413, -1833, -5211, -9387, -12128, -11136, -7715, -4139, -2429, -5347, -7768, -5677, -7898, -4332, -6633, -7838, -9497, -7838, -5307, -6223, -3305, -5138, -5437, -3758, -4751, -2500, -1503, -1474, 927, 781, -1915, -1541, -3150, -3512, -2438, -3908, -4388, -4711, -4316, -853, -814, -4384, -8229, -8651, -4809, -5904, -5506, -5908, -4654, -4565, -7510, -5126, -3480, -1231, -1678, -3415, -3495, -4584, -5494, -9997, -8435, -5769]
8006e769P42J34L876j057J026m754R27R37J461l118j725K064M016Q58k330J725
7990i87k514l910J534K924K26N93l517J363j061J259j094J166J60k736j353L732
7974d215L397l407k537M773j879M09n24q96k392M215J975n523k5L555K832M05
7958A63K14m278n917k163L855k06J01N265J246l658J552k07k082J633j875k29
7942f586J631O2q10O11L01j657m008N427j47J566R55k098J699k702R2J232J592
7925b840L451j778k129q45J595j441j013J031j465k487K046N70J632O82o555K656
7909f890L444p50k976L010j410O42n61K39J682J910k51l014O20K200Q2o07j762
7892d392j484J760K295j31J361k039o68j538k630K700L033l196P80J832k19k720
$$ y = [-5769, -5027, -4893, -1017, -2074, -1048, -5802, -4875, -3938, -2477, -5595, -7320, -5256, -1240, -382, -2712, -987, -3501, -7411, -5877, -2953, -2727, -2134, -5651, -4288, -5349, -4090, -5184, -4018, -3858, -6594, -7947, -4215, -818, -4225, -6762, -1989, -3868, -3459, -3983, -4879, -7271, -3056, -1081, -6604, -6629, -3074, -242, 163, 377, -3901, -9818, -11981, -8126, -8332, -8231, -2966, -1720, -5378, -3826, -4033, -6115, -4482, -6357, -6586, -4955, -4893, -5703, -5092, -4791, -6448, -10456, -5029, -5176, -3610, -2655, -4753, -3054, -5756, -5664, -4432, -2840, 611, -1167, -3296, -4141, -2546, -3987, -5000, -3969, -5434, -7921, -5875, -5305, -3673, -2991, -9546, -6890, -3446, -4196, -7172, -4162, -5572, -4930, -5491, -5252, -3570, -1660, -1911, -4925, -4305, -2105, -2023, -2630, -4392, -5876, -4116, -1821, -1952, -591, -2630, -3298, -4836, -7466, -4766, -1733, -4929, -4149, -2317, -2536, -5256]
7876e256k852M262J271J200J780l311j837J437q38k613L328L94Q29j337j75j087
7860d805Q75P72r09O94j790k902K236N27k434J115N503K134l631l266k001N173
7844b709K955p774j44J835Q15m78n83j650K271L49K113M411m90M97k132k423q0
7827c217R67J916j640l62L368l219k116K210O06L612P230k618J597J286O959J1760
7811B8339K9576o704m3141l0074K588o52M387L49q98L023K049Q78J189P41K583
7796e767m28k105J103J051j766k016j71L630J661j14Q53k371R04J80J805m973
7780h524N9l59J251j102M27M70r79K643n74j163R28n48O95L513O62k386j508P75
7762e720J366j598N97J029K188j581j657k033n53L348K086j699P5n54L122j788
$$ y = [-5256, -8108, -3846, -2575, -1375, 405, -2906, -4743, -3306, -4144, -6757, -3429, -3035, -2206, -3543, -3718, -4805, -3930, -3158, -4067, -3373, -5163, -8065, -5829, -5302, -7736, -6621, -1118, 1016, -2615, -5881, -7882, -2709, 246, -7528, -7672, -5837, -5022, -5500, -6083, -7733, -5462, -5113, -3000, 1411, 921, 1418, -714, -3137, -3217, -2250, -334, -1974, -2336, 1032, -2187, -4303, -2093, -1487, 2125, 9355, 6737, 8334, 9620, 16579, 28339, 57915, 51211, 8070, -22004, -19416, -20068, -15681, -15332, -16230, -13207, -11158, -10280, -9091, -8350, -5767, -6195, -8300, -7197, -6146, -7912, -9928, -10099, -6469, -4808, -4922, -4069, -6440, -5536, -5356, -3551, -8524, -8465, -8824, -7573, -8675, -8248, -7778, -8757, -6114, -6688, -7851, -6923, -7471, -6776, -3263, -2601, -4987, -6495, -5720, -4354, -5952, -5355, -4326, -2138, -3719, -5376, -7409, -7962, -4614, -2528, -4227, -4152, -4706, -1584, -3372]
7746c372J033k941j740j881L767k084K374r61l133K755K119N70k479m70N45k198
7730h096k257L824J254L13r27Q82p55Q9K125M98J190k030l091k272j699k138M213
7713h877K550k425P93K260q4K341l22m371R76o47L042J469k685k849K853J954
7697d022j791k790K361N287l699j773l699M194Q62j150J989m11J08l401m9j638
7681i622J686p67J370K432k120l638J936P10L015j029J401L44j618L044NP91m269
7664f329j592K271j648K249M79k059L720o31k855l052j5O019J058k488j37j968
7648f978r94J802p03m72K241j508k094J885P78J650k036K528K677k722j501k288
7632g735k717J175K49J977K754J756m125L051L046L34l755k621Q65Q24O25k9J03
$$ y = [-3372, -2339, -5280, -7020, -8901, -5134, -7218, -4844, -5805, -8938, -6183, -4064, -3494, -5973, -6443, -5898, -8096, -10353, -6529, -5275, -4962, -5889, -5007, -5762, -5673, -3548, -3050, -1860, -3890, -6981, -9253, -10952, -13090, -8877, -6327, -8752, -7959, -5699, -5783, -3442, -3764, -8135, -7159, -7806, -4764, -3295, -5980, -8829, -5976, -4022, -5813, -8603, -6242, -955, -4654, -6427, -10126, -5932, -5070, -6220, -4231, -4642, -4534, -7935, -7984, -9622, -7936, -8703, -7333, -4901, -7021, -10659, -8723, -8013, -4998, -6027, -4626, -4282, -5900, -2856, -2851, -2060, -6329, -7921, -5650, -7298, -5049, -4570, -6629, -2909, -3540, -6395, -9447, -9462, -3443, -2385, -4873, -5010, -6978, -7972, -6170, -6873, -7345, -5104, -6612, -8706, -6821, -6043, -4393, -6429, -3901, -1224, -3946, -5447, -7735, -10452, -9277, -9028, -7051, -4297, -2541, -6666, -3615, -569, -235, -3990, -6611, -5746, -4922, -4297, -4326, -4223]
7615d223j662k513K629k862n87L51j577J895K864L636l719k241O70K26K395K711
7599b007o43J070J156l499J554j908j313j278j483K598j53J351J567k318q54N38
7583e622n92J473K19J984j543J521J606l512R07K10l75K013j495j353k48j246
7567f053J546q35P41K69k336K326k210N97J673J096j360K874j066M80k216l22
7551d796J166j912n36L440j763k945J073j821r53L362j282j271L36L993l519J845
7535e583P4L38P40j744m30K989m524K649M22K485j020l4k467J044m357N84n025
7518a3859M014L232L122k888l025o540K5111M0271l0379j0122p215p15m833K192
7504a634k913O215r85k582P9R87m370o29K482M95p66K433l7L6k697J4M088m371
$$ y = [-4223, -5885, -8398, -5769, -8631, -9218, -8867, -10444, -8549, -5685, -2049, -5768, -8009, -7339, -7113, -4718, -2007, -2650, -1580, -424, -3923, -2369, -4277, -5590, -6868, -8351, -5753, -5906, -4555, -2988, -5306, -6160, -5622, -6214, -4741, -4522, -2538, -4081, -2560, -954, -4466, -3559, -3349, -3724, -1711, -3206, -4559, -4807, -6053, -4507, -5342, -4601, -4332, -6668, -4342, -6552, -5955, -4282, -3186, -4546, -1672, -2738, -2258, -4474, -4796, -3630, -5542, -6078, -2638, -4401, -7346, -6273, -8094, -9047, -5685, -6967, -8238, -7902, -3909, -7428, -5583, -5509, -5171, -4431, -6175, -6605, -3616, -8140, -5491, -5069, -2584, -3604, -3638, -6105, -5061, -9418, -8834, -13859, -9845, -6613, -3491, -6379, -9404, -15944, 9167, 49438, 19059, 8937, 1722, 1007, -3826, -1634, -4547, 1668, 683, -1899, -1820, -833, -5203, -5832, -3350, -2855, -3621, -1188, -1225, -1189, -3886, -3872, 216, -4155]
7486d155o53J226K365j863j037P32n77k235j019K601P66m291J328J98J884L323
7470a407j664j154j201r12J665M27J140k399K026j96k296K067j978Q74K934L03
7454a771j743m01J437q37r13o49n31Q34J31j015J012J684n3m011j377K465J355
7437d383L70K31K898j166q69p78J341J355p74j499J069j750r87L110M52j002K230
7420a52N0k19O4m654k325N35J661J513j374j996K421L731L72l690k159J788K09
7403d225M76l109k96O006j269j919J971K133j493l189j038P90J015p27J598o04
7387c880M67J296k780J995K761j108L1o17l088J559k13j153l914M038J066O79
7371b861k750J692j079N10j960K370M868n350M51j061k723k91L146L041l72k742
$$ y = [-4155, -4808, -3582, -1217, -3080, -4117, -3385, -3962, -6197, -7216, -4615, -3849, -8140, -6812, -6614, -4730, -1407, -3071, -4225, -5426, -6338, -4673, -4246, -3106, -5505, -3479, -3675, -5971, -3904, -5882, -5008, -2074, -1771, -3514, -3915, -2478, -3315, -4228, -4877, -5408, -4574, -4443, -5458, -4446, -2762, -2815, -6826, -8203, -5738, -4383, -4013, -3782, -884, -2050, -2919, -3697, -2356, -1001, -1775, -3274, -2205, -3955, -4942, -1832, -1380, -2382, -152, -102, -321, -257, -4911, -7236, -6701, -5040, -3527, -4901, -6897, -4476, -745, -373, -4063, -6222, -4434, -4225, -3749, -6858, -7154, -1148, -2417, -4336, -2365, -232, -1725, -4914, -5952, -5162, -4147, -4874, -3276, -3880, -3413, -2117, -4897, -2902, -141, -1249, -1218, -1835, -4923, -3364, -3577, -4730, -8644, -4606, -3540, -2861, -5611, -3919, -4998, -4488, -6448, -4078, 790, -4560, -4109, -5170, -7893, -8184, -5038, -1997, -2369, -5111]
7355e111r74J304J643j058m458L372p41k625L066r59J612j646m01K990l34L948
7339c72k238O48k896j291L247j451J027n89J215j423R81k358M88J015O27n70N02
7322c438r95R26K095k01p79l169M59k5n40O51o42q10k84N2L336K388J879l928
7304c025k351K893K328j913r80m8k485j004J046L506K600j87j426j273K094k64
7288d89k995r66k4K453J983k057o08p01M18j041R7J226j812J062P08J502o8N90
7270g22j918j623K0K640l84k528k953N194J075N16k389Q50j345Q70p74k00K163
7253a508J525k017k669J141J290O57k307L79J907K526J22%m46Q73j103o06k321
7236b557K314n75l015k4o56J293L683q89j133p27M09j044k738K114L844J392n21
$$ y = [-5111, -6085, -4781, -3138, -4196, -8654, -5282, -6023, -8648, -5582, -6541, -4929, -6575, -6976, -3986, -4320, -372, -2610, -1962, -4858, -6149, -2902, -4353, -3326, -3915, -2700, -4123, -3142, -5500, -5012, -3997, -3370, -3940, -3438, -4433, -3507, -1412, -1613, -2392, -5561, -5102, -5127, -5667, -5016, -5658, -6468, -6752, -6700, -3364, -976, 903, -3025, -5376, -2483, -155, -2068, -3048, -3096, -5581, -6585, -5539, -2033, 567, 380, -1046, -2319, -225, -489, -3484, -4450, -4474, -2021, -38, -2095, -2703, -3404, -2986, -4027, -3930, -2704, -4516, -3454, -2746, -1244, -1312, -722, -2640, -4263, -4243, -1603, -1987, -4515, -7468, -2274, -1199, -683, -3072, -2222, -3567, -2697, -3471, -3671, -1508, 17, -2000, -4669, -3528, -2238, -1581, -3888, -3509, -1602, 924, 1046, 1046, 600, 1473, 370, -236, -2557, -243, -818, -3833, -3857, -4513, -3220, 463, -426, -1559, -2286, -1877, -2921, -5659, -3545, 299, 1691, 1170]
7219A170j120m63q13j55j717N79K637m198j61L354j128P51j333l86J177k492J575
7202b723m49k207N9L96J363K56j190P06R29j140p17K102M51j338K472j409p50
7185c189J450l03o74O60j03r05J961j7J900j023j573J322l244j40K342r10q58
7168c304r68n53k150L68J570J885L316l047k313J437j133L374n68l355J419J8
7152d004Q51O11P29j082j593j996K26J202N57%n20K11J578n72j259L843j261j114
7134c593j438J157K564m225K051l25l29J624k722K401m60p39K784k425J060M78
7118b137L265J433Q83m01l770k601l5l664N55J747K088K15N62R83l23l593J175
7101c618J671k634J58L85M23L62J960K864n315j463o44l18M292j103R00M741j317
$$ y = [1170, 50, -413, -1226, -1381, -3098, -2519, 118, -4080, -4241, -887, -2015, -1264, -2597, -2983, -1806, -4298, -2723, -3172, -5379, -5320, -4924, -3561, -3305, -4495, -3789, -2860, -4000, -4717, -2615, -2164, -3502, -1030, -2439, -3189, -1739, -2042, -2716, -2056, -2159, -3064, -1103, -1120, 780, -243, -1816, -494, -3738, -3878, -1536, -2446, -3304, -4272, -4825, -6975, -6607, -5037, -3152, 164, -2883, -5196, -3759, -4892, -1518, -2086, -5441, -4022, -4004, -3153, -2542, -1813, -2895, -4488, -6484, -6258, -5056, -4499, -4499, -5019, -4808, -3230, -3802, -5061, -1218, -2479, -3593, -5031, -3874, -1310, -5535, -3484, -3809, -4138, -2514, -5236, -2835, -3295, -4034, -1250, -3675, -2615, -2137, 1128, 2561, 3444, 3043, -727, -3328, -3363, -7027, -6472, -4725, -2637, -2422, -1860, -877, -1200, -4793, -3618, -1947, -4581, -4423, -4038, -3615, -3253, -1293, 1571, -3744, -5207, -5851, -6169, -1877, -2980, -2080, 2661, 1344]
7084A344l266L290K729j660p45j56l209l39J49J439j956J744R9O11j274k435l14
7067c949J461M288k886l292K735q62k41R47k343j0328N276O983P93K142K140j191
7051A673n2l739j391J838K904k414m702M548J352J153m074J817J215m064l759
7036g695J202L254J838J492k023m50r77k992N976L909J113k289l006L3l49K309
7020A345J077l925q70L180j550p37k823M90K23J455Q02j525k025M887R10p04O90
7003I00j994Q29r39M23n12K322K508m383nN72o31j821J23j208J707K684k591j659
6985c675J488K397k203J107m203L454J335J933J594m562p88J588N61k86n01k082
6969b843K214j152L67P63J030K67R79L6R63J713k08l556l578K257m1j581m01K609
$$ y = [1344, -1922, 1368, 4097, 2437, 1692, 1536, -1673, -2012, -1863, -424, -2380, -636, -537, 74, -1200, -3635, -3949, -2488, 1800, -1086, -4378, -1643, -2505, -2746, -1799, -4142, -14470, -9194, -2211, -1418, 724, 2864, 1673, 1621, -2118, -3509, -1671, 1233, -1181, -5883, -1335, 17, 1170, -2904, -1087, 128, -3936, -7695, -6493, -3239, -1401, 91, -1932, -2382, -3359, -6351, -375, 3534, 4647, 2358, -648, -615, -964, 1345, 2422, -1503, -2373, 807, -743, -1480, -4303, -3813, -3590, -2135, -1333, -2858, -4883, 4, 914, 210, 900, -1094, -265, -1204, -781, -1293, 1029, 3537, -846, -851, -279, -910, -2731, -2608, -3816, -2109, 575, -2016, -3675, -2187, 210, -1993, -886, -5089, -1635, -300, 1633, 3227, -1335, -2123, -535, 26, -260, -761, -2843, -629, -1781, -1414, -651, 379, 646, 1625, 1661, 2624, 4337, 4129, 573, -3005, -748, -789, -2370, -2771, -162]
6951a62k084j586M37m8J942J130Q08l087K428N87j700P30k219j612K518m11j678
6934d007K130K444P03J949j31l414j92k760J71N36K479J262k42p42J958O51j162
6917A633o74K925l077j203J622p38K10k146k357J580O18M25J082j52k186N56J151
6900g31J792j877P35p10K033o99k222q19J82K805k167o20P73J327J627K031k950
6883E10L774l414p69o68O78j545J97J63M26K868P41J448k306j902j531L269J55
6866B094m31k811K781L608L56k445r47m250M269P89j954L234k194m88j223K33
6850F21k968P40J988m16q11J355j276P89J642j238j502J856n68p81n89j99k322
6833c679q56M136m00J244l93j969Q6j28m63k746j932L952N05jM068k892n74J532
$$ y = [-162, -2246, -3832, -3395, -3443, -1501, -371, 437, -2650, -222, 365, -1335, -605, -2824, -4436, -1918, -2329, -4007, -1877, 567, 1270, 3219, 3088, -326, -518, -3278, -3107, -2571, -92, 1170, 928, 186, 2144, 2795, 1633, 959, 3884, 807, -396, 1226, 488, 698, -1448, -3805, -2225, -1607, -1182, -100, -252, -2438, -1882, -731, 1061, -816, -81, -791, 1242, 543, -1679, -2498, -2316, 489, -1678, -2298, -1525, -198, 1429, 3460, 510, 4284, 870, 101, -567, 111, -1434, -1237, -1074, -648, 2220, 2961, 4409, 2103, 201, -1330, 1939, 2094, 1663, -1148, 1633, 5241, 5597, 3152, 2205, -2045, 2224, 3013, 1059, 4293, 2099, 1611, 388, 621, -2347, -1607, 381, -35, -846, 509, -767, 22, 1664, 426, -1076, 780, 212, -569, -1158, -1357, -3679, -4535, -399, -799, 445, 52, -1917, -1831, -1959, -2422, -5168, -7100, -3148, -2643, -2644, 1424, -1468, -2042, -510]
6815e10j605j137M461j80lK387l111k164q63K034L326k834J076k41J548j482M05
6798A107l38j545K742MJ700o67K92k136j465L94j132L244K27k599j089J429j848
6781a680M6K065q34r62K319k998K184j502Q74K558l612Q24K018J022j594k73k299
6764a844P46k812K664j255m9R06j1K222j490J432j099k334k7K15M300n58j586
6747e80q26J237L992j080j848j243J367j229J87q91M46Q49m36M818J01k509l228
6730h73J422k496k704L753L779j267J10P7k710j016N024K047J10l577k02J94k843
6713a172P17K437j949J060l051j10j96P02K503L163n06J12j094J80R97l40K87
6696C740j761J559o61m10K561Q1k908L184o26l716p05J989J096J619k193M30j723
$$ y = [-510, -2115, -3252, 1209, 1029, 1026, 3413, 302, -1862, -2725, -691, 2635, -199, 877, 636, 2184, 702, 1107, 769, -776, 1966, 1970, 3670, 3003, 3295, 1159, -306, 88, -1044, 2200, 2427, -172, -1261, 168, -1680, -1634, 431, -403, -1365, 954, -2044, 140, -1362, -488, 2070, -1542, -718, 1300, 2322, 728, 455, -1844, -1098, -3910, -1246, -2501, -2550, -1644, -1655, 567, -923, 509, -590, -2924, -2951, -2736, 1564, 1006, -580, -1406, -169, 3823, 2743, 895, -348, 1019, -210, -23, -914, -468, 381, -55, 4763, 4864, 2355, -873, 549, -1947, -4651, -898, 2881, 1614, 1724, 1801, -909, -1925, 3099, 5146, 5256, 1679, 1477, 1671, -1172, -455, 1982, 33, 1093, -1958, -2068, -2264, -1562, 941, 4104, 3598, 3710, 2616, 2796, 3793, 3453, 3740, 1979, 3538, 2877, 2467, 5028, 5109, 2201, 5385, 4759, 1043, 338, 2327, 3423, 5042, 2849, 3279, 1556]
6679A556Q39J507Q72J50O60J128R04o092M34q27L311j437p88j221P22K432p83
6662C367L50j750m95n65L646k773j654p82j462Q82q73KJ161r72m68L375J753L343
6644F085k228l088J332l054M594O4J717k719k317J005j06l28L20K056j789J274
6628B818k69j939j650L554J245N41Q14J48K539m71j977k463K262J353j732j491
6612C282r89j56J23k00M68N11o1k608L922K787k942k77q62O01J394l159O94L2
6594B560o92M427j219P16q08l50j469K447j509O94K315M09K65j792j056k093L216
6577F061M58k384P9J496r45L34j140q23J06k782L715L827j184j743m92M14m396
6560F01m33K972K494j137K922j099K08p3j243J131n40j66j214K923j317K69L110
$$ y = [1556, 2395, 3902, 4774, 4924, 5584, 6712, 7616, 1524, 1958, 1131, 4442, 3005, 2217, 996, 1718, 4150, 3367, 3717, 1967, 1472, 907, 4553, 1780, 126, -656, -2118, -1236, -2109, -2107, -946, -1918, -2386, 989, 2742, 6085, 3857, 769, 2101, -953, 3641, 3705, 5422, 2703, 386, 1391, 1285, 957, 1277, 3333, 1544, 2818, 2549, 610, -1040, 2514, 3759, 4300, 5114, 5262, 7801, 7330, 5353, 2890, 5152, 6505, 4773, 3282, 2293, 2137, 2260, 2060, 2528, 3039, 2978, 370, 4292, 7079, 4137, 3860, 2998, 3599, 4993, 1834, 2528, 2560, 1868, 6295, 5076, 5792, 4984, 4634, 3165, 5612, 4103, 4797, 7112, 7521, 7786, 5994, 4938, 2845, 6061, 6519, 4135, 4214, 5710, 4765, 5099, 3959, 3136, 3242, 460, 4175, 8002, 6818, 5075, 4583, 4997, 601, 168, 3140, 5634, 4497, 7419, 6320, 6528, 6455, 5212, 6343, 5803, 5637, 4423, 7346, 6029, 6298, 9408]
6543I408j767k853j142k142J884J139K480P14j471n59j30J47j248L067j559k676
6527C292J065K294R79K721j075j02j21j461k186j017L85K782K012n123l13J284
6511E416m039J48N233j152k122k380J169Q44L93Q10k483K044K786J055J215j644
6495G293l256K267J170m29j333Rj44j40L712j710j396p21j682J924l237R56Q5
6478C368K805J501j555j844M44j96N30Q14m12J208m4J764Q26O01k351J722l754
6461E427J767J231O74l104j40k04J441J90n5J152J77j872Q52m36k688J047L052
6444H511k801n0J672j57m42o45j68J943Q22j49L046k161n71J218P45j830j139
6427G844J105J67k69K436p87j114o49n05K226K193j306k48m676L208j724k500
$$ y = [9408, 7641, 4788, 3646, 1504, 3388, 4527, 7007, 7721, 6250, 5691, 5561, 5708, 4460, 7527, 5968, 3292, 4357, 6651, 7630, 10351, 9276, 9174, 9053, 7592, 5406, 4389, 4774, 7556, 9568, 4445, 4132, 5416, 1377, 1525, 6758, 5606, 3484, 1104, 2273, 3117, 3510, 4320, 1837, 3881, 6667, 7722, 8937, 7293, 4037, 6304, 7474, 7045, 5712, 5721, 5577, 5437, 9149, 7439, 6043, 5322, 3640, 5564, 2327, 3283, 3368, 6173, 7674, 6119, 4275, 4719, 4523, 5053, 5867, 5455, 6663, 6619, 8383, 9209, 9810, 7459, 9181, 5427, 7194, 8425, 9099, 5995, 5855, 5651, 7092, 7282, 7227, 8379, 8556, 6684, 7536, 7100, 4412, 5459, 8511, 5710, 5660, 7332, 7175, 6733, 6088, 5920, 7863, 8685, 8536, 11582, 9421, 8850, 10068, 10813, 8983, 7844, 8949, 9116, 8847, 11283, 10496, 9382, 8733, 8228, 10454, 12647, 11341, 11093, 6417, 9625, 7901, 5401]
6411E401J442L50K96l09M12n62K325k262m651O01N510L157k405k540k767J002
6395E000P21J349p91j619R27J593O73L191j592M2K264k56j674m247J390L165r65
6378I171k651k014l05K13Q00K790J226m32o8O40k409j20N93J373k722j338J10
6361D857M763l66k620K546o84P95j528q1k06Q54J514J99o97Q27J417o67k331K917
6343A1509j397l024r70o81L372k382P23J791j247K776q2l111o79K55O33o26j889
6326D971J607K510j010m22p80j225R73m10K528L146k99k315m08J392l378l249
6310C631k45K602K389p08J157k932J079r34l9J68k010j9M50N61J64J363J900M14
6292H991J230N059l027K393k578l215m4l06L177K221j159j299o20L566N42M86
$$ y = [5401, 6843, 7193, 7489, 7180, 7592, 7030, 9355, 7093, 2442, 3043, 8553, 11710, 9305, 6765, 3998, 5000, 5721, 7070, 6279, 4660, 5587, 7180, 7853, 11044, 9452, 9494, 11758, 11502, 9828, 5581, 6971, 10136, 9171, 6520, 4506, 4201, 4414, 5214, 8004, 9230, 8798, 8730, 9370, 6961, 6841, 7434, 8807, 6085, 4747, 4857, 9620, 9254, 6634, 9180, 8496, 9291, 7763, 7682, 7476, 8330, 9844, 10043, 9346, 10173, 11590, 10923, 8592, 11509, 10112, 7088, 6118, 5437, 8809, 6427, 7150, 8941, 7694, 10470, 10388, 7277, 6598, 6853, 7486, 6860, 4971, 6578, 9088, 8078, 7656, 6876, 5651, 6624, 6214, 8742, 11888, 11589, 9274, 8866, 10258, 6880, 3631, 3386, 5988, 8377, 7669, 8826, 5894, 6973, 6039, 6000, 6168, 4158, 4139, 4589, 5150, 5314, 6677, 8577, 8991, 10221, 15280, 12253, 14646, 12068, 8853, 8809, 8503, 11680, 13901, 12742, 11443, 10823, 14389, 14931, 15417]
6276A5417j402K51K670j725j270K434j845R24M16m155o87p33J805m51K737J474
6260A5860P92k885q97P84q00J491o19o54j032n9P23j535J854L208j479O5k95j867
6242A2655j186J28j375L652J783J781k567m414m77J040L159L557k173j838J64
6227A3889o07p06J832K48R45j418N04k256p70J313M45L075l501N67K816p55m745
6210A0876K996o4K166O13q59k326m268k805K468K713J136L8p34k08L20K035P72
6193A4869k365n58j613K204O541l578k38k196n42L561L163j219j935K304m11O69
6177A8656k241j9k832K389P37q26j510j319K397N13l020J277J620q50M77l64Q10
6160A5895j120j019R80j125N32J173j477P07K075K09r44o25N35J961j622J73k212
$$ y = [15417, 14015, 14266, 16936, 15211, 13941, 16375, 14530, 15454, 15870, 11715, 11028, 10295, 12100, 11649, 14386, 15860, 16652, 13767, 12870, 13654, 12854, 14345, 13726, 13072, 12040, 11981, 12704, 11169, 13023, 16231, 14752, 14817, 14522, 12655, 11469, 11597, 10222, 13874, 15657, 17438, 14871, 10457, 9980, 11020, 14179, 17736, 15563, 13725, 13889, 13282, 12576, 14408, 14656, 15601, 14183, 14687, 12431, 11661, 12974, 13419, 16494, 12993, 13560, 16376, 15621, 10876, 13872, 13808, 15974, 16587, 15728, 13402, 9134, 6329, 8797, 11510, 12646, 12684, 11950, 11742, 12062, 14097, 14869, 12504, 11946, 10333, 12537, 19078, 15500, 15262, 13066, 12524, 16085, 19248, 18029, 16094, 18398, 17987, 18656, 16415, 16396, 13564, 15953, 16690, 15864, 14354, 13035, 15432, 15945, 12925, 14202, 15822, 14972, 15449, 15085, 15895, 14775, 13756, 14736, 13611, 14143, 15316, 13839, 14546, 16621, 16830, 15886, 15261, 15796, 17757, 16135, 16308, 14096]
6143A4096K130J868k069q57l050m77k324R58J232K759Qk1m96M40N10L440j252
6126A6895j091Nk34l207k26R37m02J388K908K304k241J801M78L172k831N45j321
6109A8880l149J006R33J758k320j870k23j286R46R25J483j049O62J210k215l003
6093A2688l15L07r01K363m45R73J720O1r22q31j66k93K778m84J869J365P19j743
6075A8743j113j506K684J303J234k301j7j938K021K442j150r53q7j359k9K593
6059B0567l013J271L703k918Q39J962j821L36J23k370J332K021l460k655J213
6044A7130L11J087J093J268K155j426k870K084R01q5J942k786l237n38j53L903
6028B0779J168j700K082k00q05j095j144J775K844l049n09N44j093J82j02j119
$$ y = [14096, 16226, 18094, 16025, 15168, 12118, 11641, 9317, 10275, 11507, 14266, 14274, 14253, 13757, 14197, 14707, 18147, 16895, 15804, 15809, 15575, 12368, 12142, 13079, 12677, 14065, 16973, 19277, 17036, 18837, 19315, 22487, 19656, 20201, 18880, 15731, 16737, 17670, 19428, 17108, 15238, 15015, 13729, 14675, 15600, 17083, 16034, 16696, 17906, 15691, 12688, 12373, 12680, 11779, 14142, 13697, 14670, 16390, 16451, 15529, 14698, 14532, 14239, 17017, 16533, 18402, 19767, 20486, 18743, 17630, 16124, 18808, 20111, 21345, 19044, 19027, 17089, 19110, 21552, 20402, 19449, 19362, 18003, 17974, 20567, 17554, 18825, 22528, 19610, 20449, 22411, 20590, 20926, 21049, 18679, 20011, 22032, 18572, 15917, 17130, 17441, 18528, 19621, 20889, 23044, 21618, 18748, 20832, 21733, 21648, 23590, 20804, 17567, 17029, 16876, 20779, 21947, 20247, 22329, 22129, 21324, 20229, 19085, 20860, 23704, 20655, 20146, 20690, 19597, 19779, 19677, 18558]
6012A8558L151L26j681J76j820K568J396L53L264J394J055m036k428j907L358
5997B3727J13l243k725J201K173L27k981K886N069P03j517J64k417J352j852j714
5981B1266J906Q89K123j900Q42k72m78K27k044rJ454K696K370l042q20j273K00
5964B4135m80q96M37N91K95J701J316K359M41Q27q98P57R7l82j840k951P11q78
5946B5342p16J651L049L39k044l435O2J753l97J803J06j325L79J68o86K63J122
5929B7434j043N32K35l91k398L85l66M03J178p99J575P4J73Q1n31k851J23K604
5911B6418j58J024l54J165L90j143k79K977K0k303R08K058K98N56q97O57J3j506
5893B9844l574l7Q39J642k99r81l73K569j39j501l72o03K338k029K837J112J442
$$ y = [18558, 21709, 22035, 20354, 20530, 18710, 21278, 22674, 23027, 26291, 27685, 28740, 24704, 22276, 20369, 23727, 23840, 20597, 17872, 19073, 21246, 21573, 18592, 21478, 26547, 27250, 25733, 25897, 23480, 24832, 22980, 21266, 23172, 24061, 26184, 24284, 25126, 24854, 24376, 24603, 22559, 22550, 24004, 26700, 29070, 26028, 25208, 23935, 24135, 23655, 22759, 23196, 23787, 24082, 25783, 27099, 29458, 29899, 30726, 29828, 30585, 30682, 30300, 28460, 25509, 26220, 25342, 24626, 26277, 29326, 29665, 27621, 24186, 24248, 26001, 25604, 27407, 27513, 26188, 26567, 26735, 26049, 26312, 27434, 26391, 26923, 27158, 26767, 24369, 24754, 24388, 24791, 25969, 25170, 26745, 26819, 26992, 27073, 26542, 23691, 23814, 26418, 26260, 27284, 26930, 28095, 28485, 27342, 27063, 30040, 30060, 27757, 28665, 30723, 31021, 31577, 30680, 31337, 31350, 29844, 26270, 26233, 27072, 28714, 28415, 27434, 27061, 29630, 29491, 27990, 27618, 27015, 29353, 27324, 30161, 31273, 32715]
5876C2715J43k912j696J525O72k039J958J155k551J895J3o48L89q83l34j87K053
5859C1268l760k846L491M70J780p21R05j441j274K128J828j683o50J378J458l34
5843C1997J801j371j974L67j506K674j014K22k49p69K333p3O5j552Q12M3r30M323
5825C5199k790k197J452j713q73K197L83N23M136J274j455j479k424l677J974
5810C0530k026M939R21m264k49J656j799K903M14J383j007P2J571k72J86pj28
5793C4823J693j106k632O2j85P98k079J733R63r95L521J309l928L91j29K560m81
5776C6318P36k341j395m12j143J653K493J159p32j581j121K342J219K73O00L06
5760C8374j79n36k234j17j293J375J113j006K60K125N75m424k590K052M377k81
$$ y = [32715, 32858, 29946, 28250, 29775, 30447, 28408, 30366, 31521, 28970, 30865, 30878, 30230, 30619, 29736, 29402, 29215, 31268, 27508, 24662, 28153, 28623, 30403, 29682, 30587, 29146, 27872, 30000, 31828, 30145, 29495, 30873, 32331, 31997, 33798, 32427, 30453, 30820, 29314, 31988, 30974, 31196, 30947, 30178, 32511, 32438, 32503, 30951, 31763, 31806, 30876, 35199, 32409, 30212, 31664, 29951, 29078, 31275, 31658, 32181, 36317, 37591, 36136, 34657, 32233, 28556, 30530, 28504, 33443, 34364, 30100, 29851, 31507, 29708, 32611, 33025, 34408, 33401, 33473, 35044, 34772, 34958, 34951, 34823, 36516, 35410, 32778, 32840, 32655, 33453, 31374, 33107, 34070, 33075, 36596, 37905, 33977, 34368, 34239, 36799, 36318, 37054, 34713, 33318, 32906, 31763, 33416, 35909, 37068, 36336, 34755, 33634, 35976, 37195, 37468, 38068, 38374, 38195, 37659, 35425, 35308, 34015, 35390, 36503, 35497, 35757, 37882, 38457, 34033, 31443, 33495, 37872, 37591]
5744C7591l016P06P79n76n84k92L94o30N119N68K577l122J220O21K96m884L713
5727D0480p7l418j244K023J215J448J872k72k119j384L75n45J306R63j376N86
5711C9833l559J584K679p21j624R59K495m64k184l21N50J495J18J498J079l822
5695C9595L987r30M99k242K320J125P35O91l98j251q89K094M23k105J309J324
5679D6287k454l682J518J339K559k110J818j115P33J174m20q20l22j904K504j335
5663D3770l374K964q57L72Q04K918M0k31J992j820N67k73j142l47P13j409J534
5646D6221M147l445k476j338rK413j23M989k114l894L243j484m09K568O43k040
5630D6892N75J673j202j24j28Q80m26J289K05q24L238p6j605l977J871L354j815
$$ y = [37591, 34575, 35281, 36060, 35484, 34900, 34608, 35002, 34372, 39491, 40059, 42636, 39514, 40734, 41355, 41651, 36767, 40480, 40403, 36985, 35741, 37764, 38979, 40427, 42299, 42027, 39908, 38524, 38899, 38354, 39660, 40623, 39247, 39833, 36274, 37858, 40537, 39816, 38192, 39151, 41646, 41182, 38998, 38677, 39227, 40722, 40840, 42338, 43417, 39595, 43582, 42652, 43151, 40909, 43229, 44354, 45089, 45780, 45382, 44131, 43242, 45336, 45759, 43654, 44963, 46287, 43833, 40151, 41669, 43008, 45567, 43457, 45275, 44160, 44893, 46067, 45647, 44827, 44505, 42601, 45105, 43770, 40396, 43360, 42503, 42875, 43679, 46597, 46637, 46406, 48398, 46578, 47145, 46872, 45730, 45383, 46096, 44687, 46221, 50368, 46923, 44447, 43109, 43100, 45513, 45390, 50379, 48265, 44371, 47614, 46130, 45721, 48289, 48932, 46892, 47467, 49140, 47938, 47814, 47686, 48566, 48140, 49429, 49634, 48810, 52048, 51972, 50367, 46390, 48261, 51615, 49800]
5613D9800j83L35K737J482o023M34L084R0j744K67J572J776M75Q7J748j428k072
5596E2437r0k94J101J578k283L65K15m5J557J909J440O32j350j569K335J788k150
5579E7576l201j823K580j073J072J493j059j864O03J155J121r52K547j05L25L695
5563F2090k369j88k983j811J148Q09j061j26l52L729K24j053j992Q47J808r56
5547E7764J617Q03j002q89L0M952J75m444K922L198K28l160j498k0q91L287j166
5530F1906M88J257J527j17q57J382N06j077K577P30j595N96k903K29K95J97J99
5513F5340o05N76q17k506K174K138J626M75o92M30o7K698m463K09J277j211L22
5496F6904K266P1l53K85k991L692K039J807J075k072M55o94q74j182K695p40l09
$$ y = [49800, 49617, 49952, 52689, 54171, 48148, 48582, 51666, 51756, 50012, 50279, 51851, 53627, 54102, 54189, 55937, 54509, 52437, 52347, 52053, 53154, 54732, 52449, 52814, 53029, 52984, 54541, 56450, 57890, 58522, 57172, 55603, 57938, 59726, 57576, 54375, 52552, 55132, 54059, 55131, 56624, 55565, 53701, 54304, 55459, 56580, 55628, 58175, 58070, 58395, 62090, 59721, 59533, 56550, 54739, 55887, 56696, 55635, 55509, 55157, 58886, 59110, 58057, 56065, 56912, 58720, 57764, 59381, 60184, 59182, 58293, 58323, 63275, 63450, 59006, 61928, 65126, 65354, 62194, 60696, 60676, 59785, 63072, 61906, 62394, 63651, 65178, 65061, 64204, 65586, 66092, 65015, 67592, 68322, 66727, 67323, 64420, 64649, 64944, 65141, 65340, 64735, 65311, 64494, 61988, 64162, 66300, 67926, 68401, 67709, 68139, 68072, 70770, 66307, 66516, 67793, 66582, 66904, 69170, 69241, 68888, 69173, 66182, 69874, 71913, 73720, 74795, 72723, 73178, 72484, 71610, 70428, 73123, 72383, 72074]
5479G2074k11N32L143l328J044J110k429K154J934j788O89j092j728L565j772
5464G3897L31L597K428j137l11n30j1K258J944J290n000k155J159P99N90M26n87
5447G8988K073L95J473L17K833k695k770J915J605o13j509p81J84j146K412K945
5431H5626O74K251j454P91J074m12k532k23K580j051L850K783n092j124j035O23
5415H7329N421K933j685j874j09Q04L115M03J821j406q41J55l186J455K536K493
5399I9364k295l71K880J962m13L867K689j137l315K29k173R05L291q27J374n24
5383A05506L198j903J329K585k20J510J687k066Q15k432o50m33J168K567p18K030
5367A13973p38o97J550P78L109M973l726k948L512K316j185k773J736J77J661
$$ y = [72074, 71863, 72395, 75538, 72210, 73254, 74364, 71935, 74089, 76023, 74235, 74924, 73832, 72104, 75669, 73897, 74228, 77825, 80253, 79116, 78805, 78275, 78264, 80522, 82466, 83756, 78756, 76601, 77760, 78559, 79149, 79575, 78988, 81061, 81456, 82929, 83246, 86079, 83384, 80614, 82529, 84134, 83521, 82012, 81231, 81415, 80269, 82681, 85626, 86300, 88551, 87097, 87888, 88962, 88550, 86018, 85795, 88375, 87324, 91174, 93957, 88865, 87741, 86706, 87329, 92750, 95683, 93998, 92124, 92015, 92819, 95934, 96337, 98158, 96752, 95911, 96066, 92880, 94335, 96871, 99364, 97069, 96698, 99578, 101540, 101127, 104994, 107683, 106546, 103231, 103460, 101287, 102192, 105483, 104656, 106030, 105506, 108704, 106801, 108130, 110715, 110495, 112005, 113692, 111626, 112441, 110009, 109359, 108926, 110094, 112661, 111943, 113973, 113235, 112538, 114088, 114866, 117975, 122948, 119222, 116274, 119786, 122102, 120917, 118144, 119880, 120057, 121718]
5352A21718N032k277M09K007K750l15k040O90J117J61J80J159K069L477n9n58
5336A35520N93K732J347l20M68j107R08J487j19P2J8J895k765L308K41J882K47
5319A46407m38m51j437L766J272k423m06K749L404k41p93M685J06j592Q53L971
5303A59432K709K11J368o04j045J963j454L321J694j589J769L270K146J293J262
5288A75746Q61J367L71k043n84J215K273K997O53K967M525j18j140O91L216O66
5272A93663J839K685J511J307k33R34J51K608L219K431N927o58o58K356K927k913
5256B17096l738l62J903L214L792K921m82j679j086j072j78J238N99O487K697
5241B31350l611J755K519j10J994L371j432J062K056L480L647J526M009L719J720
$$ y = [121718, 126750, 124473, 124882, 126889, 129639, 129324, 127284, 127974, 129091, 129252, 129432, 130591, 132660, 136137, 136078, 135520, 136113, 138845, 140192, 139872, 140340, 139233, 140141, 141628, 141509, 141581, 141599, 143494, 140729, 144037, 144278, 146160, 146407, 145969, 145518, 144081, 147847, 149119, 146696, 146290, 149039, 152443, 152202, 151409, 156094, 156200, 154608, 155461, 159432, 162141, 162352, 163720, 163116, 162071, 164034, 162580, 165901, 167595, 166006, 167775, 171045, 173191, 174484, 175746, 176607, 177974, 178345, 176302, 175718, 176933, 179206, 182203, 182856, 185823, 190348, 190230, 189090, 189781, 192997, 193663, 195502, 198187, 199698, 201005, 200772, 201706, 201857, 204465, 207684, 210115, 216042, 215384, 214726, 217082, 220009, 217096, 213358, 212996, 214899, 218113, 221905, 224826, 224344, 222665, 221579, 220507, 220329, 221567, 222166, 228653, 231350, 227739, 229494, 232013, 231903, 233897, 237268, 235836, 236898, 238954, 242434, 246081, 247607, 251616, 255335, 257055]
5226B57055J943M83N297M080K817p6M383Q4M084K731M936O972K161M849m35O87
5210C02051l00L477N308K993M595K020O042K222N961L098L231M691L081M320O142
5195C58932P612K782O771N742Q067P314O557N801Q350Q274J1233N984P193L965
5181D54577R313R883N172M623Q344Q858J0494J1868J1791J2904J4652J2821J8106
5168E93406J4450J6354J6144J9649J5150J6705K6526K4456K2333K5277J9002K0097
5156H29549J9785J4378J6085K1941K0445J4493J6957J7626J8196K2581K6087J9646
5144A057769K2811K8266K8814K3339K6224K1062J7673J8526J6323K4508K7152
5133A312467K4456K5304K5873K7865K8719K5732K8110L2187L5321L7902L8478
$$ y = [257055, 258998, 259481, 264778, 268858, 271675, 271599, 275982, 276066, 280150, 282881, 287817, 294789, 296950, 301799, 301364, 302051, 301751, 305228, 310536, 313529, 318124, 320144, 326186, 328408, 334369, 337467, 340698, 345389, 348470, 352790, 358932, 366544, 369326, 376097, 381839, 389906, 397220, 403777, 409578, 417928, 426202, 437435, 443419, 450612, 454577, 463890, 473773, 478945, 483568, 491912, 500770, 511264, 523132, 534923, 547827, 562479, 575300, 593406, 607856, 624210, 640354, 660003, 675153, 691858, 718384, 742840, 765173, 790450, 809452, 829549, 849334, 863712, 879797, 901738, 922183, 936676, 953633, 971259, 989455, 1012036, 1038123, 1057769, 1080580, 1108846, 1137660, 1160999, 1187223, 1208285, 1225958, 1244484, 1260807, 1285315, 1312467, 1336923, 1362227, 1388100, 1415965, 1444684, 1470416, 1498526, 1530713, 1566034, 1603936, 1642414]
5122A642414L7179L6800M2435M7083M3901M3129M4978M6562M9361N7604O6024
5111B157470O7600P4353P6661Q0035Q3903R5198R7560R9789J06192J12117J17027
5100C167905J25645J34527J51087J78241J99388K21968K48232K86955L29260L78463
5090E421671M42012N19324O01844O80105P53878Q29800R34537J091884J287655
5081A2562710J452621J596726J774617J765535J247453K12696q71208j596370
5073A8144780j928291j951252j809078j585572j354323j140346r41635p90363
5065F643920o74133n84312n15115m42903l73577l10568k67850k33553k06994j86110
5055B848805j62039j53102j42093j32505j24284j12857j01862r6981q4685p7262
$$ y = [1642414, 1679593, 1716393, 1758828, 1805911, 1849812, 1892941, 1937919, 1984481, 2033842, 2091446, 2157470, 2225070, 2299423, 2376084, 2456119, 2540022, 2635220, 2732780, 2832569, 2938761, 3050878, 3167905, 3293550, 3428077, 3579164, 3757405, 3956793, 4178761, 4426993, 4713948, 5043208, 5421671, 5863683, 6383007, 6984851, 7664956, 8418834, 9248634, 10183171, 11275055, 12562710, 14015331, 15612057, 17386674, 19152209, 20399662, 20612358, 19741150, 18144780, 16216489, 14265237, 12456159, 10870587, 9516264, 8375918, 7434283, 6643920, 5969787, 5385475, 4870360, 4427457, 4053880, 3743312, 3475462, 3241909, 3034915, 2848805, 2686766, 2533664, 2391571, 2259066, 2134782, 2021925, 1920063, 1823082, 1738397, 1661135]
5045A661135p8947o6862o1953n4005n5812m8010m4634m6412m0672l7989l2474
5034A093365l4704l1659k9167l2608k9850k6372k2108k4145k6372k4611j9869
5023G91900j7434j4387j7246j6332j8838j7958j2506j4683j0581j5893j4406j3443
5011F08193j1627p150j4251j0871n369j2729o634o071j1216o671r260p102j0200
4998D89042r006o128j0209p749j0120p409n032r628n054n406k982k018o521q088
4984C93692l017p048m459l145o444m317j949j811l222k666m190l712k223l235
4970C42254o1m532l625J742l968n182l443l451k768r72j814k197m147k353r26
4955C04557m059m285p21n40j467k628k067l658j227k82l258j579l74j179j450
$$ y = [1661135, 1582188, 1515326, 1453373, 1399368, 1343556, 1295546, 1250912, 1204500, 1163828, 1125839, 1093365, 1058661, 1027002, 997835, 965227, 935377, 909005, 886897, 862752, 836380, 811769, 791900, 774466, 760079, 742833, 726501, 707663, 689705, 677199, 662516, 651935, 636042, 621636, 608193, 596566, 589416, 575165, 564294, 558925, 546196, 539562, 533491, 522275, 515604, 506344, 499242, 489042, 480036, 473908, 463699, 455950, 445830, 438421, 433389, 423761, 418707, 413301, 410319, 408301, 401780, 393692, 390675, 383627, 379168, 376023, 369579, 365262, 363313, 361502, 358280, 355614, 351424, 347712, 345489, 342254, 342193, 337661, 334036, 335778, 331810, 326628, 323185, 319734, 316966, 315994, 314180, 311983, 307836, 305483, 304557, 300498, 296213, 295492, 294952, 293485, 290857, 288790, 285132, 283905, 283623, 280365, 278786, 278412, 277233, 275783]
4940B75783j889k048j974K580K667j576m960j99j011J661j061L63j301R34K313
4925B70282Q12j151n82k116l176K182N86l47j779j247L49k2k397k060K87JJ449
4908B61071m115k81n05J337r58j261j614j417O32Q45j070l541l089M92k014k949
4892B41563k829M74L710K067J252K042K214N10N39j269K654K477j518r88K295
4877B55193N18n95j868M33M414J406j168K102J657p74N26P57O44j468K629K134
4861B66540L25k902o84K269k085M033J05o44K620L22Km24J282M610J053p90L916
4844B79548R52k739K98k16J463J72K305J356m7J106M218p48L280J203j512n94
4828B90045L875N06J132K412m010K4L665O98M066m49J068M250k378n9J797N75
$$ y = [275783, 273894, 271846, 269872, 272452, 275119, 273543, 268583, 268384, 267373, 269034, 267973, 268336, 267035, 267969, 270282, 271094, 269943, 269361, 267245, 264069, 266251, 266837, 266490, 264711, 263464, 263813, 263791, 261394, 259334, 259621, 259622, 261071, 256956, 256675, 256170, 257507, 256549, 255288, 253674, 252257, 252889, 253734, 252664, 249123, 246034, 246526, 244512, 241563, 238734, 239208, 242918, 244985, 246237, 248279, 250493, 251003, 251542, 250273, 252927, 255404, 253886, 252898, 255193, 255711, 255116, 253248, 253681, 258095, 259501, 258333, 260435, 262092, 261318, 261844, 262601, 263245, 261777, 264406, 266540, 266865, 263963, 263279, 265548, 263463, 267496, 267601, 266957, 269577, 269899, 269901, 269477, 270759, 275369, 276422, 275632, 279548, 280500, 277761, 278059, 277843, 279306, 279478, 281783, 283139, 283092, 284198, 288416, 287668, 290948, 292151, 290639, 290045, 293920, 294426, 295558, 297970, 293960, 293984, 297649, 298347, 302413, 301964, 303032, 307282, 304904, 304845, 306642, 307217]
4812C07217k118K613J212j936K344P02K939Q51R60K079K073J768Q67M455K568
4797C28594j284Q95r85J598m79R10K95M872R598k16j783K881K588K174l216l02
4781C46140L533J458l12J319p68J124L965J277K283J703K453L31n67L642M56K652
4765C70689M193J328j523Q09N324J147L673L282j526J864L072L304M887k9K050
4750D02544K454K915L067p63o13O76J731L897L257L274K157L663L88j299J754
4735D29102M900j053L839N591J386L642J200L289L943J750K380J826J588j576
4721D61807R009J734L052L337N396M254K287J918L779M523J649L180N215Q547
4707E19687J481N627M251L188N946J881M146M016K444M360M631N405J445M570
$$ y = [307217, 305099, 307712, 308924, 306988, 309332, 310034, 312973, 313824, 314784, 316863, 318936, 320704, 321571, 326026, 328594, 327310, 328205, 327220, 328818, 328339, 329249, 329544, 334416, 344014, 343798, 342015, 344896, 347484, 349658, 346442, 346140, 349673, 351131, 350819, 352138, 351370, 352494, 356459, 357736, 360019, 361722, 364175, 364506, 363939, 367581, 368037, 370689, 374882, 376210, 374687, 375496, 380820, 381967, 385640, 388922, 387396, 389260, 392332, 395636, 400523, 400494, 402544, 404998, 407913, 410980, 410217, 409604, 410280, 412011, 415908, 419165, 422439, 424596, 428259, 428647, 427348, 429102, 434002, 432949, 436788, 442379, 443765, 447407, 448607, 451896, 455839, 457589, 459969, 461795, 463383, 461807, 470816, 472550, 475602, 478939, 484335, 488589, 490876, 492794, 496573, 501096, 502745, 505925, 511140, 519687, 521168, 526795, 531046, 534234, 540180, 542061, 546207, 550223, 552667, 557027, 561658, 567063, 568508, 573078]
4693E73078L475M061P177N505L687L019M682L006M383L420M465L565M741O449
4679F34713L302M511P753O92N865O307M755N712L494M675K892O399J0210N879
4665G07159O933O566M521Q931O325P968O778P176N773N366R169Q491R018M578
4651H04752Q984P748R543J0113J0175Q773R318R113R434J0306Q248Q713Q955J0645
4637I34820P324Q439Q562N129R534J3824J0711J0606J1400J4867Q355R602J0727
4624A063900Q774Q494J2819J0442J1504J0671Q823J2405J1779J1178R897J5891
4612A196577J6293J5840J5668J5927J5465J7148J9685J4935J7657J9390J4702
4601A379287J7376K1620K5302K5562K3423K6079K5081K2185K5708L0095L2807
$$ y = [573078, 576553, 580614, 587791, 593296, 596983, 600002, 604684, 607690, 612073, 615493, 619958, 623523, 628264, 634713, 638015, 642526, 650279, 650971, 656836, 663143, 667898, 673610, 677104, 681779, 684671, 691070, 701280, 707159, 714092, 720658, 725179, 734110, 740435, 748403, 755181, 762357, 768130, 773496, 782665, 791156, 800174, 804752, 813736, 821484, 831027, 841140, 851315, 860088, 869406, 878519, 887953, 898259, 906507, 915220, 924175, 934820, 942144, 950583, 959145, 964274, 973808, 987632, 998343, 1008949, 1020349, 1035216, 1043571, 1053173, 1063900, 1072674, 1081168, 1093987, 1104429, 1115933, 1126604, 1135427, 1147832, 1159611, 1170789, 1180686, 1196577, 1212870, 1228710, 1244378, 1260305, 1275770, 1292918, 1312603, 1327538, 1345195, 1364585, 1379287, 1396663, 1418283, 1443585, 1469147, 1492570, 1518649, 1543730, 1565915, 1591623, 1621718, 1654525]
4590A654525K9187L2682L5940L3102L8190L9841M5477M5797N1865N6065O4229
4579B126900P5430Q2966R6320J11185J25980J38483J52365J69048J91969K22988
4569C493634K51248K82736L04416K95043K46252J47176K3918j08125k25779k99610
4559D410909l24124l11281k82970k40324k01768j64365j32951j07479r1903p8155
4549B475589o6607n2618l5982l0062k8949j9173j7722j0881j1207p250n264j056
4537B188818k918m45K954L534O198Q021J1540J2948J5243J9035J9763J4407J5630
4524B314728J6509J8032K0922J9513J8543J5684J7007J7305J6520Q384J1551J5549
4512B510247J3116J2239J3294J3200J2051J3749J6122J2846J3891J3678J9424
$$ y = [1654525, 1683712, 1716394, 1752334, 1785436, 1823626, 1863467, 1908944, 1954741, 2006606, 2062671, 2126900, 2202330, 2285296, 2381616, 2492801, 2618781, 2757264, 2909629, 3078677, 3270646, 3493634, 3744882, 4027618, 4332034, 4627077, 4873329, 5020505, 5044423, 4936298, 4710519, 4410909, 4086785, 3775504, 3492534, 3252210, 3050442, 2886077, 2753126, 2645647, 2553744, 2475589, 2408982, 2356364, 2320382, 2290320, 2261371, 2242198, 2224476, 2213595, 2202388, 2195138, 2189874, 2188818, 2185900, 2185455, 2188409, 2191943, 2198141, 2206162, 2217702, 2230650, 2245893, 2264928, 2284691, 2299098, 2314728, 2331237, 2349269, 2370191, 2389704, 2408247, 2423931, 2440938, 2458243, 2474763, 2483147, 2494698, 2510247, 2523363, 2535602, 2548896, 2562096, 2574147, 2587896, 2604018, 2616864, 2630755, 2644433, 2663857]
4501B663857K0126J5601K0930J8375K2652K0999K0623K3489K3641K2158K1650
4490B894101K2905K7461K4205K4846K6590K3057K5569L2137L3566L6507L2027
4479C202971K9131L0097L3632L1730L3580L5047L4310L4224L5164L2665L7748
4468C570299L9339L6119L2493L7367L2649L5486L7872L8060M0517M1567M4693
4457C986461M6523M6851M9321N0507N2261M8702N5330N0672M9082M6672N0438
4446D532820M7051M5543M8564N4135N1262M8856M7316M6542M4080L8995L3770
4435E038934K7406K5879L0489L1113L9790L8065M0072L7209M5083N1781N7298
4424E463119N6143N6718N9147N4039N6690N3104N4447N7431N3891N9959N7948
$$ y = [2663857, 2683983, 2699584, 2720514, 2738889, 2761541, 2782540, 2803163, 2826652, 2850293, 2872451, 2894101, 2917006, 2944467, 2968672, 2993518, 3020108, 3043165, 3068734, 3100871, 3134437, 3170944, 3202971, 3232102, 3262199, 3295831, 3327561, 3361141, 3396188, 3430498, 3464722, 3499886, 3532551, 3570299, 3609638, 3645757, 3678250, 3715617, 3748266, 3783752, 3821624, 3859684, 3900201, 3941768, 3986461, 4032984, 4079835, 4129156, 4179663, 4231924, 4280626, 4335956, 4386628, 4435710, 4482382, 4532820, 4579871, 4625414, 4673978, 4728113, 4779375, 4828231, 4875547, 4922089, 4966169, 5005164, 5038934, 5066340, 5092219, 5122708, 5153821, 5193611, 5231676, 5271748, 5308957, 5354040, 5405821, 5463119, 5519262, 5575980, 5635127, 5689166, 5745856, 5798960, 5853407, 5910838, 5964729, 6024688, 6082636]
4413F082636N5706O1186O4095O8185P5123P8061Q0027Q9503R2771R8460J02077
4402F947830R8589R8944R8865R8029J01113J03299J05401J07069J08875J13412
4392G981426J16098J10993J02938R2061R5560R7600J07918J19360J38055J49083
4382I111092J57144J57153J54060J50862J57535J64059J80435J92140J98333K12010
4372A0834823K18561K15948K16997K25985K39066K49689K63027K77347K89589
4363A3031032K94129K97566K89321K81315K82039K80222K96951L26017L51644
4354A5730236L76507L78896L88641M04600M06628M10495M57577N25982N74801
4345A9654363N96301O04369O02327O15768O60380P32491P83580Q27740Q40615
$$ y = [6082636, 6138342, 6199528, 6263623, 6331808, 6406931, 6484992, 6565019, 6654522, 6747293, 6845753, 6947830, 7046419, 7145363, 7244228, 7342257, 7443370, 7546669, 7652070, 7759139, 7868014, 7981426, 8097524, 8208517, 8311455, 8403516, 8499076, 8596676, 8704594, 8823954, 8962009, 9111092, 9268236, 9425389, 9579449, 9730311, 9887846, 10051905, 10232340, 10424480, 10622813, 10834823, 11053384, 11269332, 11486329, 11712314, 11951380, 12201069, 12464096, 12741443, 13031032, 13325161, 13622727, 13912048, 14193363, 14475402, 14755624, 15052575, 15378592, 15730236, 16106743, 16485639, 16874280, 17278880, 17685508, 18096003, 18553580, 19079562, 19654363, 20250664, 20855033, 21457360, 22073128, 22733508, 23465999, 24249579, 25077319, 25917934]
4336B5917934Q24799P44503O42195N60451N61553O26534O62039O13993N41445
4327C1695446N52182O59699P32968P82187Q01849Q39375R03937R06608R25798
4318C8800049R21157P67667O60944O30352O06008O24243P54224R12988R80944
4309D5658576R98079J005356J014954J022224R95743R87762J123295J298062J354747
4300E5458798J338386J268217J269462J403543J565857J567798J533803J640172
4292F7046036J806171J958070K179283K381412K448054K401294K505639K719477
4284H5445436K841766K982568L166604L231796L340131L590710L838751M077823
4276A12515585M445786M987266N577553O064360O531550P168296P820227Q613424
$$ y = [25917934, 26742733, 27487236, 28129431, 28689882, 29251435, 29877969, 30540008, 31154001, 31695446, 32247628, 32907327, 33640295, 34422482, 35224331, 36063706, 36967643, 37874251, 38800049, 39721206, 40488873, 41149817, 41780169, 42386177, 43010420, 43764644, 44677632, 45658576, 46656655, 47662011, 48676965, 49699189, 50694932, 51682694, 52805989, 54104051, 55458798, 56797184, 58065401, 59334863, 60738406, 62304263, 63872061, 65405864, 67046036, 68852207, 70810277, 72989560, 75370972, 77819026, 80220320, 82725959, 85445436, 88287202, 91269770, 94436374, 97668170, 101008301, 104599011, 108437762, 112515585, 116961371, 121948637, 127526190, 133590550, 140122100, 147290396, 155110623, 163724047]
4268A63724047R584942J0600613J1619150J2556482J3215436J3346069J3405202
4261B48051941J4161111J5560453J7280839J7538411J6820178J7772334J8406282
4254C65591549J5077183O513550m304508j0957390j4116388j6691503j8599114
4247C22513379j8737082j8684353j8319512j6886038j5497805j4514178j3777076
4240B06097335j3321096j2875162j1696124j0443712r242335q289541p584929
4233A32644436o984898o334399n861760n643350n490131n165941m804650m422952
4225H7936355m100882l790112l510446l250501l057000k863620k670511k486674
4217F2206609k353426k247010k163360k055797j942716j801616j681861j566229
$$ y = [163724047, 173308989, 183909602, 195528752, 208085234, 221300670, 234646739, 248051941, 262213052, 277773505, 295054344, 312592755, 329412933, 347185267, 365591549, 380668732, 387182282, 382877774, 371920384, 357803996, 341112493, 322513379, 303776297, 285091944, 266772432, 249886394, 234388589, 219874411, 206097335, 192776239, 179901077, 168204953, 157761241, 148518906, 140229365, 132644436, 125659538, 119325139, 113463379, 107820029, 102329898, 97163957, 92359307, 87936355, 83835473, 80045361, 76534915, 73284414, 70227414, 67363794, 64693283, 62206609, 59853183, 57606173, 55442813, 53387016, 51444300, 49642684, 47960823, 46394594]
4209D6394594j495841j443473j372611j287457j233305j185461j144420j101560
4201C6130466j070144j025592r74644r21927q89056q60938q38010p98700p47439
4192B8004016o92422o65193o40479o32385o16396o00253n79504n62018n30534
4183B2484832n11061m86121m66363m47380m40501m44588m40120m25296m01487
4174A8421915l80940l68195l67331l74670l91836l98459l79516l56842l38089
4165A5066037l31549l22270l05985k91362k76641k62095k45846k37746k25545
4156A2566998k21360k16557k12564k07438k07547k06826k05265k01305j94612
4147A0693524j89518j82016j68897j72143j69188j71012j62878j61519j55587
$$ y = [46394594, 44898753, 43455280, 42082669, 40795212, 39561907, 38376446, 37232026, 36130466, 35060322, 34034730, 33060086, 32138159, 31249103, 30388165, 29550155, 28751455, 28004016, 27311594, 26646401, 26005922, 25373537, 24757141, 24156888, 23577384, 23015366, 22484832, 21973771, 21487650, 21021287, 20573907, 20133406, 19688818, 19248698, 18823402, 18421915, 18040975, 17672780, 17305449, 16930779, 16538943, 16140484, 15760968, 15404126, 15066037, 14734488, 14412218, 14106233, 13814871, 13538230, 13276135, 13030289, 12792543, 12566998, 12345638, 12129081, 11916517, 11709079, 11501532, 11294706, 11089441, 10888136, 10693524, 10504006, 10321990, 10153093, 9980950, 9811762, 9640750, 9477872, 9316353, 9160766]
4138I160766j54125j48029j49468j45690j43492j39432j35070j35608j32522j28123
4128G749207j28143j24831j20786j17816j17214j13284j05521j02745j01943r8635
4118F618289r6621r2336r2009r1573q6940q0629p9045p7384q1663p1951p1298
4107E696840p2001o8095o3974o6884o5126o4493o4598o6458o3472o4552o2504
4096D974683o0488o0673o1890n9118o2760o1197o5140o5450p2087o6710o6705
4085D272465o5460p0398o8798o6010o3548o5910o5735o2030o1029o0317o4139
4074C559091o1556o2201o2852o2311o1991n6121n0899l8729l2331k9419k8122
4063C012559k4604k4854k5010k7417k1417k4311k5685k7597k4317k1668k2983
$$ y = [9160766, 9006641, 8858612, 8709144, 8563454, 8419962, 8280530, 8145460, 8009852, 7877330, 7749207, 7621064, 7496233, 7375447, 7257631, 7140417, 7027133, 6921612, 6818867, 6716924, 6618289, 6521668, 6429332, 6337323, 6245750, 6158810, 6078181, 5999136, 5921752, 5840089, 5768138, 5696840, 5624839, 5556744, 5492770, 5425886, 5360760, 5296267, 5231669, 5165211, 5101739, 5037187, 4974683, 4914195, 4853522, 4791632, 4732514, 4669754, 4608557, 4543417, 4477967, 4405880, 4339170, 4272465, 4207005, 4136607, 4067809, 4001799, 3938251, 3872341, 3806606, 3744576, 3683547, 3623230, 3559091, 3497535, 3435334, 3372482, 3310171, 3248180, 3192059, 3141160, 3102431, 3070100, 3040681, 3012559, 2987955, 2963101, 2938091, 2910674, 2889257, 2864946, 2839261, 2811664, 2787347, 2765679, 2742696]
4052B742696k8395k3178k0098k4083k2047k3383k3956k1664j9489k2166j9142
4041B495095j9999k2788k1556j8200j8037j5121j9125j9555j7064j4419j7106
4030B292125j5777j6608j4717j9204j3975j2761j4522j6785j3201j1763j5528
4019B127284j5169j1891j3535j2705j4259j2383j2221j3204j9100j3764j0318
4008A978735j0072j0052j3151j2366j4608j1114r618j2866j2041j0114j1385r997
3996A841351j1091j2448q348j1173r847j1298n599o012p914p294k52r866p787
3983A732422n892p262m889k290n503l801k802n630o289m028l95J260K358J563
3969A688822M939K268N506N240M632Q178J2214Q245J1808J5833K1714K7669L4300
$$ y = [2742696, 2714301, 2691123, 2671025, 2646942, 2624895, 2601512, 2577556, 2555892, 2536403, 2514237, 2495095, 2475096, 2452308, 2430752, 2412552, 2394515, 2379394, 2360269, 2340714, 2323650, 2309231, 2292125, 2276348, 2259740, 2245023, 2225819, 2211844, 2199083, 2184561, 2167776, 2154575, 2142812, 2127284, 2112115, 2100224, 2086689, 2073984, 2059725, 2047342, 2035121, 2021917, 2002817, 1989053, 1978735, 1968663, 1958611, 1945460, 1933094, 1918486, 1907372, 1897754, 1884888, 1872847, 1862733, 1851348, 1841351, 1830260, 1817812, 1809464, 1798291, 1788444, 1777146, 1771547, 1765535, 1757621, 1750327, 1750075, 1740209, 1732422, 1726530, 1719268, 1714379, 1712089, 1706586, 1702785, 1699983, 1694353, 1688064, 1684036, 1683641, 1684901, 1687259, 1688822, 1693761, 1696029, 1701535, 1706775, 1711407, 1719585, 1731799, 1740044, 1751852, 1767685, 1789399, 1817068, 1851368]
3956A851368L9881M6757N6051O8069Q0601R2224J13148J29597J40839J64517J98631
3945B981683K29261K65330K94245K94553K55965J74451N2791q1964k04060k80736
3935C981519l21483l23021k96847k59154k24784j91876j59446j34168j14441j05404
3925A850895r1464p7248o3677n8853n2114m6074m2074l7049l4172k9724l3595
3914A284851l1417k5210k5310k4111k5060k0354k0000k2955j6151j5639j3799
3903A044845j4142j5518j4839j1319j4466j2974j3433j0445r861j2458j1302j0059
3891H94029q932j3862p264o939j1737o912n783r405n722o603q447o433p921q869
3877G79200n245n823o832q846p323n403n392l896n330n461q239n602o486q733
$$ y = [1851368, 1891249, 1938006, 1994057, 2062126, 2142727, 2234951, 2348099, 2477696, 2618535, 2783052, 2981683, 3210944, 3476274, 3770519, 4065072, 4321037, 4495488, 4548279, 4466315, 4262255, 3981519, 3660036, 3337015, 3040168, 2781014, 2556230, 2364354, 2204908, 2070740, 1956299, 1850895, 1759431, 1682183, 1618506, 1559653, 1507539, 1461465, 1419391, 1382342, 1348170, 1318446, 1284851, 1253434, 1228224, 1202914, 1178803, 1153743, 1133389, 1113389, 1090434, 1074283, 1058644, 1044845, 1030703, 1015185, 1000346, 989027, 974561, 961587, 948154, 937709, 927848, 915390, 904088, 894029, 885097, 871235, 863971, 857032, 845295, 838383, 832600, 823195, 817473, 810870, 802423, 795990, 788069, 779200, 773955, 768132, 761300, 752454, 745131, 739728, 734336, 730440, 725110, 719649, 711410, 705808, 699322, 690589]
3863F90589l636l578m615n527p443m634q79p816n880l769m556n263o304n256j353
3848F20080l902l565o028l886n218p115m606l151k675j720o737o514j893j905
3834E61165p957j911n271k878m631m696m199j064l468m739k184m439k457j886
3820E09385o302m316m834o948l336j949j61l491n456j998k126k368m187l789k004
3805D56120l037o048k031k771j751k180j432j626m404J37j306l443m880k45l245
3790D17858k155J023l184l192j564J345l340l777o22j024k153n412j999j338k752
3775C87714J58r5n954k128R90k912m917m931m329M68p63M39m003j059J204K98
3759C60180l708l107k020n13n445m325j675l948J339K605l383l455m076O56j158
$$ y = [690589, 686953, 683375, 678760, 673233, 665790, 661156, 660277, 652461, 646581, 642812, 638256, 632993, 626689, 621433, 620080, 616178, 612613, 606585, 602699, 597481, 590366, 585760, 582609, 579934, 578214, 571477, 564963, 563070, 561165, 553208, 551297, 546026, 543148, 538517, 533821, 529622, 528558, 525090, 520351, 518167, 513728, 511271, 509385, 503083, 498767, 493933, 486985, 483649, 481700, 481539, 478048, 472592, 470594, 468468, 466100, 461913, 458124, 456120, 453083, 447035, 445004, 442233, 440482, 438302, 436870, 435244, 430840, 430977, 429671, 426228, 421348, 421103, 417858, 415703, 416726, 413542, 410350, 408786, 410131, 406791, 403014, 402392, 401368, 399215, 393803, 391804, 390466, 387714, 387872, 387777, 381823, 379695, 380685, 377773, 372856, 367925, 363596, 364064, 363301, 363740, 359737, 358678, 359882, 360180, 356472, 353365, 351345, 350832, 345387, 341062, 339387, 335439, 336778, 339383, 336000, 332545, 328469, 329125, 327967]
3744C27967k274rj946m439o61r86k653j188p52j526P61k359k443k41K07j892l663
3727C01903L55R51j740r88l046k019l188M74m16o80l926q44j188o59k725qJ56
3710B82412n595K80J09j853k396j989P93k125k266m7j482kl884j702J008K00q76
3693B60585j906l05M30m036k53l602p54J335K98l319j966K386j866oL34n117l927
3676B38311j90R84J177p56n144J419K08j422j813k401K02k259j139l6J879k281
3660B26739l441j142j18j244J908j875l972j882j155K170j169k639P11j745k079
3645B09067q21j292l94P00l81p41j208k621J428L445r07n299j760p86l636j624
3629A93170k066k174K535k220j54m9j024l463P67M10K318p10j747k487J169M68
$$ y = [327967, 325693, 325684, 323738, 319299, 318638, 317652, 314999, 313811, 313059, 311533, 312294, 309935, 307492, 307251, 307458, 305566, 301903, 302258, 303209, 301469, 300481, 297435, 295416, 292228, 292702, 292286, 291606, 287680, 286836, 285648, 284989, 282264, 282256, 282412, 276817, 277097, 277206, 275353, 272957, 270968, 271761, 269636, 267370, 267323, 265841, 265839, 261955, 260253, 261261, 261461, 260585, 258679, 258374, 258804, 254768, 254515, 250913, 250159, 251494, 251792, 248473, 246507, 248893, 247027, 247021, 247355, 242238, 238311, 238121, 239105, 240282, 239526, 234382, 235801, 236009, 234587, 232774, 230373, 230575, 228316, 227177, 227141, 229020, 226739, 223298, 222156, 222038, 220794, 222702, 220827, 216855, 214973, 213818, 215988, 214819, 212180, 212891, 211146, 209067, 208246, 206954, 206560, 207260, 206879, 206138, 204930, 202309, 203737, 207182, 206275, 200976, 199216, 198430, 194794, 193170, 191104, 188930, 191465, 189245, 189091, 189042, 188018, 184555, 185322, 185732, 188050, 187340, 185593, 183106, 184275, 184743]
3613A84743k948l001P05o76l17j515J889R82J93l281O33J772j477j440k901p78
3597A72583j062P64j563j342k051K4j126j044l34j985P39n76P77P56M54k910p85
3580A61319l89k420L311J710k372k462k257R17L395l78l29l402k364q72j660n73
3564A51174J260k134k347j714J789k135j669J19p98k06J043L047j704l954J527
3549A43298J55j807J97J612l255J757j802p7k12l236Q81L56j805J555R42J19l25
3532A38353n117l544n08p59p57j284m250J895K423Q30J859lj504J71k916r32j079
3515A22878l494l70j68j042K604M44j449M40j232k60K33J83J566R37qj590j121
3498A18551l448l99j471l190K181k88K109n11P14J550M95P39k627l095j807j657
$$ y = [184743, 181795, 178794, 179499, 178823, 178506, 176991, 178880, 179862, 180055, 176774, 177407, 179179, 177702, 176262, 173361, 172583, 171521, 172285, 170722, 169380, 167329, 167353, 166227, 165183, 164849, 162864, 163603, 163027, 163804, 164560, 165014, 162104, 161319, 160930, 158510, 161821, 163531, 161159, 158697, 156440, 157357, 160752, 160374, 160045, 156643, 154279, 153407, 151747, 151174, 152434, 150300, 147953, 146239, 148028, 145893, 144224, 144343, 143545, 143339, 144382, 147429, 145725, 141771, 143298, 143453, 141646, 141843, 143455, 140200, 141957, 140155, 140078, 139866, 136630, 137511, 137867, 136062, 137617, 138559, 138678, 138353, 133236, 129692, 129184, 128425, 127668, 126384, 122134, 124029, 126452, 127282, 129141, 129138, 127634, 127805, 124889, 123957, 122878, 119384, 119014, 118846, 117804, 120408, 120852, 119403, 119843, 118611, 118351, 118584, 118767, 120333, 121270, 121262, 119672, 118551, 115103, 114704, 113233, 110043, 112224, 111936, 114045, 113534, 114248, 115798, 116293, 117032, 114405, 111310, 109503, 107846]
3482A07846R5k501p40p32j21k441J324K383M182N871j110l647O0j942k703j262
3466A04562k311l475k069o20O64k02r34K962J789J892K003L556P72N05j543n594
3450A01957o066k739n500n102J581j962J414K497J697n1L293K353L427M672J504
3435A02975k434j527J687k948m636k615m272k725O349O136L772K164j147l993
3421I6786l237m274m584k311j944J95j181j37r21k395M779J207K004M02J029J987
3405H7405K132r53n36k367k002K376l049n808R26m99p92n2J680L286K47K192J029
3388H5215r87k230J981k086j093l618k957J852P0j753P01M293l023K229j211q01
3372G6582K951J403m153k364k53l571J756K005n54l81k210J076J513k16j092J437
$$ y = [107846, 107941, 105440, 104700, 103968, 103847, 101406, 102730, 105113, 109295, 115166, 114056, 110409, 110469, 108527, 105824, 104562, 102251, 98776, 96707, 96087, 96751, 96549, 95615, 98577, 100366, 102258, 104261, 107817, 108589, 109094, 107551, 101957, 95891, 93152, 87652, 82550, 84131, 82169, 83583, 86080, 87777, 87726, 91019, 93372, 96799, 101471, 102975, 100541, 99014, 100701, 97753, 93117, 90502, 86230, 83505, 89854, 95990, 99762, 101926, 100779, 96786, 93549, 89275, 84691, 82380, 80436, 80631, 79450, 79313, 78392, 75997, 80776, 81983, 83987, 84389, 85418, 87405, 89537, 88584, 88048, 85681, 83679, 86055, 83006, 77198, 78124, 77625, 76833, 76781, 78461, 81747, 81994, 84186, 85215, 84228, 81998, 83979, 81893, 80800, 77182, 74225, 76077, 76147, 74394, 75095, 79388, 76365, 78594, 77383, 76582, 79533, 80936, 76783, 74419, 74166, 70595, 72351, 74356, 73802, 73421, 71211, 72287, 73800, 73584, 72492, 73929]
3356G3929p69j930q50k582J25J397j007j836J418j314j477N135J8l155M60l27
3340F7235N70K030k817O89n93j466j052j865r70N357J800l223j767m70m65R2N06
3323F3591k375J253k118p47L656O26j548o3j005k617K056L88l164O69J604j733
3307E8473j823J29r0j697J327L590r86k040m31R49j57Q18J426n84k594J242k598
3290E4954r66J113P93k080J513j206M62j450Q31J603P29J114k178O02k95j074
3274E4465k78l478k34M24J650J220l552O10J981k810j155n01J435l57j317L566
3258E1669L08k475M85J844K958j093l899j44J168l117j527N54l0j605J325k596
3242D3825j337J241j53J321k215m33l70J376J043R78O82k284j249j299k680L123
$$ y = [73929, 73160, 71230, 70380, 67798, 67923, 69320, 68313, 66477, 67895, 66581, 65104, 70239, 70257, 67102, 67562, 67235, 67805, 69835, 67018, 67707, 67114, 65648, 64596, 62731, 61761, 67118, 68918, 65695, 63928, 63458, 62993, 63085, 63591, 61216, 62469, 60351, 59604, 63260, 63886, 62338, 62275, 61270, 58653, 60709, 61097, 57933, 58602, 60206, 58473, 56650, 56779, 56689, 54992, 56319, 59909, 58923, 56883, 56452, 57401, 57244, 58062, 59488, 58904, 56310, 57552, 54954, 53988, 55101, 55894, 53814, 55327, 54121, 54583, 53133, 53964, 55567, 56296, 57410, 55232, 55834, 55539, 54465, 54187, 50709, 50475, 50899, 52549, 53769, 50217, 50827, 52808, 49998, 48843, 48342, 49777, 49420, 48103, 51669, 51977, 49502, 49987, 51831, 54789, 53696, 49797, 49653, 50821, 47704, 46177, 46731, 46701, 45096, 46421, 43825, 42488, 43729, 43576, 44897, 42682, 42249, 41879, 43255, 44298, 45276, 45958, 43674, 42425, 41126, 38446, 41569]
3226D1569n56K202O74J57j557q57J123k161J428O24j029l267J271J502j983J125
3210D0265Q45j36k67K123O42p53r03k581j321K883J527m207j658R11O10j154j62
3193C6664K367j28p59n4J098j526N97L984k18l839j196J855o82j365k633n79R22
3176C4508L128q43L389l55j498L56J385j173m321l15q05J929q83j451j435P35
3160C2351j895K892M72M25J715j203k625K836K708k097Mk918k534m14K160K97
3144C2174J282p80n131O31M119j017L67L067q76p48j154K98L2O15k345NJ664j785
3126C0418o69K22j240j107J09J987j263m234L25L565Q55J929o95k78K548l990
3110B8482m99J515N89j870o88L470j034K423j375k048K555O7j118Q05j672j852
$$ y = [41569, 41013, 43215, 43889, 44046, 42489, 41632, 42755, 40594, 42022, 42646, 41617, 38350, 39621, 41123, 39140, 40265, 41110, 40974, 40707, 42830, 43472, 42719, 41816, 39235, 37914, 40797, 42324, 38117, 36459, 37370, 37980, 36826, 36664, 39031, 38903, 38144, 38090, 39188, 37662, 38259, 42243, 42025, 38186, 36990, 38845, 38163, 36798, 34165, 33586, 34508, 37636, 36793, 40182, 39827, 38329, 38685, 40070, 38897, 34576, 34261, 33456, 35385, 34502, 33051, 31616, 32351, 30456, 33348, 33820, 34245, 35960, 34757, 32132, 34968, 37676, 35579, 35583, 32665, 30131, 29717, 31877, 32174, 33456, 32676, 27545, 28176, 32295, 31278, 31645, 34712, 33836, 33088, 31934, 32232, 32264, 32879, 30534, 30539, 32203, 30418, 29749, 29971, 28731, 27624, 27733, 29720, 28457, 24223, 24548, 28113, 28968, 30897, 30202, 29924, 32472, 28482, 27983, 29498, 30087, 28217, 27529, 30999, 29965, 32388, 31013, 28965, 31520, 31587, 30469, 31274, 29602, 27750]
3094B7750K392J58k971r92n30K958j784L57J238P98j858M77q28J227L61J780k455
3077B8078J712L09m96J900L34P88o97N20r91J118k416k69R93j209J579j568j144
3060B8541K843k487k097j735K916Q49j093j220L99J984K58j81J81r86J657O74
3044C0503M1k763o95n56L015n96J347J547P70j168J362j702L477j218J762j146
3028C3980q81p66l017j024k292L875L37o5N72j76k168j730j8j971K327k65J564
3011B8282q67R95K70K191j502j540L5J80k767q93p50j899K763K642M97n01P39
2994B7875j212k38q78L81p01j357p57J472j554k68L831r87j614J806k232k862
2978B0705j69P34J555J312j68j758M57j205j759K77q6J96K038j17k210L056j953
$$ y = [27750, 30142, 30300, 27329, 26337, 25807, 28765, 26981, 27338, 28576, 29374, 27516, 27993, 27165, 28392, 28753, 30533, 28078, 29790, 30099, 29603, 31503, 31837, 32625, 31928, 32448, 31457, 32575, 30159, 29890, 30883, 29674, 31253, 29685, 28541, 31384, 28897, 26800, 25065, 27981, 28830, 27737, 26517, 26916, 28900, 29158, 28977, 29158, 28172, 29829, 30503, 30544, 27781, 27086, 26530, 29545, 28949, 30296, 31843, 32613, 31445, 32807, 31105, 34582, 33364, 35126, 33980, 33099, 32333, 29316, 28292, 26000, 29875, 30212, 30147, 30719, 30543, 28375, 26645, 26627, 24656, 26983, 26718, 28282, 27415, 28410, 28680, 30871, 29369, 27829, 27864, 28044, 25277, 24384, 23634, 21735, 24498, 27140, 27637, 27136, 27875, 26663, 26425, 25547, 25928, 25227, 23870, 23113, 24585, 23031, 22763, 26594, 25607, 23993, 25799, 23567, 20705, 20536, 21270, 22825, 24137, 23969, 22211, 22668, 21463, 19704, 19981, 19895, 20091, 22129, 22012, 19802, 22858, 20905]
2961B0905o63k354Q39J147j43M26Q11J89j159n060N023l230K83q61n97K783j719
2944A6620o49K431j282L79O70O63M38j07J334k171l549K422K198N40l41q31o37
2927A8128R22m183k37j084K288O88k433K410J747j747n255K625r52O02L270K47
2911A7036j423K228o03J238N66j520K28P24J791j407j327R50p11n3j61J588K955
2894B2099J003J299k202k612K974j744j378k006r28p27K827Q23q18n53m17j775
2878A5865j866J112L49J25K907J038n28J689M101j51j964k230m080j652J751k32
2862A6234J213M07j834P14j741K980k725j074k006K174J203p65o97k489J221L996
2846A6811j062j387k235J475L53k00K943j260p6j885Ok426R45J523R58m46n74
$$ y = [20905, 20242, 17888, 18727, 19874, 19731, 20157, 20968, 21157, 19998, 14938, 19961, 16731, 17014, 16153, 15556, 18339, 16620, 15971, 18402, 17120, 17499, 18169, 18832, 19270, 19163, 20497, 18326, 14777, 17199, 19397, 19937, 19596, 18765, 18128, 19050, 14867, 14630, 13546, 15834, 16522, 14089, 16499, 18246, 16499, 11244, 13869, 12917, 13519, 16789, 17036, 15613, 17841, 17238, 18476, 19042, 17522, 17750, 18474, 20265, 18858, 17531, 18481, 17770, 17717, 17556, 19144, 22099, 23102, 24401, 22199, 19587, 22561, 20817, 19439, 17433, 16505, 15778, 18605, 19428, 18610, 18057, 17640, 15865, 13999, 15111, 15460, 15585, 18492, 19530, 19002, 20691, 24792, 24641, 22677, 20447, 16367, 14715, 16466, 16234, 17447, 17854, 16020, 16734, 14993, 17973, 15248, 14174, 12168, 14342, 15545, 14780, 14083, 11594, 12815, 16811, 15749, 14362, 12127, 13602, 13955, 13755, 16698, 15438, 15362, 13477, 13483, 11057, 12002, 13525, 14483, 14037, 13463]
2829A3463p21K303k847j910k54J530k080j274M950j802l879J86r38K95N17L114
2813A0653l073k034L977J601l41k250O49J164J513k272j13n63k07K563P04k15
2797A1756j055K785l69k361J230l99l128J815O19m96J089r80l710J625j76J246
2781I491j296O42k028o03K555Q47J110j29N53M55j501k658N28Q99k2j496R85k649
2763E683j325J567J597j95K429j11k51J603Q75k034N86k97j015k945K501K20j206
2746G682J392l435O15M150k436J882Q70j415N09n69j018l255m064J49O777J547
2730I381J776l009j79J431m7k276K249J659k802j457j786q75J106J5q95Q58K072
2713G221J15K666o39R62n53k326j102n01K058l617J971j676q8Q08J80j807L782
$$ y = [13463, 12742, 15045, 12198, 10288, 10034, 11564, 9484, 8210, 13160, 11358, 7479, 7665, 6727, 7022, 7539, 10653, 7580, 5546, 9523, 11124, 10783, 8533, 9182, 10346, 11859, 9587, 9474, 8911, 8704, 11267, 11971, 11756, 10701, 13486, 13117, 10756, 11986, 11587, 8459, 10274, 10893, 10397, 11486, 10506, 6796, 8421, 8245, 9491, 8195, 8837, 6809, 6206, 8761, 9608, 10718, 10589, 11142, 11597, 10096, 7438, 7966, 8865, 8843, 7347, 8332, 5683, 4358, 5925, 7522, 7327, 9756, 9645, 9394, 10997, 11872, 9838, 10424, 10127, 9112, 6167, 8668, 8888, 7682, 9074, 5639, 6254, 10404, 7968, 9850, 10720, 9305, 9814, 9245, 8227, 4972, 908, 1057, 7834, 9381, 11157, 8148, 7969, 9400, 9353, 7077, 9326, 10985, 8183, 6726, 4940, 4065, 5171, 5186, 4291, 5149, 7221, 7336, 10002, 9363, 10325, 9772, 7446, 6344, 5843, 7901, 4284, 6255, 4579, 4491, 5299, 5479, 3672, 7454]
2696G454j311l98J968M7Q9r36L902k54k167l4k262l863j165M316N88q01Q04j2
2678E965l18K75J75J106J846j679p66q44J598n06k367J750k333J700k301j68J581
2661D714L90K131K595o45k226k626j017K080l194j550J058k138J693j80N44P17
2645B346j12J469M63K024J937j526l765k31q90r08K960J881r75J085j531k121
2629B106j043r60N52j200Q46K156R59K71L85j641r32J388j796j453J472L516j683
2612B943J385O38J33k154J643J45J279J242k15j265k60j096k843K143J825q32
2596D711k787r60K458J06J196p18j094K477n3o64o21J333k76j931K59k489N8P08
2578A713l39j516J548p73k190J708M547J323q12l226k115j7J615m99K34k344J427
$$ y = [7454, 6143, 5745, 7713, 7760, 7849, 6913, 10815, 10561, 8394, 8360, 6098, 2235, 1070, 5386, 5974, 5173, 5977, 5965, 5647, 5922, 6097, 7203, 9049, 7370, 6604, 5760, 7358, 6852, 4485, 6235, 3902, 5602, 3301, 3133, 4714, 5104, 7235, 9830, 9185, 6959, 4333, 3316, 5396, 2202, 652, 1710, -428, 1265, 1085, 1629, 2346, 2234, 3703, 4166, 6190, 8127, 6601, 2836, 2605, 1715, 807, 3767, 5648, 4673, 5758, 4227, 2106, 1063, 103, 655, -545, 301, 2457, 3416, 3687, 4072, 2431, 1499, 2887, 1091, -362, 1110, 4626, 2943, 4328, 4966, 5099, 2945, 4588, 4733, 6012, 7254, 7039, 5774, 5514, 4418, 1575, 3718, 5543, 4711, 1924, 964, 3422, 3528, 4724, 4006, 2912, 5389, 5336, 4672, 4051, 5384, 5108, 3177, 3436, 947, 1005, 1713, 1374, -142, 1406, 633, -1557, 151, 4698, 6021, 5209, 1983, -132, -149, 1466, 967, 1201, -1143, 284]
2561B84K423m468L972j49k246R71j348M566J41j093J158k265J600L78l715k017
2545a808M058K69j478n33j310L254P16q39l97p80m57K206m117K4K415j348J046
2528I21J672j147o81l11j039L64R03K461L30J364k277m20l294J570J180k527J142
2511B11j26J81P11j185J727J0P25O55J503J465o39r67k934k766J044p27j064J426
2493g50M094J26K23k515J264J523l61j918N92N14j13J417L87j711k264p94J499
2476A213j78j31J558j160J061J56j435j987j355M48K628K800J703j189j504q13
2460A815k799q2M114O29j852J974L14m76m98l984o25J210o62J552O2n38L70Q67
2442A391K356l482j95J071j895J657J810l637n17J909k734j718L505O14k081J814
$$ y = [284, 2707, -1761, 2211, 2062, -184, 787, -561, 4005, 4146, 3053, 4211, 1946, 3546, 3924, 209, -1808, 2250, 2519, 1041, 508, -802, 2452, 3168, 2329, 1932, 1152, 695, 2901, -1216, -1192, 1223, -125, 921, 2593, 1446, 765, 454, -585, -221, 682, 3143, 3473, 4837, 2560, 2140, -1154, 416, 1596, -931, 211, 85, 266, 977, -208, 1519, 1529, 2254, 2909, 4412, 5877, 5238, 4271, 1337, -1429, -385, -1112, -2176, -750, 3344, 3470, 3693, 1178, 2442, 3965, 3604, 1686, 2278, 2792, 2679, 4096, 4483, 2772, 508, -286, 1213, 1035, 904, 2462, 1302, 2363, 2519, 1084, -903, -2258, -1810, 818, 3618, 5321, 4132, 2628, 1815, -984, -1066, 3048, 3677, 1825, 3799, 4113, 3637, 3139, -845, -1470, -260, -922, 630, 692, 154, 524, 1391, 3747, 265, 70, 1141, -754, 903, 2713, -924, -1441, 468, -2266, -3984, -479, 135, -1946, -132]
2426a32j192L38J418j924R41K221k363R61N89R88J17m94k093o31N40K354K271
2409C909k64P87j990p39j398k027J642K451j958r67l45L809qj184k415O99K620
2392B622J14k149j052j045M79P38O15J159J196k495j167l78K779k174R00R08q86
2375A64J055k722O55L67O53Q63j481L196J787n386O64L443J394j519P02J349j204
2358C980L87J233j901k952j990j743K549L251k858l030J516j100J485L936k863
2343a00j470J679K100m8j393J86J748L73j733l065O119l561l825J903j642l89
2327c118K001J237j084j673N38L174P16q50k016p6j2j928J196L909k143j755q57
2310b741j820R48K596O59L30J857K223j283l711j960K313j63k953N95L309j162
$$ y = [-132, -1324, -986, 432, -1492, -551, 1670, -693, 268, 857, 1845, 1962, 1468, -625, -1256, -716, 1638, 3909, 3645, 4432, 2442, 1703, 305, -1722, -80, 2371, 413, -554, -899, 2910, 2902, 1718, -697, 2, 2622, 2736, 587, -465, -1510, -1031, -293, 322, 1481, 2677, 182, -985, -1363, 1416, -758, 142, 1050, 164, 1219, -1503, -848, -481, 172, 1035, -446, 2750, 4537, -849, -185, 3258, 4652, 3133, 3835, 5184, 3980, 4367, 5600, 3699, 747, -1243, -2986, -437, 2814, -44, -3074, -1558, -2658, -1173, 2763, -100, -1570, 109, 2209, 2161, 768, 954, 2702, 3075, 1342, -1723, 4396, 835, -2990, -1087, -2729, -3118, -1117, 120, -964, -2637, -2099, 1075, 1791, 941, -1075, -1151, -1163, -3091, -1895, 2014, -129, -1884, -2741, -4561, -3613, -1017, -358, -28, 1829, 4052, 2769, -942, -2902, -589, -752, -3705, -3110, 199, -963]
2294i63k03l550J578K893k329J103J163p77k340n18N28l90J756p0K446N95j92
2277G30J914k861n2j673J4J024P23l440J38K065j952l22J878L639K45j067m04
2260E99l469K331p0j988J307J4k81q20J521P26o95l56J062j625J567l449J213
2243b413J843j798k115r75J465J65J762L33p47R49k21n66Q50m192J448J225j561
2226d548N03p05N42K743j39p29k942P26J750K043J005K025j068q15k729P23J666
2209E1o59L22K530P23r84m65J44q32j428M71j85K817q59k124RO36k032l82N261
2190C014Q09j422k554O16m132J855J805P45L33j081J907Q24o65l776J50J556N72
2173E56J107K759k794n069R0J536J398r79j557K058N13j878j752L89q91L914K71
$$ y = [-963, -1166, -4716, -3138, -245, -2574, -1471, -308, -1085, -3425, -3943, -3415, -3805, -2049, -2119, 327, 922, 730, 2644, -217, -269, -1942, -1928, -904, -181, -3621, -3483, -1418, -3370, -3692, -1814, 1825, 2070, 1003, 599, -2870, -539, -609, -2597, -1290, -1276, -1557, -2377, -856, -130, -825, -1181, -119, -1744, -177, -3626, -2413, -570, -2368, -4483, -5458, -3993, -3828, -2066, -1733, -2480, -1531, -1752, -2318, -1468, -5660, -4212, -2987, -4548, -4045, -4750, -4208, -1465, -1604, -2333, -5275, -4549, -2799, -756, 249, 2274, 1206, 391, -2338, -1615, 51, -608, -286, 2244, 2967, 1983, 1518, 1662, 830, -598, -127, -312, 2505, 1646, -478, -469, 167, -1865, -2247, 3014, 3823, 2401, -153, 463, -3669, -1814, -9, 736, 1069, -12, 1895, 2719, 2054, -1722, -1572, -16, 556, 1663, 4422, 1628, -3441, -3351, -1815, -417, -1396, -2953, -895, -382, -2260, -4012, -3623, -4514, -600, -329]
2156c29l223J309L869j885n73K001J636k934J785J532q53o380K227q85k522K448
2140b777k185J571J025J789P26J931k027k769K312J221j386N68J39j818j009j859
2124d548J953J167L340O59k192l459Q08J077j471J028K373R69n70j275n67K000
2108A292j597L56M47K474j610r34j488J281R22k097k434k076P75K152P07l063
2092d893M397K083o29n27j554k424L42K874j537o78J982J919q31m034L19m79L734
2075F4l80J18l162j893L894n2l686k45N206J179l201L49J755l158j71K300k146
2058c229o69J49q66j253j363L791M317K688k796p54j675Q86q37k675k876L523
2042c639Q56J227J105P0k072m83K515R43n486J499j293M37K894j44k845j099K25
$$ y = [-329, -3552, -2243, 1626, -259, -832, 1169, 2805, -129, 1656, 3188, 2335, -4045, -1818, -2703, -5225, -2777, -4962, -3391, -2366, -577, 149, 2080, 53, -2716, -404, 817, -569, -1, 138, -1680, -2689, -4548, -2595, -1428, 1912, 2571, 379, -3080, -2272, -1195, -2666, -1638, 735, 1704, 1134, -141, -708, 1292, -305, 51, 498, 2972, 1362, 428, -1060, 221, 1143, -954, -3388, -5464, -4689, -2537, -1830, -4893, -496, 1587, 958, 431, -1123, -3547, -3205, -331, -1868, -2546, -564, 1355, 524, -3510, -3191, -3670, 64, -316, -198, -3360, -5253, -1359, -1411, -5097, -5342, -136, 1043, -2158, -1809, -54, -3212, -3383, -1083, -3229, -3898, -3749, -4615, -5868, -7231, -3440, 877, 3565, 769, 15, -1660, -774, -1611, -4286, -7162, -3639, -2783, -1556, -451, -381, -2453, -2936, -421, 522, -4964, -3465, -4758, -4321, -1427, -1571, -4416, -5515, -5290]
2025e290J163K907j70J012m85l474k570L599K169k389Q04J84l164K316o40J129
2009b899M19L32K127m75J44J49j279k075L89L073J814J304l176l13j784j906J00
1992d056K74J97j679L616k070J619J073J44j243p6L594k444p48j784O19Qk80j400
1974d636q26K493R69k388L830n7L24k93j071r23l280Q42K905J960L61j809r26
1957b525k544l769L353J115K343%l210R98o41N32p66R63O46j544l04Q52J842J085
1939a574o72j095K066N57k742k05Q97J231R48j68J90j892J231P59r32k19n86K093
1921a13j430J045K82j84q80k013J903Q09k182K72J043n43L512M25j898l229N40
1904b641p58m55lJ346j734P28J863j1N29k86O99l851J240O06m142j847J156J904
$$ y = [-5290, -4127, -1220, -1390, -378, -863, -4337, -6907, -3308, -1139, -3528, -2724, -2540, -5704, -3388, -4028, -2899, -2480, -2148, -21, -496, -352, -203, -1482, -3557, -3168, -95, 1719, 3023, -153, -466, -2250, -4156, -4056, -3782, -3585, -5264, -1648, -3718, -2099, -1026, -882, -2125, -2201, 1393, -1051, -1799, -3583, -2964, -2956, -3236, -4636, -5462, -2969, -2000, -4388, -558, -615, -291, -584, -1655, -2578, -5858, -5016, -2111, -151, 210, -1599, -2525, -5069, -8838, -5485, -4370, -2027, -2027, -5237, -4239, -4880, -4348, -5114, -4151, -3505, -5049, -5353, -4501, -2659, -1574, -2246, -3341, -1275, -718, -3460, -3665, -2768, -1537, -589, -757, -567, -2459, -1228, -469, -1401, -1620, -2206, -113, -1543, -498, -216, -400, -1280, -3293, -1390, -581, -2763, -2491, -1448, -1991, 1521, 1946, 48, -3181, -2641, -3399, -3854, -3857, -2511, -4245, -3517, -1654, -1665, -1136, -1422, -723, -4574, -3334, -2728, -6870, -8717, -7561, -5657]
1886e657M411o64j943K034J002q22k534J903N46j155J767n77R37k425J355J549
1870b73k571p53n54J794Q8N02J63J155O93j382l18p76j745J90P68j776M73K532
1852a790R81o64L01r89q5j493j246K17K254j209r74L488n83l287k56K714K615
1835fk106l462K695J971P14l006j074J072J145o09n74L247k013N40j044k181O91
1818d000M81j575jL79J945J712k94L62P62k099j899m56n95M89r13J340R08J974
1800a480r43m00R95k668j113L936J988P2j649K741M66J150k308j186k741J97J544
1783a399l38o48j188k119J721L309o74k301K216m58N6o87J442K876k621k57j058
1766b128K72K316J39j805q36j312J872Q87K09K239k296j899N24K503k93k208Q82
$$ y = [-5657, -1246, -1910, -3853, -1819, -817, -1639, -4173, -2270, -1724, -2879, -1112, -1689, -752, -3177, -1822, -273, -2844, -3597, -4151, -2357, -2269, -1767, -1604, -449, 244, -1138, -1456, -2232, -3977, -3787, -3019, -4795, -4322, -1790, -809, -1473, -1172, -2161, -2246, -3739, -4985, -4768, -2514, -3723, -4697, -1209, -1792, -5079, -5335, -2621, -6, -2112, -5574, -2879, -908, -194, -3200, -4274, -3202, -2057, -2666, -3240, 7, -2006, -1466, -2510, -4691, -4000, -3519, -5094, -5095, -4716, -2771, -1059, -1353, -991, -229, -2328, -4227, -4683, -5278, -4789, -5702, -4362, -3454, -1480, -2423, -2823, -1828, -4496, -5609, -1673, 315, 387, -1262, 1479, 1945, 3095, 787, -399, -3140, -2943, -1399, -1737, -2385, -3573, -5692, -3971, -662, -1336, -3637, -1421, -1879, -1823, -2510, -1068, 1808, -813, -1070, -2128, -1856, 460, 599, -1206, -2042, -3354, -1482, -595, -386, 1853, -443, -2342, -1818, 685, 392, -1816, -934]
1749i34k217K230l187k767K752K60L30K171k757K43J027J293j465k62k987J193
1733e077J250j327J761j656k452J360P68J715J12P18K584j71k497l757K272J937
1717b460j333l70j597K093J301J426O5Q18j39J24J279J133k573l47j451M76q92
1700b447j297J182K125O45j972K55j504j789k217K892o20L188j515J783M08o61
1684a544J709J534l440J9L133l615j653J137K02K87P42O08k505J289j594r38O57
1667c972q10j42R5K287Q80j894p67J370p15K549j724k566Q18R4J396l60J515O13
1649a333j370k570J129J72J336n40j196n78K163q66J985q1j992L211o92P22j896
1632b396k226J341Q64n48J84q56J408Q88J231j236k8k788m510J740K656r64M077
$$ y = [-934, -3151, -921, -4108, -6875, -4123, -3863, -3533, -1362, -4119, -3876, -2849, -1556, -3021, -3283, -6270, -5077, -3827, -5154, -3393, -5049, -7501, -6141, -5373, -3658, -3546, -2828, -244, -415, -2912, -6669, -4397, -2460, -3793, -4163, -5760, -3667, -2366, -940, -875, -57, -196, -72, 1207, 2340, -233, -580, -2031, -1555, -2447, -3744, -2562, -437, 208, -1764, -1509, -3013, -4802, -7019, -4127, -4747, -1559, -3074, -1291, -883, -1544, 165, 1699, -1741, -1722, 1411, -2204, -3857, -2720, -2518, -2231, -1489, -881, -3386, -2097, -3691, -4629, -3972, -4782, -4924, -4829, -2542, -1662, -3556, -4323, -2953, -3668, -1119, -2843, -5409, -4591, -4497, -3101, -3461, -1946, -1333, -2703, -5273, -4144, -3972, -2636, -3176, -4372, -4950, -2787, -3653, -1668, -1749, -3741, -530, -1222, -500, -2396, -4622, -3281, -2417, -2965, -2781, -3637, -2229, -1341, -110, -1346, -1374, -4162, -8672, -6932, -4276, -5240, -1163]
1615a163M310k733P20k75k010R04k419j568J641L49J062j99k263J726r5J262m768
1598e519L434o76P57K731p09L06k500j313p62j979J345R83j695L663P85m71L59
1581a261l925L081K660l608P90q56k829q5j95L10L451Q34p57P81j454j059k037
1564f159k9M189K10k054J061l35j710L2K591L164J054m578P07K470j088k75j662
1547b412k86k574L978j518R74n47M9j703r74K37j210K92K549K168l835p25J735
1530c802J739q31J020N55J897l64J16J228J70R43l919l015O95J95K615O3j058
1513a753j482J076m50J148K282j244m62J564k264k391O208l689j018K49J61l71
1497b436M89M6R87q80l099O51J960k096O96q05J796J035j839J019k080O46O93
$$ y = [-1163, 3147, 414, 1134, 859, -1151, -247, -2666, -4234, -2593, -2244, -1182, -1381, -3644, -1918, -2013, -751, -5519, -2085, -2761, -2004, 727, 18, 324, -2176, -3489, -4251, -6230, -4885, -3902, -5597, -1934, -1149, -1620, -1261, -5186, -2105, 555, -3053, -2263, -3119, -5948, -6033, -6228, -5918, -2467, -1633, -2390, -1609, -3063, -4122, -6159, -6188, -1999, -1789, -3843, -2782, -3117, -4827, -4795, -2204, 960, 2014, -2564, -1857, 613, -475, -750, -2412, -2698, -5272, -1294, -2812, -1838, -2385, -2336, -4039, -5013, -4776, -5986, -5694, -3145, -977, -4812, -5537, -3802, -2063, -2894, -1874, -1319, 578, 214, 330, 1558, 1728, 2671, -1248, -4263, -3568, -3373, -758, -695, -1753, -3235, -2159, -2609, -1461, 821, -423, -885, 679, -1585, -3976, 2232, -1457, -2475, -2226, -2065, -2436, -1947, -1901, -914, -1794, -4893, -4242, -2282, -4378, -3682, -4487, -2691, -1656, -3495, -2476, -4556, -3910, -3217]
1480c217j974N833L078j379m417j247K747J867k241k650P97Q16l75K955j242m145
1464d794K176r77J612N97R48L9j61k005n29J893k69k352l52L35P57n16K11p97
1446d184K93K4j978J835n96J669K279P97l58l814o24l68K638j131O86K494l245
1429c583j904K254o00J512K674l210L514k77j588M30J45m68r95J358l451J199
1413b990k76j275K976K473k007K33j759K518j288P09m169J867K516M12K50O89
1397H79j167m299J186K914J689j701o56J055p23k499J587j110J757O38j79J186
1381E57j212J188j639J93K20m228J247K379L93R88K828k543j729L373J658p18
1365B955k074j49M70p91j090j323M435P82q26k148j067j714k107R50K479K000
$$ y = [-3217, -5191, 642, 3720, 2341, -2076, -3323, -576, 1291, -950, -3600, -2803, -1987, -2362, 593, -649, -4794, -2618, -3595, -1983, -1386, -438, -399, -560, -2565, -3094, -1201, -1470, -3822, -4174, -3839, -3082, -3598, -3387, -4184, -3891, -3867, -5845, -4010, -4606, -2937, -658, 139, -219, -4033, -4657, -5025, -2387, -3518, -2832, -338, -3583, -5487, -3233, -3833, -2321, 353, -2857, 657, 380, -1208, -778, -633, -1101, -2096, -738, -4189, -2990, -3266, -4541, -1565, 908, -1099, -866, -2625, -107, -1395, -686, -4855, -2988, -472, -60, 190, 879, -288, -4587, -3401, -487, 1202, -499, -1155, -100, -823, -3322, -1735, -2845, -1088, -450, -629, 557, -655, 533, -1106, -913, -693, -4921, -3674, -1295, -902, 86, 2914, 371, -1358, 2015, 3673, 2955, 881, 732, 1202, 411, -679, -2002, 2433, 3215, 2389, 241, -826, -2540, -4647, -3697, -1218, 782]
1349G82k811Q27P89j791J904q45J13j444J4L206N5l872M23K432R17o34m18q77
1331a230j77L36j137K538K261k621J426j618m50j714j359K933k764L322R17m373
1315c710J492K548j927j06L311m194l179J250j012R39M48r64M6L10n97K182R95
1298b168R12p66j172K05Q95N38M65j091p52P72k236n17L60J755m66J345K293o83
1280c11J04k250j525J562j74J412q4K144n12k068l07J928j252P82k837K221k77
1263a444j901j053k030N05N086L050k449j569l33J1p36Q52J551L102k655P53j541
1246h01j167L101j073o91K075L66N0K25J598l923o5j194J378P43m2N26J527l627
1228i94k27m85j016O9K069J055k966o78J620j161j93o49m84N107k232r81L02k28
$$ y = [782, -2029, -1202, -413, -2204, -300, -1145, -1032, -2476, -2462, 744, 799, -3073, -2650, -218, 699, 65, -353, -1230, -1407, -1071, -2208, 330, 2591, -30, 1396, -222, -672, -2386, -3745, -812, -3576, -254, 663, -3710, -2218, 330, -1597, -1703, 1608, -2586, -5765, -4515, -5527, -4588, -4140, -5104, -5058, -4748, -5345, -3163, -2168, -1256, -2022, -3194, -2989, -2094, -1556, -1091, -2182, -2934, -2162, -4398, -4915, -4555, -2800, -3266, -1921, 372, -311, -207, -2457, -3982, -2420, -2594, -1182, -1266, 878, 366, -1702, -2009, -81, -1333, -551, -3388, -1167, -1444, -3345, -4398, -6428, -5923, -837, 2213, -236, -1805, -2138, -2127, -2863, -2011, -460, 2642, -13, 740, -801, -1968, 1133, 60, -631, 1444, 1810, 1860, 2085, 3683, -240, -305, -1499, -121, 622, 580, 1106, 2633, -994, -1221, -1706, -2722, -2653, -584, 471, -2495, -3173, -1553, -2714, -2907, -3556, -4040, 1067, -1165, -2146, -1844, -2072]
1210b072P59j460Q41m95J601o23K24K417k531k888J904n55L571M703k079j101
1194B216j152p90J549n89j324p75r80j318j701M915L411j405p90j599N45k13p18
1177g18r72k227o7L219J24J229Pj669L03j913J091Q00o4L704k405m02J634j662
1159A2R32k175m93L358j315P81M875k038j352k957q74J156L28J517%j238p13l258
1141c454J454o9L098J65L326l257j082J059l242L262K629k188j272q57K241q02
1125A011j189l76J105l504j083L142r0n11M640O06j748L538l302j188k970j052
1109b971R82N22k542k182R12M932r90j342K607k01J271j010p92J475k219K177
1093F29J504j428J193J692J706l717q21M8j691P70L175p90j414j764r28O21j99
$$ y = [-2072, -1313, -2773, -1932, -2427, -826, -1449, -1225, 1192, -1339, -4227, -2323, -2878, 693, 5396, 3317, 2216, 1064, 274, 1823, 1234, -90, -865, -1845, -3163, -4864, 51, 3462, 2057, 1267, -332, 213, 0, -718, -1690, -3917, -3984, -765, -641, 588, 595, -1074, -771, -2684, -1593, -793, -857, 2847, 442, 40, 1674, 12, 944, -1231, -1724, 1634, 319, 1100, 5975, 3937, 2585, -372, -1246, -90, 238, 1755, 1755, 517, -196, -3454, -2000, -2069, 1029, 1194, 4520, 1263, 181, 1240, -2002, 1260, 3889, 1701, 429, -428, 1813, 1011, -178, -554, 551, -2953, -4036, -894, -984, -1495, 3145, 3751, 2003, 5541, 2239, 1051, -1919, -2971, -1989, -1467, -4009, -6191, -5279, -347, -1337, -2679, -72, -273, 998, -12, -804, 671, -1548, 629, 2133, 705, 1898, 3590, 5296, 1579, 758, 806, -885, -115, 3060, 2270, 856, -908, -1836, -1215, -1414]
1076a414m45k106L534J998J14k771L629P73p65m063j882M216J279j761j295j416
1060b375J776J693Q11j764J370r32k721L285k388J577N590l270k275k254j137
1045c014O48r13M025J109p71j4k983K720L58J565l61l909J521J769N74l194j339
1028b209L083J974l111j496j59K219r57R61j974k313J054oJ288p95QJ64J322R59
1010A2J965j77l361j60j327n67K776m01O91J787j439j850j187J329J077K477N16
993B161j96o96m172K13M141j89j80j374J184j936k286O95L338o08j497K128J598
976B324J093j447O69q6M71J023m085J155J225j56k54J505l028k356K818L93Q57
959B121K472N52p392j787J343K360J454k008K584j923j554O2j21J820M89j354
$$ y = [-1414, -1859, -3965, -431, 1567, 1681, -1090, 2539, 3312, 2547, -1516, -3398, 818, 2097, 336, -959, -2375, -599, 1094, 1905, 141, 1511, 579, -2142, 1143, -1245, 332, 5922, 2652, 377, -1877, -3014, -2366, -3279, 746, 1855, 1084, 1070, -1913, 807, 1165, 2730, 2369, -1540, -19, 1750, 2324, -870, -2209, 874, 2848, -263, -1759, -1918, 301, -656, 305, -1669, -3982, -2928, -2934, -1646, -2441, -2433, -2269, -947, 12, 1977, 1800, -1561, -1721, -3048, -3615, -839, -1240, -549, 1238, -201, -2051, -3238, -1909, -832, 1645, 2161, 1965, 1269, -2903, -2690, 1451, 1262, 1082, -292, 892, -1044, -3330, -2635, 703, 95, -1402, 726, 2324, 3417, 1970, 2639, 2553, 3024, 4047, -38, 1117, 2342, 2186, 1932, 3437, 409, -1947, 871, 1264, 2121, 4593, 5145, -2247, -4034, -2691, -331, 1123, -885, 1699, -224, -1778, -1716, -1837, -17, 472, -882]
943h82p0J161j893k280J649J581P56O51j35j473P91J999j501j149k379K39K32
926b703M44J481J17m19J650r53L018q5k350r92J326J250J886n40j940J340o34
909A896j157P29l25j225J612P16k992r33J612j689L244j278O87M179m223m158
893c305n05L177N53K9n70J824j717j267K471J805j583k530l99K766k264K165n73
876G7k57n98J856J713Q76k82m356J022K706J45R24p80N43l228l4J797j715R28
858A337o01J15m472j566M463P58N06l69j479K577J713q30K0P63o92k41r07J601
840B696k766J257J370j797l101M450PK725J301O7l935k079K650L64jm63k399o9
822B77j88l08l39K312Q15Q64l072J966j163j304J88R2J687Q21m92j145j135P81
$$ y = [-882, -952, 209, -1684, -3964, -2315, -734, 22, 673, 538, -935, -144, 1855, 354, -795, -3174, -2935, -2703, -2259, -778, -661, -1080, 570, -383, 2635, 2550, 200, -792, 534, 1784, 3670, 3130, 1190, 2530, 1896, 739, 1468, 1143, -82, 1530, 2246, -746, -1679, -67, -1756, 1488, 210, 897, 5076, 853, -3305, -3810, -633, -80, -51, -621, 1203, -514, -1781, 690, 2495, 912, -1618, -2017, 749, -1515, 650, 77, -180, -778, 1078, 2791, 3667, 3385, -971, 51, 2757, 2902, 3826, 3046, 3589, 361, 327, 2124, 409, 1337, 736, 851, -3621, -5187, -724, 34, 540, 171, -1308, 1269, 2982, 2152, 2172, 2935, 2243, 2002, 1095, 2696, -70, 1187, 2557, 760, -2341, 2109, 2116, 4841, 6142, 6209, 2274, 195, 2845, 3209, 3208, 2745, 346, 277, 89, -219, -558, 1754, 2569, 3433, 361, 2327, 1164, -140, 48, 140, 1827, 2648, 2156, 1011, -124, 657]
804F57J170O52j87M40P61N52R61j00J259l147k911j097j315L71J086p5K899J240
786C216M32j902j42J06M73q80m92q85M60m95K317j447Q19N84j634L007k006l681
768b150M241K676j619j545n09j161J977N43r63M41L642j655K030j679k435L39
752B173l52M28J862j762j364j265j63K202k827p98J564K034r33k32L99l69Q8k82
734D03M00O85p24M87j073j49J649j654M89l05j913J694q18k694M127r88O80j922
716a626J107K689q22O94k167J489k827L3n34K187K053k899j606K944p42p05j683
699b415J674K432J5K3l136J086J650J761j753l699O08O88J087J02Q26l565O07
682b009K317l309J164K227RJ71K192Q97n14k61j651j199J080J219Q28j798k066
$$ y = [657, 1827, 2479, 2292, 2732, 3493, 4045, 5006, 4906, 6165, 3018, 107, -990, -2305, -1934, -848, -923, 1976, 3216, 3648, 1746, 1604, 1710, 2183, 1303, 811, -74, 386, -109, 2208, 761, 1580, 2164, 530, 3537, 1531, -2150, 2091, 4767, 3148, 1603, 1094, -67, 1910, 2453, 1490, 1931, 5573, 3918, 5948, 4269, 1834, 2173, 1821, 2249, 4111, 2349, 985, -280, -443, 1759, -1068, -1866, -302, 1732, 799, 567, 966, 597, 685, 403, 803, 1488, 764, 1251, 178, 29, 1678, 24, 513, 208, -1705, -11, -829, -3523, 604, -384, 296, -1626, -519, 2170, 1348, 2042, -125, 1364, -1463, -1430, -1964, 223, 2276, -623, -2229, 715, -27, -732, -2415, -741, 1691, 1706, 1729, -1407, -321, 1329, 3090, 1337, -2362, -1754, -1066, 21, 123, 949, -2616, -2009, 308, -3001, -1837, 390, 399, 570, 2762, 3659, 3145, 2884, 1233, 34, 1114, 2333, 3161, 1363, -703]
665g03O75J846J234l865M60o40K177J821N20j995q00r0K354n69K181j333k723
648E50K341q95j737k419L506Jj449Q08J040K782j64l328J364j764j471L727j23
631B769j629m43J356o21n57J678k96k28K045k698k459P32K11N323K88P55l846
614B380o39m24j842L26J264r12Q38j532o90J626j607L02J245M41r5l150N01M160
596B192j938PJ927J680J448m307j096J572l323J576M863k458k313K08N72j244
580f34K240J311K182k712j707L077j737J162p01m583J386M235J941j959k585j003
564h7Q55K35j302J72K042M21j575J152K175j384j371J826j039J605j728J360J25
547C482j524J567O8k069J067n52J382k029j506K89J073N24K026j289j62Q96j986
$$ y = [-703, -28, 1818, 3052, -813, -353, -993, 1184, 3005, 3525, 1530, 730, 640, 2994, 2425, 4606, 3273, 550, 2891, 1996, 259, -2160, 1346, 1347, -102, 706, 1746, 4528, 4364, 1036, 2400, 636, -835, 2892, 2769, 1140, 697, 2053, 1432, 875, 2553, 2257, 2029, 4074, 1376, -1083, -351, -140, 5183, 5471, 6226, 2380, 1741, 1317, -525, -199, 1065, 153, 991, -541, -1231, 395, -1212, -910, 335, 776, 681, -2469, -1968, 2192, 254, 261, 2188, 3868, 5316, 1009, -87, 1485, -1838, -262, 4601, 2143, -170, 38, 610, -634, 1606, 2917, 5099, 2387, 680, 3757, 2020, 3182, 2481, -2102, -716, 3519, 5460, 3501, 916, -87, 768, 1003, -299, -127, 1915, 2336, 761, 1913, 4088, 2704, 1333, 3159, 2120, 3725, 1997, 3357, 3482, 1958, 3525, 3593, 1524, 2591, 2039, 3421, 1392, -114, 175, 1248, 1772, 3798, 2509, 2347, 3243, 1257]
530A257Q51o34j123k51M37K118k23k126L23J031q94j888R18J345J722Q02j534
513B131p40J584M75K348k50l511j008o65r84j947k142K091L732m230L428J805
497B117L453k333n76q94j67J822j614j30R74L174j563n88j167P45O06j552J333
480C640J939n20O2j242M5J219j855l19K21l998K837j556j05J621O75j801m56j281
462h74K757l46J314K87J02R47n61j614P78N34p54j476J405k60n93q10r71k067
444b202j285M169L315m58j454J745l41j662k31L038J242j004Q26M04j101n85j813
427B603l146l58K319K188j976n34K557k85k466l430M647P31j657k391M17q29o66
410b276m77J326J429L074k125O0K296l623O62J659K183L3m808P69K832j48j091
$$ y = [1257, 2108, 1474, 351, 100, 537, 2655, 2432, 306, 629, 1660, 766, -1122, -204, 1141, 2863, 3665, 2131, 1391, 2975, 3450, 5798, 5548, 2037, 1029, 364, -620, -2567, -4709, -2618, 1114, -3116, 312, 2117, 5570, 3237, 2661, 1767, 1600, 3422, 1808, 1678, 2652, 5826, 4263, 3675, 2508, 3253, 3859, 2307, 3640, 5579, 5059, 5121, 3879, 3924, 5143, 3288, 2969, 3190, -808, 2029, 473, 368, 1989, 2664, 863, 407, -874, 1883, 1537, 2851, 3138, 3240, 4187, 3626, 2012, 2790, 3324, 2570, 1094, 2499, 2239, 1646, 836, -135, -2202, -3487, 682, 3997, 3539, 2085, 3830, 3489, 1827, 1596, 4634, 5876, 4872, 5698, 6102, 5001, 4416, 2603, -543, -901, 1418, 3606, 1630, 1096, 3653, 3368, 902, -2528, 2119, 2850, 1193, -1198, -781, -1610, -2276, -2753, -1427, 2, 3076, 951, 1011, 3307, -316, 346, 2005, 4188, 4221, -587, 182, 3014, 2866, 1775]
393A775j419K473r11J88R08K948r98k50k371J30J136j274m644J929L729m5J238
376D542J967K76l885q97j095P20j255k66J969r59M89n59q54K788O75o3K585k485
358C693j847N04m68k000N48K880j055k786R22L063J330q67n82p05K301J998j895
341E034l774J232J550k839J971J016j584k590K033j208J710l390K782j050k96
326E97n06n61J895O25j708J977L118k823k313k940K75K323j78P64J45P34j112
309C12N80N56L160K885j479m441j978K285j4q58k27K65o45o77m28q01K456m99
291D52k198J211J939J301Q11j572J6J071k86k681K326K661k37j071j752R12K385
274E288J308m060J236j42j877O97K108j539j147j144R85J488Q03J899j613j231
$$ y = [1775, 356, 2829, 1918, 2106, 3014, 5962, 4964, 4714, 2343, 2473, 3609, 2335, -2309, -380, 3349, 3304, 4542, 6509, 6785, 2900, 2003, 908, 1628, 373, 107, 2076, 1117, 1606, 1047, 193, 2981, 3656, 3593, 6178, 3693, 1846, 2350, 1882, -118, 430, 3310, 2255, -531, 391, 3454, 4784, 3917, 3335, 2630, 4931, 6929, 5034, 1260, 2492, 4042, 1203, 3174, 4190, 2606, 16, 2049, 841, 2551, -839, 1943, 893, 597, 91, -470, 1425, 2050, 342, 2319, 5437, 2614, 301, -2639, -2364, -41, -219, 545, 690, 1424, 312, 892, 1448, 4608, 7493, 6014, 1573, -405, 1880, 1866, 1008, 781, 1046, 401, -276, -704, -1505, 951, 452, -1746, -535, 1404, 2705, 3516, 1944, 1960, 3031, 2745, 64, 2390, 5051, 4814, 3743, 1991, 2903, 5288, 6596, 2536, 3772, 3630, 1753, 2450, 4558, 3019, 1872, 728, 1713, 3201, 4004, 5903, 4290, 3059]
258C059K172J259k77j606n77j433J693m200K055L27O66J949m33p24J820k573n74
241B603o67J322l687R79L634m36j971L60o55r03Q42q70J690j017l65j047R48K406
223C166p87M9j76L176J8l154j205J68K914k064N15J284l73q2j621K73J255J438
205D794Q70n06j679J765j628k912Q17n04j177J383Q52l2k725K52n46K856R53m37
187B396k094j727R82m49J475J590P35l938M046o16l52K791J577j086M10j692j569
170B479Q9M37l262r69Q78L69j512K032j237K090K602n30j860j397Q86K614J253
153D962k57l876m76L134N03r27p1j830O8J929J588j563j627M24R86k183J17p37
135A64R89J544o6K978J588l184J445j341l190K352L191l29k068r04K04Q25p52
$$ y = [3059, 5231, 6490, 6213, 4607, 4030, 2597, 4290, 90, 2145, 2472, 3138, 5087, 4654, 3930, 5750, 3177, 2603, 1936, 3258, -429, 550, 4184, 3748, 1777, 2137, 1482, 579, 1421, 551, 2241, 1224, 859, -188, 760, 3166, 2379, 2428, 2252, 5428, 5446, 2292, 1087, 1255, 4169, 2105, 2620, 3904, 3531, 3449, 1828, 2101, 3356, 4794, 5664, 5158, 3479, 5244, 3616, 704, 1521, 1017, -160, 1223, 2075, 2043, -682, -430, -976, 1880, 2833, 2396, 302, -1425, -443, -892, 583, 2173, 2908, -1030, 3016, 2400, 2048, 4839, 6416, 5330, 5740, 4048, 2479, 2568, 3005, -257, -1226, -348, 21, -1491, 541, -696, 1394, 3996, 3466, 1606, 209, 1095, 3709, 4962, 4705, 829, 353, 3487, 3990, 3063, 2992, 1162, 1230, 3159, 4747, 3184, 1557, 1981, 2967, 784, 901, 164, 1153, 2697, 2631, 5609, 7197, 4013, 5458, 4117, 927, 3279, 6470, 6141, 4073, 3169, 3373, 4198, 3446]
118C446o72J28K567q00k608k040J320J27Q31J765k14k241J249O04n01P34j151
101B544K985q27k204q22l54Q82L32K030j259n74j057J341j143J80J189j612J152
84B783R65j056l82J637J862j390j615J69M97q22m56j8j263l12K21J15q65m69P88
65C89M57K580r22J757L41k167j549j44R65J316j544M85J518L55K63j638k67K277
47D472R53k676j308J263q2q21j213J814N23J827K256j722k096j652K36R82o23
30B133N43L98O19j239k94k17J317j050r98J88J967J838n94j216n28j520J104R58
12C409J01j002q62J545l59j853M30J970O18j825J819M81
0D472
$$ y = [3446, 2774, 2902, 5469, 4669, 2061, 21, 1341, 1468, 2299, 4064, 3850, 1609, 2858, 3462, 2961, 3695, 2544, 5529, 4702, 2498, 1676, 1322, 2204, 2536, 4566, 3307, 2733, 1676, 3017, 1874, 2054, 3243, 1631, 2783, 3748, 2692, 2310, 3947, 5809, 4419, 2804, 2973, 3470, 2648, 2192, 2174, 911, 599, 820, 935, 70, -399, 389, 846, 3426, 2504, 4261, 4602, 2435, 886, 742, 1707, 3023, 1479, 1964, 3482, 3837, 4100, 2462, 2195, 4472, 5425, 2749, 1441, 2704, 2622, 1801, 588, 2402, 2925, 4752, 7008, 5286, 3190, 1538, 1774, 2756, 2133, 2676, 3074, 3693, 2454, 2160, 1943, 3260, 2210, 1212, 1400, 3367, 5205, 4611, 3395, 2867, 1347, 2451, 3409, 3510, 2508, 1646, 3191, 2832, 979, 1409, 3379, 3997, 2172, 3991, 4472]
$$ Imaginary data points
##PAGE= N=2
##DATA TABLE= (X++(I..I)), XYDATA
16383d40612N450Q083O835O920N746O350O699P021P163O243N539O091N070O741
16369c50661P692M145L861J0310M172N189P928O772N740O477M348P330N365O582
16355b64750P004O241N503M389M779O595Q312O187M945O462N256Q926L849N167
$$ y = [-440612, -435162, -427079, -420244, -413324, -407578, -401228, -394529, -387508, -380345, -374102, -368563, -362472, -357402, -350661, -342969, -338824, -334963, -324653, -320481, -315292, -307364, -300592, -294852, -288375, -284027, -276697, -271332, -264750, -257746, -251505, -246002, -241613, -236834, -230239, -221927, -215740, -210795, -204333, -199077, -190151, -186302, -181135]
$$ [...]
##END NTUPLES=NMR SPECTRUM
##END=
