##TITLE=1H_CA-9263-2
 DMSO-d6
 8 sc, 
 12.4.2024
##JCAMPDX= 6.0         $$ Bruker NMR JCAMP-DX V2.0
##DATA TYPE= NMR SPECTRUM
##DATA CLASS= NTUPLES
##ORIGIN= UXNMR, Bruker Analytische Messtechnik GmbH
##OWNER= root
$$ XWIN-NMR		Version 3.5
$$ Fri Apr 12 14:37:41 2024 Russian Standard Time (UT+4h)  she@DPX200
##.OBSERVE FREQUENCY= 200.1309
##.OBSERVE NUCLEUS= ^1H
##.ACQUISITION MODE= SIMULTANEOUS
##.ACQUISITION SCHEME= undefined
##.AVERAGES= 8
##.DIGITISER RES= 18
##SPECTROMETER/DATA SYSTEM= spect
##.PULSE SEQUENCE= zg30
##.SOLVENT NAME= CDCl3
##.SHIFT REFERENCE= (INTERNAL, CDCl3, 0, 15.5089)
##AUDIT TRAIL= $$ (NUMBER, WHEN, WHO, WHERE, WHAT)
$$ ##TITLE= Audit trail, XWIN-NMR		Version 3.5
$$ ##JCAMPDX= 5.01
$$ ##ORIGIN= Bruker BioSpin GmbH
$$ ##OWNER= she
$$ F:/spectra/data/she/nmr/H-F/1/pdata/1/auditp.txt
$$ ##AUDIT TRAIL=  $$ (NUMBER, WHEN, WHO, WHERE, WHAT)
(   1,<2024-04-12 14:35:45.60 +0400>,<she>,<DPX200>,
      <created by zg, POWCHK disabled, PULCHK disabled
       configuration hash MD5:
       00 E9 B6 7A A2 85 ED C7 34 08 36 98 17 FE 4E 26
       data hash MD5: 16K
       B2 B0 32 72 A6 D9 F9 9F A2 A3 F8 DA 2D 47 37 04>)
(   2,<2024-04-12 14:36:42.42 +0400>,<she>,<DPX200>,
      <Start of raw data processing
       efp BC_mod = 2 LB = 0.24 FT_mod = 6 PKNL = 1 PHC0 = -25298.32 PHC1 = 8.38731 SI = 16K 
       data hash MD5: 16K
       1A 1C 60 0D DA B5 9A AC 11 FA AC 92 DC 93 6B 3E>)
(   3,<2024-04-12 14:36:57.14 +0400>,<she>,<DPX200>,
      <pk PHC0 = -2.360676 PHC1 = 0 
       data hash MD5: 16K
       6F 0B 41 86 BE F4 1C 60 B4 E0 9C 36 B4 36 38 D4>)
(   4,<2024-04-12 14:37:00.98 +0400>,<she>,<DPX200>,
      <abs ABSG = 5 
       data hash MD5: 16K
       88 98 57 97 E0 75 2D F5 12 91 75 BF 8B 80 0D 06>)
$$ ##END=
$$ 
$$ hash MD5
$$ DB 11 86 23 8F 65 1D 7A BE 36 AA FA 50 54 98 BD
##$RELAX= 
##$RELAX= 
##$RELAX= 
##$RELAX= 
##$RELAX= 
##$RELAX= 
$$ Bruker specific parameters
$$ --------------------------
##$DU= <F:/spectra>
##$EXPNO= 1
##$NAME= <H-F>
##$PROCNO= 1
##$TYPE= <nmr>
##$USER= <she>
##$AMP= (0..31)
100 100 100 100 100 100 100 100 100 100 100 100 100 100 100 100 100 100 
100 100 100 100 100 100 100 100 100 100 100 100 100 100 
##$AQSEQ= 0
##$AQ_mod= 1
##$AUNM= <au_zg>
##$AUTOPOS= <>
##$BF1= 200.13
##$BF2= 200.13
##$BF3= 200.13
##$BF4= 200.13
##$BF5= 200.13
##$BF6= 200.13
##$BF7= 200.13
##$BF8= 200.13
##$BYTORDA= 1
##$CFDGTYP= 0
##$CFRGTYP= 5
##$CHEMSTR= <none>
##$CNST= (0..31)
1 1 145 1 1 1 1 1 1 1 1 1 1 1 1 1 1 1 1 1 1 1 1 1 1 1 1 1 1 1 1 1 
##$CPDPRG= <>
##$CPDPRG1= <>
##$CPDPRG2= <>
##$CPDPRG3= <>
##$CPDPRG4= <mlev>
##$CPDPRG5= <mlev>
##$CPDPRG6= <mlev>
##$CPDPRG7= <mlev>
##$CPDPRG8= <mlev>
##$CPDPRGB= <>
##$CPDPRGT= <>
##$D= (0..31)
0 1.2 0 0 0 0 0 0 0 0.06 0 0.03 0 0 0 0 0.0002 0 0 0 0 0 0 0 0 0 0 0 0 
0 0 0 
##$DATE= 1712918145
##$DBL= (0..7)
120 120 120 120 120 120 120 120 
##$DBP= (0..7)
150 150 150 150 150 150 150 150 
##$DBP07= 0
##$DBPNAM0= <>
##$DBPNAM1= <>
##$DBPNAM2= <>
##$DBPNAM3= <>
##$DBPNAM4= <>
$$ [...]
##$SUBNAM3= <"">
##$SUBNAM4= <"">
##$SUBNAM5= <"">
##$SUBNAM6= <"">
##$SUBNAM7= <"">
##$SUBNAM8= <"">
##$SUBNAM9= <"">
##$SW= 18.0517689322627
##$SWIBOX= (0..15)
0 0 2 0 0 0 0 0 0 0 0 0 0 0 0 0 
##$SW_h= 3612.71676300578
##$TD= 16384
##$TD0= 1
##$TE= 0
##$TE2= 300
##$TE3= 300
##$TEG= 300
##$TL= (0..7)
0 120 120 120 120 120 120 120 
##$TP= (0..7)
150 150 150 150 150 150 150 150 
##$TP07= 0
##$TPNAME0= <>
##$TPNAME1= <>
##$TPNAME2= <>
##$TPNAME3= <>
##$TPNAME4= <>
##$TPNAME5= <>
##$TPNAME6= <>
##$TPNAME7= <>
##$TPOAL= (0..7)
0.5 0.5 0.5 0.5 0.5 0.5 0.5 0.5 
##$TPOFFS= (0..7)
0 0 0 0 0 0 0 0 
##$TUNHIN= 0
##$TUNHOUT= 0
##$TUNXOUT= 0
##$USERA1= <user>
##$USERA2= <user>
##$USERA3= <user>
##$USERA4= <user>
##$USERA5= <user>
##$V9= 5
##$VALIST= <valist>
##$VCLIST= <CCCCCCCCCCCCCCC>
##$VD= 0
##$VDLIST= <DDDDDDDDDDDDDDD>
##$VPLIST= <PPPPPPPPPPPPPPP>
##$VTLIST= <TTTTTTTTTTTTTTT>
##$WBST= 1024
##$WBSW= 4
##$XGAIN= (0..3)
0 0 0 0 
##$XL= 0
##$YL= 0
##$YMAX_a= 262378
##$YMIN_a= -343908
##$ZGOPTNS= <>
##$ZL1= 120
##$ZL2= 120
##$ZL3= 120
##$ZL4= 120
##$ABSF1= 15.50893
##$ABSF2= -2.542955
##$ABSG= 5
##$ABSL= 3
##$ALPHA= 0
##$AQORDER= 0
##$ASSFAC= 0
##$ASSFACI= 0
##$ASSFACX= 0
##$ASSWID= 0
##$AUNMP= <proc_1d>
##$AZFE= 0.1
##$AZFW= 0.1
##$BCFW= 0
##$BC_mod= 2
##$BYTORDP= 0
##$COROFFS= 0
##$CY= -3
##$DATMOD= 1
##$DC= 0
##$DFILT= <>
##$DTYPP= 0
##$F1P= 0
##$F2P= 0
##$FCOR= 1
##$FTSIZE= 16384
##$FT_mod= 6
##$GAMMA= 0
##$GB= 0
##$INTBC= 1
##$INTSCL= 3.70164e-10
##$ISEN= 128
##$LB= 0.24
##$LEV0= 0
##$LPBIN= 0
##$MAXI= 10000
##$MC2= 0
##$MEAN= 0
##$ME_mod= 0
##$MI= 1.114404
##$NCOEF= 0
##$NC_proc= -6
##$NLEV= 6
##$NOISF1= 3.799351
##$NOISF2= 2.8
##$NSP= 0
##$NTH_PI= 0
##$NZP= 0
##$OFFSET= 15.50893
##$PC= 1
##$PHC0= -25300.68
##$PHC1= 8.38731
##$PH_mod= 1
##$PKNL= yes
##$PPARMOD= 0
##$PSCAL= 0
##$PSIGN= 0
##$REVERSE= no
##$SF= 200.129602561657
##$SI= 16384
##$SIGF1= 3
##$SIGF2= 2
##$SINO= 5.538805
##$SIOLD= 16384
##$SREGLST= <1H.CDCl3>
##$SSB= 0
##$STSI= 16384
##$STSR= 0
##$SW_p= 3612.71676300577
##$SYMM= 0
##$S_DEV= 0
##$TDeff= 16384
##$TDoff= 0
##$TI= <>
##$TILT= no
##$TM1= 0
##$TM2= 0
##$TOPLEV= 0
##$USERP1= <user>
##$USERP2= <user>
##$USERP3= <user>
##$USERP4= <user>
##$USERP5= <user>
##$WDW= 1
##$XDIM= 16384
##$YMAX_p= 533333754
##$YMIN_p= -905133
$$ End of Bruker specific parameters
$$ ---------------------------------
##NTUPLES= NMR SPECTRUM
##VAR_NAME=  FREQUENCY,     SPECTRUM/REAL,   SPECTRUM/IMAG
##SYMBOL=    X,             R,               I
##VAR_TYPE=  INDEPENDENT,   DEPENDENT,       DEPENDENT
##VAR_FORM=  AFFN,          ASDF,            ASDF
##VAR_DIM=   16384,         16384,           16384
##UNITS=     HZ,            ARBITRARY UNITS, ARBITRARY UNITS
##FACTOR=    0.220516191357247, 1,           1
##FIRST=     3103.79603834306, 0,            0
##LAST=      -508.920724662708, 0,           0
##MIN=       -508.920724662708, -905133,     0
##MAX=       3103.79603834306, 533333754,    0
$$ Real data points
##PAGE= N=1
##DATA TABLE= (X++(R..R)), XYDATA
$$ [...]
6843A982258P8228q9780j23036r8396Q4572J14554j06142R4466L2338j2538J05832
$$ 1982258 2060486 1970706 1847670 1749274 1833846 1948400 1842258 1936724 1969062 1956524 2062356
6832B062356n1280k2865J61758k5844j00798m824K2957L9433J11839j63859j03014
$$ 2062356 2011076 1988211 2149969 2124125 2023327 2018503 2041460 2080893 2192732 2028873 1925859
6821A925859O2611O9770N4635o9500k6165j43034R5560K80479r5493j04652R2523
$$ 1925859 1988470 2058240 2112875 2043375 2017210 1874176 1969736 2250215 2154722 2050070 2142593
6810B142593l0690P9423r6315M0914O2900J03830j5228K9880q884O4662m0278
$$ 2142593 2111903 2191326 2095011 2135925 2198825 2302655 2287427 2317307 2308423 2373085 2332807
6799B332807P9893J24230r28p2589m4361p7391J14593P3721Q530n5905j0129J64795
$$ 2332807 2412700 2536930 2536002 2463413 2419052 2341661 2456254 2529975 2538505 2482600 2472471 2637266
6787B637266J04150o9391k0207j1900L3404j71023N2405R3259M9834K0478M0036
$$ 2637266 2741416 2672025 2651818 2639918 2673322 2502299 2554704 2647963 2697797 2718275 2758311
6776B758311j60883K7200L033l8269K1912L0843j7655J26860J24073M8045j65997
$$ 2758311 2597428 2624628 2627661 2589392 2611304 2642147 2624492 2751352 2875425 2923470 2757473
6765B757473O5128p6681k0236N4955p886P4110r4282L8946K409k0802J16285j24501
$$ 2757473 2822601 2745920 2725684 2780639 2772753 2846863 2752581 2791527 2793936 2773134 2889419 2764918
6753B764918j07864J53109J40343p5975P8165K3337p8998j203J33781Q8584l8657
$$ 2764918 2657054 2810163 2950506 2874531 2952696 2976033 2897035 2895832 3029613 3118197 3079540
6742C079540J08693l9356J00175J22909K2578j64375r087K4113J73459q8242k630
$$ 3079540 3188233 3148877 3249052 3371961 3394539 3230164 3221077 3245190 3418649 3330407 3327777
6731C327777j3113N082l6489P6062K4725J44992O7599O529J29323Q1582L4850
$$ 3327777 3314664 3319746 3283257 3359319 3384044 3529036 3596635 3603164 3732487 3814069 3848919
6720C848919j20611p8899O4678n6904J37286n019j3504O6113J99141R0297J40585
$$ 3848919 3728308 3649409 3714087 3657183 3794469 3789450 3775946 3842059 4041200 4131497 4272082
6709D272082l119l5519N6505J64080n7555j72472O3174M1393l1550J83689Q5233
$$ 4272082 4268963 4233444 4289949 4454029 4396474 4224002 4287176 4328569 4297019 4480708 4565941
6698D565941q1902K730J27092K23291P3444J24953K3371m563k1459R8584J52767
$$ 4565941 4484039 4486769 4613861 4837152 4910596 5035549 5058920 5054357 5032898 5131482 5284249
6687E284249K16843N0372K28490L0163q4380J18415L40401K40655J23184J14065
$$ 5284249 5501092 5551464 5779954 5810117 5725737 5844152 6184553 6425208 6548392 6662457
6677F662457J00976K23353L41415K56681K64290L97666L12717L79006L53829M64017
$$ 6662457 6763433 6986786 7328201 7584882 7849172 8246838 8559555 8938561 9292390 9756407
6667I756407L87881L92879M33643J6836j63953o88l72309k19213l21107k93946
$$ 9756407 10144288 10537167 10970810 10987646 10823693 10823005 10450696 10231483 9910376 9616430
6657I616430m10014l88678k39162l60283j01126j17067P7260j58134k18972k395
$$ 9616430 9206416 8817738 8578576 8218293 8117167 8000100 8077360 7919226 7700254 7697859
6647G697859m4003p9829J47445r1265m103J03320J23208l2514j9713J67697K27570
$$ 7697859 7653856 7574027 7721472 7630207 7626104 7729424 7852632 7820118 7800405 7968102 8195672
6636H195672P3238J50459P2592J34531J82488J67949R2754Q0001K55283J56884
$$ 8195672 8268910 8419369 8491961 8626492 8808980 8976929 9069683 9149684 9404967 9561851
6626I561851M93472K62672L18293N17752L37380L45545M19530M18675L45812L62141
$$ 9561851 10055323 10317995 10636288 11154040 11491420 11836965 12256495 12675170 13020982 13383123
6616A3383123M11640J66167N957J18139j50594l03577n24203n56973m55544m27297
$$ 13383123 13794763 13960930 13966887 14085026 13934432 13630855 13106652 12549679 12094135 11666838
6606A1666838n77878n62078m10929l79997l67184k19339j71944l30155j41437
$$ 11666838 11088960 10526882 10115953 9735956 9368772 9149433 8977489 8647334 8505897
6597H505897r6978k5789j79940j55889j53500j59339j0283m4575L5104k7438k56948
$$ 8505897 8408919 8383130 8203190 8047301 7893801 7734462 7724179 7679604 7714708 7687270 7430322
6586G430322J52101q7913r8065J02936M4991j04613q4193M210j29410O6246P2736
$$ 7430322 7582423 7494510 7396445 7499381 7544372 7439759 7355566 7359776 7230366 7296612 7369348
6575G369348j3402L1604J04190N4451k1664j0842r6334K01007J34426N8638K06617
$$ 7369348 7355946 7387550 7491740 7546191 7524527 7513685 7417351 7618358 7752784 7811422 8018039
6564H018039Q642M927j5651P089J33008J56738K76066J89833Q2560L73716J40449
$$ 8018039 8026681 8031608 8015957 8023046 8156054 8312792 8588858 8778691 8861251 9234967 9375416
6553I375416K76006K29136J88161M13982M50955J28354J64324K73529K11880K39064
$$ 9375416 9651422 9880558 10068719 10482701 10933656 11062010 11226334 11499863 11711743 11950807
6543A1950807p8658j19129q3390j86715j85242k81133k46725l2433j06320j25664
$$ 11950807 11872149 11753020 11669630 11482915 11297673 11016540 10769815 10737382 10631062 10505398
6533A0505398p4916K1704r1542J45015n7205j25268K81432J90125j1207K27158
$$ 10505398 10430482 10452186 10360644 10505659 10448454 10323186 10604618 10794743 10783536 11010694
6523A1010694J55218P449L6334R3731K17805K45707K81395J50539K93952K46679
$$ 11010694 11165912 11173361 11209695 11303426 11521231 11766938 12048333 12198872 12492824 12739503
6513A2739503M62702M09580N47354M71575M25900N84561N96565O27998N93374
$$ 12739503 13202205 13611785 14159139 14630714 15056614 15641175 16237740 16865738 17459112
6504A7459112O20103O48960M90130K51045k2413j10149m26077p09089p18017o94332
$$ 17459112 18079215 18728175 19218305 19469350 19446937 19336788 18910711 18201622 17483605 16789273
6494A6789273p59002n80496m68259m40105m29857m50490k96119l44933k42169
$$ 16789273 16030271 15449775 14981516 14541411 14111554 13661064 13364945 13020012 12777843
6485A2777843p4911j68214l04600q5504j37100j11006l2808p1466J9141J07714
$$ 12777843 12702932 12534718 12230118 12144614 12007514 11896508 11863700 11792234 11811375 11919089
6475A1919089j03826j2564Q358r665J40107M0901J34664P4980k5342J72556K69477
$$ 11919089 11815263 11802699 11811057 11801392 11941499 11982400 12117064 12192044 12166702 12339258 12608735
6464A2608735J65438K72612K37211K11552L31413N07996L19120L36576N77813
$$ 12608735 12774173 13046785 13283996 13495548 13826961 14334957 14654077 14990653 15568466
6455A5568466M63904M81083O25200N53287M73722N29078P22427M65838J30638
$$ 15568466 16032370 16513453 17138653 17691940 18165662 18694740 19417167 19883005 20013643
6446B0013643j07966m5623k71900o73796n77290o55143o66837o20877m28904m90574
$$ 20013643 19905677 19860054 19588154 18914358 18337068 17681925 17015088 16394211 15965307 15474733
6436A5474733k39399m89843l57814k39355o22481k10399k88351j15076j76087
$$ 15474733 15235334 14745491 14387677 14148322 13525841 13315442 13027091 12912015 12735928
6427A2735928k3965R0730k66505j36636j44215r5031M1391N6952j65410J08265
$$ 12735928 12711963 12802693 12536188 12399552 12255337 12160306 12201697 12258649 12093239 12201504
6417A2201504N9739J1199L9792J4488K01779J84366J73195J12583N6914K21169
$$ 12201504 12261243 12272442 12312234 12326722 12528501 12712867 12886062 12998645 13055559 13276728
6407A3276728K07291L02803K50767J80544Q0815J1888k18617p0531k22555k24159
$$ 13276728 13484019 13786822 14037589 14218133 14298948 14310836 14092219 14021688 13799133 13574974
6397A3574974k15634j46109n2624k30343j42395k25325l9689L7521k06500O4858
$$ 13574974 13359340 13213231 13160607 12930264 12787869 12562544 12522855 12560376 12353876 12418734
6387A2418734P217r6101j6108M5075Q7098n9148j9691J56581J04929K49481J37026
$$ 12418734 12425951 12329850 12313742 12358817 12445915 12386767 12367076 12523657 12628586 12878067 13015093
6376A3015093M3903J33675J66503J90323K95262L77421J95805J15940M34795L19160
$$ 13015093 13058996 13192671 13359174 13549497 13844759 14222180 14417985 14533925 14968720 15287880
6366A5287880M13519O71730K09916L70909M44472L95501J54034l3190j33426l8275
$$ 15287880 15701399 16373129 16583045 16953954 17398426 17793927 17947961 17914771 17781345 17743070
6356A7743070j99693l43716l57777n12440m71649l64514n29962k05183k10367
$$ 17743070 17543377 17199661 16841884 16329444 15857795 15493281 14963319 14758136 14547769
6347A4547769j54017j77164k74898q7934k85013k78096L1239j09421k23745n2515
$$ 14547769 14393752 14216588 13941690 13853756 13568743 13290647 13321886 13212465 12988720 12936205
6337A2936205J04713l4229J09707m7731q3620j24057o9707P8589O2242M1168m2704
$$ 12936205 13040918 13006689 13116396 13068665 12985045 12860988 12791281 12869870 12932112 12973280 12930576
6326A2930576K85593R3990Q3494P4220J47705R1351K29047J63833J41232L48501
$$ 12930576 13216169 13310159 13393653 13467873 13615578 13706929 13935976 14099809 14241041 14589542
6316A4589542L50185L55031J79083L24383J82441J17333J47550O4288L3634N6018
$$ 14589542 14939727 15294758 15473841 15798224 15980665 16097998 16245548 16309836 16343470 16399488
6306A6399488j28101l19082j58705k94088k78862k35062k63087k51362j99429
$$ 16399488 16271387 15952305 15793600 15499512 15220650 14985588 14722501 14471139 14271710
6297A4271710j19627j85271r9299k12711k23887j6974J07960l32826k39955j93115
$$ 14271710 14152083 13966812 13867513 13654802 13430915 13413941 13521901 13189075 12949120 12756005
6287A2756005j62278N9417j31296K0930p5262l3273Q3038j8616m8288N5717m5762
$$ 12756005 12593727 12653144 12521848 12542778 12467516 12434243 12517281 12498665 12450377 12506094 12460332
6276A2460332K3457k9790l4369j16937P4199J14357j62159J69692j98540J45011
$$ 12460332 12483789 12453999 12419630 12302693 12376892 12491249 12329090 12498782 12300242 12445253
6266A2445253k3152O7983m5396k2908p0909J23103N9643p1508R0654j01235J6860
$$ 12445253 12422101 12490084 12444688 12421780 12350871 12473974 12533617 12462109 12552763 12451528 12468388
6255A2468388J9425Q4984K14707O7253j27061O41K33028p2791M9197J83771m9864
$$ 12468388 12487813 12572797 12787504 12854757 12727696 12728337 12961365 12888574 12937771 13121542 13071678
6244A3071678K3619R9584p7613o108J00454l215J38934R2662Q1516m0005J46177
$$ 13071678 13095297 13194881 13117268 13111160 13211614 13208399 13347333 13439995 13521511 13481506 13627683
6233A3627683J4903J37793k6047n9837J9907P3347Q2341Q7381j65193K22745r5597
$$ 13627683 13642586 13780379 13754332 13694495 13714402 13787749 13870090 13957471 13792278 14015023 13919426
6222A3919426R9301n252J60046J01714n3768J1190K9375m1162J22965M7989m5605
$$ 13919426 14018727 14013475 14173521 14275235 14221467 14232657 14262032 14220870 14343835 14391824 14346219
6211A4346219J28295N1688J23662M869j39138l4876n7099Q0605L17022J02794
$$ 14346219 14474514 14526202 14649864 14654733 14515595 14480719 14423620 14504225 14821247 14924041
6201A4924041j60124L0347K42025N6469q3078L8694R4396L6639O5633o5023j15227
$$ 14924041 14763917 14794264 15036289 15092758 15009680 15048374 15142770 15179409 15245042 15180019 15064792
6190A5064792J90670J24765J9810k4125j3130N9157N7854j7847r0532K97259N3397
$$ 15064792 15255462 15380227 15400037 15375912 15362782 15421939 15479793 15461946 15371414 15668673 15722070
6179A5722070J7203J67742R227j65456J6385J37185K9590p660J71631q0902m1231
$$ 15722070 15739273 15907015 15916242 15750786 15767171 15904356 15933946 15926286 16097917 16017015 15975784
6168A5975784K57498J49856Q2773P0884M311K9558P6044Q3906k4389L3861J14580
$$ 15975784 16233282 16383138 16465911 16536795 16541106 16570664 16646708 16730614 16706225 16740086 16854666
6157A6854666K7489J0182Q158R0519J8279m6769R5819L6304j3066M6946J37680
$$ 16854666 16882155 16892337 16900495 16991014 17009293 16962524 17058343 17094647 17081581 17128527 17266207
6146A7266207m5912K03559p3579J61165Q8735k25351O3290R0002j6980j05142
$$ 17266207 17220295 17423854 17350275 17511440 17600175 17374824 17438114 17528116 17511136 17405994
6136A7405994l9602J30259J68012K61352j03331J70153O1739N2643L3609Q3899
$$ 17405994 17366392 17496651 17664663 17926015 17822684 17992837 18054576 18107219 18140828 18224727
6126A8224727l5230j43088J57198j34117L2654J40578K09662n3023N7689j1865
$$ 18224727 18189497 18046409 18203607 18069490 18102144 18242722 18452384 18399361 18457050 18445185
6116A8445185R1718O5351o9915M8805J70173J64326M0543M1006L2048r323P4075
$$ 18445185 18536903 18602254 18532339 18581144 18751317 18915643 18956186 18997192 19029240 19019917 19093992
6105A9093992m9851J17431J12533M4519P6406n8964m4056J45739J54606Q2929
$$ 19093992 19044141 19161572 19274105 19318624 19395030 19336066 19292010 19437749 19592355 19675284
6095A9675284K1857J3988R1866R109K8409L0344N7422J21589Q7830J01430Q38
$$ 19675284 19697141 19711129 19802995 19812104 19840513 19870857 19928279 20049868 20137698 20239128 20239966
6084B0239966l990L8013M1502L4466L4744K70352j58865j05454K3277J39098q3005
$$ 20239966 20235976 20273989 20315491 20349957 20384701 20655053 20496188 20390734 20414011 20553109 20470104
6073B0470104m316R020K5829J82548Q2336q1031j43067M2854L10507J48528l7797
$$ 20470104 20465788 20474808 20500637 20683185 20765521 20684490 20541423 20584277 20894784 21043312 21005515
6062B1005515r5650k9552o275J11826J07265n4157J30815m1735J63775M0982m8065
$$ 21005515 20909865 20880313 20874038 20985864 21093129 21038972 21169787 21128052 21291827 21332809 21284744
6051B1284744p8438k8119K24512P1455J09160j40569j08824J22938k5154K7505
$$ 21284744 21206306 21178187 21402699 21474154 21583314 21442745 21333921 21456859 21431705 21459210
6041B1459210J26684M3067j11723l1583l4454L0389J42426N6529J38115K6627
$$ 21459210 21585894 21628961 21517238 21485655 21451201 21481590 21624016 21680545 21818660 21845287
6031B1845287j747J56207O2838j08853M0024M6288j49715M4745J74012L2149J8368
$$ 21845287 21843540 21999747 22062585 21953732 21993756 22040044 21890329 21935074 22109086 22141235 22159603
6020B2159603r7652N0942K21495k1122j6577j98284J83625p0218p521J9216N2960
$$ 22159603 22061951 22112893 22334388 22313266 22296689 22098405 22282030 22211812 22204291 22223507 22276467
6009B2276467P03O3708j83667R4473K3050P351q8183P4504L512r8326O5864P0959
$$ 22276467 22277170 22340878 22157211 22251684 22274734 22282085 22193902 22268406 22271918 22173592 22239456 22310415
5997B2310415l2352J7987p9751N9854K1155j00274j7791j79065J20849k2719k4044
$$ 22310415 22278063 22296050 22216299 22276153 22297308 22197034 22179243 22000178 22121027 22098308 22074264
5986B2074264K39726k2626n6569M776L788j46462j38892J55078K4630J7422j05750
$$ 22074264 22313990 22291364 22234795 22239571 22243359 22096897 21958005 22113083 22137713 22155135 22049385
5975B2049385N9085k3531q8560M4582R0810j48468J06484M6033p9826n3132J36438
$$ 22049385 22108470 22084939 21996379 22040961 22131771 21983303 22089787 22135820 22055994 22002862 22139300
5964B2139300j1440L5752k69074r6805J77171J1582P5295q414N3758k1377j68800
$$ 22139300 22127860 22163612 21894538 21797733 21974904 21986486 22061781 22053367 22107125 22085748 21916948
5953B1916948p9050q8426k4963N8605M0238j89364J7789L5446L4829l3925r8632
$$ 21916948 21837898 21749472 21724509 21783114 21823352 21633988 21651777 21687223 21722052 21688127 21589495
5942B1589495k9152M0130k4536p4872j05831K0345r9221J1832j0282n6352j30097
$$ 21589495 21560343 21600473 21575937 21501065 21395234 21415579 21316358 21328190 21317908 21261556 21131459
5931B1131459r8517m1514Q4115N6685j25170r6847m3065r8319j90745J18818M354
$$ 21131459 21032942 20991428 21075543 21132228 21007058 20910211 20867146 20768827 20578082 20696900 20701254
5920B0701254k11487j80955l4162P8596O8463K2319j83660j34678N026j45014
$$ 20701254 20489767 20308812 20274650 20353246 20421709 20444028 20260368 20125690 20130716 19985702
5910A9985702P48M2873j00623j19511J6150p503O4986j30243J18340k01363j26212
$$ 19985702 19986450 20029323 19928700 19809189 19825339 19817836 19882822 19752579 19870919 19669556 19543344
5899A9543344J05284o7865j6353K8232j79798m2135r4465q4665M8917n5580J43687
$$ 19543344 19648628 19580763 19564410 19592642 19412844 19370709 19276244 19191579 19240496 19184916 19328603
5888A9328603j25539M9348k40326j85908J54576j03563m8504k17096j31858K05293
$$ 19328603 19203064 19252412 19012086 18826178 18980754 18877191 18828687 18611591 18479733 18685026
5878A8685026M9710j18503m5647r2368k71464q2527L0049P640N2127p1872j33288
$$ 18685026 18734736 18616233 18570586 18478218 18206754 18124227 18154276 18161916 18214043 18142171 18008883
5867A8008883j20216j21281j162j5797r7991j68146l828J33221q0837q1661l76255
$$ 18008883 17888667 17767386 17766224 17750427 17652436 17484290 17480462 17613683 17532846 17451185 17074930
5856A7074930j77002K10934j0819j16851l1703r7494j37800k4138o0885j45856
$$ 17074930 16897928 17108862 17098043 16981192 16949489 16851995 16714195 16690057 16629172 16483316
5846A6483316j30826J5694n024J15867k56607j00664j3716j82746O8154j01260
$$ 16483316 16352490 16368184 16363160 16479027 16222420 16121756 16108040 15925294 15993448 15892188
5836A5892188m9237l9357p6388K2846k759n3168m7869m6914j20631j33963P1645
$$ 15892188 15842951 15803594 15727206 15750052 15747293 15694125 15646256 15599342 15478711 15344748 15416393
5825A5416393O877m7547j50876j51656q2298J03125j36872L0887q5360j01548
$$ 15416393 15423270 15375723 15224847 15073191 14990893 15094018 14957146 14988033 14902673 14801125
5815A4801125N2379k8754m2626o0037N769L8463j20641j45884k01440R6796n3710
$$ 14801125 14853504 14824750 14782124 14722087 14727856 14766319 14645678 14499794 14298354 14395150 14341440
5804A4341440K1564L4366k54386p9003n9793M7623j08870r9941l648o779k3690
$$ 14341440 14363004 14397370 14142984 14063981 14004188 14051811 13942941 13843000 13839352 13832573 13808883
5793A3808883j6476j74112j65043n9453m4776n1026n3345m05763l5533J38832
$$ 13808883 13792407 13618295 13453252 13393799 13349023 13297997 13244652 12838889 12803356 12942188
5783A2942188j9371j70114J9444N7855j05503j70103L3063J00951j46259k11976
$$ 12942188 12922817 12752703 12772147 12830002 12724499 12554396 12587459 12688410 12542151 12330175
5773A2330175Q2790N6641m2670q5032m570J335k22892j10674m768j2137m9494
$$ 12330175 12412965 12469606 12426936 12341904 12337334 12338669 12115777 12005103 12000335 11988198 11938704
5762A1938704M2305j50227q1609L1554j14847n5825q1716k7250O4720J37930q8473
$$ 11938704 11981009 11830782 11749173 11780727 11665880 11610055 11528339 11501089 11565809 11703739 11615266
5751A1615266p9655l721j67952l3374M0321J3208k2427j15463j87973J18315q4623
$$ 11615266 11535611 11531890 11363938 11330564 11370885 11384093 11361666 11246203 11058230 11176545 11091922
5740A1091922n5575p7881L0833l402j50550j758j14401Q7522n4128q5565k6900
$$ 11091922 11036347 10958466 10989299 10985897 10835347 10833589 10719188 10806710 10752582 10667017 10640117
5729A0640117p4045j52300j36957J26419J3240N9217j04311j99763l9646n0059
$$ 10640117 10566072 10413772 10276815 10403234 10416474 10475691 10371380 10171617 10131971 10081912
5719A0081912L0986O6713p4955j21405n119j89012j60744q586J31755n4235q6123
$$ 10081912 10112898 10179611 10104656 9983251 9978132 9789120 9628376 9619790 9751545 9697310 9611187
5708I611187j45047K708J11712j8560j83963q0206L305J56004j72132j2216J73869
$$ 9611187 9466140 9468848 9580560 9562000 9378037 9297831 9301136 9457140 9285008 9272792 9446661
5697I446661j64178j69993j00656O6881M4196J08180n9347q2837k35743J1817
$$ 9446661 9282483 9112490 9011834 9078715 9122911 9231091 9171744 9088907 8853164 8864981
5687H864981Q4175p3694J6759p0699o9206J29698K2863q0915O2459l7078l4445
$$ 8864981 8949156 8875462 8892221 8821522 8752316 8882014 8904877 8823962 8886421 8849343 8814898
5676H814898m0882j10260q2064J40472J96468j29518j64643m0045J71817L9956
$$ 8814898 8774016 8663756 8581692 8722164 8918632 8789114 8624471 8584426 8756243 8796199
5666H796199M3297o898r773M1035Q4145o8042J67344j16961J46426J06381j5086
$$ 8796199 8839496 8832598 8822825 8863860 8948005 8879963 9047307 8930346 9076772 9183153 9168067
5655I168067r8041N3569J57814J24286K31646K00380J24423K08876J71880J67833
$$ 9168067 9070026 9123595 9281409 9405695 9637341 9837721 9962144 10171020 10342900 10510733
5645A0510733J69637J15617N1538r8477p4391l89896k84589k86496l57507l14821
$$ 10510733 10680370 10795987 10847525 10749048 10674657 10284761 10000172 9713676 9356169 9041348
5635I041348k02495j08819o7198j92873j28462l48746k43586j0283k42698k1001
$$ 9041348 8838853 8730034 8662836 8469963 8341501 7992755 7749169 7738886 7496188 7475187
5625G475187P2667j21339n148j03825o686k00466N7343o0228r918r9898p4320
$$ 7475187 7547854 7426515 7421367 7317542 7310856 7110390 7167733 7107505 7097587 6997689 6923369
5614F923369K1597k1139j82289r7466k6300L6984l6401L9169l3336n3153Q8577
$$ 6923369 6944966 6923827 6741538 6644072 6617772 6654756 6618355 6657524 6624188 6571035 6659612
5603F659612k7699j45675j5655k64082m3820J14583K5778P26j07717p4319J5934
$$ 6659612 6631913 6486238 6470583 6206501 6162681 6277264 6303042 6303768 6196051 6121732 6137666
5592F137666q5668l0091M7463k26721R1779K0068j39835k498k7363j31495K2203
$$ 6137666 6051998 6021907 6069370 5842649 5934428 5954496 5814661 5812163 5784800 5653305 5675508
5581E675508n6001j30828p2287l3101r5805J13726n1964J95512r7848m0253r3446
$$ 5675508 5619507 5488679 5416392 5383291 5287486 5401212 5349248 5544760 5446912 5406659 5313213
5570E313213j00228J68343j9505j04791j15182J5549p2732L4508j30182j58040
$$ 5313213 5212985 5381328 5361823 5257032 5141850 5157399 5084667 5119175 4988993 4830953
5560D830953l9905K30113K51651p2909k02774j15167L6565N0235p47j20843N4396
$$ 4830953 4791048 5021161 5272812 5199903 4997129 4881962 4918527 4968762 4968015 4847172 4901568
5549D901568J3427j34019p5052J25903J17719m9679l9457J8096K972j33027j8269
$$ 4901568 4914995 4780976 4705924 4831827 4949546 4899867 4860410 4878506 4881478 4748451 4730182
5538D730182M3615l5417Q4488j1821p4605n1365p679L0274k3245Q4763m5702O6361
$$ 4730182 4773797 4738380 4822868 4811047 4736442 4685077 4677398 4707672 4684427 4769190 4723488 4789849
5526D789849k8844j03483L7465P525p3233k5061j26923l9753K3902q793R0521
$$ 4789849 4761005 4657522 4694987 4702512 4629279 4604218 4477295 4437542 4461444 4452651 4543172
5515D543172j86536q2915N6544O8320o0768r5236m493K2582j08614M4534Q6449
$$ 4543172 4356636 4273721 4330265 4398585 4337817 4242581 4238088 4260670 4152056 4196590 4283039
5504D283039r1209j03566O2445q4202R2679n7120l6597p2323q6118M530K2583
$$ 4283039 4191830 4088264 4150709 4066507 4159186 4102066 4065469 3993146 3907028 3911558 3934141
5493C934141r7104l7432K0836K0418j941J74102p3301r8820J92501n7007j75746
$$ 3934141 3837037 3799605 3820441 3840859 3838918 4013020 3939719 3840899 4033400 3976393 3800647
5482C800647n2299N968k5723M0235K2992j9471R2420j28383k2538J01794m2885
$$ 3800647 3748348 3754316 3728593 3768828 3791820 3772349 3864769 3736386 3713848 3815642 3772757
5471C772757K05480n9398l2354j70905L5998k9039K5646L0991P0804m6426R666
$$ 3772757 3978237 3918839 3886485 3715580 3751578 3722539 3748185 3779176 3849980 3803554 3813220
5460C813220R951N141r2484j51371j4526L9221k3420k0829J50210P4409p9864
$$ 3813220 3823171 3828312 3735828 3584457 3569931 3609152 3585732 3564903 3715113 3789522 3709658
5449C709658j64748K12349M8308r4963r3678l8286o9457J04881J60122q9632O0479
$$ 3709658 3544910 3757259 3805567 3710604 3616926 3578640 3509183 3614064 3774186 3684554 3745033
5438C745033j21210j9224j16514k3328N2884j7197p4582P0159l4105q692R6074
$$ 3745033 3623823 3604599 3488085 3464757 3517641 3500444 3425862 3496021 3461916 3453224 3549298
5427C549298O637j43380m6986J65362n542J01791N729q7314j00579J35275P578
$$ 3549298 3555935 3412555 3365569 3530931 3525389 3627180 3632909 3545595 3445016 3580291 3587869
5416C587869j35563J3189n1026Q0018m365Q8584N9933R8906J0533O0894n7969
$$ 3587869 3452306 3465495 3414469 3494487 3490122 3578706 3638639 3737545 3748078 3808972 3751003
5405C751003J37586J82444j20149o4195l8163m5121J49095J45869Q5100o9053
$$ 3751003 3888589 4071033 3950884 3886689 3848526 3803405 3952500 4098369 4183469 4114416
5395D114416P2292R4014J261K30981J3922J00240j1654m4051Q8754J32465L7546
$$ 4114416 4186708 4280722 4281983 4512964 4526886 4627126 4615472 4571421 4660175 4792640 4830186
5384D830186J02070J24640l7037M5124J28855j62716J12677M1517O8942N5037
$$ 4830186 4932256 5056896 5019859 5064983 5193838 5031122 5143799 5185316 5254258 5309295
5374E309295p7761j6395m520j14886n3558J62162J97667k0444L0632L2548J8490
$$ 5309295 5231534 5215139 5210619 5095733 5042175 5204337 5402004 5381560 5412192 5444740 5463230
5363E463230Q21j48573Q6501Q0649J50955J88896P8398K14720J34175J53124J10197
$$ 5463230 5464051 5315478 5401979 5482628 5633583 5822479 5900877 6115597 6249772 6402896 6513093
5352F513093L20777R6450K443p7297l46423l390J18973k9649k59633j41879j02535
$$ 6513093 6833870 6930320 6932763 6855466 6509043 6505653 6624626 6594977 6335344 6193465 6090930
5341F090930Q387j77029k02941j66391k4759l4035n7312k6115K9510l6569J8815
$$ 6090930 6099317 5922288 5719347 5552956 5528197 5494162 5436850 5410735 5440245 5403676 5422491
5330E422491k3374Q8632J7541J80056J23712L6397K59116j0130K39790L7470K2890
$$ 5422491 5399117 5487749 5505290 5685346 5809058 5845455 6104571 6094441 6334231 6371701 6394591
5319F394591K21665J02095j62441J41210P4167j17507j11476k52355k54108j47923
$$ 6394591 6616256 6718351 6555910 6697120 6771287 6653780 6542304 6289949 6035841 5887918
5309E887918k68112j50919k3035k41138q7813j77560r5305J139k17258J8587O0124
$$ 5887918 5619806 5468887 5445852 5204714 5116901 4939341 4844036 4845175 4627917 4646504 4706628
5298D706628j68819r2562q2584N4488j53524k06336K0564M0269p6607J0765L4478
$$ 4706628 4537809 4445247 4362663 4417151 4263627 4057291 4077855 4118124 4041517 4052282 4086760
5287D086760r6083J44772o416n6623j83134j17615Q1927K06595j14020l09841
$$ 4086760 3990677 4135449 4129033 4072410 3889276 3771661 3853588 4060183 3946163 3636322
5277C636322L4848J2297j34897m4753n4244q14k5397k33727q3465j60700l2994
$$ 3636322 3671170 3683467 3548570 3503817 3449573 3448759 3423362 3189635 3106170 2945470 2912476
5266B912476J27365j06065J4278j4956m2157O7720R1901K5288n8545j13869m8243
$$ 2912476 3039841 2933776 2948054 2933098 2890941 2958661 3050562 3075850 3017305 2903436 2855193
5255B855193M5371L1261p7748l0395K054J4621J74857n186m8038M568k8474Q5892
$$ 2855193 2900564 2931825 2854077 2823682 2825736 2840357 3015214 3010028 2961990 2966558 2938084 3023976
5243C023976j63656N108N6424q9359K21623p476j16561Q7365R9166j54440J2300
$$ 3023976 2860320 2865428 2921852 2832493 3054116 3046640 2930079 3017444 3116610 2962170 2974470
5232B974470J4769P881j31546o7682M8002Q1691j19134L1018P2407R8639R4688
$$ 2974470 2989239 2997120 2865574 2797892 2845894 2927585 2808451 2839469 2911876 3010515 3105203
5221C105203M698j27217K426j1536m6542J74186o8855j718r0986j6562N4141k10020
$$ 3105203 3109901 2982684 2985110 2973574 2927032 3101218 3032363 3030645 2939659 2923097 2977238 2767218
5209B767218j88231J55605J71089O0m8328N5599k7787p6009J05739k9174L1898
$$ 2767218 2578987 2734592 2905681 2905741 2857413 2913012 2885225 2809216 2914955 2885781 2917679
5198B917679k3643L5631K1377O5994L8076P7866q526p0912J22754k8686N5594
$$ 2917679 2894036 2929667 2951044 3017038 3055114 3132980 3124454 3053542 3176296 3147610 3203204
5187C203204P7108o8423M1831J09049N4050O7759j48016L7556L5282J65056Q3303
$$ 3203204 3280312 3211889 3253720 3362769 3416819 3484578 3336562 3374118 3409400 3574456 3657759
5176C657759O7208j1062L1607J79804J3101l4618M4739P3262K4486m1361L795
$$ 3657759 3724967 3713905 3745512 3925316 3938417 3903799 3948538 4021800 4046286 4004925 4008720
5165D008720N0985J03892J74419K04466j02289J05371P813J22869J82484q1353
$$ 4008720 4059705 4163597 4338016 4542482 4440193 4545564 4553377 4676246 4858730 4777377
5155D777377q8296J12357J69686K547l5553L1668J79747m2945J84269J57400l0681
$$ 4777377 4689081 4801438 4971124 4973671 4938118 4969786 5149533 5106588 5290857 5448257 5417576
5144E417576J51035P4825n4961R7709O5651M4388O0606J54405J19519J58618O1127
$$ 5417576 5568611 5643436 5588475 5686184 5751835 5796223 5856829 6011234 6130753 6289371 6350498
5133F350498J38260J9997K18579k996L4997N5961J81254J51684K40402J39053
$$ 6350498 6488758 6508755 6727334 6724338 6759335 6815296 6996550 7148234 7388636 7527689
5123G527689J66362L66013K45432K73963K19606L8378K91980J63724J96169M48388
$$ 7527689 7694051 8060064 8305496 8579459 8799065 8837443 9129423 9293147 9489316 9937704
5113I937704K64901K79430K32268K10679L16734L66953M30326M95842K90620N57889
$$ 9937704 10202605 10482035 10714303 10924982 11241716 11608669 12038995 12534837 12825457 13383346
5103A3383346M51888N29702M48172M69560M76639O90415N99355O69208Q35814
$$ 13383346 13835234 14364936 14813108 15282668 15759307 16449722 17049077 17718285 18554099
5094A8554099P33540P17458P20883R98409J378549J287584J183163J413681J710665
$$ 18554099 19287639 20005097 20725980 21724389 23102938 24390522 25573685 26987366 28698031
5085B8698031J499130J558087J892674J841559J790635J940691J900509J846403
$$ 28698031 30197161 31755248 33647922 35489481 37280116 39220807 41121316 42967719
5077D2967719J903233J922736J699343J879350J736977J523022J444367J210030
$$ 42967719 44870952 46793688 48493031 50372381 52109358 53632380 55076747 56286777
5069E6286777R30822R54123Q85660N53438N05070K83635j70384n36239r80033
$$ 56286777 57217599 58171722 59057382 59610820 60115890 60399525 60229141 59692902 58712869
5060E8712869j101744j228342j498777j374808j441897j512120j826016j790827
$$ 58712869 57611125 56382783 54884006 53509198 52067301 50555181 48729165 46938338
5052D6938338k206195k264464k066809k111622j952004j862342j993944j859477
$$ 46938338 44732143 42467679 40400870 38289248 36337244 34474902 32480958 30621481
5044C0621481j807500j767388j720405j833292j357072j530259j388163r98342
$$ 30621481 28813981 27046593 25326188 23492896 22135824 20605565 19217402 18219060
5036A8219060r65865j055491q07091p03156q54425o02697o81790p15721n17767
$$ 18219060 17253195 16197704 15390613 14687457 13833032 13230335 12548545 11832824 11315057
5027A1315057o01935o80397l81950n56332m62780k71581l83075j52701l16499
$$ 11315057 10713122 10032725 9650775 9094443 8631663 8360082 7977007 7824306 7507807
5018G507807l38675k84365m19168j53458k15936l44186l37522k94157m1915k18870
$$ 7507807 7169132 6884767 6465599 6312141 6096205 5752019 5414497 5120340 5078425 4859555
5008D859555L9213q8411j97582j62990o2832K993j58622n8641p4321M1206l43506
$$ 4859555 4898768 4810357 4612775 4449785 4386953 4389946 4231324 4172683 4098362 4139568 3796062
4997C796062j306j9794L6793Q7282r8702o1123j1438L4579j40267m4044P272O362
$$ 3796062 3794756 3774962 3811755 3899037 3800335 3739212 3727774 3762353 3622086 3578042 3585314 3591676
4985C591676Q8115j0207j58483J47060q6948j95978L7541J47842j00980j8082
$$ 3591676 3679791 3669584 3511101 3658161 3571213 3375235 3412776 3560618 3459638 3441556
4975C441556k6713k42555k4216j20603J42003m0060Q929q4997k27019j18385Q7599
$$ 3441556 3414843 3172288 3148072 3027469 3169472 3129412 3138341 3053344 2826325 2707940 2795539
4964B795539n9709o5103k17575r4923K8953L7329j45357M1437n379j24318j14669
$$ 2795539 2735830 2670727 2453152 2358229 2387182 2424511 2279154 2320591 2315212 2190894 2076225
4953B076225K654N61j44396q8919j67530r3970m3934j00787J06925L3763j17083
$$ 2076225 2078879 2079440 1935044 1846125 1678595 1584625 1540691 1439904 1546829 1580592 1463509
4942A463509K5094j44994j6180j04843o9821K6802m8138J25741p7540l5394k9455
$$ 1463509 1488603 1343609 1327429 1222586 1152765 1179567 1131429 1257170 1179630 1144236 1114781
4931A114781j14328R967P2876O8651P8358Q1757j80970J43194m430J0l1656P0409
$$ 1114781 1000453 1010420 1083296 1151947 1230305 1312062 1131092 1274286 1269856 1269866 1238210 1308619
4919A308619N3462K2107L3730J95881j96920O8081K0921l139p3052k8467R0400
$$ 1308619 1362081 1384188 1417918 1613799 1416879 1484960 1505881 1502742 1429690 1401223 1491623
4908A491623J01459N1679j27829N2625k56072K4704J01410q9830J47134N111j08465
$$ 1491623 1593082 1644761 1516932 1569557 1313485 1338189 1439599 1349769 1496903 1502014 1393549
4897A393549O0753M7927p3657n2812m2610p5264j20595R701K2055n2370l3646
$$ 1393549 1454302 1502229 1428572 1375760 1333150 1257886 1137291 1146992 1169047 1116677 1083031
4886A083031j46484Q1730j8567k82447P6084K0041j12020j1930J87867P1371n2080
$$ 1083031 936547 1018277 999710 717263 793347 813388 701368 689438 877305 948676 896596
4875H96596J4878j85834r2104J7846O1973M120j19187j82699J11341J81334p0525
$$ 896596 911474 725640 633536 651382 713355 717475 598288 415589 526930 708264 637739
4864F37739m3073R7856Q6662k9125J1133m5909J0740J05535r0068R2514p1585
$$ 637739 594666 692522 779184 750059 761192 715283 726023 831558 741490 834004 762419
4853G62419K7312m6888R5028J26216O6768R051J150K1237K1817J48968p6111q8551
$$ 762419 789731 742843 837871 964087 1030855 1039906 1041056 1062293 1084110 1233078 1156967 1068416
4841A068416L1115P36m3472L1078O0094j16416n3049J7857R4626R0379j61757
$$ 1068416 1099531 1100267 1056795 1087873 1147967 1031551 978502 996359 1090985 1181364 1019607
4830A019607M897J55853J65471o8670j8049l896n9733j02006j05201k95884J39379
$$ 1019607 1024504 1180357 1345828 1277158 1259109 1255213 1195480 1093474 988273 692389 831768
4819H31768J21997j33157J18212J1645j47457j08610j36688L2506M3435L2975
$$ 831768 953765 820608 938820 950465 803008 694398 557710 590216 633651 666626
4809F66626K2238K553n0183K5040M2517r7103l2347m910J23760p331k15131j07251
$$ 666626 688864 691417 641234 666274 708791 611688 579341 574431 698191 690860 475729 368478
4797C68478R6116l9463j5059K3425r4083J6484J83906m2231P3450J25129J02645
$$ 368478 464594 425131 410072 433497 339414 355898 539804 497573 571023 696152 798797
4786G98797j25381O472K7543J34178Q3371j9484p367j5657M1403k8419m3920K1556
$$ 798797 673416 679888 707431 841609 924980 905496 898129 882472 923875 895456 851536 873092
4774H73092P3053J70010R5163l8965n720J4224k936j4524L3790Q026k7207J04319
$$ 873092 946145 1116155 1211318 1172353 1166633 1180857 1177921 1163397 1197187 1205213 1178006 1282325
4762A282325J47032J7401j13980N9979N5227k3201q3406J27233L4249p8628q5406
$$ 1282325 1429357 1446758 1332778 1392757 1447984 1424783 1341377 1468610 1502859 1424231 1338825
4751A338825j37429R8514J4572j69896O6088j69715j24360P573L4368K2731j5920
$$ 1338825 1201396 1299910 1314482 1144586 1210674 1040959 916599 924172 958540 981271 965351
4740I65351J52622j13031j0681q6470l3309l0836L4620J72447n5492j21889k9469
$$ 965351 1117973 1004942 994261 907791 874482 843646 878266 1050713 995221 873332 843863
4729H43863q1605m0199J43803R4008j31496P3219j58139K77085l4858l0403l8945
$$ 843863 762258 722059 865862 959870 828374 901593 743454 1020539 985681 955278 916333
4718I16333J00077N984n8628J01672J2630K02254j58392N2564q5030J57370J42364
$$ 916333 1016410 1022394 963766 1065438 1078068 1280322 1121930 1174494 1089464 1246834 1389198
4707A389198J66040r0352j33418P7663j10823Q5182J30069M5428j03304P7498
$$ 1389198 1555238 1464886 1331468 1409131 1298308 1383490 1513559 1558987 1455683 1533181
4697A533181J02095q8194j15063j6502L7412M5065L3341K9325O35J79936P9512
$$ 1533181 1635276 1547082 1432019 1415517 1452929 1497994 1531335 1560660 1561295 1741231 1820743
4686A820743j18811n6985L1765j19875n5987J92944Q5310L2096m3564K5954j8041
$$ 1820743 1701932 1644947 1676712 1556837 1500850 1693794 1779104 1811200 1767636 1793590 1775549
4675A775549o3355J24671J73453j67144L9267n3608j74556K60667r212K2455o0652
$$ 1775549 1712194 1836865 2010318 1843174 1882441 1828833 1654277 1914944 1905732 1928187 1867535
4664A867535o0463Q9081n6270O524K55281o6988j30551j3910O3624J03166K78004
$$ 1867535 1807072 1896153 1839883 1846407 2101688 2034700 1904149 1890239 1953863 2057029 2335033
4653B335033P7280j2519k3782O950K34488q8295P3248J02542l841q6628K07353
$$ 2335033 2412313 2399794 2376012 2382962 2617450 2529155 2602403 2704945 2701104 2614476 2821829
4642B821829K01926J77217J85703K07448N0506J80336J79312J56729J27858M0073
$$ 2821829 3023755 3200972 3386675 3594123 3644629 3824965 4004277 4161006 4288864 4328937
4632D328937K55049K86723K97926J29173K45322L74683L29830M95107M56568M18700
$$ 4328937 4583986 4870709 5168635 5297808 5543130 5917813 6247643 6742750 7199318 7618018
4622G618018M32213N18007J64872K98704J87756j11453l13378m35671k51763n83709
$$ 7618018 8050231 8568238 8733110 9031814 9219570 9108117 8794739 8359068 8107305 7523596
4612G523596l86603l97579n42071m32505m45617k36535j97834j26770k76452l15831
$$ 7523596 7136993 6739414 6197343 5764838 5319221 5082686 4884852 4758082 4481630 4165799
4602D165799j78057l21752m8500j69708n8696k18967n0551j45825k05257k62880
$$ 4165799 3987742 3665990 3617490 3447782 3389086 3170119 3119568 2973743 2768486 2505606
4592B505606k53792J45093M1029l22898j4430P8883j16119J04538Q1304L1332
$$ 2505606 2251814 2396907 2437936 2115038 2100608 2179491 2063372 2167910 2249214 2280546
4582B280546j02357q1329q578J34819r9774P0543n1586m0049J7993M0953J1277
$$ 2280546 2178189 2096860 2088282 2223101 2123327 2193870 2142284 2102235 2120228 2161181 2172458
4571B172458L7069O3672l4171j06919o938J93795m9152n5445R7263P2655n2741
$$ 2172458 2209527 2273199 2239028 2132109 2125171 2318966 2269814 2214369 2311632 2384287 2331546
4560B331546R8267J0807Q4872o7975p2651M3363J44535j2947k7529J15765q361
$$ 2331546 2429813 2440620 2525492 2457517 2384866 2428229 2572764 2559817 2532288 2648053 2639692
4549B639692j3034K0309P9821O239J61941r7798K1708R262r9250r7406M7721J32605
$$ 2639692 2626658 2646967 2726788 2733027 2894968 2797170 2818878 2828140 2728890 2631484 2679205 2811810
4537B811810M3295j159P4980K7223j26586J27904Q5493j22804m2069j86477M5430
$$ 2811810 2855105 2853946 2928926 2956149 2829563 2957467 3042960 2920156 2878087 2691610 2737040
4526B737040J36286L3374k6827Q478J41590J58403O7946m9237j39311N9552J91215
$$ 2737040 2873326 2906700 2879873 2888351 3029941 3188344 3256290 3207053 3067742 3127294 3318509
4515C318509K9119O4498Q9277J37442o1050o8224j736J64935J56891J10228P0064
$$ 3318509 3347628 3412126 3501403 3638845 3577795 3509571 3507835 3672770 3829661 3939889 4009953
4504D009953J56452N6895R5079K26021K8486K0632O6414J21087O6103l8787N1429
$$ 4009953 4166405 4223300 4318379 4544400 4572886 4593518 4659932 4781019 4847122 4808335 4859764
4493D859764J72816J86187J12753N3581J75233J13098M5311q1521J62094L24712
$$ 4859764 5032580 5218767 5331520 5385101 5560334 5673432 5718743 5637222 5799316 6124028
4483F124028O4348J80937N2527O0240K06672K47568K24713K20663J46004J11111
$$ 6124028 6188376 6369313 6421840 6482080 6688752 6936320 7161033 7381696 7527700 7638811
4473G638811K29151M16082J0289K62091K79421K41713J70394J38454L55615K79849
$$ 7638811 7867962 8284044 8294333 8556424 8835845 9077558 9247952 9386406 9742021 10021870
4463A0021870K23431M21884M40083L02798L14529L93631L26652N31522M41349
$$ 10021870 10245301 10667185 11107268 11410066 11724595 12118226 12444878 12976400 13417749
4454A3417749L14768N04979N39527O57590M80899O40568N97742O28012Q36607
$$ 13417749 13732517 14237496 14777023 15434613 15915512 16556080 17153822 17781834 18618441
4445A8618441J006525P86625J062408J288861J358537J390065J534138J734014
$$ 18618441 19624966 20411591 21473999 22762860 24121397 25511462 27045600 28779614
4437B8779614J938023K160021K151337K249037K402892K101407J737459J285437
$$ 28779614 30717637 32877658 35028995 37278032 39680924 41782331 43519790 44805227
4429D4805227P10482p5614p01523j498941k047349k333817k432215k318764k169734
$$ 44805227 45515709 45440095 44738572 43239631 41192282 38858465 36426250 34107486 31937752
4420C1937752j910250j684460j445516j440339j382349j146599j107314r86888
$$ 31937752 30027502 28343042 26897526 25457187 24074838 22928239 21820925 20834037
4412B0834037p27386p64027o57158p44932p60145n21810m66611n34666l09519
$$ 20834037 20106651 19342624 18685466 17940534 17180389 16658579 16191968 15657302 15347783
4403A5347783k32514l73341k48435k13919l51977j96113j70409l36761l7690j12983
$$ 15347783 15115269 14741928 14493493 14279574 13927597 13731484 13561075 13224314 13186624 13073641
4393A3073641j19194l0051j05928k8559n1497Q0585J50770L7898r3822J77352
$$ 13073641 12954447 12924396 12818468 12789909 12738412 12818997 12969767 13007665 12913843 13091195
4383A3091195J81114J87619L19140L74249L20207K53707K24458L11194L89067
$$ 13091195 13272309 13459928 13779068 14153317 14473524 14727231 14951689 15262883 15651950
4374A5651950L82118K77458M41303N14315L61772N21448O96421P54177N86970
$$ 15651950 16034068 16311526 16752829 17267144 17628916 18150364 18846785 19600962 20187932
4365B0187932Q42284R10238R51438J163988J228323J278818J544473J818951J972442
$$ 20187932 21030216 21940454 22891892 24055880 25284203 26563021 28107494 29926445 31898887
4356C1898887K144180K374187K659179K573693K685044K591681K152154J747511
$$ 31898887 34043067 36417254 39076433 41650126 44335170 46926851 49079005 50826516
4348E0826516J319701N54939m18815j299151k337480k898064k862000k895022
$$ 50826516 52146217 52701156 52282341 50983190 48645710 45747646 42885646 39990624
4340C9990624k759379k743806k249346j852543j868124j843819j706975j355769
$$ 39990624 37231245 34487439 32238093 30385550 28517426 26673607 24966632 23610863
4332B3610863j357971j287136j258917r41015q38293j085999j187882p46279o12300
$$ 23610863 22252892 20965756 19706839 18765824 17927531 16841532 15653650 14907371 14295071
4323A4295071n44380o81574p96730m57474o60927n66813n58322m18740m01465
$$ 14295071 13750691 13069117 12272387 11814913 11153986 10587173 10028851 9610111 9208646
4314I208646l40774n00022m94402l51492k75337l35996m66602j27902j46264m70211
$$ 9208646 8867872 8367850 7873448 7521956 7246619 6910623 6444021 6316119 6169855 5699644
4304E699644j55825k15498l01982j4849j63676j11893o4430k28855j92506j7716
$$ 5699644 5543819 5328321 5026339 5011490 4847814 4735921 4671491 4442636 4250130 4232414
4294D232414Q1457n2752K3380k1239R546Q0523o3212n0205J5321L3217R9132p9117
$$ 4232414 4313871 4261119 4284499 4263260 4272806 4353329 4290117 4239912 4255233 4288450 4387582 4308465
4282D308465N9601K45359J281J67223j23805Q8647J20392J22075j6849j18028
$$ 4308465 4368066 4613425 4614706 4781929 4658124 4746771 4867163 4989238 4972389 4854361
4272D854361o9138J60752M611j94390j24516M2902O3331J9712j94104k7643K6360
$$ 4854361 4785223 4945975 4950586 4756196 4631680 4674582 4737913 4757625 4563521 4535878 4562238
4261D562238o7578j31716j42974L5248j27508m0039k7654k09308k05756O8948
$$ 4562238 4494660 4362944 4219970 4255218 4127710 4087671 4060017 3850709 3644953 3713901
4251C713901M1630j14028j22845j71509j76433P7038k24649j17344r5830n4962
$$ 3713901 3755531 3641503 3518658 3347149 3170716 3247754 3023105 2905761 2809931 2754969
4241B754969n5435R0605j96022j78706J10085L4125J70210j72801j5818J61883
$$ 2754969 2699534 2790139 2594117 2415411 2525496 2559621 2729831 2557030 2541212 2703095
4231B703095J1321p7199n3616J1848J49580L5756j53234O3756L58597R8002J02834
$$ 2703095 2714416 2637217 2583601 2595449 2745029 2780785 2627551 2691307 3049904 3147906 3250740
4220C250740j9161O6281N4750J61155M01347j4786P4533R8280J15106K68858n2803
$$ 3250740 3231579 3297860 3352610 3513765 3915112 3900326 3974859 4073139 4188245 4457103 4404300
4209D404300J29260J30835K35762L5401R0607K81238m1239L26090J55979K36216
$$ 4404300 4533560 4664395 4900157 4935558 5026165 5307403 5266164 5592254 5748233 5984449
4199E984449M6086K22140M7550p2529J13800L4729M3085J25526J16283N3659n5298
$$ 5984449 6030535 6252675 6300225 6227696 6341496 6376225 6419310 6544836 6661119 6714778 6659480
4188F659480l7103K13383n110k24936j63854j78789N0217k97908j91617j26155
$$ 6659480 6622377 6835760 6830650 6605714 6441860 6263071 6313288 6015380 5823763 5697608
4178E697608k87868l07707j18770k21004j90766k60493q0492O7778k82307p6474
$$ 5697608 5409740 5102033 4983263 4762259 4571493 4311000 4230508 4298286 4015979 3939505
4168C939505j01597J1220k18323P5666k79m154k6507L5900l3545P9426O8408p8337
$$ 3939505 3837908 3849128 3630805 3706471 3706192 3702038 3675531 3711431 3677886 3757312 3825720 3747383
4156C747383M5913J19530Q9309J51499J73660J37984P5742N4501M6687J39319
$$ 3747383 3793296 3912826 4002135 4153634 4327294 4465278 4541020 4595521 4642208 4781527
4146D781527L18594J08465J42104J01361L6766J75972J91733R6295M502M6147
$$ 4781527 5100121 5208586 5350690 5452051 5488817 5664789 5856522 5952817 5957319 6003466
4136F003466Q6279M4196P5862n010K32427P5271n2964J66405M8088Q2176j6178
$$ 6003466 6089745 6133941 6209803 6204793 6437220 6512491 6459527 6625932 6674020 6756196 6740018
4125F740018p2844M7990m2435Q3093m3079J38366p4286j33557L0009k06279K7987
$$ 6740018 6667174 6715164 6672729 6755822 6712743 6851109 6776823 6643266 6673275 6466996 6494983
4114F494983j55722L6754q4769k28783o142j10097n8397M6185j48155j02231L5680
$$ 6494983 6339261 6376015 6291246 6062463 6056321 5946224 5887827 5934012 5785857 5683626 5719306
4103E719306J6951p3424m8201J58653m9880q1660J16443j20224J54149q256J15880
$$ 5719306 5736257 5662833 5614632 5773285 5723405 5641745 5758188 5637964 5792113 5783857 5899737
4092E899737J41246R0160K28022L2410J41708r9283K76752J65323J26439L99339
$$ 5899737 6040983 6131143 6359165 6391575 6533283 6434000 6710752 6876075 7002514 7401853
4082G401853K38794K71537J68138L0487J83962K96509K66338K21275K94694K77796
$$ 7401853 7640647 7912184 8080322 8110809 8294771 8591280 8857618 9078893 9373587 9651383
4072I651383L86267K59935L24857J12614K33847K28439J31836L35534J81048P8846
$$ 9651383 10037650 10297585 10622442 10735056 10968903 11197342 11329178 11664712 11845760 11924606
4062A1924606J91045K09408j6590K72566K33453q8192J88869K25029j31350J47002
$$ 11924606 12115651 12325059 12308469 12581035 12814488 12726296 12915165 13140194 13008844 13155846
4052A3155846O4122j23221L0163j4704m969r6920n4691J80717m4630j21147J54814
$$ 13155846 13219968 13096747 13126910 13112206 13107237 13010317 12955626 13136343 13091713 12970566 13125380
4041A3125380m001r1229N7771O1561j2104j7520j9885M731K42727J22945p407
$$ 13125380 13121379 13030150 13087921 13149482 13137378 13119858 13099973 13104704 13347431 13470376 13462969
4030A3462969q8387R666K01166K07780J15066M2774J18340L05177L54922J67957
$$ 13462969 13374582 13384248 13585414 13793194 13908260 13951034 14069374 14374551 14729473 14897430
4020A4897430K02581K83753K85059L93745L74585M44145L33333O98292M33305
$$ 14897430 15100011 15383764 15668823 16062568 16437153 16881298 17214631 17912923 18346228
4011A8346228L51636N47911L78077N07677O72399N88336N15422O21182N14281
$$ 18346228 18697864 19245775 19623852 20131529 20803928 21392264 21907686 22528868 23043149
4002B3043149M87786N61279M58128O74469Q14898N38573O45267P85343N29390
$$ 23043149 23530935 24092214 24550342 25224811 26039709 26578282 27223549 28008892 28538282
3993B8538282N24581P53907N11317N80162N41717O88821O40733M60103O34359
$$ 28538282 29062863 29816770 30328087 30908249 31449966 32138787 32779520 33239623 33873982
3984C3873982O42776N62480N74361N18544M14742O14740O20090N70324N93036
$$ 33873982 34516758 35079238 35653599 36172143 36586885 37201625 37821715 38392039 38985075
3975C8985075M39108M13987N44518P61622P98993N79160M16389P81668P40772
$$ 38985075 39424183 39838170 40382688 41144310 41943303 42522463 42938852 43720520 44461292
3966D4461292P65291Q67414P44477R27566J025469J023199J179542J289619J176140
$$ 44461292 45226583 46093997 46838474 47766040 48791509 49814708 50994250 52283869 53460009
3957E3460009J116960J349713J353059J471422J668410J578350J839810J981366
$$ 53460009 54576969 55926682 57279741 58751163 60419573 61997923 63837733 65819099
3949F5819099K166480K269168K093471K507261K402787K724353K828242K890337
$$ 65819099 67985579 70254747 72348218 74855479 77258266 79982619 82810861 85701198
3941H5701198L195816L149627L066076L276762L317380L507683L768626L916196
$$ 85701198 88897014 92046641 95112717 98389479 101706859 105214542 108983168 112899364
3933A12899364M198284M267023M224813M741326M972422N194001N664294N709561
$$ 112899364 117097648 121364671 125589484 130330810 135303232 140497233 146161527 151871088
3925A51871088O135448O654109P032617P492889Q063237Q506963R236394J0322319
$$ 151871088 158006536 164660645 171693262 179186151 187249388 195756351 204992745 215315064
3917B15315064J1294676J2025047J3362932J4707151J6105196J7446694J9371133
$$ 215315064 226609740 238634787 251997719 266704870 282810066 300256760 319627893
3910C19627893K0911564K2240817K3723909K4889983K5439351K5010782K3227764
$$ 319627893 340539457 362780274 386504183 411394166 436833517 461844299 485072063
3903D85072063K0022978J5632776R933900K672037n199780j2974232j9824611
$$ 485072063 505095041 520727817 530661717 533333754 528133974 515159742 495335131
3896D95335131k4728510k7125470k7469985k6855192k5321096k3584188k2041676
$$ 495335131 470606621 443481151 416011166 389155974 363834878 340250690 318209014
3889C18209014k0384820j8882685j7480210j6036337j5132770j3941551j2629318
$$ 318209014 297824194 278941509 261461299 245424962 230292192 216350641 203721323
3882B03721323j1716298j0854443j0008349r237199q734926p973523p255834o806494
$$ 203721323 192005025 181150582 171142233 161905034 153170108 145196585 137940751 131134257
3874A31134257o281183o171567n643248n180302n151187m823997m493880m011923
$$ 131134257 124853074 118681507 113038259 107857957 102706770 97882773 93388893 89376970
3866H9376970m227051l742804l573398l360207l313764l210782k730329k699915
$$ 89376970 85149919 81407115 77833717 74473510 71159746 67948964 65218635 62518720
3858F2518720k554366k529799k368587k279501k064315j773924k006469j644147
$$ 62518720 59964354 57434555 55065968 52786467 50722152 48948228 46941759 45297612
3850D5297612j370665j659126j459537j281819j200259j073853r80326j010061
$$ 45297612 43926947 42267821 40808284 39526465 38326206 37252353 36272027 35261966
3842C5261966q75902r18298p84817m52428o18231n70278m46300n44425m08332
$$ 35261966 34386064 33467766 32682949 32230521 31612290 31042012 30595712 30051287 29642955
3833B9642955k55260l41400n97548l25299l11619l20702k16937k41609l05046
$$ 29642955 29387695 29046295 28448747 28123448 27811829 27491127 27274190 27032581 26727535
3824B6727535j76103k11422m74124l37295k11525k09119j91956k69384j56268
$$ 26727535 26551432 26340010 25865886 25528591 25317066 25107947 24915991 24646607 24490339
3815B4490339l29929l54882l54210m49103l05614l49104l40535l49885m68776
$$ 24490339 24160410 23805528 23451318 23002215 22696601 22347497 22006962 21657077 21188301
3806B1188301m74491l57617m03397m13109l94880m47543l52107n78996l36576
$$ 21188301 20713810 20356193 19952796 19539687 19144807 18697264 18345157 17766161 17429585
3797A7429585l85122m12195k90174k70650m32071m06208l42067j74926k21504
$$ 17429585 17044463 16632268 16342094 16071444 15639373 15233165 14891098 14716172 14494668
3788A4494668k41175M3833m9744j41533n8745j7764o7616n3151J85504L9084l9216
$$ 14494668 14253493 14297326 14247582 14106049 14047304 14029540 13961924 13908773 14094277 14133361 14094145
3777A4094145n3675J12863n4238k60363K0855j28374k51214j37947r7127o0731
$$ 14094145 14040470 14153333 14099095 13838732 13859587 13731213 13479999 13342052 13244925 13184194
3767A3184194j65961k9868K4858L379l8029K4915K58975M42743K80544P0170J98522
$$ 13184194 13018233 12988365 13013223 13016602 12978573 13003488 13262463 13705206 13985750 14055920 14254442
3756A4254442K05166M94738L39379M50706N23287K16221M76612O03697L72988
$$ 14254442 14459608 14954346 15293725 15744431 16267718 16483939 16960551 17564248 17937236
3747A7937236L39372K60909J42210j08231j72380l31687l12636q33994o15176
$$ 17937236 18276608 18537517 18679727 18571496 18399116 18067429 17754793 16920799 16305623
3738A6305623n97531p44046m25896l42342m83084k57147n00640l69143l43449
$$ 16305623 15708092 14964046 14538150 14195808 13712724 13455577 12954937 12585794 12242345
3729A2242345k93473k20456l27771p4804j20956o6733l208q6057j53846j09458
$$ 12242345 11948872 11728416 11400645 11325841 11204885 11138152 11134944 11048887 10895041 10785583
3719A0785583k7177j84037n1496n9797k99430k78637j82774k54360k85180q434
$$ 10785583 10758406 10574369 10522873 10463076 10163646 9885009 9702235 9447875 9162695 9154261
3709I154261j89453l60440m39884k33814k66454l60133k04733k31437l50680j83821
$$ 9154261 8964808 8604368 8164484 7930670 7664216 7304083 7099350 6867913 6517233 6333412
3699F333412n1411k0197N6101O3007k48770m3547j22761p2495r444p9496J18938
$$ 6333412 6282001 6261804 6317905 6380912 6132142 6088595 5965834 5893339 5883895 5804399 5923337
3688E923337P4277q5526m4419Q0953n0086N0202O0125m3383J18607J460k39326
$$ 5923337 5997614 5912088 5867669 5948622 5898536 5948738 6008863 5965480 6084087 6085547 5846221
3677E846221j61252N7973l8087J4594j10816J34701n5881j25799n2497j83825
$$ 5846221 5684969 5742942 5704855 5719449 5608633 5743334 5687453 5561654 5509157 5325332
3667E325332j30691O4861L7608j05172j87790j76161j74522j73091L7997j68164
$$ 5325332 5194641 5259502 5297110 5191938 5004148 4827987 4653465 4480374 4518371 4350207
3657D350207j00548j13993j06544l3998l4373j05053k28195j28806o2906n1401
$$ 4350207 4249659 4135666 4029122 3995124 3960751 3855698 3627503 3498697 3435791 3384390
3647C384390j87823q7960M1987M9369q1459l06539J25548J26592n0159k8612k9756
$$ 3384390 3196567 3108607 3150594 3199963 3118504 2811965 2937513 3064105 3013946 2985334 2955578
3636B955578L9311l9K5983J63107J17817J23548j36559J44791q8752K15165L06786
$$ 2955578 2994889 2994850 3020833 3183940 3301757 3425305 3288746 3433537 3344785 3559950 3866736
3625C866736n4369Q4710K26859J89706M0955J55193J7308J37195K96032J89297
$$ 3866736 3812367 3897077 4123936 4313642 4354597 4509790 4527098 4664293 4960325 5149622
3615E149622K4666Q0367K13769J98876n7723K2565R5891j14411j38342n8798r4635
$$ 5149622 5174288 5254655 5468424 5667300 5609577 5632142 5728033 5613622 5475280 5416482 5321847
3604E321847p2190r6919l76072j50569j13614j37847p3053o1898j47830q6447
$$ 5321847 5249657 5152738 4776666 4626097 4512483 4374636 4301583 4239685 4091855 4005408
3594D005408k8144j16802k46327j91212K3071r3276k46253j26020K8297j64964
$$ 4005408 3977264 3860462 3614135 3422923 3445994 3352718 3106465 2980445 3008742 2843778
3584B843778k29430k34108p7561J00130l6191Q393k54659k78320K182k0796M9196
$$ 2843778 2614348 2380240 2302679 2402809 2366618 2375011 2120352 1842032 1844214 1823418 1872614
3573A872614j52708l6930j20306l4971r7222m7435O972Q4648m1422n8180n7023
$$ 1872614 1719906 1682976 1562670 1527699 1430477 1383042 1390014 1474662 1433240 1375060 1318037
3562A318037k4816Q691J57573M7543n8086p003K27332j43559K75234J72055m7703
$$ 1318037 1293221 1301912 1459485 1507028 1448942 1441939 1669271 1525712 1800946 1973001 1925298
3551A925298o7267k24552j0735M1128K24993K7058O7469K3154J16270J8325j80960
$$ 1925298 1858031 1633479 1622744 1663872 1888865 1915923 1983392 2006546 2122816 2141141 1960181
3540A960181K35555M8942j64767l7259K3888J92787l1398K55l1061P7562J99095
$$ 1960181 2195736 2244678 2079911 2042652 2066540 2259327 2227929 2228184 2197123 2274685 2473780
3529B473780r2650j45755m0047j82077n8430Q8084K2133j39176k9363k16905P762
$$ 2473780 2381130 2235375 2195328 2013251 1954821 2042905 2065038 1925862 1896499 1679594 1687356
3518A687356o3071j27071M3844m4574k34501O661j11875k8944l4572q3305o6668
$$ 1687356 1624285 1497214 1541058 1496484 1261983 1268644 1156769 1127825 1093253 1009948 943280
3507I43280j11324m5585k0376Q2044j651k25887K6920J828n8178j26530J20173
$$ 943280 831956 786371 765995 848039 846388 620501 647421 649249 591071 464541 584714
3496E84714L2730j58656J5851M2674J00421j6731k0030K054J43602R4236M465
$$ 584714 617444 458788 474639 517313 617734 601003 580973 583027 726629 820865 825330
3485H25330J03130J2774K777n0396j85549J01884J98650J20263J31352j27144
$$ 825330 928460 941234 944011 893615 708066 809950 1008600 1128863 1260215 1133071
3475A133071J39894P4185o2065J66607k5492J2233j21220M1127J39869J20825
$$ 1133071 1272965 1347150 1285085 1451692 1426200 1438433 1317213 1358340 1498209 1619034
3465A619034k06387n6374J02452j31281j42006J78472J52296j60002n1330k1164
$$ 1619034 1412647 1356273 1458725 1327444 1185438 1363910 1516206 1356204 1304874 1283710
3455A283710n7571m5028P8199j2582r5772o6855n3886J30820k6345k01998l5835
$$ 1283710 1226139 1181111 1259310 1246728 1150956 1084101 1030215 1161035 1134690 932692 896857
3444H96857m9333p4954k18328k9093N7007j7823L664k00654J13156l0176j14974
$$ 896857 847524 772570 554242 525149 582156 564333 567997 367343 480499 450323 335349
3433C35349j16497L226J09920Q9504k26651r3817o1865J84832N0281j9008p4300
$$ 335349 218852 222078 331998 421502 194851 101034 39169 224001 274282 255274 180974
3422A80974m0780L51692m8045M6998M775k7038R4561r3094J52285J08308M4374
$$ 180974 140194 491886 443841 490839 495614 468576 563137 470043 622328 730636 775010
3411G75010L6605L8814n8898j13257J11208k1826j1432k1834K22108K5724Q8406
$$ 775010 811615 850429 791531 678274 789482 767656 756224 734390 956498 982222 1070628
3400A070628L0145j3433l1506m9030N781J08302L6489l3423j13983R1532j23545
$$ 1070628 1100773 1087340 1055834 1006804 1012585 1120887 1157376 1123953 1009970 1101502 977957
3389I77957l4425o5225k31011R6874J37726O8977k27069O0879J37177j3719j35927
$$ 977957 943532 878307 647296 744170 881896 950873 723804 784683 921860 908141 772214
3378G72214M4242j22153N73k1432j21354K4272p1799n5007j11619q3815J777o3690
$$ 772214 816456 694303 694876 673444 552090 576362 504563 449556 337937 254122 255899 192209
3366A92209m2523o9597j49857J25913J13463r8165K6041J67088j68095l1397j26522
$$ 192209 149686 80089 -69768 56145 169608 71443 97484 264572 96477 65080 -61442
3355f1442J58420O2737L9068P313p1228l30j0111N2020p2807Q1681J18220N5984
$$ -61442 96978 159715 198783 206096 134868 134538 124427 176447 103640 185321 303541 359525
3343C59525l3168J07697r8489N4903Q1109l423n638J23058M4038J28413K9159
$$ 359525 326357 434054 335565 390468 471577 468154 462516 585574 629612 758025 787184
3332G87184m7292j6621J41216j68001J86360j47328j23388J9357j8361J86935
$$ 787184 739892 723271 864487 696486 882846 735518 612130 631487 613126 800061
3322H00061O8280l6541p2023J7496p2077k5864k23260P9925n0653k3935J51159
$$ 800061 868341 831800 759777 777273 705196 679332 456072 535997 485344 461409 612568
3311F12568P0921o9275o1351j9733r6420j424L1408p8610j11080Q3949R0947j76651
$$ 612568 683489 614214 552863 533130 436710 435286 466694 388084 277004 360953 451900 275249
3299B75249j33892J52069q3442j19227L0087o6454N7014j45130M8601O8043j13488
$$ 275249 141357 293426 209984 90757 120844 54390 111404 -33726 14875 82918 -30570
3288c0570o1489M6828l2879J30875J59180j2130j4004p6774r980n8342L4037K09261
$$ -30570 -92059 -45231 -78110 52765 211945 199815 185811 109037 99057 40715 74752 284013
3276B84013j00080N4143Q8873j06988K5448J85152j32526j7432J49240J6833q9765
$$ 284013 183933 238076 326949 219961 245409 430561 298035 280603 429843 446676 356911
3265C56911J80961j11582K9214p6218J62605J38531j29767n6030M5581L5433N8614
$$ 356911 537872 426290 455504 379286 541891 680422 550655 494625 540206 575639 634253
3254F34253k32388J17190J71683j67696M0404p2799L5127N9353L6539l7357p2347
$$ 634253 401865 519055 690738 523042 563446 490647 525774 585127 621666 584309 511962
3243E11962q679J76549m8552j08492p9058R720k7564p8652j85094J05950n7049
$$ 511962 503283 679832 631280 522788 443730 453450 425886 347234 162140 268090 211041
3232B11041O1772M841j5241p4666J6763j24236J8679l1652j30438k3902K6234
$$ 211041 272813 277654 262413 187747 204510 80274 98953 67301 -63137 -87039 -60805
3221f0805q0219k00090Q2544J98629K4314n7517J12617N3483j39662q7264o45
$$ -60805 -141024 -341114 -258570 -59941 -35627 -93144 19473 72956 -66706 -153970 -154615
3210a54615K332J42789L9222j81057P3619J03712O1488K2923O1323P8508K9395
$$ -154615 -152283 -9494 29728 -151329 -77710 26002 87490 110413 171736 250244 279639
3199B79639P4958n7581p3739K0873k6963J97299l2482L5432Q5608o8038m7003
$$ 279639 354597 297016 223277 244150 217187 414486 382004 417436 503044 435006 388003
3188C88003p8839M3495R5403N44K9161r99N6336P303r2726m3434j8458J35912
$$ 388003 309164 352659 448062 448606 477767 476768 533104 540407 447681 404247 385789 521701
3176E21701L0305r9395r5682R115j21517R8263P90n7828M8801j09243p8682j26592
$$ 521701 552006 452611 356929 366044 244527 342790 343580 285752 334553 225310 146628 20036
3164B0036K6929j9296L3244J01338l254j68832k20857J82097k4230L2543r3209
$$ 20036 46965 27669 60913 162251 158997 -9835 -230692 -48595 -72825 -40282 -133491
3153a33491J9262M1275j18167N4551R322J39766l5925j21986k8633K2401q6394
$$ -133491 -114229 -72954 -191121 -136570 -127248 12518 -23407 -145393 -174026 -151625 -238019
3142b38019P5041N9965J15835J18422L0058j08835o4557J9999j13257J13857j13513
$$ -238019 -162978 -103013 12822 131244 161302 52467 -12090 7909 -105348 8509 -105004
3131a05004K6935Q7221l3883J40692j48773L2678K23405M9841L4764p3617Q5483
$$ -105004 -78069 9152 -24731 115961 -32812 -134 223271 273112 307876 234259 319742
3120C19742K3287J354J8862R7885J10770J06862l62282j74007P9632J47247j37120
$$ 319742 343029 344383 363245 461130 571900 678762 316480 142473 222105 369352 232232
3109B32232J26087M9003j57183J29686P055j96869j032O5941k0184j6833K4157
$$ 232232 358319 407322 250139 379825 386880 190011 188979 254920 234736 217903 242060
3098B42060j36168R5581N9155j46370K6841j14689j78384O6290J49527o2573J28128
$$ 242060 105892 201473 260628 114258 141099 26410 -151974 -85684 63843 1270 129398
3087A29398j82957n5233J2657j9721k6623J22833N7172p5008j0225R2225n51o8424
$$ 129398 -53559 -108792 -96135 -115856 -142479 -19646 37526 -37482 -47707 44518 43967 -24457
3075b4457j10176k47330K16981O6198n1656l6217l9654J63570N6167n986m4485
$$ -24457 -134633 -381963 -164982 -98784 -150440 -186657 -226311 -62741 -6574 -12560 -57045
3064e7045J90418k8980J2716l5683J07595P094l7913k1645n5360J22925K0461
$$ -57045 133373 104393 117109 81426 189021 196115 158202 136557 81197 204122 224583
3053B24583l6088J07119O7352j06296K3052j28024m501J42047J0056N5332J09912
$$ 224583 188495 295614 362966 256670 279722 151698 147197 289244 299300 354632 464544
3042D64544j6391l28740O3993K89564k2610K2944L4637r4137L1243l1119j84910
$$ 464544 448153 119413 183406 472970 450360 473304 507941 413804 445047 413928 229018
3031B29018O5498j4548r0593j77604J47554N0047j05877n2604n3003K5631j26297
$$ 229018 294516 279968 189375 11771 159325 209372 103495 50891 -2112 23519 -102778
3020a02778P4800P0039j22437j37402n0016J26956p2323m2832J39712j26953K1285
$$ -102778 -27978 42061 -80376 -217778 -267794 -140838 -213161 -255993 -116281 -243234 -221949
3009b21949Q000j66077R5271J40595p8754j3108l5471m4770p3023J72356K5649
$$ -221949 -213949 -380026 -284755 -144160 -222914 -236022 -271493 -316263 -389286 -216930 -191281
2998a91281J31826p8925j3025q5501K5025J87153O9480l2769r1743J4711q884
$$ -191281 -59455 -138380 -151405 -236906 -211881 -24728 44752 11983 -79760 -65049 -73933
2987g3933K42260M6036q807P2121j2228j42247Q6171j7586P330M2044Q778r9979
$$ -73933 168327 214363 205556 277677 265449 123202 209373 191787 199117 241161 249939 149960
2975A49960j23944K12523m9108N7125N0409j35020J47104n9825K5971K4573P429
$$ 149960 26016 238539 189431 246556 296965 161945 309049 249224 275195 299768 307197
2964C07197p0324k21648J07452L8064k17566O8464j42848j1928K07094k9089R086
$$ 307197 236873 15225 122677 160741 -56825 11639 -131209 -143137 63957 34868 43954
2953D3954M856k17433o916M6582r9949n307J59141R7203j35085o1439P056m0814
$$ 43954 48810 -168623 -175539 -128957 -228906 -234213 -75072 22131 -112954 -174393 -167337 -208151
2941b08151R5555N9862N3135o372R468j36724m9297K04177p5053j70293O2913
$$ -208151 -112596 -52734 401 -5971 3497 -133227 -182524 21653 -53400 -223693 -160780
2930a60780j19556q1395J88719K5898m955K0389L3813n6480j19803J26726p688
$$ -160780 -280336 -361731 -173012 -147114 -152069 -131680 -97867 -154347 -274150 -147424 -155112
2919a55112R5716k4100J76489J43429j78144J37850j06461p0623J00335J78829
$$ -155112 -59396 -83496 92993 236422 58278 196128 89667 19044 119379 298208
2909B98208k55011J8114J62308j06585R5321j57590N5391J76518N1697j00834
$$ 298208 43197 61311 223619 117034 212355 54765 110156 286674 338371 237537
2899B37537L5653k6128j01825L2709l7208K63571k21669l0506p2915r5996L3020
$$ 237537 273190 247062 145237 177946 140738 404309 182640 152134 79219 -16777 16243
2888A6243L7279k5367Q8122N4583p8965j04769N7124P478j46892j07238p7987
$$ 16243 53522 28155 116277 170860 91895 -12874 44250 51728 -95164 -202402 -280389
2877b80389M7749Q9124o1344Q4724R7155j26111L3702j50157O0204k4101m2517
$$ -280389 -232640 -143516 -204860 -120136 -22981 -149092 -115390 -265547 -205343 -229444 -271961
2866b71961j17524J82000J78797j59727j27530m124O6003M5358O5656L1397r4034
$$ -271961 -389485 -207485 -28688 -188415 -315945 -320069 -254066 -208708 -143052 -111655 -205689
2855b05689j28544M5701J84688J17852L1951m1885r3244Q4171K56759q3617j05753
$$ -205689 -334233 -288532 -103844 14008 45959 4074 -89170 -4999 251760 168143 62390
2844F2390M0611k5187J37474p9935p1501L0966R8206J6161m6307q03J396N1077
$$ 62390 103001 77814 215288 135353 63852 94818 193024 209185 162878 162075 163471 214548
2832B14548R5931Q2530r9466J953j84266l8685Q3843N9112q3785L3033o3396m0095
$$ 214548 310479 393009 293543 295496 111230 72545 156388 215500 131715 164748 101352 61257
2820F1257M6015m8206j05809J2853k9505q2194J63619j60940l30453m2981K54173
$$ 61257 107272 59066 -46743 -33890 -63395 -145589 18030 -142910 -473363 -516344 -262171
2809b62171Q7740r977o0562N2784k3578J43730n767k2745r8875r4191Q8520Q3353
$$ -262171 -174431 -184408 -244970 -192186 -215764 -72034 -77801 -100546 -199421 -293612 -205092 -121739
2797a21739o8463n0651n5818J42306l5078o4637O5581M9131l3643r7423P4490
$$ -121739 -190202 -240853 -296671 -154365 -189443 -254080 -188499 -139368 -173011 -270434 -195944
2786a95944P3459L9348p7917J14153q2548J54456M5725q1307q4968l8323j7955
$$ -195944 -122485 -83137 -161054 -46901 -129449 25007 70732 -10575 -95543 -133866 -151821
2775a51821J55716n1160O5478J31575K6024j08571j32536Q4803P3443j7853P4339
$$ -151821 3895 -47265 18213 149788 175812 67241 -65295 19508 92951 75098 149437
2764A49437R9458l9896J13981j13676J25567o9491m8476m8455j01372J01199k16
$$ 149437 248895 208999 322980 209304 334871 265380 216904 168449 67077 168276 168060
2753A68060q420l6409l0896n7819m1966J54324j69909J19293k8157n6613K9283
$$ 168060 159640 123231 92335 34516 -7450 146874 -23035 96258 68101 11488 40771
2742D0771j86691R500M6759J53255j9267n2482r16l0317o6915k7313K1917q9537
$$ 40771 -145920 -136420 -89661 63594 44327 -8155 -9071 -39388 -106303 -133616 -111699 -201236
2730b01236p2287M1400Q6485m255m3233n558J56891l453m1884m4300m7000P3755
$$ -201236 -273523 -232123 -145638 -149893 -193126 -198684 -41793 -45246 -87130 -131430 -178430 -104675
2718a04675q6600J09667K3714J2608n4853j12762N0352P7087O6365K45902o1204
$$ -104675 -191275 -81608 -57894 -45286 -100139 -212901 -162549 -85462 -19097 226805 165601
2707A65601j75817O729L4995l2850P9309L8730q3598m2481J20970m5372J07058
$$ 165601 -10216 -3487 31508 -1342 77967 116697 33099 -9382 111588 66216 173274
2696A73274L1524k36717P7435M9507q9426Q6397L5201n4986n6207j49727K30396
$$ 173274 204798 -31919 45516 95023 5597 91994 127195 72209 16002 -133725 96671
2685I6671j37343R8983J41037k01833l4366N3388l3609j64557n7283Q2541J96025
$$ 96671 -40672 58311 199348 -2485 -36851 16537 -17072 -181629 -238912 -156371 39654
2674C9654k5535P164q4777m2995k3137m4851n4372J51540j36666j9843K5459n4275
$$ 39654 14119 21283 -63494 -106489 -129626 -174477 -228849 -77309 -213975 -233818 -208359 -262634
2662b62634m7355R0842L3038j51415k4104M6697J29256k122O9244j28474j45119
$$ -262634 -309989 -219147 -186109 -337524 -361628 -314931 -185675 -187797 -118553 -247027 -392146
2651c92146J59742J69855n7925j64428J61909P0265q5092J17139k5725P8763l8420
$$ -392146 -232404 -62549 -120474 -284902 -122993 -52728 -137820 -20681 -46406 32357 -6063
2640f063R2177O9469L1491L0307p7565r7438m850q1967K9082n3218j4089K44815
$$ -6063 86114 155583 187074 217381 139816 42378 37528 -44439 -15357 -68575 -82664 162151
2628A62151J01077j21636m9322J3537k9477j21318k198J44538J57623J46967j23435
$$ 162151 263228 141592 92270 105807 76330 -44988 -47186 97352 254975 401942 278507
2617B78507j44922Q3363n2049K4521l3502p6976K6202j84858j7559J4332j6146
$$ 278507 133585 216948 164899 189420 155918 78942 105144 -79714 -97273 -82941 -99087
2606i9087J57532O0931o8359j08206J33523J7529j24949J2909Q878Q9919o0343
$$ -99087 58445 119376 51017 -57189 76334 93863 -31086 -18177 -9299 80620 20277
2595B0277j36147k2092L9708j08415n8385J33301j81403J3343J3165j8079J67015
$$ 20277 -115870 -137962 -98254 -206669 -265054 -131753 -313156 -299813 -286648 -304727 -137712
2584a37712n375M5808k2071o7624J501l3051n6943M3767P3858k7176L4023l2838
$$ -137712 -143087 -97279 -119350 -186974 -185473 -218524 -275467 -231700 -157842 -185018 -150995 -183833
2572a83833J15838J27389M8349k7025j40974L2920k3589J63223j20081l1208J61578
$$ -183833 -67995 59394 107743 80718 -60256 -27336 -50925 112298 -7783 -38991 122587
2561A22587P4110M3540q1847J7387p0987j28897O7777k3227K7583J62972m0153
$$ 122587 196697 240237 158390 175777 104790 -24107 43670 20443 48026 210998 170845
2550A70845J8451M9844N1217n1187j29255l4810l3477j897J1788j13978j3049
$$ 170845 189296 239140 290357 239170 109915 75105 41628 39731 51519 -62459 -75508
2539g5508L3804J54800j20668P6040M3079j3332j9101j28917j519j10472r0668
$$ -75508 -41704 113096 -7572 68468 111547 98215 79114 -49803 -51322 -161794 -252462
2528b52462K26711l9514k29785K23777j22406p7575N3679M1206p9027O0176l5955
$$ -252462 -25751 -65265 -295050 -71273 -193679 -271254 -217575 -176369 -255396 -195220 -231175
2517b31175O4956j2279J29680o1992l211j20413O3691N0433P8363q9712k03154
$$ -231175 -166219 -178498 -48818 -110810 -114021 -234434 -170743 -120310 -41947 -131659 -334813
2506c34813K4607J32999M7040J47885o7508m6414P1524P0236O4359j07412j16319
$$ -334813 -310206 -177207 -130167 17718 -49790 -96204 -24680 45556 109915 2503 -113816
2495a13816Q2219J00268n1070N3370J6264j77132j5021P6688N7819J22876J36361
$$ -113816 -31597 68671 17601 70971 87235 -89897 -104918 -28230 29589 152465 288826
2484B88826j06696j22510P0278J13493j11533j82863K02250j41521M3573R127
$$ 288826 182130 59620 129898 243391 131858 -51005 151245 9724 53297 62424
2474F2424K21438r8247J06559r7153r8582r0900n800q2912l287J48443r8421J01734
$$ 62424 283862 185615 292174 195021 96439 5539 -261 -83173 -86460 61983 -36438 65296
2462F5296o6818j9024j01153j15763L9331l5726l2490L1607J63748J76382o2027
$$ 65296 -1522 -20546 -121699 -237462 -198131 -233857 -266347 -234740 -70992 105390 43363
2451D3363l25557O6263L7319N9721j6226n3176j04988J03047L1865L0538N8260
$$ 43363 -282194 -215931 -178612 -118891 -135117 -188293 -293281 -190234 -158369 -127831 -69571
2440f9571n9409k7779k527o7595O0906M4019J50803p6495l9802n8044j22770K05104
$$ -69571 -128980 -156759 -159286 -226881 -165975 -121956 28847 -47648 -87450 -145494 -268264 -63160
2428f3160j04808L6270O2904N7755q8700l0932J03969Q3093r674l3607L2270J8627
$$ -63160 -167968 -131698 -68794 -11039 -99739 -130671 -26702 56391 46717 13110 45380 64007
2416F4007J8261m0422n2222L261Q8854k7271p7297J46848Q2394k53730J3980J15185
$$ 64007 82268 41846 -10376 -7115 81739 54468 -22829 124019 206413 -47317 -33337 81848
2404H1848o9122l0407k6979R8439K31281J7851k7012j86536r4128L9682M5823
$$ 81848 12726 -17681 -44660 53779 285060 302911 275899 89363 -4765 34917 80740
2393H0740J4097j87481m4983R6274J02838j18883R5126j26677p8121r0925K8118
$$ 80740 94837 -92644 -137627 -41353 61485 -57398 37728 -88949 -167070 -257995 -229877
2382b29877r8411R5904O9869j31619j08857M1364J85276J51171K3224k05102P5019
$$ -229877 -328288 -232384 -162515 -294134 -402991 -361627 -176351 -25180 -1956 -207058 -132039
2371a32039n238q5402M7520l6274J94155q2480K9533K18994q7192j55639Q1470
$$ -132039 -137277 -222679 -175159 -211433 -17278 -99758 -70225 148769 61577 -94062 -12592
2360a2592M1996J3155q5899l6217p6142N2862J91623O9626P666j47784j76792
$$ -12592 29404 42559 -43340 -79557 -155699 -102837 88786 158412 166078 18294 -158498
2349a58498R8579L8971M3570o9027J25653P6006J2991J9187j08525m3352l0699
$$ -158498 -59919 -20948 22622 -46405 79248 155254 168245 187432 78907 35555 4856
2338D856q5346J1465P8585K7007o9608j71850J41392J40510J10458j01148o2706
$$ 4856 -80490 -69025 9560 36567 -33041 -204891 -63499 77011 187469 86321 23615
2327B3615M542q8444M9655N4645J1618P2936l0219O1827P4702j46137j60361m4607
$$ 23615 28157 -60287 -10632 44013 55631 128567 98348 160175 234877 88740 -71621 -116228
2315a16228j0395K6969j28415J16263Q1076L6360p1013j12935j754L4642q1504
$$ -116228 -126623 -99654 -228069 -111806 -30730 5630 -65383 -178318 -180072 -145430 -226934
2304b26934L378j4764q2422N1572r4644J39850M0735m2881R0161k523L7933k461
$$ -226934 -223556 -238320 -320742 -269170 -363814 -223964 -183229 -226110 -135949 -138472 -100539 -103000
2292a03000P0731K1027L4407p72L0914o4540K0606j0447J49360L1987N9584j82658
$$ -103000 -32269 -11242 23165 22393 53307 -11233 9373 -1074 148286 180273 239857 57199
2280E7199M7192J7232r3183N7692J53370N4699k94076j09284R8073O0187N3712
$$ 57199 104391 121623 28440 86132 239502 294201 125 -109159 -11086 49101 102813
2269A02813J90088k4478m7164j6893k45247p2081O6470P7028J75712j81338J6190
$$ 102813 292901 268423 221259 204366 -40881 -112962 -46492 30536 206248 24910 41100
2258D1100l1834J04274j30149j0822K0841j02138p4589M5844J21531n1088j28471
$$ 41100 9266 113540 -16609 -27431 -6590 -108728 -183317 -137473 -15942 -67030 -195501
2247a95501p421J90587j09560k22262P3822J16258K0618l4747j51503J71350m2550
$$ -195501 -202922 -12335 -121895 -344157 -270335 -154077 -133459 -168206 -319709 -148359 -190909
2236a90909l5467J01168j28546n471P0250o5183q2806J69278J72081j19273m4116
$$ -190909 -226376 -125208 -253754 -259225 -188975 -254158 -336964 -167686 4395 -114878 -158994
2225a58994o7740R7958L4730K4141n9315J03511p0325q6373R6751r9720J74884
$$ -158994 -226734 -128776 -94046 -69905 -129220 -25709 -96034 -182407 -85656 -185376 -10492
2214a0492k7622Q682Q9311R6972o4813J2035r25P3267Q6344q9783j22007p4392
$$ -10492 -38114 -29432 59879 156851 92038 104073 103148 176415 262759 172976 50969 -23423
2202b3423J36587m9725O6323p6188j83101J84954J00012j07470J52526r9734m3307
$$ -23423 113164 63439 129762 53574 -129527 55427 155439 47969 200495 100761 57454
2191E7454J27788k37561K7497j8112p0288K9155k4810O5782J16310p1602o2737
$$ 57454 185242 -52319 -24822 -42934 -113222 -84067 -108877 -43095 73215 1613 -61124
2180f1124K3831l4245M264q8210m117Q0296J29581j03057j91544O2763O2197k4918
$$ -61124 -37293 -71538 -67274 -155484 -159601 -79305 50276 -52781 -244325 -181562 -119365 -144283
2168a44283q2137J8861J05896n5892j84863R0355P1998Q50J10282j9990p9902
$$ -144283 -226420 -207559 -101663 -157555 -342418 -252063 -180065 -179215 -68933 -88923 -168825
2157a68825K0300j9534j73964M4258Q9856j75847l6452J51310K67438K7474J6269
$$ -168825 -148525 -168059 -342023 -297765 -207909 -383756 -420208 -268898 -1460 26014 42283
2146D2283l479p134q1758O0611R8248j19647O7842J81695j26853m1876l7806k0922
$$ 42283 38804 31670 -50088 10523 108771 -10876 56966 238661 111808 69932 32126 11204
2134A1204P7689L9352p7912L4695m6603j9969m4469p0564J77152k1524o5214j12847
$$ 11204 88893 128245 50333 85028 38425 18456 -26013 -96577 80575 59051 -6163 -119010
2122a19010L4027K2594Q7887N825O5028J18320k31191k4380K37543j90228k9224
$$ -119010 -84983 -62389 25498 31323 96351 214671 -16520 -40900 196643 6415 -22809
2111b2809L6298q1496k497j4870p2370l9832J50428J67399k6720j9456j02885
$$ -22809 13489 -68007 -70504 -85374 -157744 -197576 -47148 120251 93531 74075 -28810
2100b8810k59903Q3235J49231L2059j66900L8607M2920R2104l635q8732r8814
$$ -28810 -288713 -205478 -56247 -24188 -191088 -152481 -109561 -17457 -21092 -109824 -208638
2089b08638J42828O2266P1761l0864p5672N4364Q281j2829j18377L3910R6227
$$ -208638 -65810 -3544 68217 37353 -38319 16045 24326 11497 -106880 -72970 23257
2078B3257L0898m6374J09693R8769j05683q9433R0067j79521J18001L7605j6609
$$ 23257 54155 7781 117474 216243 110560 21127 111194 -68327 49674 87279 70670
2067G0670N4017N5114q6105o4119J08497l5910j64035q1782L3480N8284K44643
$$ 70670 124687 179801 93696 29577 138074 102164 -61871 -143653 -110173 -51889 192754
2056A92754R5427j46385n5705j62653J42832R4664n5862j53618j1137J60026j20846
$$ 192754 288181 141796 86091 -76562 66270 160934 105072 -48546 -59683 100343 -20503
2045b0503l4739j05276J21967K2268m291j06404k21125M4404j8389J21408J25316
$$ -20503 -55242 -160518 -38551 -16283 -20574 -126978 -348103 -303699 -322088 -200680 -75364
2034g5364K05450r6130r5598O507J00332R489o1279p698n2153j48160J1878M1560
$$ -75364 130086 33956 -61642 -55135 45197 54686 -6593 -14291 -66444 -214604 -202726 -161166
2022a61166O7586Q7774r8948l5549r039n2999J47986K31930j08674q3519M2968
$$ -161166 -93580 -5806 -104754 -140303 -149342 -202341 -54355 177575 68901 -14618 28350
2011B8350o203m0150k0154P0208O7042L0571m0555j92035N6443J14143m2650j8097
$$ 28350 22147 -18003 -38157 32051 99093 129664 89109 -102926 -46483 67660 25010 6913
1999F913P9026J21315j54707L473J4239p2183K8374P3773m1503O2473R7944j31705
$$ 6913 85939 207254 52547 56020 70259 -1924 26450 100223 58720 121193 219137 87432
1987H7432j01021Q6226J4883k66111j3316J01713J72240n2808o1640k8901K35256
$$ 87432 -13589 72637 87520 -178591 -191907 -90194 82046 29238 -32402 -61303 173953
1976A73953j32674o209N4747j45276j7094j5117J17523m8225j33635j7486J20429
$$ 173953 41279 35070 89817 -55459 -72553 -87670 29853 -18372 -152007 -169493 -49064
1965d9064O9225j91226j20027Q4867K18943j2795j3142j1287k24108O2565l9530
$$ -49064 20161 -171065 -291092 -206225 12718 -77 -13219 -24506 -248614 -186049 -225579
1954b25579j6869j1671o546L8948L73j9208L6327J80797k4057L7336O4586k2530
$$ -225579 -242448 -254119 -260665 -221717 -221344 -240552 -204225 -23428 -47485 -10149 54437 31907
1942C1907K1257j3589m2232P9715J8978k5630K6523L6714k00447k1140q424Q314
$$ 31907 53164 39575 -2657 77058 96036 70406 96929 133643 -66804 -87944 -96368 -88054
1930h8054J38091r5230J27423J40935j09154r7445J15883O1390j99794l1614K8186
$$ -88054 50037 -45193 82230 223165 114011 16566 132449 193839 -5955 -37569 -9383
1919i383K12250j15297j51799Q4340K1422J9652O1314q4316k5703J602l1665Q2933
$$ -9383 202867 87570 -64229 20111 41533 61185 122499 38183 12480 14082 -17583 65350
1907F5350N9604j37819J4640K33336j11067r599k6584j7746j06475P071p8503
$$ 65350 124954 -12865 1775 235111 124044 114445 87861 70115 -36360 -29289 -107792
1896a07792J03239j08136M853m685Q4797j04764n4586P8335o1011J96988n6929
$$ -107792 -4553 -112689 -107836 -112521 -27724 -132488 -187074 -108739 -169750 27238 -29691
1885b9691j27013J767N3300L2751p3935P544O9523O2279J95940j1945J32410r4620
$$ -29691 -156704 -154937 -101637 -68886 -142821 -135277 -65754 -3475 192465 180520 312930 218310
1873B18310p8307j16951q5896L6098p8608Q5603k3518K6057J9940p751n7004J04838
$$ 218310 140003 23052 -62844 -26746 -105354 -19751 -43269 -17212 2728 -5023 -62027 42811
1861D2811m0143n8347J03034K2969M5557k1919K06444n1096j49218l9256j14363
$$ 42811 2668 -55679 47355 70324 115881 93962 300406 249310 100092 60836 -53527
1850e3527J28688n999j7937p2907l2774m5332N2256Q1477J06081n1450r752k9625
$$ -53527 75161 69162 51225 -21682 -54456 -99788 -47532 33945 140026 88576 78824 49199
1838D9199L145K6464j6558M8576K5039p6964j03343N1378k4668J07503Q5099k23044
$$ 49199 52344 78808 62250 110826 135865 58901 -44442 6936 -17732 89771 174870 -48174
1826d8174j73018J56006O9009j03483q6702J36258P7439j45763P9191J91015j85612
$$ -48174 -221192 -65186 3823 -99660 -186362 -50104 27335 -118428 -39237 151778 -33834
1815c3834j34018J19651J00090j29523P5952J08256j37432k02176O4120K16026
$$ -33834 -167852 -48201 51889 -77634 -1682 106574 -30858 -233034 -168914 47112
1805D7112o2664l9261N7589j65667J30316J38453L2442q1795M2122j09117K5734
$$ 47112 -15552 -54813 2776 -162891 -32575 105878 138320 56525 98647 -10470 15264
1794A5264L6145j2311J52588j70677p4053J48900j11635J23082P5680r7228L2507
$$ 15264 51409 39098 191686 21009 -53044 95856 -15779 107303 182983 85755 118262
1783A18262j3401M120R10N9023j02698q2139J05229M162m0623Q9815n4890m8083
$$ 118262 104861 108981 109891 168914 66216 -15923 89306 93468 52845 142660 87770 39687
1771C9687M782j4651j29176J40030J36340k11189k27154J84309L6392r024j6409
$$ 39687 44469 29818 -99358 40672 177012 -34177 -261331 -77022 -40630 -49654 -66063
1760f6063J47395j07899P1444j28136O0106R1860o4876K5099k24484k5248o7971
$$ -66063 81332 -26567 44877 -83259 -23153 68707 3831 28930 -195554 -220802 -288773
1749b88773j9098J03495O9238R2210J16534q3105Q406l9803o3140m0624O2400
$$ -288773 -307871 -204376 -135138 -42928 73606 -9499 -1093 -40896 -104036 -144660 -82260
1738h2260J46001j34975J54140j01984r4568J15032J07818l4150q7840P7867L4714
$$ -82260 63741 -71234 82906 -19078 -113646 1386 109204 75054 -12786 65081 99795
1727I9795Q664M472j23580j1218L270j86927O1754K07196J21301M4590J02401
$$ 99795 108459 112931 -10649 -21867 -18597 -205524 -143770 63426 184727 229317 331718
1716C31718j40325o5452j00122j36035K1047J67260K15550m4993k21303N8803
$$ 331718 191393 125941 25819 -110216 -89169 78091 293641 248648 27345 86148
1706H6148o1559J650N2813q50k8520L7674k09822L8010K69265m6291j03258O9519
$$ 86148 24589 26239 79052 78202 49682 87356 -122466 -84456 184809 138518 35260 104779
1694A04779J6045j22139k10208L4877J64359n4707O9303J68321j73750p7058j63603
$$ 104779 120824 -1315 -211523 -176646 -12287 -66994 2309 170630 -3120 -80178 -243781
1683b43781J30302q400j9139o5005J14374J3947j7524J12018l278j36899r0978
$$ -243781 -113479 -121879 -141018 -206023 -91649 -77702 -95226 16792 13514 -123385 -214363
1672b14363M6858P64J76823q387n80m6240j0796R9147O7640n5380l4176r5531
$$ -214363 -167505 -166741 10082 1695 1115 -45125 -55921 43226 110866 55486 21310 -74221
1660g4221R8056R4408O0806j35249l4849M7641j5629M9211q8082N3063L6238l2733
$$ -74221 23835 118243 179049 43800 8951 56592 40963 90174 2092 55155 91393 58660
1648E8660q774J05958j9676r7150n6786P2151q007j27469o3284J39908J23785
$$ 58660 49886 155844 136168 39018 -17768 54383 46376 -81093 -144377 -4469 119316
1637A19316o1239L4350j41206Q080j15064O4687Q3590N0949j90103O6319N4589
$$ 119316 58077 92427 -48779 -40699 -155763 -91076 -7486 43463 -146640 -80321 -25732
1626b5732P8937Q1503m261K2515j46449k62961M7943m909N3687J16483J30122
$$ -25732 53205 134708 130447 152962 6513 -256448 -208505 -213414 -159727 -43244 86878
1615H6878j39609j65338q076j7964l555J37173J42913p3502k76707p3386R6919
$$ 86878 -52731 -218069 -226145 -244109 -247664 -110491 32422 -41080 -317787 -391173 -294254
1604b94254J48140P2646k1601Q8170l7015J15039k55444p9515K45851N5820L4950
$$ -294254 -146114 -73468 -95069 -6899 -43914 71125 -184319 -263834 -17983 37837 72787
1593G2787P599j48624j3139J75469J3914j57880n6378J22235Q9962o3115P7489
$$ 72787 80386 -68238 -81377 94092 108006 -49874 -106252 15983 105945 42830 120319
1582A20319j09366P5704j07912o7277R3676J28917J40301j00760j70563j93067
$$ 120319 10953 86657 -21255 -88532 5144 134061 274362 173602 3039 -190028
1572a90028L82O1326N0350J28030P3643O6573k8128M0347j74719N8589J10483
$$ -190028 -189646 -128320 -77970 50060 123703 190276 162148 202495 27776 86365 196848
1561A96848r9973J29691k3671q6633L3090n3797o4859j47888J14210J19820L4662
$$ 196848 96875 226566 202895 116262 149352 95555 30696 -117192 -2982 116838 151500
1550A51500M084J8514j74021j49518l1638N8527l8102r9460K61191q1804Q7001
$$ 151500 155584 174098 77 -149441 -181079 -122552 -160654 -260114 1077 -80727 6274
1539F274l1020p056o922p0220L9505l6614J50843J7676L2283l3393j47443R9459
$$ 6274 -24746 -31802 -38724 -108944 -69439 -106053 44790 62466 94749 61356 -86087 13372
1527A3372J9769p6240R8378J05240k03940K9555J97027j26851k90280N1411O6078
$$ 13372 33141 -43099 55279 160519 -43421 -13866 183161 56310 -233970 -182559 -116481
1516a16481J09884M2702o5978N91o4638J24947J25535m1633J22649k28752J6352
$$ -116481 -6597 36105 -29873 -29282 -93920 31027 156562 114929 237578 8826 25178
1505B5178r3029J64681p352L5913M2652l8891Q8681j1085P3934m9472m2572j11401
$$ 25178 -67851 96830 89478 125391 168043 129152 217833 206748 280682 231210 188638 77237
1493G7237K2780R9682k1330j25597O0285j50270m308k6258N0591O8377m6577o1506
$$ 77237 100017 199699 178369 52772 113057 -37213 -41521 -67779 -17188 51189 4612 -56894
1481e6894l7099R8749J22062q3832L9557j2256J07550k03727L5266p8720q401
$$ -56894 -93993 4756 126818 42986 82543 70287 177837 -25890 9376 -69344 -77745
1470g7745K6161J0636L2585j24160r6870J4221J5202m1290L5225Q6012L6458J6522
$$ -77745 -51584 -40948 -8363 -132523 -229393 -215172 -199970 -241260 -206035 -120023 -83565 -67043
1458f7043p0525J27114L4483M7909n6000j08488R4557j28662n0639K13010k0188
$$ -67043 -137568 -10454 24029 71938 15938 -92550 2007 -126655 -177294 35716 15528
1447A5528k763K3713K6049j0259M4223k12766Q8039J54935j82411l9692J9946
$$ 15528 12765 36478 62527 52268 96491 -116275 -28236 126699 -55712 -95404 -75458
1436g5458J80171j06090L1983J2529J08247k27590R856K14479P6905J9667k86956
$$ -75458 104713 -1377 30606 43135 151382 -76208 -66352 148127 225032 244699 -42257
1425d2257j57588K40464m1748N3092k5594M4719J37947j81717o5150P4069m3266
$$ -42257 -199845 40619 -1129 51963 26369 71088 209035 27318 -37832 36237 -7029
1414g029j0165n8317L1988N9646j74392K52557P5331m6444N1244p7066K0008j11665
$$ -7029 -17194 -75511 -43523 16123 -158269 94288 169619 123175 174419 97353 117361 5696
1402E696m5651L4699P0409k01453N5675M0125M5039N8126o0316k1612J16777k48879
$$ 5696 -39955 -5256 65153 -136300 -80625 -40500 4539 62665 2349 -19263 97514 -151365
1390a51365J02881l9583O1556O3575j69848M0268j02981P1673P5951J90905k6411
$$ -151365 -48484 -88067 -26511 37064 -132784 -92516 -195497 -123824 -47873 143032 116621
1379A16621M717j3607j59854l5904m4610P4208Q9908R5113J12565M474o2598j4780
$$ 116621 121338 107731 -52123 -88027 -132637 -58429 31479 126592 239157 243631 181033 166253
1367A66253M7675p4457l4900j8833Q5958n5711Q422q2076L4621Q0627L2346p2870
$$ 166253 213928 139471 104571 85738 171696 115985 124407 42331 76952 157579 189925 117055
1355A17055L1562M7564r6515N4081N0535m1527J4310j46927j31368J09560q1383
$$ 117055 148617 196181 99666 153747 204282 162755 177065 30138 -101230 8330 -73053
1344g3053J13427J23318K7279l5502n5734j59699K0187O9735j35539k9750k1445
$$ -73053 40374 163692 190971 155469 99735 -59964 -39777 29958 -105581 -135331 -156776
1333a56776m6869J0435J67424J08883P2107j26336k03709m1706L2028N3164J10076
$$ -156776 -203645 -193210 -25786 83097 155204 28868 -174841 -216547 -184519 -131355 -21279
1322b1279q0922n5445Q8142J34825p4331P7952J1212J3119J56904R0383l19504
$$ -21279 -102201 -157646 -69504 65321 -9010 68942 80154 93273 250177 340560 21056
1311B1056m8995R2077l9287q6871K07878N8552j67501M353M9381K1719j52771
$$ 21056 -27939 64138 24851 -62020 145858 204410 36909 41262 90643 112362 -40409
1300d0409J21716n3173J24877p3358N1150J64046n8555j99494J31955N0601m3441
$$ -40409 81307 28134 153011 79653 130803 294849 236294 36800 168755 219356 175915
1289A75915o863L070q1371n9118Q6463M573l9942J0856K9702j14723J6103L7649
$$ 175915 169052 172122 90751 31633 118096 122669 82727 93583 123285 8562 24665 62314
1277F2314N0670M8730j06413K0395M937n102q8347q3067J26298q1649O0272P7241
$$ 62314 112984 161714 55301 75696 80633 75531 -12816 -95883 30415 -51234 9038 86279
1265H6279o6972j68227o4063J57553l5119J78r371K9892J4941k32903J37256L7859
$$ 86279 19307 -148920 -212983 -55430 -90549 -90371 -99742 -69850 -54909 -287812 -150556 -112697
1253a12697J04823O3593k682p831j0342p3628j0443N7241j19305R8584J07646
$$ -112697 -7874 55719 53037 45206 34864 -38764 -49207 8034 -111271 -12687 94959
1242I4959L1288L2256k69255j66736J22530J55902o7617o0474J12924j8023n9629
$$ 94959 126247 158503 -110752 -277488 -154958 944 -66673 -127147 -14223 -32246 -91875
1231i1875L3938O0651l7474O2038O9603N0211l4389j04957o1051n4098J85502
$$ -91875 -57937 2714 -34760 27278 96881 147092 112703 7746 -53305 -107403 78099
1220G8099J25922p6950P1433q0464p5851n3687k06706J68392R2337r4004r2178
$$ 78099 204021 127071 198504 118040 42189 -11498 -218204 -49812 42525 -51479 -143657
1209a43657L1404K03129o7501j11671N555K4996j2597n413k3375J18495o9708
$$ -143657 -112253 90876 23375 -88296 -82741 -57745 -70342 -75755 -99130 19365 -50343
1198e0343q075q3551P90L2406L188K2797m9626O2474P9152j8820j49551R8579
$$ -50343 -58418 -141969 -141179 -108773 -105585 -82788 -132414 -69940 9212 -9608 -159159 -60580
1186f0580r9780N5468J39523M0299O3130j06347q8791N6000P3095k7924r3603
$$ -60580 -160360 -104892 34631 74930 138060 31713 -57078 -1078 72017 44093 -49510
1175d9510K4957J20753K6468j47139j0682Q15K0464m9615n4079N6917L7479L4437
$$ -49510 -24553 96200 122668 -24471 -35153 -34338 -13874 -63489 -117568 -60651 -23172 11265
1163A1265K5148k610R84R3468p3497j36657j62602J16942J72798K3425K2257J02322
$$ 11265 36413 33803 34787 128255 54758 -81899 -244501 -127559 45239 68664 90921 193243
1151A93243j83051k8930R1049Q3085r7293n1833J20341J09493L2783M9547q0953
$$ 193243 10192 -18738 72311 155396 58103 6270 126611 236104 268887 318434 237481
1140B37481j00928Q0322k33152j00417K06239J68272k7940j92078k4017J68457
$$ 237481 136553 216875 -16277 -116694 89545 257817 229877 37799 13782 182239
1130A82239k1433k36550n8900K6318P9334j7961R8276M40m3730m100p8933j61381
$$ 182239 160806 -75744 -134644 -108326 -28992 -46953 51323 51763 8033 3933 -75000 -236381
1118b36381J52028J38252j04635J49057j57943J1834n4237J59409K6810j72165
$$ -236381 -84353 53899 -50736 98321 -59622 -47788 -102025 57384 84194 -87971
1108h7971J1361n2207L0257j40476K32286J7279n4540K6783k6240P9384j14329
$$ -87971 -76610 -128817 -98560 -239036 -6750 10529 -44011 -17228 -43468 35916 -78413
1097g8413p0697j9738J28510R0299j29308j14223L0218L5317J21406M3028m4175
$$ -78413 -149110 -168848 -40338 49961 -79347 -193570 -163352 -128035 -6629 36399 -7776
1086g776m4407K5463r9120J19122J19665j7239p226J05804k27755j64431K41977
$$ -7776 -52183 -26720 -125840 -6718 112947 95708 88482 194286 -33469 -197900 44077
1075D4077M9368j22544p5275R1457o971K9898M4391K3539J39306j22555k05388
$$ 44077 93445 -29099 -104374 -12917 -19888 10010 54401 77940 217246 94691 -110697
1064a10697K1457R8629P939j8396K842P1965J5377n3738J27438M0640k16657j28225
$$ -110697 -89240 9389 17328 -1068 1774 73739 89116 35378 162816 203456 -13201 -141426
1052a41426J1317Q3131M5635K5693k1382r3601k0066L0057M9193O3727n1393l2280
$$ -141426 -130109 -46978 -1343 24350 2968 -90633 -110699 -80642 -31449 32278 -19115 -51395
1040e1395p3968N555k7133K3764J34001N1660k4669N2170j84000k04961R3118
$$ -51395 -125363 -119808 -146941 -123177 10824 62484 37815 89985 -94015 -298976 -205858
1029b05858Q7790J70455j15516K1589O3806K8965R9845o7856L0546K9023j72860
$$ -205858 -118068 52387 -63129 -41540 22266 51231 151076 83220 113766 142789 -30071
1018c0071Q7269J39518r2709j45885J88048J01106j75161O6242n1332o3626P8329
$$ -30071 57198 196716 104007 -41878 146170 247276 72115 138357 87025 23399 101728
1007A01728l688m4774J7736P6634j42342k3289j0871n3662K9098Q2262j5245P916
$$ 101728 98040 53266 71002 147636 5294 -17995 -28866 -82528 -53430 28832 13587 21503
995B1503K5517o0245J87753p2204k27206Q7698O8232q9669k2172N9419j5374m8096
$$ 21503 47020 -13225 174528 102324 -124882 -37184 31048 -58621 -80793 -21374 -36748 -84844
983h4844J19306p178j50001j0776J49755q6415L9657R7442j54049o9834N6963
$$ -84844 34462 27284 -122717 -133493 16262 -70153 -30496 66946 -87103 -156937 -99974
972i9974J13419r4582k0138m4788J5263P3547j18398n0798R2003J50124O2714
$$ -99974 13445 -81137 -101275 -146063 -130800 -57253 -175651 -226449 -134446 15678 78392
961G8392j1049j08293L3488L2566K1832J2367q0526j03600J02657K5332L5024
$$ 78392 67343 -40950 -7462 25104 46936 59303 -21223 -124823 -22166 3166 38190
950C8190j43693j02991K51653K18551P792j91023L9249r7700o1588J35197K3630
$$ 38190 -105503 -208494 43159 261710 269502 78479 117728 20028 -41560 93637 117267
939A17267k608p7296J3122J18739j01705J55729j01033L5213R2725j32355l1448
$$ 117267 114659 37363 50485 169224 67519 223248 122215 157428 250153 117798 86350
928H6350Q2009j06458r5533j8293K8626P7442P9332k4385J5042K7752j09960l2614
$$ 86350 168359 61901 -33632 -51925 -23299 54143 133475 109090 124132 151884 41924 9310
916I310p2071Q6599p2003Q0288O9896L1936K5753o0119l5163r1760J14771j6972
$$ 9310 -62761 23838 -48165 32123 102019 133955 159708 99589 64426 -27334 87437 70465
904G0465J75035q9973k26718L8599j6720J81688n5758M7738K1946J21431q3j20825
$$ 70465 245500 155527 -71191 -32592 -49312 132376 76618 124356 146302 267733 267650 146825
892A46825j18319k8474K1635n0058k2978j8874j51168O7326N6630J24794k1282
$$ 146825 28506 32 21667 -28391 -51369 -70243 -221411 -154085 -97455 27339 6057
881F057j83728N9277K6347L8134O4964K53987j11551M1595l7389J4014L6125q8285
$$ 6057 -177671 -118394 -92047 -53913 11051 265038 153487 195082 157693 171707 207832 119547
869A19547O5249j72535j78424J54246J73690Q8525j40020m6371K6107J64736j42871
$$ 119547 184796 12261 -166163 -11917 161773 250298 110278 63907 90014 254750 111879
858A11879r3726Q1204n2898L2104r8177n8795q1195O1940p4775M4254J62028L8874
$$ 111879 18153 99357 46459 78563 -19614 -78409 -159604 -97664 -172439 -128185 33843 72717
846G2717j19842j70756J39608R9736J02599o8469n8746k8927K2102J9189M9261
$$ 72717 -47125 -217881 -78273 21463 124062 55593 -3153 -32080 -9978 9211 58472
835E8472j4523l4034j00993M8607J25809k13975k04994J21199P5004K0369J40399
$$ 58472 43949 9915 -91078 -42471 83338 -130637 -335631 -214432 -139428 -119059 21340
824B1340n7553J60574j37352k10495o2848J44237J61813J60470q4670n1402j20257
$$ 21340 -36213 124361 -12991 -223486 -286334 -142097 19716 180186 95516 44114 -76143
813g6143J07956J6589j43496j81336J85392K35329j06902L1487j89157p3127K25041
$$ -76143 31813 48402 -95094 -276430 -91038 144291 37389 68876 -120281 -193408 31633
802C1633J39243l6284q5650M711k2432K2114P0095R5779j70849p0377m7380O3028
$$ 31633 170876 134592 48942 53653 31221 53335 123430 219209 48360 -22017 -69397 -6369
790f369J87276K7520k08963o6593R4181m0788Q829J47159p2796l45904m330J13186
$$ -6369 180907 208427 -536 -67129 27052 -13736 -4907 142252 69456 -276448 -280778 -167592
778a67592J86783J53376K9993K7900q4943j12231N814o6462k2726P2162j55619
$$ -167592 19191 172567 202560 230460 145517 33286 39100 -27362 -50088 22074 -133545
767a33545M2098o639q3952K33730J7518p8545q5383Q2390j30857m9669K7355Q5950
$$ -133545 -91447 -98086 -182038 51692 69210 -9335 -94718 -12328 -143185 -192854 -165499 -79549
755g9549J15097k892j58286r3302M5750J12033J4458O987K1265Q6987l7175k0560
$$ -79549 35548 32656 -125630 -218932 -173182 -61149 -46691 -39704 -18439 68548 31373 10813
$$ [...]
##END NTUPLES=NMR SPECTRUM
##END=
