##TITLE=1H_CA-9263-1
 DMSO-d6
 8 sc, 
 12.4.2024
##JCAMPDX= 6.0         $$ Bruker NMR JCAMP-DX V2.0
##DATA TYPE= NMR SPECTRUM
##DATA CLASS= NTUPLES
##ORIGIN= UXNMR, Bruker Analytische Messtechnik GmbH
##OWNER= root
$$ XWIN-NMR		Version 3.5
$$ Fri Apr 12 14:42:22 2024 Russian Standard Time (UT+4h)  she@DPX200
##.OBSERVE FREQUENCY= 200.1309
##.OBSERVE NUCLEUS= ^1H
##.ACQUISITION MODE= SIMULTANEOUS
##.ACQUISITION SCHEME= undefined
##.AVERAGES= 8
##.DIGITISER RES= 18
##SPECTROMETER/DATA SYSTEM= spect
##.PULSE SEQUENCE= zg30
##.SOLVENT NAME= CDCl3
##.SHIFT REFERENCE= (INTERNAL, CDCl3, 0, 15.2158)
##AUDIT TRAIL= $$ (NUMBER, WHEN, WHO, WHERE, WHAT)
$$ ##TITLE= Audit trail, XWIN-NMR		Version 3.5
$$ ##JCAMPDX= 5.01
$$ ##ORIGIN= Bruker BioSpin GmbH
$$ ##OWNER= she
$$ F:/spectra/data/she/nmr/H-F/1/pdata/1/auditp.txt
$$ ##AUDIT TRAIL=  $$ (NUMBER, WHEN, WHO, WHERE, WHAT)
(   1,<2024-04-12 14:41:08.20 +0400>,<she>,<DPX200>,
      <created by zg, POWCHK disabled, PULCHK disabled
       configuration hash MD5:
       00 E9 B6 7A A2 85 ED C7 34 08 36 98 17 FE 4E 26
       data hash MD5: 16K
       7C A6 8B C9 38 7F BF 96 5D CA 49 C9 35 E8 17 27>)
(   2,<2024-04-12 14:41:11.20 +0400>,<she>,<DPX200>,
      <Start of raw data processing
       efp BC_mod = 2 LB = 0.24 FT_mod = 6 PKNL = 1 PHC0 = -25300.68 PHC1 = 8.38731 SI = 16K 
       data hash MD5: 16K
       03 52 B8 AB 80 3C 72 A4 23 D1 A2 30 24 71 64 E2>)
(   3,<2024-04-12 14:41:27.98 +0400>,<she>,<DPX200>,
      <pk PHC0 = -0.6696579 PHC1 = 0 
       data hash MD5: 16K
       16 B1 21 7A A3 1E 30 CF 32 F1 74 28 FF F0 2E 2E>)
(   4,<2024-04-12 14:41:31.34 +0400>,<she>,<DPX200>,
      <abs ABSG = 5 
       data hash MD5: 16K
       31 71 CC 88 EB 1B 4B C0 33 12 90 72 E1 C3 89 46>)
$$ ##END=
$$ 
$$ hash MD5
$$ 67 F0 A3 5C E2 CE DF 0E 15 25 5B 0B 27 60 E0 DD
##$RELAX= 
##$RELAX= 
##$RELAX= 
##$RELAX= 
##$RELAX= 
##$RELAX= 
$$ Bruker specific parameters
$$ --------------------------
##$DU= <F:/spectra>
##$EXPNO= 1
##$NAME= <H-F>
##$PROCNO= 1
##$TYPE= <nmr>
##$USER= <she>
##$AMP= (0..31)
100 100 100 100 100 100 100 100 100 100 100 100 100 100 100 100 100 100 
100 100 100 100 100 100 100 100 100 100 100 100 100 100 
##$AQSEQ= 0
##$AQ_mod= 1
##$AUNM= <au_zg>
##$AUTOPOS= <>
##$BF1= 200.13
##$BF2= 200.13
##$BF3= 200.13
##$BF4= 200.13
##$BF5= 200.13
##$BF6= 200.13
##$BF7= 200.13
##$BF8= 200.13
##$BYTORDA= 1
##$CFDGTYP= 0
##$CFRGTYP= 5
##$CHEMSTR= <none>
##$CNST= (0..31)
1 1 145 1 1 1 1 1 1 1 1 1 1 1 1 1 1 1 1 1 1 1 1 1 1 1 1 1 1 1 1 1 
##$CPDPRG= <>
##$CPDPRG1= <>
##$CPDPRG2= <>
##$CPDPRG3= <>
##$CPDPRG4= <mlev>
##$CPDPRG5= <mlev>
##$CPDPRG6= <mlev>
##$CPDPRG7= <mlev>
##$CPDPRG8= <mlev>
##$CPDPRGB= <>
##$CPDPRGT= <>
##$D= (0..31)
0 1.2 0 0 0 0 0 0 0 0.06 0 0.03 0 0 0 0 0.0002 0 0 0 0 0 0 0 0 0 0 0 0 
0 0 0 
##$DATE= 1712918467
##$DBL= (0..7)
120 120 120 120 120 120 120 120 
##$DBP= (0..7)
150 150 150 150 150 150 150 150 
##$DBP07= 0
##$DBPNAM0= <>
##$DBPNAM1= <>
##$DBPNAM2= <>
##$DBPNAM3= <>
##$DBPNAM4= <>
$$ [...]
##$SUBNAM3= <"">
##$SUBNAM4= <"">
##$SUBNAM5= <"">
##$SUBNAM6= <"">
##$SUBNAM7= <"">
##$SUBNAM8= <"">
##$SUBNAM9= <"">
##$SW= 18.0517689322627
##$SWIBOX= (0..15)
0 0 2 0 0 0 0 0 0 0 0 0 0 0 0 0 
##$SW_h= 3612.71676300578
##$TD= 16384
##$TD0= 1
##$TE= 0
##$TE2= 300
##$TE3= 300
##$TEG= 300
##$TL= (0..7)
0 120 120 120 120 120 120 120 
##$TP= (0..7)
150 150 150 150 150 150 150 150 
##$TP07= 0
##$TPNAME0= <>
##$TPNAME1= <>
##$TPNAME2= <>
##$TPNAME3= <>
##$TPNAME4= <>
##$TPNAME5= <>
##$TPNAME6= <>
##$TPNAME7= <>
##$TPOAL= (0..7)
0.5 0.5 0.5 0.5 0.5 0.5 0.5 0.5 
##$TPOFFS= (0..7)
0 0 0 0 0 0 0 0 
##$TUNHIN= 0
##$TUNHOUT= 0
##$TUNXOUT= 0
##$USERA1= <user>
##$USERA2= <user>
##$USERA3= <user>
##$USERA4= <user>
##$USERA5= <user>
##$V9= 5
##$VALIST= <valist>
##$VCLIST= <CCCCCCCCCCCCCCC>
##$VD= 0
##$VDLIST= <DDDDDDDDDDDDDDD>
##$VPLIST= <PPPPPPPPPPPPPPP>
##$VTLIST= <TTTTTTTTTTTTTTT>
##$WBST= 1024
##$WBSW= 4
##$XGAIN= (0..3)
0 0 0 0 
##$XL= 0
##$YL= 0
##$YMAX_a= 208711
##$YMIN_a= -276176
##$ZGOPTNS= <>
##$ZL1= 120
##$ZL2= 120
##$ZL3= 120
##$ZL4= 120
##$ABSF1= 15.50893
##$ABSF2= -2.542955
##$ABSG= 5
##$ABSL= 3
##$ALPHA= 0
##$AQORDER= 0
##$ASSFAC= 0
##$ASSFACI= 0
##$ASSFACX= 0
##$ASSWID= 0
##$AUNMP= <proc_1d>
##$AZFE= 0.1
##$AZFW= 0.1
##$BCFW= 0
##$BC_mod= 2
##$BYTORDP= 0
##$COROFFS= 0
##$CY= -3
##$DATMOD= 1
##$DC= 0
##$DFILT= <>
##$DTYPP= 0
##$F1P= 0
##$F2P= 0
##$FCOR= 1
##$FTSIZE= 16384
##$FT_mod= 6
##$GAMMA= 0
##$GB= 0
##$INTBC= 1
##$INTSCL= 3.70164e-10
##$ISEN= 128
##$LB= 0.24
##$LEV0= 0
##$LPBIN= 0
##$MAXI= 10000
##$MC2= 0
##$MEAN= 0
##$ME_mod= 0
##$MI= 1.114404
##$NCOEF= 0
##$NC_proc= -5
##$NLEV= 6
##$NOISF1= 3.799351
##$NOISF2= 2.8
##$NSP= 0
##$NTH_PI= 0
##$NZP= 0
##$OFFSET= 15.21585
##$PC= 1
##$PHC0= -25301.35
##$PHC1= 8.38731
##$PH_mod= 1
##$PKNL= yes
##$PPARMOD= 0
##$PSCAL= 0
##$PSIGN= 0
##$REVERSE= no
##$SF= 200.129661214965
##$SI= 16384
##$SIGF1= 3
##$SIGF2= 2
##$SINO= 5.538805
##$SIOLD= 16384
##$SREGLST= <1H.CDCl3>
##$SSB= 0
##$STSI= 16384
##$STSR= 0
##$SW_p= 3612.71676300577
##$SYMM= 0
##$S_DEV= 0
##$TDeff= 16384
##$TDoff= 0
##$TI= <>
##$TILT= no
##$TM1= 0
##$TM2= 0
##$TOPLEV= 0
##$USERP1= <user>
##$USERP2= <user>
##$USERP3= <user>
##$USERP4= <user>
##$USERP5= <user>
##$WDW= 1
##$XDIM= 16384
##$YMAX_p= 337160444
##$YMIN_p= -283819
$$ End of Bruker specific parameters
$$ ---------------------------------
##NTUPLES= NMR SPECTRUM
##VAR_NAME=  FREQUENCY,     SPECTRUM/REAL,   SPECTRUM/IMAG
##SYMBOL=    X,             R,               I
##VAR_TYPE=  INDEPENDENT,   DEPENDENT,       DEPENDENT
##VAR_FORM=  AFFN,          ASDF,            ASDF
##VAR_DIM=   16384,         16384,           16384
##UNITS=     HZ,            ARBITRARY UNITS, ARBITRARY UNITS
##FACTOR=    0.220516191357247, 1,           1
##FIRST=     3045.14288086246, 0,            0
##LAST=      -567.573882143309, 0,           0
##MIN=       -567.573882143309, -283819,     0
##MAX=       3045.14288086246, 337160444,    0
$$ Real data points
##PAGE= N=1
##DATA TABLE= (X++(R..R)), XYDATA
$$ [...]
6966C437165p636k2666k5232K7120Q951o615k800J7856j8694n4391l9616l883
$$ 3437165 3429529 3406863 3381631 3408751 3417702 3411087 3408287 3426143 3407449 3353058 3313442 3309559
6954C309559M941Q1406j7739J2717p4067k3098q7235N9763J6202J6437O335J4661
$$ 3309559 3314500 3395906 3378167 3390884 3316817 3293719 3206484 3266247 3282449 3298886 3305221 3319882
6942C319882R03K2493L8019m0910K3407j2891l3092J8971K8160j15344j2139K5771
$$ 3319882 3320785 3343278 3381297 3340387 3363794 3350903 3317811 3336782 3364942 3249598 3237459 3263230
6930C263230j8039R5872k8686K4732N2518j9255j28731J6887J14774n3175m5422
$$ 3263230 3245191 3341063 3312377 3337109 3389627 3370372 3241641 3258528 3373302 3320127 3274705
6919C274705n0252J7860J7726J0361l518l8705p2778l577R7915k1815j7667m2207
$$ 3274705 3224453 3242313 3260039 3270400 3266882 3228177 3155399 3151822 3249737 3227922 3210255 3168048
6907C168048j0627l5156q242M9816l8715j7932n543M3709J5800j8813n47J7233
$$ 3168048 3157421 3122265 3114023 3163839 3125124 3107192 3101649 3145358 3161158 3142345 3141798 3159031
6895C159031n077J8915k1491o1136p1770J7218R9129K5221n1483q674o6415l7001
$$ 3159031 3153954 3172869 3151378 3090242 3018472 3035690 3134819 3160040 3108557 3099883 3033468 2996467
6883B996467K8863K5778P605l7529m7248j1590N6681K1142k0330k2905q8128L6194
$$ 2996467 3025330 3051108 3058713 3021184 2973936 2962346 3019027 3040169 3019839 2996934 2908806 2945000
6871B945000O4930j4682k7698J0543j4042k9664J9764K6301j51487M8602O4951
$$ 2945000 3009930 2995248 2967550 2978093 2964051 2934387 2954151 2980452 2828965 2877567 2942518
6860B942518q3344j8564O1627l0820r032O7149L6493q2493k6677n633l8491O3708
$$ 2942518 2859174 2840610 2902237 2871417 2862385 2929534 2966027 2883534 2856857 2851224 2812733 2876441
6848B876441k2863J4443n0003q1105o156o188m790K051P845J9827m6163M5403
$$ 2876441 2853578 2868021 2818018 2736913 2730757 2724569 2719779 2721830 2729675 2749502 2703339 2748742
6836B748742N0586o2718P2884M7595q4004M3542o2461N9922O0154O344J2465r6563
$$ 2748742 2799328 2736610 2809494 2857089 2773085 2816627 2754166 2814088 2874242 2880586 2893051 2796488
6824B796488q3662k4573L7209n663j2176l3479M8822p9737O245N3380R863l1211
$$ 2796488 2712826 2688253 2725462 2719799 2707623 2674144 2722966 2643229 2649474 2702854 2712717 2681506
6812B681506m7453n444L3345J2219K7557j1391l3015q5777N1530J40607r4641
$$ 2681506 2634053 2628609 2661954 2674173 2701730 2690339 2657324 2571547 2623077 2763684 2669043
6801B669043o9699L4724r002k9407n2758n4818O5688M953o2970K818R0893k2199
$$ 2669043 2599344 2634068 2625066 2595659 2542901 2488083 2553771 2558724 2495754 2498572 2589465 2567266
6789B567266M0768k9272J162M7186n1973m4016M0994O4959L0448k301r0254q9646
$$ 2567266 2608034 2578762 2579924 2627110 2575137 2531121 2572115 2637074 2667522 2665221 2574967 2485321
6777B485321j07133J4704M9081j2614K0128L2306o6571k8494P6839k2964q143
$$ 2485321 2378188 2392892 2441973 2429359 2449487 2481793 2415222 2386728 2463567 2440603 2432460
6766B432460M7105o838J7832q003j5456J7789o5447J3488O9143j12865N1632L6821
$$ 2432460 2479565 2472727 2490559 2482556 2467100 2484889 2419442 2432930 2502073 2389208 2440840 2477661
6754B477661q2494J16916j12636j582Q861r0404K2125o955o0560l4409N6446K0042
$$ 2477661 2395167 2512083 2399447 2397865 2406726 2316322 2338447 2331492 2270932 2236523 2292969 2313011
6742B313011J0360L1010m2961p0511l2678N6720N7322m2460j915L5803l9301L1667
$$ 2313011 2323371 2354381 2311420 2240909 2208231 2264951 2322273 2279813 2277898 2313701 2274400 2306067
6730B306067j8187m2076O4295p4j00550m0649M7875M2925O189k1594L1838n1912
$$ 2306067 2287880 2245804 2310099 2310025 2209475 2168826 2216701 2259626 2265815 2244221 2276059 2224147
6718B224147Q531n571N6199l5403K8894j2786o4600M0902k9433n9963n161M003
$$ 2224147 2232678 2227107 2283306 2247903 2276797 2264011 2199411 2240313 2210880 2150917 2145756 2149759
6706B149759K9105K2592j8574o1836K520M4470L999l214k3426j376O8586k5030
$$ 2149759 2178864 2201456 2182882 2121046 2123566 2168036 2172035 2168821 2145395 2144019 2212605 2187575
6694B187575m2129m5627n9754P1107N8683l40o5165O8539n1508k4191l1037K5471
$$ 2187575 2145446 2099819 2040065 2111172 2169855 2169515 2104350 2172889 2121381 2097190 2066153 2091624
6682B091624k4681j7922j2512L0414j7206L4627L1105q38j6738K0549q8412n8187
$$ 2091624 2066943 2049021 2036509 2066923 2049717 2084344 2115449 2114611 2097873 2118422 2030010 1971823
6670A971823K7621j3131P0796J4329L1365P053n0215k508n9883j9017Q0157M0946
$$ 1971823 1999444 1986313 2057109 2071438 2102803 2109856 2059641 2057133 1997250 1978233 2058390 2099336
6658B099336P353j9396n4773k5543r840n5947j491J27369N3336j23184n6k9912
$$ 2099336 2106689 2087293 2032520 2006977 1997137 1941190 1939699 2067068 2120404 1997220 1997164 1967252
6646A967252K2660p0178N8318K0954m3381O3120l0606r953L6098J8764m3703n3600
$$ 1967252 1989912 1919734 1978052 1999006 1955625 2018745 1988139 1978186 2014284 2033048 1989345 1935745
6634A935745O5149p0908P679J8475n01k5713l9752M2947l6676m890J06853N010
$$ 1935745 2000894 1929986 1937665 1956140 1955639 1929926 1890174 1933121 1896445 1891555 1998408 2003418
6622B003418o5984n4240n4830R0366Q381n0972L3876K3842k2271M1266m2791J2169
$$ 2003418 1937434 1883194 1828364 1918730 1927111 1876139 1910015 1933857 1911586 1952852 1910061 1922230
6610A922230N0154L8435L202O740j2080N1758n3941o5803k346m8992O5647n7334
$$ 1922230 1972384 2010819 2014021 2020761 2008681 2060439 2006498 1940695 1938349 1889357 1955004 1897670
6598A897670j4904N0349K7925N3566O1888j15395j03732M4438M5265L7086k245
$$ 1897670 1882766 1933115 1961040 2014606 2076494 1961099 1857367 1901805 1947070 1984156 1981911
6587A981911J603l3635n914Q8237K1348k552q4376N6503L4861K1255J03194q5332
$$ 1981911 1983514 1949879 1943965 2032202 2053550 2050998 1966622 2023125 2057986 2079241 2182435 2097103
6575B097103K121K2749j17059R7003j5362J6402j1047N496k5074j9604L0734R4832
$$ 2097103 2099224 2121973 2004914 2101917 2086555 2102957 2091910 2097406 2072332 2052728 2083462 2178294
6563B178294M4522j07714L6015M0191O1018O201j4061J3296M9879n6360j1500
$$ 2178294 2222816 2115102 2151117 2191308 2252326 2258527 2244466 2257762 2307641 2251281 2239781
6552B239781N5149M5573q427L7070L55j5446Q1450k8230L0149N8250J921j0541
$$ 2239781 2294930 2340503 2332076 2369146 2369501 2354055 2435505 2407275 2437424 2495674 2497595 2487054
6540B487054J2256K1211N7236j0685O4576J12866J8301J26695N3692n7586J1105
$$ 2487054 2499310 2520521 2577757 2567072 2631648 2744514 2762815 2889510 2943202 2885616 2896721
6529B896721L6557J41783j3832l5561Q4630L1358M3261O8277L627j4860J34922
$$ 2896721 2933278 3075061 3061229 3025668 3110298 3141656 3184917 3253194 3256821 3241961 3376883
6518C376883j8626K9206J18582J46935j4045m3646L0910P1422P3967L3211J8428
$$ 3376883 3358257 3387463 3506045 3652980 3638935 3595289 3626199 3697621 3771588 3804799 3823227
6507C823227J04384P7934M8714q9877N1205O0318K5757O1241J73478J50428R7861
$$ 3823227 3927611 4005545 4054259 3964382 4015587 4075905 4101662 4162903 4336381 4486809 4584670
6496D584670M8277m8478k8994j68779k49927p9720j86611j28856k00899j88422
$$ 4584670 4632947 4584469 4555475 4386696 4136769 4057049 3870438 3741582 3540683 3352261
6486C352261p2156j19193o2352n3005m2563o8884r4510p4207p620l0981o6228
$$ 3352261 3280105 3160912 3098560 3045555 3002992 2934108 2839598 2765391 2757771 2726790 2660562
6475B660562j22834j5063M3232p3692n8996N2848Q083K673l2515J2839k3111j0975
$$ 2660562 2537728 2522665 2565897 2492205 2433209 2486057 2494140 2496813 2464298 2477137 2454026 2443051
6463B443051k8694j2148l2448r196N4777J7003J2679k7783P2470J0092j1307J74036
$$ 2443051 2414357 2402209 2369761 2360565 2415342 2432345 2445024 2417241 2489711 2499803 2488496 2662532
6451B662532J36385R8401J03053R1753J45434J93617J97183J26000J29839O7110
$$ 2662532 2798917 2897318 3000371 3092124 3237558 3431175 3628358 3754358 3884197 3951307
6441C951307j14349k31659k15052j50725j82994k19487j92528j46819j31839j2390
$$ 3951307 3836958 3605299 3390247 3239522 3056528 2837041 2644513 2497694 2365855 2353465
6431B353465p5620j20031n0252m8417j24283O9955o1645K0585m1905r0851N2789
$$ 2353465 2277845 2157814 2107562 2059145 1934862 2004817 1943172 1963757 1921852 1831001 1883790
6420A883790j07272p029j1627p6822m2479L3052J01916q4276m0949n4908R0360
$$ 1883790 1776518 1769489 1757862 1681040 1638561 1671613 1773529 1689253 1648304 1593396 1683756
6409A683756k4287k4373K6559n1036j10009M2162N5660K872O3313q3593n6321
$$ 1683756 1659469 1635096 1661655 1610619 1500610 1542772 1598432 1601304 1664617 1581024 1524703
6398A524703Q4511o1870J1529R1928j9182M3500m3781M3536Q8187n1958p3726
$$ 1524703 1609214 1547344 1558873 1650801 1631619 1675119 1631338 1674874 1763061 1711103 1637377
6387A637377m6510j4548N5504M9130Q3898m9098J7746N6459m0836P03N5020R551
$$ 1637377 1590867 1576319 1631823 1680953 1764851 1715753 1733499 1789958 1749122 1749825 1804845 1814396
6375A814396J12551N7796j8261J20610P8025M3198J02341O7464R2140J65584J17108
$$ 1814396 1926947 1984743 1966482 2087092 2165117 2208315 2310656 2378120 2470260 2635844 2752952
6364B752952J2856K2102l2093l6514j81580p4460p722k7847j94250j18814m0525
$$ 2752952 2765808 2787910 2755817 2719303 2537723 2463263 2455541 2427694 2233444 2114630 2074105
6353B074105J4347L3800J4678k8157l6405m9042N01N6889o649k0212K0422J8600
$$ 2074105 2088452 2122252 2136930 2108773 2072368 2023326 2023827 2080716 2074067 2053855 2074277 2092877
6341B092877J1564O2286J34418K0547J727J00663l248M4885Q6892R2968J49831
$$ 2092877 2104441 2166727 2301145 2321692 2323419 2424082 2420834 2465719 2552611 2645579 2795410
6330B795410J67843J03229J21157K06733J47926J66284K96168L76703L82324L74656
$$ 2795410 2963253 3066482 3187639 3394372 3542298 3708582 4004750 4381453 4763777 5138433
6320E138433L52994P8430o2894j46132k36233l16403l50719l59448k68248l24180
$$ 5138433 5491427 5569857 5506963 5360831 5124598 4808195 4457476 4098028 3829780 3505600
6310C505600k26549k05238r5641m6323j12748j33313j0174l6152N2289N064n1554
$$ 3505600 3279051 3073813 2978172 2931849 2819101 2685788 2675614 2639462 2691751 2696815 2645261
6299B645261j9003L4543R1020k6615K8830k7984P7159J13481J47851R0557J58890
$$ 2645261 2626258 2660801 2751821 2725206 2754036 2726052 2803211 2916692 3064543 3155100 3313990
6288C313990J56758J22565K03056L21310K34921K47281J53996J43050J69883j21594
$$ 3313990 3470748 3593313 3796369 4117679 4352600 4599881 4753877 4896927 5066810 4945216
6278D945216j51219k34369j26959k22332l89590k68457k94905j86348j33138j86656
$$ 4945216 4793997 4559628 4432669 4210337 3820747 3552290 3257385 3071037 2937899 2751243
6268B751243j01283n0849j16866l5839l7539l0180j99348K6L1675p4020o961n1876
$$ 2751243 2649960 2599111 2482245 2446406 2408867 2378687 2179339 2179365 2211040 2137020 2130059 2078183
6256B078183n511K7827j9276q3061K4183L496j3930o6541L5722o0352P3772J18047
$$ 2078183 2072672 2100499 2081223 1998162 2022345 2025841 2011911 1945370 1981092 1920740 1994512 2112559
6244B112559k3031J57615O589k411J07524J18497R3727O0862j5504k8589L8186
$$ 2112559 2089528 2247143 2253732 2251321 2358845 2477342 2571069 2631931 2616427 2587838 2626024
6233B626024j5509k0078p1304p5908j22172P764O4037j25149k9721R7616R3075
$$ 2626024 2610515 2590437 2519133 2443225 2321053 2328817 2392854 2267705 2237984 2335600 2428675
6222B428675N5794J48709R1575J03999J26743R4403N8850M6175k6227q2196j6113
$$ 2428675 2484469 2633178 2724753 2828752 2955495 3049898 3108748 3154923 3128696 3046500 3030387
6211C030387j45398j96114j56626j93541j72688j14890r4494j02752j29905l2672
$$ 3030387 2884989 2688875 2532249 2338708 2166020 2051130 1956636 1853884 1723979 1691307
6201A691307p6802l0373N520l6456k1268l9511k9935L4826j03029k1780r8708
$$ 1691307 1614505 1584132 1589652 1553196 1531928 1492417 1462482 1497308 1394279 1372499 1273791
6190A273791O4041j108m7089J8649o8668K8601N5487R948L0665J9755J2496n2346
$$ 1273791 1337832 1336724 1289635 1308284 1239616 1268217 1323704 1333652 1364317 1384072 1396568 1344222
6178A344222p0729L397P1702N5288J5052j08108O5842R2796K4880J06416N9702
$$ 1344222 1273493 1276890 1348592 1403880 1418932 1310824 1376666 1469462 1494342 1600758 1660460
6167A660460R545J60035J91066Q0189P6703N9203n2910j20718j02975n6403j37754
$$ 1660460 1670005 1830040 2021106 2101295 2177998 2237201 2184291 2063573 1960598 1904195 1766441
6156A766441j91847k9210q6573r6581j38120j10864j9493J9714q7890o4157J4229
$$ 1766441 1574594 1545384 1458811 1362230 1224110 1113246 1093753 1113467 1025577 961420 975649
6145I75649q5793L3490R240r2425L3077k2446o1859K9047p076j07185J49069L9821
$$ 975649 889856 923346 932586 840161 873238 850792 788933 817980 810904 703719 852788 892609
6133H92609n1528n4913l9953K3706P6155q5349j4110J641k8139k9703O4395r327
$$ 892609 841081 786168 746215 769921 846076 760727 746617 748258 720119 690416 754811 745484
6121G45484p6262j9116J7435O6514M8675q7593q0730K1855j746o7433K9056j0028
$$ 745484 669222 650106 667541 734055 782730 695137 614407 636262 634516 567083 596139 586111
6109E86111j07005j9462J04006j6222l8520P3413R3128J8709N524k0173n9695
$$ 586111 479106 459644 563650 547428 508908 582321 675449 694158 699682 679509 619814
6098F19814m4501P7390J29424M474l4576L2122l3207j3203k1025k8574q838j5212
$$ 619814 575313 652703 782127 786601 752025 784147 750940 737737 716712 688138 679300 664088
6086F64088n0219k5209N0933r1925O4484J5263m8696M7252K5980M740k1667L820
$$ 664088 613869 588660 639593 547668 612152 627415 578719 625971 651951 656691 635024 638844
6074F38844M0740n616L4999K302l7743R9569P4584k5757O7157j9365l7778Q518
$$ 638844 679584 673968 708967 711269 673526 773095 847679 821922 889079 869714 831936 840454
6062H40454l2727l6779o0886n1795k1586L8064j016m3486L2406k0941j4168M0326
$$ 840454 807727 770948 710062 658267 636681 674745 673729 630243 662649 641708 627540 667866
6050F67866P009j2883j9883L289j4162O835P0749K6647J04841k0406Q65J14907
$$ 667866 674875 661992 642109 645398 631236 638071 708820 735467 840308 819902 820767 935674
6038I35674J01221O522r3383q2538O221n0523j7583j15664l1129o7198r715K0368
$$ 935674 1036895 1043417 950034 867496 873717 823194 805611 689947 658818 591620 581905 602273
6026F02273J3665j7998P6137r3772j5797k5985o8350L6572Q415K4937j2817Q8839
$$ 602273 615938 597940 674077 580305 564508 538523 470173 506745 515160 540097 527280 616119
6014F16119O1276N8170O9632l6591K7966M7486m1466j53862m6730r692N1869J5487
$$ 616119 677395 735565 805197 768606 796572 844058 802592 648730 602000 592308 644177 659664
6002F59664o6832r477n8469n2216Q4457k6754j8968l6410l6923J06115j6172j3674
$$ 659664 592832 583355 524886 472670 557127 530373 511405 474995 438072 544187 528015 514341
5990E14341R672M019p7019K3555L1450l2115k0179j2892l4475P8112J4095M963
$$ 514341 524013 528032 451013 474568 506018 473903 453724 440832 406357 484469 498564 503527
5978E03527p8101p7693O1273M0600r2414k4943l9580N670O287m2391R301M4740
$$ 503527 425426 347733 409006 449606 357192 332249 292669 298339 304626 262235 271536 316276
5966C16276n2303N3753J0390p2190L0384R711j027N0031o8297l3714M6468L7204
$$ 316276 263973 317726 328116 255926 286310 296021 294994 345025 276728 243014 289482 326686
5954C26686r5400M8860N0885n2505K4944M442j00650j8944l7817O3507M9244j1532
$$ 326686 231286 280146 331031 278526 303470 307912 207262 188318 150501 214008 263252 251720
5942B51720j3114O4060L8063l6315J4286L6320r4729p2579k4156M1754K7046p1859
$$ 251720 238606 302666 340729 304414 318700 355020 260291 187712 163556 205310 232356 160497
5930A60497M9487M7145k3061L4855m9497j7397N3808j6859l0061k0197K599l9900
$$ 160497 209984 257129 234068 268923 219426 202029 255837 238978 208917 188720 191319 151419
5918A51419q4678j0234Q1202O3773j0588q7604P6774k6517L3677J19279q0535
$$ 151419 66741 56507 137709 201482 190894 103290 180064 153547 187224 306503 225968
5907B25968n5233J3468m0745l1546N862K4496n335Q802K3135K8209j2724n9941
$$ 225968 170735 184203 143458 111912 117774 142270 136935 145737 168872 197081 184357 124416
5895A24416p058o687j990Q6094l8701j7611l0803k3087K8053l6742Q847M6118
$$ 124416 117358 110671 108681 194775 156074 138463 107660 84573 112626 75884 84731 130849
5883A30849o1971L7478M0750o0937L0543J9315n3321K8177K5935M2863N5066n9713
$$ 130849 68878 106356 147106 86169 116712 136027 82706 110883 136818 179681 234747 175034
5871A75034r8706O0094L5900q1086o205L1881n5451P466L4815L6962o6458n920
$$ 175034 76328 136422 172322 91236 85031 116912 61461 68927 103742 140704 74246 68326
5859F8326K2738K1023O2742o3916K3110j5106J2544l4637k2566L9666J8945n9350
$$ 68326 91064 112087 174829 110913 134023 118917 131461 96824 74258 113924 132869 73519
5847G3519n8448R5508k0646k3130j0455R414r616K3456K058K4683l2463j289K1442
$$ 73519 15071 110579 89933 66803 56348 65762 56146 79602 81660 106343 73880 72591 94033
5834I4033q9120k2135J7816L3627Q3046J2988J142k3614l6826m2027M2606o0128
$$ 94033 4913 -17222 594 34221 117267 130255 131397 107783 70957 28930 71536 11408
5822A1408l9710j0725O8944O698M5325o656m6644M5663N621n6359m925M4811M4432
$$ 11408 -28302 -39027 29917 36615 81940 75284 28640 74303 79924 23565 18640 63451 107883
5809A07883l151r1310J7866l0885J4563l3417J8199l226o4291k4741J21987n170
$$ 107883 104732 13422 31288 403 14966 -18451 -252 -3478 -67769 -92510 29477 24307
5797B4307j7908K6281l0791k7112p0361K9707N8549K8772j9051L5303J6640k778
$$ 24307 6399 32680 1889 -25223 -95584 -65877 -7328 21444 2393 37696 54336 51558
5785E1558k1801k4997J0607l805J980k0751l3763L5104j7584K3278N297l0749
$$ 51558 29757 4760 15367 11562 13542 -7209 -40972 -5868 -23452 -174 5123 -25626
5773b5626R7612q7397m5514q824M5269m7996L9335l630M4152j3295j06403K5139
$$ -25626 71986 -15411 -60925 -69749 -24480 -72476 -33141 -36771 7381 -5914 -112317 -87178
5761h7178K7511J9512K7337k3727j8927K4915J8519p9294L8496M4087m2489j5264
$$ -87178 -59667 -40155 -12818 -36545 -55472 -30557 -12038 -91332 -52836 -8749 -51238 -66502
5749f6502M3453O5183r3146n3899J32564K8903l0974P275K9383j9460Q574m5374
$$ -66502 -23049 42134 -51012 -104911 27653 56556 25582 32857 62240 42780 51354 5980
5737E980l2867L5461L9391l8596p6290J02148K4183o851q4031k7853N60J3441
$$ 5980 -26887 8574 47965 9369 -66921 35227 59410 52559 -31472 -59325 -58765 -45324
5725d5324J2933q65L0938J5692J9459l077Q5043j9802m1695m2851K4372L063k2261
$$ -45324 -32391 -33256 -2318 13374 32833 29756 114799 94997 53302 10451 34823 37886 15625
5712A5625l3642o4762j3134J06486o150q3482L1432K8004J3473L9872M924m4742
$$ 15625 -18017 -82779 -95913 10573 4423 -79059 -47627 -19623 -6150 33722 38646 -6096
5700f096j1274K9005k4366l6014r984M9948K1587n0604k9759l3868J5970p391
$$ -6096 -17370 11635 -12731 -48745 -58729 -8781 12806 -37798 -67557 -101425 -85455 -92846
5688i2846l7350J3067R5502N0336j00348p0013Q7367p809K7502l1805L4468m5525
$$ -92846 -130196 -117129 -21627 28709 -71639 -141652 -54285 -62094 -34592 -66397 -31929 -77454
5676g7454r243L8398n513j6368M0839J8334J8317M142l5642J4959N3106j3440
$$ -77454 -86697 -48299 -53812 -70180 -29341 -11007 7310 11452 -24190 -9231 43875 30435
5664C0435m8330L2112j7180p6586M5964R1079r1148o2523R8463J9169j09574k7147
$$ 30435 -17895 14217 -2963 -79549 -33585 57494 -33654 -96177 2286 21455 -88119 -115266
5652a15266J07973m6635M203k431J0970P7625L0410n7872q8855O478M1031n3281
$$ -115266 -7293 -53928 -49725 -52156 -41186 36439 66849 8977 -79878 -73400 -32369 -85650
5640h5650j00944N3782N3533L8214O1439j6964l9554P4395L1606o6013O8317n7917
$$ -85650 -186594 -132812 -79279 -41065 20374 3410 -36144 38251 69857 3844 72161 14244
5628A4244L3451N659L7285n0635l1365J3587Q0357Q402j44599k437p7706L7232
$$ 14244 47695 53354 90639 40004 8639 22226 102583 110985 -33614 -36051 -113757 -76525
5616g6525k9261M9637O0471k3511L8507M0123n544m6194M3676l1994o0989J5239
$$ -76525 -105786 -56149 4322 -19189 19318 59441 53897 7703 51379 19385 -41604 -26365
5604b6365K6739L2129m7816O2131K0886J6131j176m6298l0110K253j525K4817
$$ -26365 374 32503 -15313 46818 67704 83835 82659 36361 6251 8504 6979 31796
5592C1796K2987M733J3325o6655M8626L4355n6763l0753m786J83O3851P147J4845
$$ 31796 54783 59516 72841 6186 54812 89167 32404 1651 -3135 -2952 60899 68046 82891
5579H2891M9996n8085k439o8335m4531J3117P4207o5337P394m2281M5139K1854
$$ 82891 132887 74802 72363 4028 -40503 -27386 46821 -18516 -11122 -53403 -8264 13590
5567A3590n2875N4153m8057L5028O6573p5091K2657N1676l3112q7739L014O4651
$$ 13590 -39285 14868 -33189 1839 68412 -6679 15978 67654 34542 -53197 -50183 14468
5555A4468M2441J6749Q301m1441K9210K3921j9762N6279q6992o5360N0473J8680
$$ 14468 56909 73658 81959 40518 69728 93649 73887 130166 43174 -22186 28287 46967
5543D6967r0839J03514M9849n3826P8232j3183l5541m039k9175N227J7345m5939
$$ 46967 -43872 59642 109491 55665 133897 120714 85173 81134 51959 57186 74531 28592
5531B8592m9593O1211L4418p8359k532m7703P6679J05796j1267O0870K5894P476
$$ 28592 -21001 40210 74628 -3731 -6263 -53966 22713 128509 117242 178112 204006 211482
5519B11482L6929K0154J912p9794p9862j5549O0526j6437L5740L2521J534m624
$$ 211482 248411 268565 270477 190683 110821 95272 155798 139361 175101 207622 209156 204532
5507B04532l9659Q454k5272L7877R1020K3756k3034J10355m4780k8526j5091l8570
$$ 204532 164873 173327 148055 185932 276952 300708 277674 388029 343249 314723 299632 261062
5495B61062L986J368L0585L7261P1801k5004q401K3888J1636J9942j4224o5659
$$ 261062 265048 266416 297001 334262 406063 381059 372658 396546 408182 428124 413900 348241
5483C48241O271R8934m4550N8494l6899N3254j1607O5652N3366K1796Q3697O0809
$$ 348241 354512 453446 408896 467390 430491 483745 472138 537790 591156 612952 696649 757458
5471G57458j3438n9633l1464L7601N6421N3824N6484K733O2856j6905O0269L9707
$$ 757458 744020 684387 652923 690524 746945 800769 857253 859986 922842 905937 966206 1005913
5459A005913R9527j2157r992L1545P9116J4536K1830m4053J41690J12568L2263
$$ 1005913 1105440 1093283 1083291 1114836 1193952 1208488 1230318 1186265 1327955 1440523 1472786
5448A472786J48317M5689Q7279J67782J21168J40461P9599J20229R2775J34173
$$ 1472786 1621103 1666792 1754071 1921853 2043021 2183482 2263081 2383310 2476085 2610258
5438B610258J73898K30256K15082L73150M15053M54479O50780P25751Q85610R43229
$$ 2610258 2784156 3014412 3229494 3602644 4017697 4472176 5122956 5848707 6734317 7677546
5428G677546J155146J202394J320267R54363L02077m48317j106009j395919j358266
$$ 7677546 8832692 10035086 11355353 12309716 12611793 12163476 11057467 9661548 8303282
5419H303282j263775r53431p87718o65570o27269m77008l05947k64604l02079
$$ 8303282 7039507 6086076 5298358 4632788 4005519 3528511 3222564 2957960 2655881
5410B655881j87792j85447j35499j76816r4118r0907j02718k9157q7761j01484
$$ 2655881 2468089 2282642 2147143 1970327 1876209 1785302 1682584 1653427 1565666 1464182
5400A464182o5913j36549p8099p0448j18787o5794q0568p7827p3381N1683o9298
$$ 1464182 1398269 1261720 1183621 1113173 994386 928592 848024 770197 696816 748499 679201
5389F79201o0378j1061l2496r2587L1463j2812J223r4869j4151Q339m9547N1207
$$ 679201 618823 607762 575266 482679 514142 501330 502553 407684 393533 401872 352325 403532
5377D03532j9530k5109n6984n2953M1415K9176n1718K1318k3820n1761L258l1620
$$ 403532 384002 358893 301909 248956 290371 319547 267829 289147 265327 213566 216824 185204
5365A85204l8800m3209L9843O3743k8018J3543K5777l7434J0301p5565m5170R1363
$$ 185204 146404 103195 143038 206781 178763 192306 218083 180649 190950 115385 70215 161578
5353A61578K0682j06508m653K8455j2763P30j10720N5245k9084k9462K2398p1547
$$ 161578 182260 75752 71099 99554 86791 87521 -23199 32046 2962 -26500 -4102 -75649
5341g5649M3649J8093R5985J7749r4615n1214p440l059M2453M0352k6398r2296
$$ -75649 -32000 -13907 82078 99827 5212 -46002 -53442 -56501 -14048 26304 -94 -92390
5329i2390J07104J2624l4468k3843n2732j6615J9843Q9879L450l2284q4033R923
$$ -92390 14714 27338 -7130 -30973 -83705 -100320 -80477 9402 12852 -19432 -103465 -93542
5317i3542Q4523j8892K8296o3946L6850l5057M747L5264m0743m8482k0805J1187
$$ -93542 -9019 -27911 385 -63561 -26711 -61768 -57021 -21757 -62500 -110982 -131787 -120600
5305a20600L4883k616j15073M5000n9928k0440M5597k1501J3549L6028l721J6446
$$ -120600 -85717 -88333 -203406 -158406 -218334 -238774 -193177 -214678 -201129 -165101 -168822 -152376
5293a52376O739n9459j1400O3822r3270K8034k2247p170N3187M8545K9170K4129
$$ -152376 -145637 -205096 -216496 -152674 -245944 -217910 -240157 -247327 -194140 -145595 -116425 -92296
5281i2296m9770Q01q451K7465J2930L907k9204j4456K0645M508M4452m5092m0773
$$ -92296 -142066 -141265 -149716 -122251 -109321 -105414 -134618 -149074 -128429 -123921 -79469 -124561 -165334
5268a65334k4006K8382j9612l3553K1510O8528M464K5476Q9498p8228o6664P440
$$ -165334 -189340 -160958 -180570 -214123 -192613 -124085 -119621 -94145 -4647 -82875 -149539 -142099
5256a42099o7313k1399L0805j3536m8020J74509m28n3570K604j1833o461k6034
$$ -142099 -209412 -230811 -200006 -213542 -261562 -87053 -87481 -141051 -138447 -150280 -156741 -182775
5244a82775p076O474J14001L5388q5851l1320n7687l0662k276R3099J8910O1970
$$ -182775 -189851 -183377 -69376 -33988 -119839 -151159 -208846 -239508 -241784 -148685 -129775 -67805
5232f7805j22476N6761o279o0065j1396o2304m496L2870Q7802O7809o4896k1914
$$ -67805 -190281 -133520 -139799 -199864 -211260 -273564 -278060 -245190 -157388 -89579 -154475 -176389
5220a76389J32941q9167l9111Q327K8461r7149L2756j0497O9294n327p1443K9108
$$ -176389 -43448 -132615 -171726 -163399 -134938 -232087 -199331 -209828 -140534 -145861 -217304 -188196
5208a88196N1801M0071l3384k8953l2162M3477N5354J4579m2392k5797k1470K7617
$$ -188196 -136395 -96324 -129708 -158661 -190823 -147346 -91992 -77413 -119805 -145602 -167072 -139455
5196a39455L5602k6197K3560M4886j797l0001P8404l7270K696J5416m4224M1939
$$ -139455 -103853 -130050 -106490 -61604 -63401 -93402 -14998 -52268 -49572 -34156 -78380 -36441
5184c6441M4131K5458Q918j77359l113L2563K9012k6629M5750p4700j0288n3772
$$ -36441 7690 33148 42066 -135293 -138406 -105843 -76831 -103460 -57710 -132410 -142698 -196470
5172a96470L7715M4500J4505k6483N361N4164l5804L5523p4314N2276q580j4568
$$ -196470 -158755 -114255 -99750 -126233 -120872 -66708 -102512 -66989 -141303 -89027 -97607 -112175
5160a12175K4502L6061l1948p6242O1211N4263j2759k9985l5340q2432k1877L9977
$$ -112175 -87673 -51612 -83560 -159802 -98591 -44328 -57087 -87072 -122412 -204844 -226721 -186744
5148a86744k9569L4511n2498L8280l4623J34217L0233k295p8289J1714N3004n9592
$$ -186744 -216313 -181802 -234300 -196020 -230643 -96426 -66193 -68488 -146777 -135063 -82059 -141651
5136a41651j7092L5193k0601K8447J13562j20872L399J0752J3474o7410J00026
$$ -141651 -158743 -123550 -144151 -115704 -2142 -123014 -119615 -108863 -95389 -162799 -62773
5125f2773R793l5503K486o1578K3712m3697l6393P7899Q8414q9016k1786j7741
$$ -62773 -52980 -88483 -85997 -147575 -123863 -167560 -203953 -126054 -37640 -126656 -148442 -166183
5113a66183K8402p583K7272l4322n1207J2011L0836O87o0165r353L8274K271J3184
$$ -166183 -137781 -145364 -118092 -152414 -203621 -191610 -160774 -160087 -220252 -229605 -191331 -189060 -175876
5100a75876K9170j7316Q783J501P6725Q3943j27760j7366k644j9697M9519N3129
$$ -175876 -146706 -164022 -155239 -153738 -77013 6930 -120830 -138196 -140840 -160537 -111018 -57889
5088e7889k8248p0502o1447R2837j750n1219m260K7950N1770J2362O580n0158
$$ -57889 -86137 -156639 -218086 -125249 -126999 -178218 -182478 -154528 -102758 -90396 -83816 -133974
5076a33974L0074j5709k2507o189L1907M8692p2889m5338n0947L7835N2770K6338
$$ -133974 -103900 -119609 -142116 -148305 -116398 -67706 -140595 -185933 -236880 -199045 -146275 -119937
5064a19937J3569m9386K4918J9081Q7415M6081j31390j7775R521k3479M9154O5757
$$ -119937 -106368 -155754 -130836 -111755 -24340 21741 -109649 -127424 -117903 -141382 -92228 -26471
5052b6471q7307m1118J4160K325r107L5657L6065J3120J3924M330m3151N7828
$$ -26471 -113778 -154896 -140736 -138411 -147518 -111861 -75796 -62676 -48752 -44422 -87573 -29745
5040b9745p631n6572p653J5832N2686k7870M3184M2968K7436o2963L2242k6479
$$ -29745 -37376 -93948 -101601 -85769 -33083 -60953 -17769 25199 52635 -10328 21914 -4565
5028d565o6687J04245R4349j51195k2492l2034N9734P713L033K0578K1930j5174
$$ -4565 -71252 32993 127342 -23853 -46345 -78379 -18645 -10932 -7899 12679 34609 19435
5016A9435N2968K0953q5l1285R207l9449K4877J9336o5325K7579l7M488Q7041
$$ 19435 72403 93356 93271 61986 71193 31744 56621 75957 10632 38211 38174 42662 129703
5003A29703k1065j8016N156J21502l2106j6669m4195j05786J13052M7605L1163
$$ 129703 108638 90622 95778 217280 185174 168505 124310 18524 131576 179181 210344
4992B10344N4006m8083j8562N5802M9178K6023M2462m0399p8995P2255L877m1838
$$ 210344 264350 216267 197705 253507 302685 328708 371170 330771 251776 324031 327908 286070
4980B86070J0480n0381M7955M9036Q5285K4639R262p405r110J42667K7284J2945
$$ 286070 296550 246169 294124 343160 428445 453084 462346 454941 445831 588498 615782 628727
4968F28727J8570n2713J5326M4269K3464L223J550M4163J5829l312M3179L107
$$ 628727 647297 594584 609910 654179 677643 680866 682416 726579 742408 739096 782275 785382
4956G85382l0258P0594L6879J25991L9082P1420l4298M5091q57J08026L462J30821
$$ 785382 755124 825718 862597 988588 1027670 1099090 1064792 1109883 1109026 1217052 1220514 1351335
4944A351335j8831R5451m009P7093J28581J8545M6447N7836M3159L727M5914N9684
$$ 1351335 1332504 1427955 1423946 1501039 1629620 1648165 1694612 1752448 1795607 1799334 1845248 1904932
4932A904932M7426N4968J07416M7719R3989J04675J24296N8901N7815R2956M6952
$$ 1904932 1952358 2007326 2114742 2162461 2256450 2361125 2485421 2544322 2602137 2695093 2742045
4921B742045R8119Q1673J08787J68244N4066P1604J80885K24101J76637K24875
$$ 2742045 2840164 2921837 3030624 3198868 3252934 3324538 3505423 3729524 3906161 4131036
4911D131036J11676K44857K48657K42717K28689K53709J87144N9956J49393K08850
$$ 4131036 4242712 4487569 4736226 4978943 5207632 5461341 5648485 5708441 5857834 6066684
4901F066684K51159K52274K78806M12046M16006M82886O33050O62733P02046P45363
$$ 6066684 6317843 6570117 6848923 7260969 7676975 8159861 8792911 9455644 10157690 10903053
4891A0903053O78411N91327N93891N60013P18923Q85170Q76542J062334Q21070
$$ 10903053 11581464 12172791 12766682 13326695 14045618 14930788 15807330 16869664 17690734
4882A7690734O96743N77562L42639N25070O63559O97487Q14200O43538K91372
$$ 17690734 18387477 18965039 19307678 19832748 20496307 21193794 22007994 22651532 22942904
4873B2942904k03846o24644r35647r31093p09179o74863o28712o56102p92488
$$ 22942904 22739058 22114414 21178767 20247674 19538495 18863632 18234920 17578818 16786330
4864A6786330q28757r53582r36349r31010p88134o20616n68815n24013p39667
$$ 16786330 15957573 15003991 14067642 13136632 12348498 11727882 11159067 10635054 9895387
4855I895387o82915o64965o35999n17332n39084l03804l24790j63903o0133L7260
$$ 9895387 9212472 8547507 7911508 7394176 6855092 6551288 6226498 6062595 6002462 6039722
4845F039722J27789M2162P9649R165r4958l47658l55381n27397m28403l91286
$$ 6039722 6167511 6209673 6289322 6298487 6203529 5855871 5500490 4973093 4544690 4153404
4835D153404k90407l07181k99804j33820k62001k08483j02444n5450r2599j24225
$$ 4153404 3862997 3555816 3256012 3122192 2860191 2651708 2549264 2493814 2401215 2276990
4825B276990q0511l4132j25009j13262r6380r1742R909L6718J1061p2601M8185
$$ 2276990 2196479 2162347 2037338 1924076 1827696 1735954 1745863 1782581 1793642 1721041 1769226
4814A769226R5937J8200J04652j8956j5278Q4439m4289j16422r0779j92545j31595
$$ 1769226 1865163 1883363 1988015 1969059 1953781 2038220 1993931 1877509 1786730 1594185 1462590
4803A462590j00593j63905q3113m1942k1577j39619j12744M8164j6630m3667m6170
$$ 1462590 1361997 1198092 1114979 1073037 1051460 911841 799097 847261 830631 786964 740794
4792G40794n9787o1040p2411J8317k5637n7086L2202N4134n9705k8128j01798
$$ 740794 681007 619967 547556 565873 540236 483150 515352 569486 509781 481653 379855
4781C79855K7890K78l2055j2206k5996m6350j33583Q7599P3457M5793n5969j7857
$$ 379855 407745 408023 375968 363762 337766 291416 157833 245432 318889 364682 308713 290856
4769B90856q0179J7912N2064m9285n7680n7793J8466N7655M5642J992r9990J1296
$$ 290856 210677 228589 280653 231368 173688 115895 134361 192016 237658 239650 139660 150956
4757A50956q603j04310l9654Q0629N8845J7604m5292m0566l0805N8960O0450m9157
$$ 150956 142353 38043 -1611 79018 137863 155467 110175 69609 38804 97764 158214 109057
4745A09057q3267M4767N2475m7676l6797O7951N5018p8490L6324m2143p1183k3058
$$ 109057 25790 70557 123032 75356 38559 106510 161528 83038 119362 77219 6036 -17022
4733a7022J0921J8444N4485k8008K0593j11527L4392J6917O7058m8086o980m2203
$$ -17022 -6101 12343 66828 38820 59413 -52114 -17722 -805 66253 18167 11187 -31016
4721c1016O6051J24082j12300l2473l542o6791L3064j5347Q8241m8929L3462K8121
$$ -31016 35035 159117 46817 14344 10802 -55989 -22925 -38272 49969 1040 34502 62623
4709F2623n3345m3272l7658r839j351N8968j9792M0853N134O5143p6542k497J8574
$$ 62623 9278 -33994 -71652 -81491 -82842 -23874 -43666 -2813 2321 67464 -9078 -11575 6999
4696F999L3745K5621R930l06j9867r6857p580K4763m1715J3090Q2636j7831Q28
$$ 6999 40744 66365 76295 75989 56122 -40735 -48315 -23552 -65267 -52177 30459 12628 13456
4683A3456N4133j8578J8633j49045n2860R3642p7107O4629O2315j22515L823K4395
$$ 13456 67589 49011 67644 -81401 -134261 -40619 -117726 -53097 9218 -113297 -109474 -85079
4671h5079l260R0845O2371M870j4225P64p1125Q7596j4036n1107l235k3936R455
$$ -85079 -88339 2506 64877 69747 55522 56286 -14839 72757 58721 7614 4379 -19557 -10102
4658a0102N379p2119K9470j6885P3310K7684p5039L3688P7101o6934K3300l0210
$$ -10102 -4723 -76842 -47372 -64257 9053 36737 -38302 -4614 72487 5553 28853 -1357
4646a357n1344N7746J2922M630J9378M1080J55q2881k4811j138N673P390L8268
$$ -1357 -52701 5045 17967 22597 41975 83055 83210 329 -24482 -25620 -19947 -12557 25711
4633B5711J2475K0025L8670r5726L2903M6481j7241l7145n8786J1331O9615O79
$$ 25711 38186 58211 96881 1155 34058 80539 63298 26153 -32633 -21302 48313 48992
4621D8992R556k7287O2196K0194l9535M8743q4426M348J7774k5247m4782P554
$$ 48992 58548 31261 93457 113651 74116 122859 38433 42781 60555 35308 -9474 -1920
4609a920M7126m572N8868J0315k364m3762j0848l180P6703n4955k6623j4546L4164
$$ -1920 45206 40634 99502 109817 107453 63691 52843 49663 126366 71411 44788 30242 64406
4596F4406L7552O5692l0026n2871k0176L1486m4203n8259O3001R1666m0151k5143
$$ 64406 101958 167650 137624 84753 64577 96063 51860 -6399 56602 148268 108117 82974
4584H2974o8730J6007M6549P9477L6100k4403m0573p3934L5002M3993R6014K1148
$$ 82974 14244 30251 76800 156277 192377 167974 127401 53467 88469 132462 228476 249624
4572B49624M7768J7894o899m2287K0675K5575l1543k3487L2072k8857M2014N1652
$$ 249624 297392 315286 308387 266100 286775 312350 280807 257320 289392 260535 302549 354201
4560C54201M8811O7449m481J6596j12426p6121M2458k2976n5824L0079O0651M1909
$$ 354201 403012 470461 465980 482576 370150 294029 336487 313511 257687 287766 348417 390326
4548C90326l9082q9881j2072M4899L8130N7378K90m3699j0370k2699k4273K707
$$ 390326 351244 261363 249291 294190 332320 389698 389988 346289 335919 313220 288947 291654
4536B91654n3127J2475J6910q9943N4170O4168k7465N8866k8609M4373m4828J3958
$$ 291654 238527 251002 267912 177969 232139 296307 268842 327708 299099 343472 298644 312602
4524C12602q45m1319o4601Q0491O1695q6570P1441j5746Q8387M279r44R3968o6998
$$ 312602 311757 270438 205837 286328 348023 261453 332894 317148 405535 409814 408870 502838 435840
4511D35840N997M9220m3980m0208Q202N939o794M4756L1700Q061k5280N3828j2632
$$ 435840 441837 491057 447077 406869 415071 421010 414216 458972 490672 498733 473453 527281 514649
4498E14649Q6787k6427K4375L8953M4950n8434k9440l990L2278O666J21702q8699
$$ 514649 601436 575009 599384 638337 683287 624853 595413 591423 623701 630367 752069 663370
4486F63370l4704K1146P7205P8164p089N1205K2112k2896k3395q5138m6714N5977
$$ 663370 628666 649812 727017 805181 798092 849297 871409 848513 825118 739980 693266 749243
4474G49243L3194k7625m4963N3249O4107M1756O065K7541o997L2970P286K5601
$$ 749243 782437 754812 709849 763098 827205 868961 875026 902567 895570 928540 935826 961427
4462I61427K0686m2098J15162J9111m4800O312k0516L8927K8360J20823J2205
$$ 961427 982113 940015 1055177 1074288 1029488 1035800 1015284 1054211 1082571 1203394 1215599
4451A215599K5376m315J09719P91Q5811M7047P7306N5981Q8521R9104J15930J46178
$$ 1215599 1240975 1236660 1346379 1347170 1432981 1480028 1557334 1613315 1701836 1800940 1916870 2063048
4439B063048J46400K27388K54219J45210J86936Q6398n6741k21963j41154p4043
$$ 2063048 2209448 2436836 2691055 2836265 3023201 3109599 3052858 2830895 2689741 2615698
4429B615698j13870j67578j24161r5535m5641j6449j7303L9977J6613k5641L7461
$$ 2615698 2501828 2334250 2210089 2114554 2068913 2052464 2035161 2075138 2091751 2066110 2103571
4418B103571R7226O1337J8749o7614O9958k4309o0667O3880M9518j3354j0517
$$ 2103571 2200797 2262134 2280883 2213269 2283227 2258918 2198251 2262131 2311649 2298295 2287778
4407B287778N0453N7904R7781J11862m3917N3659P4215J2939M3499J6855l000
$$ 2287778 2338231 2396135 2493916 2605778 2561861 2615520 2689735 2702674 2746173 2763028 2760028
4396B760028J20840O3799o21R3199J38972J43129N1796l6648J19266J6981J86895
$$ 2760028 2880868 2944667 2944046 3037245 3176217 3319346 3371142 3334494 3453760 3470741 3657636
4385C657636N1481L7540J23873M4498J33377M2955k272K20544J19388Q5505J47177
$$ 3657636 3709117 3746657 3870530 3915028 4048405 4091360 4089088 4309632 4429020 4514525 4661702
4374D661702J37780J05178K1095K17094J49819P9933R2989J49496J07815Q6354
$$ 4661702 4799482 4904660 4925755 5142849 5292668 5372601 5465590 5615086 5722901 5809255
4364E809255J50469K20468J50130J57247J81908K08570J65681J59216J27526J48888
$$ 5809255 5959724 6180192 6330322 6487569 6669477 6878047 7043728 7202944 7330470 7479358
4354G479358J77702K27276J91288J92616J22649J35798J31084J59330J81572J75308
$$ 7479358 7657060 7884336 8075624 8268240 8390889 8526687 8657771 8817101 8998673 9173981
4344I173981J19258O7631J71299J76651P9559R1370J19804P5456l0142l4525R3384
$$ 9173981 9293239 9360870 9532169 9708820 9788379 9879749 9999553 10075009 10044867 10010342 10103726
4333A0103726m8701M0097l4404J4838o1296j58388j82755l9304j9133j52240j60308
$$ 10103726 10055025 10095122 10060718 10075556 10014260 9855872 9673117 9633813 9614680 9462440 9302132
4322I302132j58028k07707j23006j41850j47732j05971j24419o5764p6558k08552
$$ 9302132 9144104 8936397 8813391 8671541 8523809 8417838 8293419 8227655 8151097 7942545
4312G942545j01920j71226j90188m9672p2812j23237j29870j07937n9776J9297
$$ 7942545 7840625 7669399 7479211 7429539 7356727 7233490 7103620 6995683 6935907 6955204
4302F955204q6676n5717m6276J5398k1168j6389l4206L2320M0942P8856L9873
$$ 6955204 6868528 6812811 6766535 6781933 6760765 6744376 6710170 6742490 6783432 6862288 6902161
4291F902161J3225J02884P9162J22969O7682J57550K17599L08577M28647L93928
$$ 6902161 6915386 7018270 7097432 7220401 7288083 7445633 7663232 7971809 8400456 8794384
4281H794384M76307N88373N83685O78820P72919P43290N42748M52515K15938k60249
$$ 8794384 9270691 9859064 10442749 11121569 11894488 12637778 13180526 13633041 13848979 13588730
4271A3588730n87842q68598r21466r08016q95496p10444p00135o21398l94626
$$ 13588730 13000888 12132290 11210824 10302808 9407312 8696868 7996733 7375335 6980709
4262F980709m40731l59139l45551l63406k51340j38780k24809q0623j58077r0124
$$ 6980709 6539978 6180839 5835288 5471882 5220542 5081762 4856953 4776330 4618253 4528129
4252D528129q8493k6928j49243p8519o9572j04440m2135q6305j04775n4441L1514
$$ 4528129 4439636 4412708 4263465 4184946 4115374 4010934 3968799 3882494 3777719 3723278 3754792
4241C754792o5270K8315o516M4975J4308N3155K4362K1954l0446n3859L5204l3503
$$ 3754792 3689522 3717837 3711321 3756296 3770604 3823759 3848121 3870075 3839629 3785770 3820974 3787471
4229C787471M5152K6077J00198R2849J49252P0962J29365K53142J10911K29851
$$ 3787471 3832623 3858700 3958898 4051747 4200999 4271961 4401326 4654468 4765379 4995230
4219D995230K50656J47537K37270K18838K77943L06660K83175L20355L95104M57725
$$ 4995230 5245886 5393423 5630693 5849531 6127474 6434134 6717309 7037664 7432768 7890493
4209G890493N79182N93864P66723Q83009R55810J095013J085618J087099R60846
$$ 7890493 8469675 9063539 9830262 10713271 11669081 12764094 13849712 14936811 15897657
4200A5897657O94587L35727k93293r34564j193398j358060j262626j280964j016927
$$ 15897657 16592244 16927971 16634678 15700114 14506716 13148656 11886030 10605066 9588139
4191I588139r90225r12968o89017o13101m88184m56802m78036j96731k03646k04502
$$ 9588139 8597914 7684946 6995929 6382828 5894644 5437842 4959806 4763075 4559429 4354927
4181D354927j97471k62227k79169p4343k00259k33079j76401p5762j52041j08078
$$ 4354927 4157456 3895229 3616060 3541717 3341458 3108379 2931978 2856216 2704175 2596097
4171B596097r8101r2586k38893j08373o708P9549q5001j23089q1068l0183q5792
$$ 2596097 2497996 2405410 2166517 2058144 2051436 2130985 2045984 1922895 1841827 1811644 1725852
4160A725852p2231K3390o1393n8858p7725o3916j05401L5181J7225m3803j03501
$$ 1725852 1653621 1677011 1615618 1556760 1479035 1415119 1309718 1344899 1362124 1318321 1214820
4149A214820n3613M4747L8728j0083p3452j2339R61k9459m185j40326q6539Q565
$$ 1214820 1161207 1205954 1244682 1234599 1161147 1148808 1149769 1120310 1116125 975799 889260 897825
4137H97825Q860k592J8913n3293M0428M4502L3768o4424n4236l2562N7112n6000
$$ 897825 906685 904093 923006 869713 910141 954643 988411 923987 869751 837189 894301 838301
4125H38301j1440k0327n7870n8088k6129j3198O9568K7126Q3164l2123l0867p9884
$$ 838301 826861 806534 748664 690576 664447 651249 720817 747943 831107 798984 768117 688233
4113F88233m8680J9175N0658o5914l7657l1333n157M2200O3052j0123k4748J3271
$$ 688233 639553 658728 709386 643472 605815 574482 569325 611525 674577 664454 639706 652977
4101F52977n332l7649Q1439j7865j0425L4699n072o2488O0142K6134m7940j7830
$$ 652977 647645 609996 691435 673570 663145 697844 692772 630284 690426 716560 668620 650790
4089F50790J02523o84j63466N0015K0053k402J622j441l5581K3152L7676Q0004
$$ 650790 753313 752629 589163 639178 659231 656829 658451 657010 621429 644581 682257 762261
4077G62261j9567j04946L1577K4837p4219K7795Q9071N442O1115j2232n7954Q2215
$$ 762261 742694 637748 669325 694162 619943 647738 736809 742251 803366 791134 733180 815395
4065H15395J9829m1916K2119K3405o6414M1462m1561M4115M6002L2985m3344M3228
$$ 815395 835224 793308 815427 838832 772418 813880 772319 816434 862436 895421 852077 895305
4053H95305j5122N0904L3424m8487L785J712L2072Q9438m1596o3177K010J8116
$$ 895305 880183 931087 964511 916024 919809 921521 953593 1043031 1001435 938258 940268 958384
4041I58384k5908J09059J6019K3331R961j947L3114k5764Q0337K5275L1505j09394
$$ 958384 932476 1041535 1057554 1080885 1090846 1088899 1122013 1096249 1176586 1201861 1233366 1123972
4029A123972N2626Q1295o7401J19749Q5123L1672M9123P3881Q8971P6438J11033
$$ 1123972 1176598 1257893 1190492 1310241 1395364 1427036 1476159 1550040 1639011 1715449 1826482
4018A826482J47763P4797L5242P6842J39349K5096P1596M4028o6900n2295l5125
$$ 1826482 1974245 2049042 2084284 2161126 2300475 2325571 2397167 2441195 2374295 2322000 2286875
4007B286875j23581m3908o3574l1172K9981j63046j77046p8119j00844p8286L7058
$$ 2286875 2163294 2119386 2055812 2024640 2054621 1891575 1714529 1636410 1535566 1457280 1494338
3996A494338R540n3764p5432l504Q819J04614j15131l6409O471j9062J715n3005
$$ 1494338 1503878 1450114 1374682 1371178 1379997 1484611 1369480 1333071 1339542 1320480 1322195 1269190
3984A269190j907R013l0005k0898m1674m8523P637J3968P6090M1099K3966j7459
$$ 1269190 1267283 1276296 1246291 1225393 1183719 1135196 1142833 1156801 1232891 1273990 1297956 1280497
3972A280497j2177L686r1900j05976j7276j5975R0564J8274L2373R2282l274N3335
$$ 1280497 1268320 1272006 1180106 1074130 1056854 1040879 1131443 1149717 1182090 1274372 1271098 1324433
3960A324433j8302q9273j7059L8742l9524J4062J8132n4876o7646L2468L7519
$$ 1324433 1306131 1216858 1199799 1238541 1199017 1213079 1231211 1176335 1108689 1141157 1178676
3949A178676J20491N30J24113L7998l0406J8579J8058m679O253N3994m2781j4027
$$ 1178676 1299167 1299697 1423810 1461808 1431402 1449981 1468039 1463360 1469613 1523607 1480826 1466799
3937A466799n6110P831Q0240O305M8368J53513j9544q704J11074M2251p6701o399
$$ 1466799 1410689 1418520 1498760 1505065 1553433 1706946 1687402 1678698 1789772 1832023 1755322 1748923
3925A748923M1318L0973o5798r0712N0280L0405l83K4649N5504N2766K8173K912
$$ 1748923 1790241 1821214 1755416 1664704 1714984 1745389 1745006 1769655 1825159 1877925 1906098 1909010
3913A909010K2415R9696l9578k8193M0002k0120q7225O1626O619J083J9269N1924
$$ 1909010 1931425 2031121 1991543 1963350 2003352 1983232 1896007 1957633 1964252 1965335 1984604 2036528
3901B036528k2092n4642M5973R4313j22194J014N9582j3838N4852k1544L7295
$$ 2036528 2014436 1959794 2005767 2100080 1977886 1978900 2038482 2024644 2079496 2057952 2095247
3890B095247j4582m750J25169M1301P0484J07879K1056J25265J25840q2782l1382
$$ 2095247 2080665 2075915 2201084 2242385 2312869 2420748 2441804 2567069 2692909 2610127 2578745
3879B578745P8896n5206M5025O9132j02506L3445J08362K290J62831J17138R7553
$$ 2578745 2657641 2602435 2647460 2716592 2614086 2647531 2755893 2758183 2921014 3038152 3135705
3868C135705N1312M7757k6502J20614p206M7990r3026P725J25043Q0669Q2898
$$ 3135705 3187017 3234774 3208272 3328886 3321680 3369670 3276644 3284369 3409412 3490081 3572979
3857C572979J05136J13398R5768J35385P0876P9721J6838M6871P301K6006J22988
$$ 3572979 3678115 3791513 3887281 4022666 4093542 4173263 4190101 4236972 4244273 4270279 4393267
3846D393267M6393N5360N5160J35224J89345J90177j7503J66150J83187M9472
$$ 4393267 4439660 4495020 4550180 4685404 4874749 5064926 5047423 5213573 5396760 5446232
3836E446232J31760J28160N5039J11369J72896p527J20831J58047J61558J81366
$$ 5446232 5577992 5706152 5761191 5872560 6045456 6037929 6158760 6316807 6478365 6659731
3826F659731K58239J88336J74789K84306J98544J44712K55204J93346J21992J43051
$$ 6659731 6917970 7106306 7281095 7565401 7763945 7908657 8163861 8357207 8479199 8622250
3816H622250J56486J32033K75467K62162L56971L92078L54618M30519M99531L40594
$$ 8622250 8778736 8910769 9186236 9448398 9805369 10197447 10552065 10982584 11482115 11822709
3806A1822709L52219L90955L53643L02758L17336L10645K51570M45023M29275
$$ 11822709 12174928 12565883 12919526 13222284 13539620 13850265 14101835 14546858 14976133
3797A4976133L79136M48248N19819M70626M77974N24022N34794N32206M25148
$$ 14976133 15355269 15803517 16323336 16793962 17271936 17795958 18330752 18862958 19288106
3788A9288106N18206M30840M56650N24050N55233O15452O25116P31599O16617
$$ 19288106 19806312 20237152 20693802 21217852 21773085 22388537 23013653 23745252 24361869
3779B4361869P11489Q60665P19768P86722P69963P63914P30031P24068O85605
$$ 24361869 25073358 25934023 26653791 27440513 28210476 28974390 29704421 30428489 31114094
3770C1114094P83873P73951Q92102R20219J073447J163089J188490J262053J247127
$$ 31114094 31897967 32671918 33564020 34484239 35557686 36720775 37909265 39171318 40418445
3761D0418445J326135J327082J290030J223437J297651J468307J537114J622405
$$ 40418445 41744580 43071662 44361692 45585129 46882780 48351087 49888201 51510606
3753E1510606K025591K280102K514206K883089L138514L361416L655845L915407
$$ 51510606 53536197 55816299 58330505 61213594 64352108 67713524 71369369 75284776
3745G5284776M099259M460262M848780N342329N906624O720956P736796Q950881
$$ 75284776 79384035 83844297 88693077 94035406 99942030 106662986 114399782 123350663
3737A23350663J0431532J2049781J3838278J5818883J7969163K0122360K2199943
$$ 123350663 133782195 145831976 159670254 175489137 193458300 213580660 235780603
3730B35780603K3853427K4494256K3190480J8889777J0869195Q2706j0853093
$$ 235780603 259634030 284128286 307318766 326208543 337077738 337160444 326307351
3723C26307351j9638582k4811487k6413647k5703319k3914207k1551531j9024708
$$ 326307351 306668769 281857282 255443635 229740316 205826109 184274578 165249870
3716A65249870j6680718j4544802j2434012j0740144r201103p829350o858362
$$ 165249870 148569152 134024350 121590338 110850194 101649091 93819741 86961379
3709H6961379n903683n217812m859015m514417m146225l835907l596994l330178
$$ 86961379 81057696 75839884 70980869 66466452 62320227 58484320 54887326 51557148
3701E1557148k999032k857443k520467k242077k090836j791364j533626j465089
$$ 51557148 48558116 45700673 43180206 40938129 38847293 37055929 35522303 34057214
3693C4057214j301642j348634j216316j284738j236819j239477j118894j053551
$$ 34057214 32755572 31406938 30190622 28905884 27669065 26429588 25310694 24257143
3685B4257143r13062r56064q22039p27438o01805n93664o19007m67507m88110
$$ 24257143 23344081 22388017 21565978 20838540 20236735 19643071 19024064 18556557 18068447
3676A8068447n23897m99806o37950n38909n63380n77737m59318n07066m11885
$$ 18068447 17544550 17044744 16406794 15867885 15304505 14726768 14267450 13760384 13348499
3667A3348499l70203k44910k98136k71465k42794k75461k21083k83022k89391
$$ 13348499 12978296 12733386 12435250 12163785 11920991 11645530 11424447 11141425 10852034
3658A0852034l63456l37365m12218l65902k32148k66978k60070j65507k09840
$$ 10852034 10488578 10151213 9738995 9373093 9140945 8873967 8613897 8448390 8238550
3649H238550j37295l9314k10243k34205p7220j35415j86396k12798k81042j76163
$$ 8238550 8101255 8061941 7851698 7617493 7540273 7404858 7218462 7005664 6724622 6548459
3639F548459j75312j12539j60188j22419j34361j01603n4424n5763K1190K3777
$$ 6548459 6373147 6260608 6100420 5978001 5843640 5742037 5687613 5631850 5653040 5676817
3629E676817j37618j06053j11446q8646j50907k06364o2550k9542j13386k4138
$$ 5676817 5539199 5433146 5321700 5233054 5082147 4875783 4813233 4783691 4670305 4646167
3619D646167n5645o0825k5297N4994k3866K172q2901j41422k9207K5903q9518
$$ 4646167 4590522 4529697 4504400 4559394 4535528 4537700 4454799 4313377 4284170 4310073 4220555
3608D220555j57254j03706J0075L0734o2900J412O9249p1005l7981m9807l4766
$$ 4220555 4063301 3959595 3969670 4000404 3937504 3938916 4008165 3937160 3899179 3849372 3814606
3597C814606N734n6403m6533r4524j19459L2345j19260l8922R1033J9660r417
$$ 3814606 3820340 3763937 3717404 3622880 3503421 3535766 3416506 3377584 3468617 3488277 3478860
3586C478860L1189Q8843J07592K1243q4014M1260K1663r0760m5058l218k5185
$$ 3478860 3510049 3598892 3706484 3727727 3643713 3684973 3706636 3615876 3570818 3567600 3542415
3575C542415L1838J51797Q6707J64590Q9895J37806J50254K41039K12574K02858
$$ 3542415 3574253 3726050 3812757 3977347 4067242 4205048 4355302 4596341 4808915 5011773
3565E011773M07995L92679M39305M78113N33445M47169J70467j72046m74692n38044
$$ 5011773 5419768 5812447 6251752 6729865 7263310 7710479 7880946 7708900 7234208 6696164
3555F696164n76074m48478l39283l39230k42452j80176k13436k55957r9091j13674
$$ 6696164 6120090 5671612 5332329 4993099 4750647 4570471 4357035 4101078 4001987 3888313
3545C888313j9401Q5360J14387P8589J71577J61229K38475L14049K33500K13463
$$ 3888313 3868912 3954272 4068659 4147248 4318825 4480054 4718529 5032578 5266078 5479541
3535E479541N41237N23424M19980K81667q676k87208m80030n78739n12978m95040
$$ 5479541 6020778 6544202 6964182 7245849 7237173 6949965 6469935 5891196 5378218 4883178
3525D883178l31360l83684k76102k06392k9456j28105j37193p3789n0273M1757
$$ 4883178 4551818 4168134 3892032 3685640 3656184 3528079 3390886 3317097 3266824 3308581
3515C308581m548J0970J4984P6870J11057J54499K09165K44242K37118K80834
$$ 3308581 3304033 3315003 3329987 3406857 3517914 3672413 3881578 4125820 4362938 4643772
3505D643772K28469K42929L70051J30978j06471j65447l27512l76528l59896j95631
$$ 4643772 4872241 5115170 5485221 5616199 5509728 5344281 5016769 4640241 4280345 4084714
3495D084714k17126j80704j95830p7584j82074j16760n8375K668j5751R615N1682
$$ 4084714 3867588 3686884 3491054 3413470 3231396 3114636 3056261 3058929 3043178 3052793 3104475
3484C104475J7927Q0044K06587J31882J53285K33207J97741K92598L66439M34894
$$ 3104475 3122402 3202446 3409033 3540915 3694200 3927407 4125148 4417746 4784185 5219079
3474E219079N70298N48566N96670N99741L78652Q7027k69168m74724p71814o98594
$$ 5219079 5789377 6337943 6934613 7534354 7913006 8000033 7730865 7256141 6484327 5785733
3464E785733n69233n37585m53721l28343l32148j81039j65712j66674n2021j08073
$$ 5785733 5216500 4678915 4225194 3896851 3564703 3383664 3217952 3051278 2999257 2891184
3454B891184l4037n3808K8145O7006K608N9174P3678R8465J53860J14998K24649
$$ 2891184 2857147 2803339 2831484 2898490 2901098 2960272 3033950 3132415 3286275 3401273 3625922
3443C625922K06494L25462L55946L40301M20387J97415J13574j4390l19825l38389
$$ 3625922 3832416 4157878 4513824 4854125 5274512 5471927 5585501 5571111 5251286 4912897
3433D912897m64647l90806k43289m19130l04803l57068k04168k08615k11042j51545
$$ 4912897 4448250 4057444 3814155 3395025 3090222 2733154 2528986 2320371 2109329 1957784
3423A957784j67968o4611p0343q1298j9449o4236j03302j31659k8172m197q8752
$$ 1957784 1789816 1725205 1654862 1573564 1554115 1489879 1386577 1254918 1226746 1222549 1133797
3412A133797p4825n6808m0386J2948j04957k7512m496P006j2125n0185N5661q6316
$$ 1133797 1058972 1002164 961778 974726 869769 842257 837761 844767 832642 782457 838118 751802
3400G51802N406l8813k3811L0223l2653j26904L4072L5199J4973J8387j538k2477
$$ 751802 757208 718395 694584 724807 692154 565250 599322 634521 649494 667881 666343 643866
3388F43866n916N134M4223q933j06925q7878L918L8604k3566L8422r6678K8643
$$ 643866 637950 643084 687307 678374 571449 483571 487489 526093 502527 540949 444271 472914
3376D72914N1712o7832J3319K2552J4054l1504o5391l021O5168j4497o7286k9529
$$ 472914 524626 456794 470113 492665 506719 475215 409824 406803 471971 457474 390188 360659
3364C60659O597M8775n8117p86j7116m3336K5275L0200P0427q8219l5729o6138
$$ 360659 367256 416031 357914 357128 340012 296676 321951 352151 422578 334359 298630 232492
3352B32492L8002L7740O4605N0566j59396M5895r940p9525l3700K0702M9239P4663
$$ 232492 270494 308234 372839 423405 264009 309904 299964 220439 186739 207441 256680 331343
3340C31343j6206r2436K4283Q4948m8515l2224N5611K0045o2980l3992q343J9406
$$ 331343 315137 222701 246984 331932 283417 251193 306804 326849 263869 229877 221534 240940
3328B40940P5939M0424Q5734o8782n6302l8642k7879p929l0991q6058j4161K2554
$$ 240940 316879 357303 443037 374255 317953 279311 251432 243503 212512 126454 112293 134847
3316A34847K6470L5601l0204L8411J7350j00945m4971o651R089O0746O5111p9502
$$ 134847 161317 196918 166714 205125 222475 121530 76559 69908 78997 139743 204854 125352
3304A25352k2189J452q0452L4718k7274o740r533P7686j2016k4103M6233l9443
$$ 125352 103163 104615 24163 58881 31607 24867 15334 93020 81004 56901 103134 63691
3292F3691L1874m8663K4820J5653j1486L8354m4379J4579K4376j8110q2879j798
$$ 63691 95565 46902 71722 87375 75889 114243 69864 84443 108819 90709 7830 6032
3280F032P3222N832J8065q7650j2068m8239L3926l0823k2186r494k2909M2078
$$ 6032 79254 85086 103151 15501 3433 -44806 -10880 -41703 -63889 -73383 -96292 -54214
3268e4214O3466N5212J4556j6137o8417J6835M4536K8720m1141o9521k861l3585
$$ -54214 9252 64464 79020 62883 -5534 11301 55837 84557 43416 -26105 -28966 -62551
3256f2551J5109m852j500O0113m887M9202M4994J9395k6089l2244k3208O7310
$$ -62551 -47442 -52294 -53794 6319 1432 50634 95628 115023 88934 56690 33482 100792
3244A00792j15496L3736l4713n3758J5739n9086M6559k7528J6174J19271j61l0120
$$ 100792 -14704 19032 -15681 -69439 -53700 -112786 -66227 -93755 -77581 41690 41529 11409
3232A1409k3654P4874m1049j3707n1416j8530L1754L4578j3521P565Q923j7362
$$ 11409 -12245 62629 21580 7873 -43543 -62073 -30319 4259 -9262 -1697 7226 -10136
3220a0136M0765k3735j4229M1723M4092j10990l1170N1990l6764q8187J0243L4587
$$ -10136 30629 6894 -7335 34388 78480 -32510 -63680 -11690 -48454 -136641 -126398 -91811
3208i1811K4825K1991n3772m093L8337J2362o1841Q994R912m117Q384N5515L0398
$$ -91811 -66986 -44995 -98767 -102860 -64523 -52161 -114002 -105008 -95096 -99213 -90829 -35314 -4916
3195d916p3246N515l1366J0147J082J1638l9575Q7211K8617j1760j4067K2228
$$ -4916 -78162 -72647 -104013 -93866 -92784 -81146 -120721 -33510 -4893 -16653 -30720 -8492
3183h492L6570o0557J8264K5911N7367j03141l6814k3875Q095P1016L5217m4859
$$ -8492 28078 -32479 -14215 11696 69063 -34078 -70892 -94767 -86672 -15656 19561 -25298
3171b5298L876m5825Q782m6153m9491P664L9649L9157m2067P6073Q376k0977R012
$$ -25298 -21422 -67247 -58465 -104618 -154109 -146445 -106796 -67639 -109706 -33633 -25257 -46234 -37222
3158c7222K5200n8469k9522K8949M4599k6821q1324k5223Q202j3584L0747K6952
$$ -37222 -12022 -70491 -100013 -71064 -26465 -53286 -134610 -159833 -151631 -165215 -134468 -107516
3146a07516q476l5748O4591P88K3484n5159P3877l9921l9940M9925O7613j16577
$$ -107516 -115992 -151740 -87149 -86361 -62877 -118036 -44159 -84080 -124020 -74095 -6482 -123059
3134a23059k4247J5097j773N133j3342R6551o6515q3078O5756P9397j0473K3763
$$ -123059 -147306 -132209 -133982 -128849 -142191 -45640 -112155 -195233 -129477 -50080 -60553 -36790
3122c6790q3992m305K5806m0279k263n559o3115L9329K4939L7800N4716K1554
$$ -36790 -120782 -125087 -99281 -139560 -141823 -147382 -210497 -171168 -146229 -108429 -53713 -32159
3110c2159l1656k3877J26965j15361m5149N798j9374L2012J5443l815m6473M2372
$$ -32159 -63815 -87692 39273 -76088 -121237 -115439 -134813 -102801 -87358 -91173 -137646 -95274
3098i5274k1490j16033J13694P9405p9634N2028l5898n0816j263m324M3253M1918
$$ -95274 -116764 -232797 -119103 -39698 -119332 -67304 -103202 -154018 -155281 -159605 -116352 -74434
3086g4434j8178L1114j653L8129K4393j4987k8737o441K2509m1328K535j4718
$$ -74434 -92612 -61498 -63151 -25022 -629 -15616 -44353 -50794 -28285 -69613 -67078 -81796
3074h1796k5494n2516k0581L3338L7550M5765k3447k2676L9920N1133m1046p8218
$$ -81796 -107290 -159806 -180387 -147049 -109499 -63734 -87181 -109857 -69937 -18804 -59850 -138068
3062a38068l320J00933l2513O510J5672m2294k1992L2636N5282n7630k4489k933
$$ -138068 -141388 -40455 -72968 -66458 -50786 -93080 -115072 -82436 -27154 -84784 -109273 -112206
3050a12206k9800K8688k3287q134o99l1493l810N6511p2544l2482N3103J08441
$$ -112206 -142006 -113318 -136605 -144739 -145438 -176931 -180741 -124230 -196774 -229256 -176153 -67712
3038f7712J5402n5823l7550o913J1997N4846l5023m8226J0765k6172O007J6092
$$ -67712 -52310 -108133 -145683 -152596 -140599 -85753 -120776 -169002 -158237 -184409 -178402 -162310
3026a62310j2930L4360p9551J2646J7618p4901N4494O3983l6846P561L0625k1939
$$ -162310 -175240 -140880 -220431 -207785 -190167 -265068 -210574 -146591 -183437 -175876 -145251 -167190
3014a67190P5712P1583n6695r7197j5164P2659O8665o3733n5720k2200N0114q1692
$$ -167190 -91478 -19895 -76590 -173787 -188951 -116292 -47627 -111360 -167080 -189280 -139166 -220858
3002b20858J8602O9239K5766k8686P7569j7099l2103J5184p9649P3777N0357m7077
$$ -220858 -202256 -133017 -107251 -135937 -58368 -75467 -107570 -92386 -172035 -98258 -47901 -94978
2990i4978j4503M0496k5771l9599l0535o645O223J1198M361j261n0755q2050P8297
$$ -94978 -109481 -68985 -94756 -134355 -164890 -171535 -165312 -154114 -149753 -151014 -201769 -283819 -205522
2977b05522M6870q07L9003j03710J4702J5376M1866k9480j6334R0191l1530o9531
$$ -205522 -158652 -159459 -120456 -224166 -209464 -194088 -152222 -181702 -198036 -107845 -139375 -208906
2965b08906l8971K5403R2633L1679k9313m1841J00563L2636l3058J9570o2342
$$ -208906 -247877 -222474 -129841 -98162 -127475 -169316 -68753 -36117 -69175 -49605 -111947
2954a11947l4867m6890L7727N6030O440q2412L6766k5793O3109P3349M0085j11239
$$ -111947 -146814 -193704 -155977 -99947 -93507 -175919 -139153 -164946 -101837 -28488 11597 -99642
2942i9642o25K4151j9054J4187m1172n7366O341l6924N8883N5501m0799l9517
$$ -99642 -100267 -76116 -95170 -80983 -122155 -179521 -173180 -210104 -151221 -95720 -136519 -176036
2930a76036N0567J0253q6656P2560N2177k6635L8481L867m5346J6642j370k5174
$$ -176036 -125469 -115216 -201872 -129312 -77135 -103770 -65289 -61422 -106768 -90126 -91496 -116670
2918a16670k7910k2719m7818K0832K1288K470O8170J6242j8991J8218J030P6881
$$ -116670 -144580 -167299 -215117 -194285 -172997 -170527 -102357 -86115 -105106 -86888 -85858 -8977
2906h977n0690k8505M089j0137o665J0713l9741n6988J4022O2464M0206Q703k7619
$$ -8977 -59667 -88172 -84083 -94220 -100885 -90172 -129913 -186901 -172879 -110415 -70209 -61506 -89125
2893h9125k3163p513k0175j1848N3295n0735N5126K5341N9362J2129k1926p5390
$$ -89125 -112288 -119801 -139976 -151824 -98529 -149264 -94138 -68797 -9435 2694 -19232 -94622
2881i4622l2525M8657k089q4479L994N3209l5615J3630Q9883O254k4100j13401
$$ -94622 -127147 -78490 -80579 -165058 -161064 -107855 -143470 -129840 -39957 -33703 -57803 -171204
2869a71204k3600N5723K5319L7419p3650m653Q4279k658r8234O7326n1965L4980
$$ -171204 -194804 -139081 -113762 -76343 -149993 -154646 -70367 -73025 -171259 -103933 -155898 -120918
2857a20918p8253R7088m8883j4448N3726J5992K3402Q045N1346l7710m9741M562
$$ -120918 -199171 -102083 -150966 -165414 -111688 -95696 -72294 -64249 -12903 -50613 -100354 -95792
2845i5792J2049P4657p4122j19834J1747L0255Q4191J03985n5995p2096M8573
$$ -95792 -83743 -9086 -83208 -203042 -191295 -161040 -76849 27136 -28859 -100955 -52382
2834e2382J2504k4058k0849K6460l613n8411q013K4829n7765O0808n63J4858m1254
$$ -52382 -39878 -63936 -84785 -58325 -61938 -120349 -128362 -103533 -161298 -100490 -101053 -86195 -127449
2821a27449j6879O4811j2548j0849j6935o3185R7681L6194j2540o837L2139J4844
$$ -127449 -144328 -79517 -92065 -102914 -119849 -183034 -85353 -49159 -61699 -68536 -36397 -21553
2809b1553M844m989j7524r8296j1120K1114K4771j3504N2685J2427q5083K8020
$$ -21553 -16709 -21698 -39222 -137518 -148638 -127524 -102753 -116257 -63572 -51145 -136228 -108208
2797a08208L0767q2389Q1959m1440L0721P4951o7142p874m0857M222M410L5288
$$ -108208 -77441 -159830 -77871 -119311 -88590 -13639 -80781 -88655 -129512 -125290 -120880 -85592
2785h5592O0768N3877j23449l7574r707N9476Q275J7763o451n3800K4543o9524
$$ -85592 -24824 29053 -94396 -131970 -141677 -82201 -73926 -56163 -62614 -116414 -91871 -161395
2773a61395k565M3449N475n939J4501J1723m2583R8025Q283j19485K7318O2922
$$ -161395 -163960 -120511 -115036 -120975 -106474 -94751 -137334 -39309 -31026 -150511 -123193 -60271
2761f0271L1118m1165j0045L3802j8549m83l1830M3055J7409m2205j7832N2903
$$ -60271 -29153 -70318 -80363 -46561 -65110 -65593 -97423 -54368 -36959 -79164 -96996 -44093
2749d4093j4717q0453M5052L975O108O5596m207q6105K0344k6829N465N3565n2858
$$ -44093 -58810 -139263 -94211 -90236 -84128 -18532 -22739 -108844 -88500 -115329 -109864 -56299 -109157
2736a09157N4635o749m1895N5475Q7729k6115l9253p8862J064K8386k2899O547
$$ -109157 -54522 -61271 -103166 -47691 40038 13923 -25330 -104192 -103128 -74742 -97641 -91094
2724i1094Q5708k4869J0689M0505m2809n1220L5593j4365q1902O8251L1189J2262
$$ -91094 -5386 -30255 -19566 20939 -21870 -73090 -37497 -51862 -133764 -65513 -34324 -22062
2712b2062M5356j4167o7787r1005P7834N8411k7478r5053J45925k1481o9019L3685
$$ -22062 23294 9127 -58660 -149665 -71831 -13420 -40898 -135951 9974 -11507 -80526 -46841
2700d6841k7704J07676n0851n6845k8969N3504L7581n4636p1120Q7959J2670j7313
$$ -46841 -74545 33131 -17720 -74565 -103534 -50030 -12449 -67085 -138205 -50246 -37576 -54889
2688e4889J2005k7846j832O0847K3762K9913O8523j47402l5759J6670M587N2709
$$ -54889 -42884 -70730 -72562 -11715 12047 41960 110483 -36919 -72678 -56008 -51421 1288
2676A288O1430l1866o4067J2219l046K1486M4743m8280J5460O0455o3843K6254
$$ 1288 62718 30852 -33215 -20996 -24042 -2556 42187 -6093 9367 69822 5979 32233
2664C2233N0386k8416n0502m0397J0309j2721o8583J03039J00063P5415o8889
$$ 32233 82619 54203 3701 -36696 -26387 -39108 -107691 -4652 95411 170826 101937
2653A01937j13345Q0120P0712k5884o354J2736J08762q7318q9342j1026J05185
$$ 101937 -11408 68712 139424 113540 107186 119922 228684 141366 52024 40998 146183
2642A46183J810Q41Q465K5662n7505N7221m93N949L336m1285N2752O7036j6514
$$ 146183 147993 148834 157299 182961 125456 182677 182184 188133 191469 150184 202936 269972 253458
2629B53458p6711K5411R202M0074P9601j8914M3775K4968O644m0540n473Q5935
$$ 253458 176747 202158 211360 251434 331035 312121 355896 380864 387508 346968 341495 427430
2617D27430j4535N5207l0639L9030M3777j0210M561j8446M92J0396r268N1069
$$ 427430 412895 468102 437463 476493 520270 510060 514621 496175 496667 507063 497795 548864
2605E48864L4610O7933p1293k5186J24377O6197p0872Q1340O3676J2951N1722
$$ 548864 583474 651407 580114 554928 679305 745502 674630 755970 819646 832597 884319
2594H84319J00768J45202J00966P3165L1525J1155J32163P7123K3754J73104J26832
$$ 884319 985087 1130289 1231255 1304420 1335945 1347100 1479263 1556386 1580140 1753244 1880076
2583A880076K38481L95901L67314M88721N18653N89954O80743P12186N57688R8084
$$ 1880076 2118557 2514458 2881772 3370493 3889146 4479100 5159843 5872029 6429717 6527801
2573F527801l31543o82293q36739o97922o42878n22257m70069k83249k58244k25639
$$ 6527801 6196258 5513965 4677226 3979304 3336426 2814169 2344100 2060851 1802607 1576968
2563A576968k33457j31949J3335m3206n7409l1252n2233n1716j57952q3555j9930
$$ 1576968 1343511 1211562 1224897 1181691 1124282 1093030 1040797 989081 831129 747574 727644
2552G27644m9809o9026r6858m9127k8621O3923N368p1450j7327P8132r8195q7488
$$ 727644 677835 608809 511951 462824 434203 498126 503494 432044 414717 492849 394654 307166
2540C07166N8474l4696n6969k5057m9284M3263j31019o1577K0919O1889Q731o052
$$ 307166 365640 330944 273975 248918 199634 242897 111878 50301 71220 133109 141840 135788
2528A35788K3238k7854K3160m0825M2922k2159r4678j4973J11195n3440L2427
$$ 135788 159026 131172 154332 113507 156429 134270 39592 24619 135814 82374 114801
2517A14801M3660p6660L0276j1423K5573k9860r6005L8549j858P3054k450j5432
$$ 114801 158461 81801 112077 100654 126227 96367 362 38911 37053 110107 107657 92225
2505I2225K752L0991M58j03277K1464n7320j0257P1301O2616o1640K1249k3930
$$ 92225 94977 125968 126426 23149 44613 -12707 -22964 48337 110953 49313 70562 46632
2493D6632n7291k0894m013J5000J8683M0867l4817J64k9881m8974Q5118m6489
$$ 46632 -10659 -31553 -35566 -20566 -1883 38984 4167 4331 -25550 -74524 10594 -35895
2481c5895k0631J56535l0502p4697M4174m3014j1286J13950M2147o8441o3199
$$ -35895 -56526 100009 69507 -5190 38984 -4030 -15316 98634 140781 72340 9141
2470I141l2389M8185P462o8121p3641P8967K3974K12k8541k5799k7796N497k520
$$ 9141 -23248 24937 32399 -35722 -109363 -30396 -6422 -6210 -34751 -60550 -88346 -82849 -85369
2457h5369j9618J9442Q9454k3061N5551M3500L849k8940n848p2144m8601j9972
$$ -85369 -104987 -85545 3909 -19152 36399 79899 83748 54808 48960 -23184 -71785 -91757
2445i1757L0363j0157n377L9509j458l8985M6080J180m6008L8471L9972Q844r3726
$$ -91757 -61394 -71551 -76928 -37419 -38877 -77862 -31782 -30602 -76610 -38139 1833 10677 -83049
2432h3049O5555q9945j1436M1138N7085P9398j1222m7056j3919N1495m9033k7405
$$ -83049 -17494 -107439 -118875 -77737 -20652 58746 47524 468 -13451 38044 -10989 -38394
2420c8394L7170p805k4756J2070L0902k6337q7668M5237L5578Q434P5828l8120
$$ -38394 -1224 -9029 -33785 -21715 9187 -17150 -104818 -59581 -24003 -15569 60259 22139
2408B2139j728L4030m5520j09469O2724J4831k1097l2852K8929j2269p531j287
$$ 22139 20411 54441 8921 -100548 -37824 -22993 -44090 -76942 -48013 -60282 -67813 -69100
2396f9100J9846R378P3310o1493p5989j440J2806N3030Q445r851L427l729k2707
$$ -69100 -49254 -39876 33434 -28059 -104048 -105488 -92682 -39652 -31207 -41058 -37631 -41360 -64067
2383f4067l1060P413M938Q0549m6414r506J2069j7679P1477R688l0170J2310l2706
$$ -64067 -95127 -87714 -82776 -2227 -48641 -58147 -46078 -63757 7720 17408 -12762 -452 -33158
2370c3158l8741K984J7721k6476M5332O7781l7377M504k3077N0759N893j00657
$$ -33158 -71899 -68915 -51194 -77670 -32338 35443 -1934 2570 -20507 30252 36145 -64512
2358f4512j799J0292K3864M8396k934K4221l4124l1259m8382L8104J6391n3142
$$ -64512 -66311 -56019 -32155 16241 13307 37528 3404 -27855 -76237 -38133 -21742 -74884
2346g4884M7532P8531k9774l175M547j11659J3631O3072n7102j2262L8565k0025
$$ -74884 -27352 51179 21405 18230 22777 -88882 -75251 -12179 -69281 -81543 -42978 -63003
2334f3003k6920n0092M1243O7154L2098l7692K7938M0003J6275K4152n5915o0542
$$ -63003 -89923 -140015 -98772 -31618 480 -37212 -9274 30729 47004 71156 15241 -45301
2322d5301l6440k4293j3204N7244J3814K9096k5707o3759k779L5881K0054j0419
$$ -45301 -81741 -106034 -119238 -61994 -48180 -19084 -44791 -108550 -111329 -75448 -55394 -65813
2310f5813k6227O827l8300K6154J4261K7495k0905J848N0753j63730k3764O3356
$$ -65813 -92040 -85213 -123513 -97359 -83098 -55603 -76508 -74660 -23907 -187637 -211401 -148045
2298a48045Q1266P411N691K6925P842L0357m5355J3140m6782J6735J0980Q1018
$$ -148045 -66779 -59368 -53677 -26752 -18910 11447 -33908 -20768 -67550 -50815 -39835 41183
2286D1183k5733n5840M6357L269m4941K3186K1230M2985l3281N9077j3273l6695
$$ 41183 15450 -40390 5967 9236 -35705 -12519 8711 51696 18415 77492 64219 27524
2274B7524k1292r0484j9818K9576J1488P1138M7993J7328K0317j03905n0546N8139
$$ 27524 6232 -84252 -104070 -74494 -63006 8132 56125 73453 93770 -10135 -60681 -2542
2262b542k9820R22o6045m9773R0539L208m9517M5471P8013K2723J96k5337N7937
$$ -2542 -32362 -31440 -97485 -147258 -56719 -53511 -103028 -57557 20456 43179 43375 18038 75975
2249G5975m1898n8987j7669J9015K5865L4211n2650m8818o7267K3749R3803q672
$$ 75975 34077 -24910 -42579 -23564 2301 36512 -16138 -64956 -132223 -108474 -14671 -23343
2237b3343K9242n8164L5145N1614J9961q0962r4388O1588M4994K7786r681j6959
$$ -23343 5899 -52265 -17120 34494 54455 -26507 -120895 -59307 -14313 13473 3792 -13167
2225a3167l1207L187l1648J1482J968N8745L0154m586j4773q4140J11332j0676
$$ -13167 -44374 -41187 -72835 -61353 -59385 -640 29514 24928 10155 -73985 37347 26671
2213B6671j31941m6698K2616R7473j0083L3160j2926M2345J1900n9713K5628n5479
$$ 26671 -105270 -151968 -129352 -31879 -41962 -8802 -21728 20617 32517 -27196 -1568 -57047
2201e7047m3495N2542J3324R757M2702j898k1212J5280k3423o414J6299l6832
$$ -57047 -100542 -48000 -34676 -24919 17783 15885 -5327 9953 -13470 -19884 -3585 -40417
2189d0417Q2435P6134o4921o7654j9751j09749k6191J36233j8031N1221M1912
$$ -40417 42018 118152 53231 -14423 -34174 -143923 -170114 -33881 -51912 -691 41221
2178D1221k4607J4212k1747J7000k4241p8399k926O3589J5432k5340k0033l7166
$$ 41221 16614 30826 9079 26079 1838 -76561 -79487 -15898 -466 -25806 -45839 -83005
2166h3005P7280P5088J9735j7507m1920l5462j6605J0589K2927Q92n376R312m4955
$$ -83005 -5725 69363 89098 71591 29671 -5791 -22396 -11807 11120 12012 6636 15948 -29007
2153b9007K588p4740k9732Q6475m921P5486L5225j6021n8404p026J7406k7826
$$ -29007 -26419 -101159 -130891 -44416 -49337 26149 61374 45353 -13051 -20077 -2671 -30497
2141c0497J1794L159q111l9555K7041L2686n9219l0869l2027J40320J3991l4673
$$ -30497 -18703 -15544 -23655 -63210 -36169 -3483 -62702 -93571 -125598 14722 28713 -5960
2129e960j18505J15338J06047r3677n6249k5683J0105m5968K4645K0108l2653
$$ -5960 -124465 -9127 96920 3243 -53006 -78689 -68584 -114552 -89907 -69799 -102452
2118a02452N603l2189O5189J26929o5619j8512J5797K4265m1924L9443j9581m8362
$$ -102452 -96849 -129038 -63849 63080 -2539 -21051 -5254 19011 -22913 16530 -3051 -51413
2106e1413J474n6461l9552N8181L3045P4748M0414p42J7522n889p1393j6934L7862
$$ -51413 -49939 -106400 -145952 -87771 -54726 20022 60436 59694 77216 71327 -66 -17000 20862
2093B0862L999m1240j35815k6860N6327Q6745J29360K0606q0414k6309R016r1112
$$ 20862 24861 -16379 -152194 -179054 -122727 -35982 93378 113984 33570 7261 16277 -74835
2081g4835R9171k4419j23639l6224R1987j2313m679k9276j3091M5624J00291J26559
$$ -74835 24336 -83 -123722 -159946 -67959 -80272 -84951 -114227 -127318 -81694 18597 145156
2069A45156n8151j21274q671o082O0813k7114j630J51571J6724n1963M2565r9578
$$ 145156 87005 -34269 -42940 -49022 11791 -15323 -16953 134618 151342 99379 141944 42366
2057D2366j9543Q8270L3405q3771k4893N2238j9443M3947L378j6316p4932j1314
$$ 42366 22823 111093 144498 60727 35834 88072 68629 112576 115954 99638 24706 13392
2045A3392j2763l2459l4820j2531J4036M9833l3114N4854K4301O146l0325O5105
$$ 13392 629 -31830 -66650 -79181 -65145 -15312 -48426 6428 30729 36875 6550 71655
2033G1655O9105l2377p3968j5796K9576k2537l6065N0677r001j0898J3089J2747
$$ 71655 140760 108383 34415 18619 48195 25658 -10407 40270 31269 20371 33460 46207
2021D6207Q8211l9952n6643l7358j27814k3506M4661K4672L6927l052P4417q2214
$$ 46207 134418 94466 37823 465 -127349 -150855 -106194 -81522 -44595 -47647 26770 -55444
2009e5444p2785J2196M8689L3528N6204N9571L381k0757k5976N113k5492K4024
$$ -55444 -128229 -116033 -67344 -33816 22388 81959 85340 64583 38607 43720 18228 42252
1997D2252k7344k6415L6620M7240j8320j7664n5106Q393N1378p5845O6066J820
$$ 42252 14908 -11507 25113 72353 54033 36369 -18737 -10344 41034 -34811 31255 33075
1985C3075o3770P048N3487K3828j4591l2700n0849k6838l1757M0335M7382R1132
$$ 33075 -30695 -23647 29840 53668 39077 6377 -44472 -71310 -103067 -62732 -15350 75782
1973G5782q0570m6345L1387J5942L9256k5489K4874R302K0556j8528o1160M2576
$$ 75782 -4788 -51133 -19746 -3804 35452 9963 34837 44139 64695 46167 -14993 27583
1961B7583l1588j1822k253m2047m745J5440Q1534M9331n8920o1620j3496K6424
$$ 27583 -4005 -15827 -18080 -60127 -64872 -49432 32102 81433 22513 -39107 -52603 -26179
1949b6179J18810j4663j16707l18p823O9279j7240K4342j7409o1430K5111n3480
$$ -26179 92631 77968 -38739 -39057 -46880 22399 5159 29501 12092 -49338 -24227 -77707
1937g7707K7500K1662M9205M2909j071j4515m2357R396L0409n3512q532k1352
$$ -77707 -50207 -28545 20660 63569 62498 47983 5626 15022 45431 -8081 -16613 -37965
1925c7965O6167k210r2163M4046Q5412J6379q5503p2730O1012Q9792k9334Q315
$$ -37965 28202 25992 -66171 -22125 63287 79666 -5837 -78567 -17555 72237 42903 51218
1913E1218j2038P727J6912J2546L0166o7916m6338K9393N2425N2369o4033L4652
$$ 51218 39180 46907 63819 76365 106531 38615 -7723 21670 74095 126464 62431 97083
1901I7083m9836M1250p1483l0588K8028M6228k9073n5716n987J2223M20O7753
$$ 97083 47247 88497 17014 -13574 14454 60682 31609 -24107 -30094 -17871 -17451 50302
1889E0302l2341j9655N6868p4195J3985r801L2889K4722n4943q0215O1564M9447
$$ 50302 17961 -1694 55174 -19021 -5036 -14837 18052 42774 -12169 -92384 -30820 18627
1877A8627j8697j10166j2318M383Q685j5612R3712M7460J7925K575L154l8475
$$ 18627 -70 -110236 -122554 -118171 -109486 -125098 -31386 16074 33999 36574 39728 1253
1865A253R718J2716o195o5316p310N0979N8256N1156n7262m6239O6042N1705l0204
$$ 1253 10971 23687 17492 -47824 -55134 -4155 54101 105257 47995 1756 67798 119503 89299
1852H9299k2306o0613L4279J9065m3597o6611K2597N0053n6327N7953O300J3923
$$ 89299 66993 6380 40659 59724 16127 -50484 -27887 22166 -34161 23792 30092 44015
1840D4015k72o720p369k1369R2749o3271L3036Q7286r3445l2726o8040j7589p414
$$ 44015 43743 37023 29654 8285 101034 37763 70799 158085 64640 31914 -36126 -53715 -61129
1827f1129k1794N3180N4470M3629m5854N9392k9969n6725N2903n1356K8260L2668
$$ -61129 -82923 -29743 24727 68356 22502 81894 51925 -4800 48103 -3253 25007 57675
1815E7675j4652m9611k2230J18537P1714q2598P1807J232m9032j9403J9703l8769
$$ 57675 43023 -6588 -28818 89719 161433 78835 150642 151874 102842 83439 103142 64373
1803F4373p9581k0129N6424l6100q2010O7193P178J3687Q13L8005M5845L4067
$$ 64373 -15208 -35337 21087 -15013 -97023 -29830 -22652 -8965 -8152 29853 75698 109765
1791A09765m1320k0548Q14m0302L4603J6914K1313O6863l9675j15858j7643J2788
$$ 109765 68445 47897 48711 8409 43012 59926 81239 148102 108427 -7431 -25074 -12286
1779a2286l1398J3972j540M4311O7232m7612n6755O822q714r569L0813m0722P3861
$$ -12286 -43684 -29712 -31252 13059 80291 32679 -24076 -17254 -25968 -35537 -4724 -45446 28415
1766B8415J00918q2437q842o3654J2699R455O0696L7565J3649j2154n6652m8352
$$ 28415 129333 46896 38054 -25600 -12901 -3446 57250 94815 108464 96310 39658 -8694
1754h694P9542O5714m9878j7035k1564o3745K9344K3448O769j7181Q284r534R584
$$ -8694 70848 136562 86684 69649 48085 -15660 13684 37132 43901 26720 35004 25470 35054
1741C5054O046j4278j1957k1313P2394j4349q1553P1061K2139K4268l1353o3518
$$ 35054 41100 26822 14865 -6448 65946 51597 -29956 41105 63244 87512 56159 -7359
1729g359P2598q077R744L9117r018k8448p1146o7890J23364L2186k2594K0147
$$ -7359 65239 57162 66906 106023 97005 68557 -2589 -70479 52885 85071 62477 82624
1717H2624q9036k0722P1212M182J6456l2196M2673l5452J1668r589r6Q955M599
$$ 82624 -6412 -27134 44078 48260 64716 32520 75193 39741 51409 41820 41724 50679 55278
1704E5278q6905M1339M197K4457M4628o2358l8797J1141J0438r733O5971m8395
$$ 55278 -31627 9712 13909 38366 82994 20636 -18161 -7020 3418 -6315 59656 11261
1692A1261L2031K303m742o1701J1166O6867m3658j2707n7888O4796M8807q3427
$$ 11261 43292 45595 40853 -20848 -9682 57185 13527 820 -57068 7728 56535 -26892
1680b6892l4181L0266J13527m4538n5344K0465l3153M1677Q321m4699P7816j7550
$$ -26892 -61073 -30807 82720 38182 -17162 3303 -29850 11827 20148 -24551 53265 35715
1668C5715M850r268K4861k5317k238J3891k1556K1667k1438l1253K6556l6728
$$ 35715 40565 31297 56158 30841 28603 42494 20938 42605 21167 -10086 16470 -20258
1656b0258P80o072N9215j3223L2136k0138J6272N6635j7270n9016m3894j1l3729
$$ -20258 -19478 -25550 33665 20442 52578 32440 48712 105347 88077 29061 -14833 -14844 -48573
1643d8573l971N0498m8526L8224L5292M6670P0577p1951n358l953M9084o2635
$$ -48573 -52544 -2046 -50572 -12348 22944 69614 140191 68240 62882 58929 108013 45378
1631D5378n923Q828k7947R63N2599n5414Q814j3564M4782j2000m0320J96oM1551
$$ 45378 39455 48283 20336 21299 73898 18484 27298 13734 58516 46516 6196 6392 6386 47937
1617D7937K8494J7534L2884O5910j08325M368n3253q9874J6101Q7548K1407n2054
$$ 47937 76431 93965 126849 192759 84434 88802 35549 -54325 -38224 49324 70731 18677
1605A8677K3150L4338Q8435q0632j9034M6306p2141j2746P1338j3976J9052M6233
$$ 18677 41827 76165 164600 83968 64934 111240 39099 26353 97691 83715 102767 149000
1593A49000n7324m397M4479l2319o6854q8333Q4627j50226M8997R0715O274L4957
$$ 149000 91676 87279 131758 99439 32585 -55748 28879 -121347 -72350 18365 24639 59596
1581E9596N9372L3782j02189N5430j006J1100m0617k9183O7485j6295l6881j2826
$$ 59596 118968 152750 50561 105991 104985 116085 75468 46285 113770 97475 60594 47768
1569D7768O1563L700j216L7948J548n7508o2342K374O2959j1104N6528L5299p3926
$$ 47768 109331 113031 111815 149763 151311 93803 31461 33835 96794 85690 142218 177517 103591
1556A03591j14332Q0890K6945J477L6125q2125R2085L2676k7632k2890r1277M2683
$$ 103591 -10741 70149 97094 98571 134696 52571 144656 177332 149700 126810 35533 78216
1544G8216K4121m5356k1848J124p7714p017J7804n9521R1263K5026P4590k6111
$$ 78216 102337 56981 35133 36257 -41457 -48474 -30670 -90191 1072 26098 100688 74577
1532G4577L306N2539M2033o337r1724Q596o7822L3984Q5023o8942l2082J6776
$$ 74577 77883 130422 172455 166118 74394 82990 15168 49152 134175 65233 33151 49927
1520D9927L2247k6987l756K1297q5360j8652L8658J5103N2783j8593m2846o4412
$$ 49927 82174 55187 51431 72728 -12632 -31284 7374 22477 75260 56667 13821 -50591
1508e0591O0416P1716P4712J0198m8780o8781O6363O2699n1781q1474L8874j9282
$$ -50591 9825 81541 156253 166451 117671 48890 115253 177952 126171 44697 83571 64289
1496F4289l0089J09332J013j26290J9409p1984N5100M1520m9864J090P3552M8639
$$ 64289 34200 143532 144545 18255 37664 -34320 20780 62300 12436 13526 87078 135717
1484A35717j3552p1485k1875m9341O291q3956N1966L7063L1334L51m7662P5466
$$ 135717 122165 50680 28805 -20536 -14245 -98201 -46235 -9172 22162 22513 -25149 50317
1472E0317m1179O416J07476K0898q7967R942o145M1094j8472j09820N6203Q2609
$$ 50317 9138 15554 123030 143928 55961 65903 59758 100852 82380 -27440 28763 111372
1460A11372l5055L2373p2277P252M2931J3076o6004M9395N9796j04492J3912r689
$$ 111372 76317 108690 36413 43665 86596 99672 33668 83063 142859 38367 52279 42590
1448D2590k1037M3704j3674R130j1850O5276j7464m3424N2454l5871j13545J04195
$$ 42590 21553 65257 51583 60713 48863 114139 96675 53251 105705 69834 -43711 60484
1436F0484J8692N4195J9267n094l2865k5859j9250O4855l143k3618j8272l4244
$$ 60484 79176 133371 152638 147544 114679 88820 69570 134425 131282 107664 89392 55148
1424E5148O5770O8042k4998p6106m3015n9353J01188J1306L178m1557N6041n4390
$$ 55148 120918 188960 163962 87856 44841 -14512 86676 97982 101160 59603 115644 61254
1412F1254J395R0390M5354j8275k8543k4249K1741j6682k1452l9100L1787p5177
$$ 61254 62649 153039 198393 180118 151575 127326 149067 132385 110933 71833 103620 28443
1400B8443O125K2535J9828J1131l8672Q8846n0089N3152m5570L6816M581K9824
$$ 28443 34568 57103 76931 88062 49390 138236 88147 141299 95729 132545 137126 166950
1388A66950q0027L512k6925M4093l5360p3991N6956L0017Q1214K8790l5171q6113
$$ 166950 86923 90435 63510 107603 72243 -1748 55208 85225 166439 195229 160058 73945
1376G3945j04995l79Q4575J4603M7232N9211r1356r4028L6574J9271o2195K7875
$$ 73945 -31050 -31429 53146 67749 114981 174192 82836 -11192 25382 44653 -17542 10333
1364A0333M7005J890o2929L1977J1881m6966N6231J5036q5690R5628J4710n6062
$$ 10333 57338 59228 -3701 28276 40157 -6809 49422 64458 -21232 74396 89106 33044
1352C3044K7632j912j7387n511m4358K0710J1346q113k4916N6112J29797o8579
$$ 33044 60676 58764 41377 35866 -8492 12218 23564 15451 -9465 46647 176444 107865
1340A07865o1848m4560p435J0813P2754R4796p7879n3430K2325j25960j3468R980
$$ 107865 46017 1457 -5978 4835 77589 172385 94506 41076 63401 -62559 -76027 -66047
1328f6047J00579L2406K5385l4645q5787O2987N0815j5531p396P8427k5899n6235
$$ -66047 34532 66938 92323 57678 -28109 34878 85693 70162 62766 141193 115294 59059
1316E9059J9791k806K7688m2956q247q2533L5438O5565q4188J1848PO5621n439
$$ 59059 78850 76044 103732 60776 52529 -30004 5434 70999 -13189 -1341 -1334 64287 58848
1303E8848L1536Q8883o2729k94M6983j2513r9711l0553K3091j6360L2859l1548
$$ 58848 90384 179267 116538 116244 163227 150714 51003 20450 43541 27181 60040 28492
1291B8492l9783O4647j8027n5994J5383P2596N6274j9842o2308J0144o7546j2949
$$ 28492 -11291 53356 35329 -20665 -5282 67314 123588 103746 41438 51582 -15964 -28913
1279b8913J22090m5451M618J6365p3166N8102L5667q5078m5505R2396L627l6046
$$ -28913 93177 47726 52344 68709 -4457 53645 89312 4234 -41271 51125 54752 18706
1267A8706Q399J8025q0763R6402N1245n2768m4389K2070J208k1742J5733K3320
$$ 18706 27105 45130 -35633 60769 112014 59246 14857 36927 38135 16393 32126 55446
1255E5446k6592O2749L3198j1455m0915j1909j2807k2914k6330n583O3288j9693
$$ 55446 28854 91603 124801 113346 72431 60522 47715 24801 -1529 -7112 56176 36483
1243C6483l2655P1677K7130q7280K5621K7946K6562L7756q8771l2982J6059j9168
$$ 36483 3828 75505 102635 15355 40976 68922 95484 133240 44469 11487 27546 8378
1231H378N2939J9251k2691j7624N5147o4662J1197j5522l2905M3783l7639P899
$$ 8378 61317 80568 57877 40253 95400 30738 41935 26413 -6492 37291 -348 7551
1219G551N3063k6637O5216j15996N4569O2807l5045N9794K7495n7709j07416K957
$$ 7551 60614 33977 99193 -16803 37766 100573 65528 125322 152817 95108 -12308 -9351
1207i351N0903j2508M1223K0224m9430o8543J3665J08581k7123j3638K2436k1254
$$ -9351 41552 29044 70267 90491 41061 -27482 -13817 94764 67641 54003 76439 55185
1195E5185j0131o4209r423L4409N5434Q543m9948J2984M4769k6440M3112q090
$$ 55185 45054 -19155 -28578 5831 61265 69808 19860 32844 77613 51173 94285 86195
1183H6195q5207L5904j7005R8983N3703K1152q5750r4398j1297R159k4788K2590
$$ 86195 988 36892 19887 118870 172573 193725 107975 13577 2280 11439 -13349 9241
1171I241J5375k4513N0724R084j3010j0440L0161L3784m792j3905M5556j29077
$$ 9241 24616 103 50827 59911 46901 36461 66622 100406 95614 81709 127265 -1812
1159a812l956O8168m3767j8448o0761M995P6839m8626o8268J31576J6942P467
$$ -1812 -5768 62400 18633 185 -60576 -55581 21258 -27368 -95636 35940 52882 60349
1147F0349l7931o2307R309Q478K0336P7167j4670o1224N1998k0756N0488o066
$$ 60349 22418 -39889 -30580 -22102 -1766 75401 60731 -493 51505 30749 81237 75171
1135G5171o172j3722L2690m4620K7282j13397M3100n975n1646L838P0046J12329
$$ 75171 68999 55277 87967 43347 70629 -42768 332 -5643 -57289 -53451 16595 128924
1123A28924l5600r794j00166P5848R6410l0645r3544j6679M3150J6759o992n0349
$$ 128924 93324 83530 -16636 59212 155622 124977 31433 14754 57904 74663 67671 17322
1111A7322K1918R49l5110M263K565L9104L3475r9218M3813j3657o8021O5621N7392
$$ 17322 39240 40189 5079 9342 11907 51011 84486 -14732 29081 15424 -52597 13024 70416
1098G0416k4409k6026o1624J8051J10627L1572j6563p5666M3779j4730M3995n1388
$$ 70416 46007 19981 -41643 -23592 87035 118607 102044 26378 70157 55427 99422 48034
1086D8034l7691j656M303r743k4544m7696J05631p8969J01227N851j7592L4269
$$ 48034 10343 8687 12990 3247 -21297 -68993 36638 -42331 58896 64747 47155 81424
1074H1424m6399J02054l3283N993m1633K0626n2547o5751l6784J7210M2661J12279
$$ 81424 35025 137079 103796 109789 68156 88782 36235 -29516 -66300 -49090 -6429 105850
1062A05850j6232n6716J2352p1483N2651K7743P6941L7325o6769p7684m745k9338
$$ 105850 89618 32902 45254 -26229 26422 54165 131106 168431 101662 23978 19233 -10105
1050a0105K2720j6915L5540O5588p3014N1470L9224r897j3375m4233j1188m1761
$$ -10105 12615 -4300 31240 96828 23814 75284 114508 104611 91236 47003 35815 -5946
1038e946R505Q600N7127O554l7004k5538k2614K5255N5969J05575j8201p6753
$$ -5946 3559 12159 69286 75840 38836 13298 -9316 15939 71908 177483 159282 82529
1026H2529O61l1392q455M7941O3370j5003j57809J7908k1565Q386J27301L192
$$ 82529 83190 51798 43343 91284 154654 139651 -18158 -250 -21815 -13429 113872 117064
1014A17064l9890q255J1650o4425J0337L332M1515l3649m7063J4349O5113o2733
$$ 117064 77174 68919 80569 16144 26481 29813 71328 37679 -9384 4965 70078 7345
1002G345j3768Q4362k4952m14j1936k4204j6394k2929J434O8731J5526p653p184
$$ 7345 -6423 77939 52987 52573 40637 16433 39 -22890 -21456 47275 62801 55148 47964
989D7964m3516Q2496O9534j4023l1386J5156P0033n4162j9070M1634r3898k1395
$$ 47964 4448 86944 156478 142455 111069 126225 196258 142096 123026 164660 70762 49367
977D9367K7273j6655J7002n1487k6254K450N3491p5945P7952p7536j1866P9840
$$ 49367 76640 59985 76987 25500 -754 1696 55187 -20758 57194 -20342 -32208 47632
965D7632J3324o493m0269j5139m170k0998J4815N6824k8040L0835k9577K4002
$$ 47632 60956 54463 14194 -945 -5115 -26113 -11298 45526 17486 48321 18744 42746
953D2746m6319r5580L552P7126J7276n8938O0285K6717R948n5633M0401o1884
$$ 42746 -3573 -99153 -95601 -18475 -1199 -60137 148 26865 36813 -18820 21581 -40303
941d0303l0184Q739N5232j673o545J4432l5284N5606M6574o0032q8606N1963K1588
$$ -40303 -70487 -61748 -6516 -8189 -14734 -302 -35586 20020 66594 6562 -82044 -30081 -8493
928h493n6426O8727J2828n9326o9445J01197N7509m2326M0068m1232n3009m969
$$ -8493 -64919 3808 16636 -42690 -112135 -10938 46571 4245 44313 3081 -49928 -54897
916e4897N1830J7448l32J2037M46q0092L1146k0369K1527J2730R226N5577J1081
$$ -54897 -3067 14381 14049 26086 26532 -53560 -22414 -42783 -21256 -8526 700 56277 67358
903F7358M8727k0065q5017p1238O2689p026k3290P3520r227p0081J8904J46233
$$ 67358 116085 96020 11003 -60235 2454 -4572 -27862 45658 36431 -33650 -14746 131487
891A31487p0854l3120p9893J6620M0793O1455K9571l5053J8757L317L1918m0562
$$ 131487 60633 27513 -52380 -35760 5033 66488 96059 61006 79763 83080 114998 74436
879G4436J3243p4075j9329j1023L5368M5980o5055J3982J3805q5747k2659K3183
$$ 74436 87679 13604 -5725 -16748 18620 64600 -455 13527 27332 -58415 -81074 -57891
867e7891J2185O8839J3450N1974k0175k2101j3552r6651n5711J16826P8996l874
$$ -57891 -45706 23133 36583 88557 68382 46281 32729 -63922 -119633 -2807 76189 72315
855G2315k630k6748l6865k8042M3973J4910j778m3607L1899M6679m6977k1473
$$ 72315 69685 42937 6072 -21970 22003 36913 35135 -8472 23427 70106 23129 1656
843A656N4450m0463N916O18k9584P4035n7148o9124P5774K6721m8677o2132L0804
$$ 1656 56106 15643 21559 22177 -7407 66628 9480 -59644 16130 42851 -5826 -67958 -37154
830c7154O331o688P4659L9045p8563Q8171j0888l0184l3158k5495K0343r9282
$$ -37154 -30823 -37511 37148 76193 -2370 85801 74913 44729 11571 -13924 6419 -92863
818i2863P8187j1137K6274O0305k3066o5592O8645n4952q0839m380N5100M1939
$$ -92863 -14676 -25813 461 60766 37700 -27892 40753 -14199 -95038 -99418 -44318 -2379
806b379o6203P5308J09039K5472j40770l9938J4300Q8394M3609j1158K4064p7638
$$ -2379 -68582 6726 115765 141237 467 -39471 -25171 63223 106832 95674 119738 42100
794D2100q6298p5324N6653k9596M2454N5632K6306o0328O7403R224m7819m7499
$$ 42100 -44198 -119522 -62869 -92465 -50011 5621 31927 -28401 39002 48226 407 -47092
782d7092N094n563O1015J7215n0468m7854P972L9570M5452j9022k2939J8147j15973
$$ -47092 -41998 -47561 13454 30669 -19799 -67653 -59681 -20111 25341 6319 -16620 1527 -114446
769a14446J11074R3539M028q767r2656l8189K8090N7521p5269J8743L3576J5700
$$ -114446 -3372 90167 94195 85428 -7228 -45417 -17327 40194 -35075 -16332 17244 32944
757C2944j54160L1889J00004q9271J7550Q751O0015p3748L4M8799P5918j58337
$$ 32944 -121216 -89327 10677 -78594 -61044 -52293 7722 -66026 -65992 -17193 58725 -99612
745i9612R9733J2423k1741n7055k0485K646M807O5256m113O6884l1624j2114J07996
$$ -99612 121 12544 -9197 -66252 -86737 -84091 -79284 -14028 -18141 48743 17119 5005 113001
732A13001p0971q7091k9846K2799j2528J0935J7890N7946j2069q309K5622q1777
$$ 113001 42030 -45061 -74907 -52108 -64636 -53701 -35811 22135 10066 1757 27379 -54398
720e4398N8648r14J6346p0939l6616L1794j0755l911J22757k7460l8303N3048
$$ -54398 4250 3336 19682 -51257 -87873 -56079 -66834 -70745 52012 24552 -13751 39297
708C9297M0568q0262q3810N7559M3342n4214N9758K3411q7844n2682J8049R4004
$$ 39297 79865 -397 -84207 -26648 16694 -37520 22238 45649 -42195 -94877 -76828 17176
696A7176m8451n3674J2007j695L9651J3981k8034P7358J3073l3126l583p0186
$$ 17176 -31275 -84949 -72942 -74637 -34986 -21005 -49039 28319 41392 8266 4683 -65503
684f5503M266M8170n9151L1111k444M1172N7879j8962l5765P663L1178n2994K6663
$$ -65503 -61237 -13067 -72218 -41107 -43551 -2379 55500 36538 773 8436 39614 -13380 13283
671A3283L124p4266M6782n7344J5618P4961K9964j04741L9082L3240L8252J6227
$$ 13283 16407 -57859 -11077 -68421 -52803 22158 52122 -52619 -13537 19703 57955 74182
659G4182l4070l2356J3190o7619q440r87O001O7744q4046K4260p11Q6813m3481
$$ 74182 40112 7756 20946 -46673 -55113 -56100 -50099 17645 -66401 -42141 -42852 43961 480
646D80o3204p35K9792k9271M6096J8364l0550L853j6309K0955J000O7483m9260
$$ 480 -62724 -63459 -33667 -62938 -16842 1522 -29028 -25175 -41484 -20529 -19529 47954 -1306
633a306n9836l0192O013q487J17771K4006m5977j1161l357M1290p4182J2836m1538
$$ -1306 -61142 -91334 -85321 -93808 23963 47969 1992 -9169 -12526 28764 -45418 -32582 -74120
620g4120l1036K3921K6702l1839j8429P6007N9607p8242K7257p157K3726k4515
$$ -74120 -105156 -81235 -54533 -86372 -104801 -28794 30813 -47429 -20172 -27329 -3603 -28118
608b8118N306r900m8667k4782K1089Q4023o7400j2620K9803n4407J0527J0720
$$ -28118 -22812 -32712 -81379 -106161 -85072 -1049 -68449 -81069 -51266 -105673 -95146 -84426
596h4426O6481j6539k5198N5747l6279o6325N010O0868M6500n6993k8526M5713
$$ -84426 -17945 -34484 -59682 -3935 -40214 -106539 -101529 -40661 5839 -51154 -79680 -33967
584c3967j0180r4382J01440N0141l7355N342l3442o8375J7780M3793M0306o6098
$$ -33967 -44147 -138529 -37089 13052 -24303 -18961 -52403 -120778 -102998 -59205 -18899 -84997
572h4997o6908q445n7081K7945N6299M3720P6883K7836j096j1899L9734q9546
$$ -84997 -151905 -160350 -217431 -189486 -133187 -89467 -12584 15252 14156 2257 41991 -47555
560d7555o1451M1345J2023m1459j2880K9281r9908Q1946M1992k4476K3550R399
$$ -47555 -109006 -67661 -55638 -97097 -109977 -80696 -180604 -98658 -56666 -81142 -57592 -48193
548d8193m2271N5796L5161q0070K6594r2112l6386Q0182J9571N3262l469j6844
$$ -48193 -90464 -34668 493 -79577 -52983 -145095 -181481 -101299 -81728 -28466 -31935 -48779
536d8779K2534m6266j3381P6194k9305o3481n6993J05744M0911J615n091q050
$$ -48779 -26245 -72511 -85892 -9698 -39003 -102484 -159477 -53733 -12822 -11207 -16298 -24348
524b4348m703l4065N1288l3769q601K2505l0887M572K4202n1369L2494J4543j3095
$$ -24348 -29051 -63116 -11828 -45597 -54198 -31693 -62580 -58008 -33806 -85175 -52681 -38138 -51233
511e1233L8565l0976K3100r344k3240K296L8021O4426m9218j0561j52842J9665
$$ -51233 -12668 -43644 -20544 -29888 -53128 -50832 -12811 51615 2397 -8164 -161006 -141341
499a41341P8379K6225m1074j00182O0237j7888Q7637Q710M306n3815p408n054
$$ -141341 -62962 -36737 -77811 -177993 -117756 -135644 -48007 -39297 -34991 -88806 -96214 -101268
487a01268L0278L9385q6207k8574N9099r3637K9104J6077N9828L0107k3321m8873
$$ -101268 -70990 -31605 -117812 -146386 -87287 -180924 -151820 -135743 -75915 -45808 -69129 -118002
475a18002L4738Q635n3127j0213J4727K0726o8149j5260P9443o8457K4585J7368
$$ -118002 -83264 -74629 -127756 -137969 -123242 -102516 -170665 -185925 -106482 -174939 -150354 -132986
463a32986k1607L8250K3629M5765O6659M972L1293r5799p1996j0245K9356P6260
$$ -132986 -154593 -116343 -92714 -46949 19710 24682 55975 -39824 -111820 -122065 -92709 -16449
451a6449L5740j78916O249R4997k0998K5975l6791Q55k7870M2425L172K6664m5043
$$ -16449 19291 -159625 -153376 -58379 -79377 -53402 -90193 -89338 -117208 -74783 -71611 -44947 -89990
438h9990k8884J0843N615J2878n969Q614N0333r1193j9424Q7746K3218M849m8985
$$ -89990 -118874 -108031 -102416 -89538 -95507 -86893 -36560 -127753 -147177 -59431 -36213 -31364 -80349
425h0349o940K4901l9816L9879j00113J3251J2792k7954L1257l621N7238P758
$$ -80349 -87289 -62388 -102204 -62325 -162438 -149187 -136395 -164349 -133092 -136713 -79475 -71717
413g1717k6846L2151l3643M0204m9963m4096O5330O4366r8782o7595M0959o1402
$$ -71717 -98563 -66412 -100055 -59851 -109814 -153910 -88580 -24214 -122996 -190591 -149632 -211034
401b11034k6333J04737n6839M5442L0543l3684l6505N1868j2725K5607K5956M4804
$$ -211034 -237367 -132630 -189469 -144027 -113484 -147168 -183673 -131805 -144530 -118923 -92967 -48163
389d8163p6122q153N3764m9791J7244K1313m2551k7205L8148K0818l4320m2293
$$ -48163 -124285 -132438 -78674 -128465 -111221 -89908 -132459 -159664 -121516 -100698 -135018 -177311
377a77311L5012n0184L6962k2606N0512r71m3183L6569j3168r2447N540J23425
$$ -177311 -142299 -192483 -155521 -178127 -127615 -128586 -171769 -135200 -148368 -240815 -235275 -111850
365a11850p995j1930o8971k5761Q3845p555K5600l0749m3225J17155l5285m2480
$$ -111850 -119845 -131775 -200746 -226507 -142662 -150217 -124617 -155366 -198591 -81436 -116721 -159201
353a59201o7449J5481O9560n0640J0026P4800J2196k3348o8744p209K6090j4183
$$ -159201 -226650 -211169 -141609 -192249 -182223 -107423 -95227 -118575 -187319 -194528 -168438 -182621
341a82621N8537K5330j7138O640J0546n8750l2181o7767O6142J08440m8998l3829
$$ -182621 -124084 -98754 -115892 -109252 -98706 -157456 -189637 -257404 -191262 -82822 -131820 -165649
$$ [...]
##END NTUPLES=NMR SPECTRUM
##END=
