##TITLE=1H_CA-9261-3
 DMSO
 8 sc, 
 9.4.2024
##JCAMPDX= 6.0         $$ Bruker NMR JCAMP-DX V2.0
##DATA TYPE= NMR SPECTRUM
##DATA CLASS= NTUPLES
##ORIGIN= UXNMR, Bruker Analytische Messtechnik GmbH
##OWNER= root
$$ XWIN-NMR		Version 3.5
$$ Tue Apr  9 14:43:34 2024 Russian Standard Time (UT+4h)  she@DPX200
##.OBSERVE FREQUENCY= 200.1309
##.OBSERVE NUCLEUS= ^1H
##.ACQUISITION MODE= SIMULTANEOUS
##.ACQUISITION SCHEME= undefined
##.AVERAGES= 8
##.DIGITISER RES= 18
##SPECTROMETER/DATA SYSTEM= spect
##.PULSE SEQUENCE= zg30
##.SOLVENT NAME= CDCl3
##.SHIFT REFERENCE= (INTERNAL, CDCl3, 0, 15.6555)
##AUDIT TRAIL= $$ (NUMBER, WHEN, WHO, WHERE, WHAT)
$$ ##TITLE= Audit trail, XWIN-NMR		Version 3.5
$$ ##JCAMPDX= 5.01
$$ ##ORIGIN= Bruker BioSpin GmbH
$$ ##OWNER= she
$$ F:/spectra/data/she/nmr/H-F/1/pdata/1/auditp.txt
$$ ##AUDIT TRAIL=  $$ (NUMBER, WHEN, WHO, WHERE, WHAT)
(   1,<2024-04-09 14:42:25.59 +0400>,<she>,<DPX200>,
      <created by zg, POWCHK disabled, PULCHK disabled
       configuration hash MD5:
       00 E9 B6 7A A2 85 ED C7 34 08 36 98 17 FE 4E 26
       data hash MD5: 16K
       11 FC B7 F7 49 EC EA 99 9D 6C FA CA 70 DE F1 A0>)
(   2,<2024-04-09 14:42:27.98 +0400>,<she>,<DPX200>,
      <Start of raw data processing
       efp BC_mod = 2 LB = 0.24 FT_mod = 6 PKNL = 1 PHC0 = -25462.73 PHC1 = 13.58731 SI = 16K 
       data hash MD5: 16K
       F8 E1 98 BA 64 CA 2D 08 B9 D5 C6 AE EE D5 03 E8>)
(   3,<2024-04-09 14:42:51.01 +0400>,<she>,<DPX200>,
      <pk PHC0 = 79.41782 PHC1 = 0 
       data hash MD5: 16K
       56 2D 9F 77 5C 4B B1 12 D5 9F 22 F7 85 93 E3 51>)
(   4,<2024-04-09 14:42:54.62 +0400>,<she>,<DPX200>,
      <abs ABSG = 5 
       data hash MD5: 16K
       ED 31 43 A6 A4 D6 16 92 38 B5 3A B0 14 54 0D 0E>)
$$ ##END=
$$ 
$$ hash MD5
$$ C5 26 DA A1 28 63 3D E7 86 3D BA 8C 62 24 B5 27
##$RELAX= 
##$RELAX= 
##$RELAX= 
##$RELAX= 
##$RELAX= 
##$RELAX= 
$$ Bruker specific parameters
$$ --------------------------
##$DU= <F:/spectra>
##$EXPNO= 1
##$NAME= <H-F>
##$PROCNO= 1
##$TYPE= <nmr>
##$USER= <she>
##$AMP= (0..31)
100 100 100 100 100 100 100 100 100 100 100 100 100 100 100 100 100 100 
100 100 100 100 100 100 100 100 100 100 100 100 100 100 
##$AQSEQ= 0
##$AQ_mod= 1
##$AUNM= <au_zg>
##$AUTOPOS= <>
##$BF1= 200.13
##$BF2= 200.13
##$BF3= 200.13
##$BF4= 200.13
##$BF5= 200.13
##$BF6= 200.13
##$BF7= 200.13
##$BF8= 200.13
##$BYTORDA= 1
##$CFDGTYP= 0
##$CFRGTYP= 5
##$CHEMSTR= <none>
##$CNST= (0..31)
1 1 145 1 1 1 1 1 1 1 1 1 1 1 1 1 1 1 1 1 1 1 1 1 1 1 1 1 1 1 1 1 
##$CPDPRG= <>
##$CPDPRG1= <>
##$CPDPRG2= <>
##$CPDPRG3= <>
##$CPDPRG4= <mlev>
##$CPDPRG5= <mlev>
##$CPDPRG6= <mlev>
##$CPDPRG7= <mlev>
##$CPDPRG8= <mlev>
##$CPDPRGB= <>
##$CPDPRGT= <>
##$D= (0..31)
0 1.2 0 0 0 0 0 0 0 0.06 0 0.03 0 0 0 0 0.0002 0 0 0 0 0 0 0 0 0 0 0 0 
0 0 0 
##$DATE= 1712659345
##$DBL= (0..7)
120 120 120 120 120 120 120 120 
##$DBP= (0..7)
150 150 150 150 150 150 150 150 
##$DBP07= 0
##$DBPNAM0= <>
##$DBPNAM1= <>
##$DBPNAM2= <>
##$DBPNAM3= <>
##$DBPNAM4= <>
##$DBPNAM5= <>
$$ [...]
##$SUBNAM3= <"">
##$SUBNAM4= <"">
##$SUBNAM5= <"">
##$SUBNAM6= <"">
##$SUBNAM7= <"">
##$SUBNAM8= <"">
##$SUBNAM9= <"">
##$SW= 18.0517689322627
##$SWIBOX= (0..15)
0 0 2 0 0 0 0 0 0 0 0 0 0 0 0 0 
##$SW_h= 3612.71676300578
##$TD= 16384
##$TD0= 1
##$TE= 0
##$TE2= 300
##$TE3= 300
##$TEG= 300
##$TL= (0..7)
0 120 120 120 120 120 120 120 
##$TP= (0..7)
150 150 150 150 150 150 150 150 
##$TP07= 0
##$TPNAME0= <>
##$TPNAME1= <>
##$TPNAME2= <>
##$TPNAME3= <>
##$TPNAME4= <>
##$TPNAME5= <>
##$TPNAME6= <>
##$TPNAME7= <>
##$TPOAL= (0..7)
0.5 0.5 0.5 0.5 0.5 0.5 0.5 0.5 
##$TPOFFS= (0..7)
0 0 0 0 0 0 0 0 
##$TUNHIN= 0
##$TUNHOUT= 0
##$TUNXOUT= 0
##$USERA1= <user>
##$USERA2= <user>
##$USERA3= <user>
##$USERA4= <user>
##$USERA5= <user>
##$V9= 5
##$VALIST= <valist>
##$VCLIST= <CCCCCCCCCCCCCCC>
##$VD= 0
##$VDLIST= <DDDDDDDDDDDDDDD>
##$VPLIST= <PPPPPPPPPPPPPPP>
##$VTLIST= <TTTTTTTTTTTTTTT>
##$WBST= 1024
##$WBSW= 4
##$XGAIN= (0..3)
0 0 0 0 
##$XL= 0
##$YL= 0
##$YMAX_a= 239294
##$YMIN_a= -258089
##$ZGOPTNS= <>
##$ZL1= 120
##$ZL2= 120
##$ZL3= 120
##$ZL4= 120
##$ABSF1= 15.65547
##$ABSF2= -2.39642
##$ABSG= 5
##$ABSL= 3
##$ALPHA= 0
##$AQORDER= 0
##$ASSFAC= 0
##$ASSFACI= 0
##$ASSFACX= 0
##$ASSWID= 0
##$AUNMP= <proc_1d>
##$AZFE= 0.1
##$AZFW= 0.1
##$BCFW= 0
##$BC_mod= 2
##$BYTORDP= 0
##$COROFFS= 0
##$CY= -3
##$DATMOD= 1
##$DC= 0
##$DFILT= <>
##$DTYPP= 0
##$F1P= 0
##$F2P= 0
##$FCOR= 1
##$FTSIZE= 16384
##$FT_mod= 6
##$GAMMA= 0
##$GB= 0
##$INTBC= 1
##$INTSCL= 3.70164e-10
##$ISEN= 128
##$LB= 0.24
##$LEV0= 0
##$LPBIN= 0
##$MAXI= 10000
##$MC2= 0
##$MEAN= 0
##$ME_mod= 0
##$MI= 1.114404
##$NCOEF= 0
##$NC_proc= -5
##$NLEV= 6
##$NOISF1= 3.799351
##$NOISF2= 2.8
##$NSP= 0
##$NTH_PI= 0
##$NZP= 0
##$OFFSET= 15.65547
##$PC= 1
##$PHC0= -25383.31
##$PHC1= 13.58731
##$PH_mod= 1
##$PKNL= yes
##$PPARMOD= 0
##$PSCAL= 0
##$PSIGN= 0
##$REVERSE= no
##$SF= 200.129573235993
##$SI= 16384
##$SIGF1= 3
##$SIGF2= 2
##$SINO= 5.538805
##$SIOLD= 16384
##$SREGLST= <1H.CDCl3>
##$SSB= 0
##$STSI= 16384
##$STSR= 0
##$SW_p= 3612.71676300577
##$SYMM= 0
##$S_DEV= 0
##$TDeff= 16384
##$TDoff= 0
##$TI= <>
##$TILT= no
##$TM1= 0
##$TM2= 0
##$TOPLEV= 0
##$USERP1= <user>
##$USERP2= <user>
##$USERP3= <user>
##$USERP4= <user>
##$USERP5= <user>
##$WDW= 1
##$XDIM= 16384
##$YMAX_p= 279373379
##$YMIN_p= -129778
$$ End of Bruker specific parameters
$$ ---------------------------------
##NTUPLES= NMR SPECTRUM
##VAR_NAME=  FREQUENCY,     SPECTRUM/REAL,   SPECTRUM/IMAG
##SYMBOL=    X,             R,               I
##VAR_TYPE=  INDEPENDENT,   DEPENDENT,       DEPENDENT
##VAR_FORM=  AFFN,          ASDF,            ASDF
##VAR_DIM=   16384,         16384,           16384
##UNITS=     HZ,            ARBITRARY UNITS, ARBITRARY UNITS
##FACTOR=    0.220516191357247, 1,           1
##FIRST=     3133.12250877705, 0,            0
##LAST=      -479.594254228724, 0,           0
##MIN=       -479.594254228724, -129778,     0
##MAX=       3133.12250877705, 279373379,    0
$$ Real data points
##PAGE= N=1
##DATA TABLE= (X++(R..R)), XYDATA
$$ [...]
9002b491J140k61p38j369o94l224L905J027l35J199q45m911L793K349k199K146
8986a508r95k245j91n89k307J156M544R77j645k224j602L076M79J031L17q68r68
8969c562J076j773n37m85l629J302M826L397k510l787l326L299J353Q75j741n112
8953a0334M131K340k762l97J389n44K89k352q58R41j15J729j168j214M435J711
8937b779k955q03J160n31J751j238j580J030L11M71r84k023M383K67n814o67j10
8920a0111K368J819o26k960J543L021J546j860l610J801J624j522P04L92N80J07
8904e184k841L07K82N99n28K03J150K075J093l22j721J621J042l955J174k548
8888g553k77L626J433l821p44J618O53j710n73m29M527l013k225m05m55k300K206
$$ y = [-2491, -1351, -1612, -2350, -3719, -4413, -7637, -3732, -2705, -3040, -1841, -2686, -7597, -3804, -1455, -3654, -1508, -2503, -4748, -4939, -5528, -7835, -6679, -2135, -1158, -2803, -5027, -6629, -3553, -3074, -2043, -1726, -2594, -3562, -2486, -4259, -4796, -5281, -8910, -7608, -2782, 615, -1895, -5682, -9008, -5709, -4356, -3481, -5222, -10334, -6203, -3863, -6625, -7022, -5633, -6177, -5888, -8240, -9098, -8157, -8272, -6543, -7711, -8925, -4490, -2779, -5734, -6537, -5377, -5908, -4157, -5395, -6975, -5945, -5634, -5163, -6147, -8170, -3787, -3520, -9334, -10001, -10111, -7743, -5924, -6550, -9510, -7967, -4946, -3400, -5260, -8870, -7069, -5445, -6967, -6263, -5871, -5291, -5184, -8025, -7718, -7436, -6837, -7365, -7162, -6012, -3937, -2844, -3166, -4887, -3266, -2224, -6179, -5005, -7553, -7830, -4204, -2771, -6592, -7336, -5718, -5065, -6775, -7348, -7777, -3250, -6263, -8488, -8893, -9348, -11648, -9442]
8871i442K619J307k362k535R9L198K727Q8l230j082J894N30L11J117l297J537
8855f521K243m302J380k074n05j763M089j765J515J300j779L99M98l207K82m401
8839a4611M06K298J988K94J14J522J559J885j333l95P17l166R60j37o22l63M043
8822d841K114j172j750L06j613J235j84m400K594J409K576p49k028K411J011l639
8806f720q57J409J083l37l834l538M159J048J858k787J096L035j635k952j291
8791a0263J228p45k32l553J513M452L763j516k015J658L544r78m425J014J492
8776e063J190n76l274M68k039j235M45K836k472L62K289k471P9K220J525k788
8760h504k92J523M74j14l779L69J626M9j444j145J284J56j620K449J024O34P10
$$ y = [-9442, -6823, -5516, -7878, -10413, -10314, -7116, -4389, -4301, -7531, -8613, -6719, -6189, -5878, -4761, -8058, -6521, -4278, -8580, -7200, -9274, -9779, -11542, -7453, -9218, -7703, -6403, -8182, -7783, -7285, -10492, -10210, -14611, -14205, -11907, -9919, -9625, -9511, -7989, -6430, -4545, -5878, -6273, -5556, -8722, -7762, -7899, -8521, -8884, -4841, -2727, -3899, -5649, -5343, -6956, -5721, -5905, -10305, -7711, -6302, -3726, -4475, -6503, -4092, -3081, -6720, -7577, -6168, -5085, -5422, -9256, -12794, -8635, -7587, -5729, -8516, -7420, -4385, -6020, -8972, -10263, -9035, -9780, -10012, -13565, -12052, -7600, -3837, -5353, -7368, -5710, -2166, -3144, -7569, -6555, -5063, -3873, -4449, -7723, -7255, -9294, -10529, -10084, -7248, -9720, -9358, -7069, -9540, -9461, -7241, -5716, -8504, -8796, -7273, -6799, -6913, -10692, -10323, -8697, -8648, -10092, -11237, -9953, -9797, -11417, -8968, -7944, -7310, -6600]
8743f600k514n62k04K06K157j235k943J240J451K96k769k005J751K674j197l88
8727a0642j756L805K670M87l291o96L139K63k580j396m5K682K53j773M67J243
8711g170j588k112j57L51J576P14N7K800O99J112k663n135m26r61j92J285L450
8694h360K109m501p92o58M4M274p56o310L934M89K592j899K355j534J068J672
8678f273l601r73M114J482r70j74l923j908M982J798l383M005J803k845o200j745
8662a3811M090K332j513j469j636P149M78J641k132j899j562J804M81k908k289
8647a1244P13j34N53J079j367K176j467m81K844o31L42O82J62j267P28m35o078
8630a3825O273J436k383l09k611K137j027O57j300J691m45N75J104j875J152J015
$$ y = [-6600, -9114, -9676, -9880, -9674, -7517, -8752, -11695, -10455, -9004, -8708, -11477, -13482, -11731, -9057, -10254, -10642, -12398, -8593, -5923, -5436, -8727, -9423, -6284, -6021, -8601, -9997, -10042, -7360, -7107, -8880, -8413, -7170, -8758, -10870, -11027, -10676, -9100, -8386, -8329, -5529, -4830, -3718, -6381, -11516, -11942, -12903, -13095, -11810, -8360, -6251, -10752, -11544, -12202, -12158, -7884, -8640, -14950, -11016, -10527, -7935, -9834, -7479, -9013, -7945, -6273, -9874, -10847, -6733, -5251, -6221, -6395, -10318, -12226, -7244, -5446, -8829, -4824, -3021, -5866, -12066, -13811, -9721, -7389, -8902, -10371, -12007, -4858, -4380, -2739, -4871, -6770, -8332, -6528, -6047, -8955, -11244, -10531, -10665, -10112, -9033, -10400, -8224, -9691, -10172, -7328, -7959, -7617, -6935, -6773, -8040, -7312, -7747, -13825, -7552, -6116, -8499, -8808, -11419, -9282, -10309, -9652, -10952, -9261, -9706, -9131, -8027, -9902, -8750, -7735]
8614g735k653Q31J296l417J507j059n269J866J261M007M299m925m560N654J633
8599g264l642l286K54j213Kk637Q21L805r23j637n97j419l094l324j286o967k323
8582c4730l132p258l0323j0840P5308L7943o816n822l791p63k578j536k949J044
8568C757j915j261j900K54K851j709n645P90J046L67l42J924L24J33j695O03l460
8551e878K104K319m074l384k861Q57M403K425J9K626L028R50m598n057l088N549
8535d660K166k174o205O62N576J815r02o340N978K698o641k758M440K320j471
8520e496k498k978J776L410m14k108K665J064l42l091j083K07N07j38j122L256
8504f385J507Q06o88m621J002K494j012k512q59L307J097n069k455P61J487J769
$$ y = [-7735, -10388, -9557, -8261, -11678, -10171, -11230, -16499, -14633, -13372, -9365, -5066, -9991, -14551, -8897, -7264, -10906, -14192, -13938, -15151, -15149, -17786, -16965, -13160, -14083, -15720, -16317, -17736, -20830, -24154, -25440, -32407, -34730, -37862, -45120, -75443, -86283, -10975, 26968, 20152, 14330, 10539, 9776, 7198, 5662, 2713, 3757, 1842, 581, -1319, -1065, 1786, 77, -5568, -4778, -3732, -3365, -3707, -1783, -1459, -1326, -3021, -2418, -5878, -3774, -1455, -5529, -8913, -11774, -10917, -6514, -4089, -4070, -1444, 1584, 2534, -2064, -7121, -10209, -4660, -2494, -4668, -10873, -10211, -4635, -2820, -3722, -10062, -4084, -1386, -8027, -10785, -6345, -4025, -5496, -7994, -10972, -9196, -5786, -6200, -8308, -5643, -4579, -4921, -8012, -9095, -8888, -8381, -8519, -9641, -6385, -4878, -4072, -4760, -9381, -8379, -5885, -6897, -9409, -10268, -6961, -5864, -10933, -13388, -12627, -11140, -9371]
8488i371L370j045J283p04q09m258k045K78L055J517K065J940K124j711l040q03
8472h154k096j494J974L933L253M75m378k771l474L909L072j916Q38K796J726
8457b307p74m171j573q44J222K304o66M20K29J563k577N55L83K547p8l777j023
8440h567M81K860q05m334K81L641M032j906l760J117k214k055J769k172L543J789
8424f300k40k73j66M459k887k038N9J575j512r39k227K939j25L362j462m858K510
8407h123J096m6M207j787J069K639k455j798m450k198k74J42L762O016k773j947
8391f920q42M604j45n80j268j767q19j054p82j295j68M691K299J719j517j579
8375e423r05J042j815n37L039m993K978J373J583M30L61k623k344j54K628J772
$$ y = [-9371, -6001, -7046, -5763, -6467, -7276, -11534, -13579, -13301, -10246, -8729, -6664, -4724, -2600, -4311, -7351, -8154, -10250, -11744, -9770, -5837, -2584, -2109, -6487, -9258, -12732, -8823, -5751, -7667, -6829, -4033, -2307, -3081, -7252, -8825, -9669, -8447, -6143, -6809, -6389, -6160, -4597, -7174, -6619, -6236, -3689, -3767, -7544, -8567, -8086, -5226, -6031, -10365, -10084, -6443, -2411, -4317, -8077, -6960, -9174, -11229, -9460, -11632, -8089, -6300, -6540, -6813, -6979, -2520, -5407, -7445, -7386, -5811, -7323, -8262, -10489, -7550, -7675, -4313, -5775, -10633, -8123, -7027, -7073, -2866, -4653, -3584, -945, -3400, -5198, -9648, -11846, -12120, -11978, -8216, -2200, -4973, -6920, -7762, -3158, -3303, -3883, -5151, -6918, -7737, -8791, -9573, -10868, -11036, -6345, -4046, -2327, -3844, -5423, -6328, -5286, -7101, -7638, -4599, -9592, -6614, -5241, -3658, -3228, -2867, -5490, -7834, -7988, -5360, -3588]
8359c588J765k928k382j87j96j018k97J656P801m352l054j702J776K397k914n197
8343a2420L037M358j27m305L236P54L295L32l147K479j538k403n45j187M303L284
8327e94M002k195n280J43J385l592M26Q77M136j379o009N718J967N175m475p149
8311f844m817M852R94j015l090P863J61j367l932J234L806M113j253m546n961
8296i802k25O247k181m846L642K791k057K844j190Q526O74n933L23j344k523J445
8280c609j45l920o04J698k55l741M592j552J256K89J251L46j473k347o0N119J606
8263a549K810k683k67M338J828Q82n387m259K199J1749j0820m018j456O63R06
8248e064K469l992J136M668n368K26Q43r08l878L193L141M84J674J421n813j719
$$ y = [-3588, -1823, -4751, -7133, -7320, -7516, -8534, -8831, -7175, 626, -3726, -6780, -8482, -6706, -4309, -7223, -12420, -9383, -5025, -5152, -9457, -6221, -5467, -2172, -1840, -4987, -2508, -4046, -6449, -6994, -8181, -3878, -594, 3408, 1213, -4067, -3924, -2539, -6131, -5705, -4828, -692, -2071, -8080, -2362, -395, 4780, 305, -6844, -11661, -6809, -5815, -6830, -9920, -2057, -1896, -3263, -7195, -5961, -2155, 1958, 705, -3841, -9802, -10027, -3780, -5961, -10807, -7165, -4374, -6431, -3587, -4777, 3749, 4423, -1510, -1187, -2531, -5054, -3609, -3754, -7674, -8278, -6580, -6835, -10576, -5984, -7536, -6280, -5991, -4740, -4394, -5867, -8214, -8274, -3155, -1549, 1261, -1422, -1689, 2649, 4477, 5359, -28, -4287, -2088, 9661, -1159, -5177, -6633, -5970, -5064, -2595, -6587, -5451, -783, -6151, -5925, -5082, -5990, -9868, -6675, -3534, -3050, -1376, 45, -5768, -7487]
8232g487j776j019J478m595k337Q632R120j001M240l29n093m196k974Q303L755
8217D721L291O69m60l824m096l823k15q222M389l532k999j5205O384o717Q716
8202b0923J2069K477L573J4590k239O065R123J6151j8131M5977o439r3227K6471
8189d463r806j9141Q215J0714L747Q98q887J0289j090R007J653Q148j4154j7551
8175b2421K943m14p789L091O265K785k297M278Q389o184p230J0630O652k79j371
8160b952L25N365m07k296j645q71j0726J729N000Q210k943l190J0370r567k622
8145f220L198J410k85l387l346O923M013j1591K37J743R101k322k416l702m77
8130g121J437l440P74N78j623r76j703R768J598m768L790J978j535j663m64l89
$$ y = [-7487, -9263, -10282, -8804, -13399, -15736, -7104, 2016, 1015, 5255, 4926, -167, -4363, -7337, 966, 4721, 8012, 8681, 8221, 4397, 301, -3522, -3737, -11959, -7570, -11102, -14101, -29306, -22922, -29639, -20923, -8854, -6377, -2804, 11786, 9547, 15612, 24735, 40886, 22755, 68732, 62293, -30934, -4463, -14269, -33410, -25195, -14481, -10734, -9836, -18723, -8434, -9524, -517, 1136, 9284, -4870, -22421, -19478, -19892, -27681, -24590, -18325, -15540, -17837, -13559, -5170, -11354, -18584, -7954, -1302, -1581, -2952, -2627, 2738, 2331, 35, -1610, -2481, -13207, -11478, -6478, 1732, -1211, -4401, 5969, -3598, -6220, -3022, -1612, -1897, -5284, -8630, -1707, 2306, -9285, -9048, -7305, 1796, -526, -2942, -6644, -7121, -5684, -9124, -8350, -7772, -9395, -10371, -12074, -2306, -708, -5476, -1686, 292, -1243, -2906, -3370, -3759]
8114c759J540J284L022K32p466j905j037j2J943k65k115J127K213n993k16N592
8098e815j124O91n84J360M293K899p486q73P06M88j550k80N078j066l6n464J596
8081g167L298J977J026r178p70O090M60m170j263J340L144P64K265j890J530O82
8065a862k167J363l10l70l93l127J082r4J638P9K783j651m796L957j024J606j059
8048d345P70K69k947J199J620O557k039p064P84j51J514J106j748K64k559j23
8032f893R39L482Q12n499n696j752Q366k269R39j376l43J407K452k76J694l953
8016g966J377J962o14k332J840J900n964k237L975M034K803k27k055l45m46j748
8000f043p40K926J177j991j126J05k81K976L846o32k917k019J150j013k947l55
$$ y = [-3759, -2219, -935, 2087, 2319, -5147, -7052, -8089, -8101, -6158, -6423, -8538, -7411, -5198, -11191, -11407, -5815, -6939, -6248, -6832, -5472, -1179, 1720, -5766, -6639, -5933, -5445, -6995, -7275, -2197, -3263, -3299, -8763, -7167, -3869, -1892, -866, -10044, -10814, -4724, -4264, -8434, -9697, -8357, -5213, -4449, -2184, -4074, -2544, -1862, -4029, -2666, -2976, -3346, -3739, -6866, -5784, -5878, -4240, -4161, -1378, -3029, -7825, -3868, -4892, -3286, -4345, -3575, -3306, -6253, -5054, -3434, 3123, 1084, -5980, -5196, -5347, -3833, -2727, -4475, -4211, -6770, -6893, -5954, -2472, -1660, -7159, -12855, -14607, -6241, -8510, -7571, -8947, -9290, -7883, -5431, -5707, -4013, -7966, -6589, -4627, -5241, -7573, -5733, -3833, -9797, -12034, -8059, -4025, -1222, -1449, -3504, -3849, -4295, -6043, -6783, -3857, -2680, -4671, -5797, -5692, -5973, -2997, 849, 217, -2700, -4719, -3569, -4582, -7529, -7884]
7984g884J879M26j838J809Q68l211M810n70M30R62J32k460k87j741q12P39J489
7967e259m93J614k176k052j16K705L608K839j881j663p44K818r47j318R39j246
7951c372N78n306j965K995O49M522k605L44K843j975m987K60M678j363K020K36
7935b448r15P0L422k219k109J845K15p09j557K092K696n73l451l795O44L499J513
7918a780j573k504K820J120k114r54j024L793k119m38k518N345L011Q1n790Q15
7902c829N00K646m750K315j784K807J042k30q70J203l708Q46m241P025L170p86
7886A356j50m228K548j799l630K111K837K646k701R50l655J847P62J684o003j290
7870f715K810J894k943K718j6K205j403j0k395K151r00p00l01L703R5J616l258
$$ y = [-7884, -6005, -5579, -7417, -5608, -4740, -7951, -3141, -3711, -3281, -2319, -2187, -4647, -4934, -6675, -7487, -6748, -5259, -5752, -4138, -6314, -8366, -8482, -5777, -2169, 670, -1211, -2874, -3618, -800, -1747, -3065, -2126, -3372, -2794, -8100, -10065, -7070, -6421, -1899, -4504, -4160, -1317, -3292, -8279, -8019, -3341, -4704, -2684, -2448, -3363, -3293, 129, -2090, -4199, -2354, -2139, -2848, -4405, -2313, 383, -190, -3641, -7436, -6792, -3293, -1780, -3353, -5857, -3037, -1917, -4031, -4985, -6009, -2216, -4335, -4773, -7291, -1946, 1065, 1146, -4644, -3829, -3329, -683, -5433, -3118, -4902, -2095, -1053, -1283, -2153, -950, -4658, -3812, -8053, -1028, 2142, 1356, 1206, -3022, -474, -2273, -5903, -3792, -955, 1691, -1010, -60, -3715, -1868, -1106, 578, -5425, -6715, -3905, -2011, -4954, -2236, -2252, -47, -1450, -1460, -3855, -1704, -2604, -3304, -3605, 98, 193, 1809, -1449]
7853a449j540M97L207k129k21k723L991K342n295M83K130J775l944J017r13K356
7837d16j17J07k724L890j268k994p8K226J422L088k892k545l82P910j588R52k237
7820B354M890j681M011n709M638j694R577p802Q895l690J5653q921L5085J9093
7806G4699J33111k16557j21031Q7083q633K8290j1748J7070o742J2240p020J0073
7794i165q764P783n464M616o258M630p24O599o577M986K44L912o153M119l071
7779i287N610m361K835j273M561r34k23n666L398J790L452l118k13o86L197o636
7763g554j236L871L136N1k138r2J078k806N23J069N47j895M925N70n526m743L230
7746f990j930p48j037r00J938M792j814j150K534K811q44k082L38K555K383m557
$$ y = [-1449, -2989, -2492, 715, -1414, -1635, -4358, -367, 1975, -3320, -2837, -707, 1068, -2876, -1859, -2772, -416, -533, -426, -3150, 740, -528, -3522, -3600, -1374, 48, 3136, 244, -2301, -2683, 5227, 3639, 4591, 2354, 7244, 5563, 9574, 3865, 8503, 6809, 16386, 8584, 17479, 13789, 29442, 20521, 55606, 74699, 207810, -8747, -129778, -42695, -51328, -23038, -34786, -17716, -24458, -12218, -19238, -9165, -17929, -10146, -15610, -10994, -17252, -12622, -13346, -6747, -13324, -8338, -8094, -4182, -10335, -6216, -9287, -3677, -8038, -5203, -6476, -1915, -2849, -3072, -8738, -5340, -3550, -98, -3216, -3429, -4115, -918, -7554, -8790, -4919, -1783, -1732, -3870, -3962, -2884, -5690, -5167, -4098, -3551, -5446, -521, 49, -5477, -10220, -6990, -8920, -9668, -10705, -11605, -9667, -4875, -6689, -7839, -5305, -2494, -3338, -5420, -5082, -2527, -144, -4701]
7730d701j54J413J585j088l185P69J041K337k740J814L684J832j698n212o97J154
7714c846K439P41l744K35M937l9l577k451M674n30K423m564J614j28l88J261j848
7697b791j485J208J739l709n04N486N9k125j042k44K817Q97m765J502R70r23j717
7680d627J823J426q0K644R21q77j29J059J099n284r26K05r03j923r53N755R62
7663A92m084J847k500L008O12m34k163J798Q11j80r9k53j6j987n80J285J299K229
7645G85j985m80j484N63R28l274l33K447L158j273l338M45K702J710m661J38J658
7628b294M200J013n155l050L941M667j141n557J684J809k026l256j927j054P442
7613g04j495k142L87k73K555M42k081P33J813m419o73L96k5N870k19k912Q04o89
$$ y = [-4701, -4855, -3442, -1857, -2945, -6130, -5361, -4320, -1983, -4723, -2909, 775, 2607, 909, -4303, -5000, -3846, -1407, -666, -4410, -4175, 762, 723, -2854, -5305, -631, -1161, 1262, -3302, -1688, -1816, -2204, -943, -2791, -4276, -3068, -1329, -5038, -5542, -56, 3, -2122, -3164, -3408, -591, 306, -4459, -2957, -1987, -2910, -4627, -2804, -1378, -1458, 1186, 2107, 1230, 1101, 2160, 3259, -2025, -2951, -2746, -3649, -5572, -6525, -770, 192, -3892, -2045, -4545, -1537, -925, -1359, -3522, -1724, -913, -1093, -1192, -1445, -1461, -3448, -4028, -2743, -1444, 785, -1200, -1680, -3164, -2601, -1673, -4947, -5280, -2833, 325, -948, -4286, -3841, -1139, 571, -4090, -3952, -2294, 1906, 2919, -2236, -5286, -1345, 3322, 2181, -3376, -1692, 117, -1909, -5165, -7092, -8146, -704, -2199, -4341, -3954, -4227, -1672, -1230, -3311, -2578, -765, -5184, -5857, -5461, -5486, 384, 165, -2747, -1943, -2632]
7595b632j265K62J253m633J408J883L929J529k408m509M052j483q35J50j70J343
7579b126J854k930l131L150J653j581m32L319J686q28k153q93k237K030J987K274
7563A642K304m663l171J631K913k488J06J091kj124j463m281K705K497J038p14
7547a979J453K130k847k206K79K741K044j908l405k575J420J988o97K90P90K402
7531h0K78k938M06K40M332k176j604q15J880j722n88j420N074L738n253J800Q92
7514B044J542p666l781N375J366J819j111k339q65J319l489K258P18J986K213
7499A389k386j508O24j68k347K981n15j804J116q36K460N55L259J269m947j727
7483b585M311L064p174J056J018J673K539k371m21K700J345m24m15M89k778n93
$$ y = [-2632, -3897, -3635, -2382, -7015, -5607, -3724, 205, 1734, -674, -5183, -1131, -2614, -3449, -3299, -3469, -2126, -272, -3202, -6333, -3183, -1530, -3111, -3543, -224, 1462, 634, -1519, -2412, -4649, -2619, -632, 1642, 3946, -717, -3888, -2257, 656, -1832, -1726, -635, -637, -1761, -3224, -7505, -4800, -2303, -1265, -1979, -526, 1604, -1243, -3449, -3170, -429, 1615, -293, -3698, -6273, -4853, -2865, -3562, -3272, -2482, -80, 198, -2740, -2334, -2094, 2238, 62, -1542, -2357, -477, -2199, -2787, -4207, 867, 4605, -648, 1152, 2044, 3586, -4080, -7861, -2486, -1120, 699, -412, -2751, -3616, -2297, -5786, -3528, -2810, -824, 1389, -997, -2505, -1881, -2049, -4396, -1415, -1930, -3734, -2618, -3454, -994, -439, 2820, 4089, -858, -2585, 1726, 4790, -2384, -1328, -310, 1363, 3902, 1531, 1110, 3810, 5155, 4731, 4316, 4805, 2027, 1434]
7467A434J141J638M55q70k149l78Q37J682J122l862m233K392Q66J669O11l232
7451h77L38N334j781j828j575k04M045k15m829M64L960M91k090K172M0K721m433
7434A733J015j76m94l031j008M025J175k036n46J05L075J154l260J424n2j472
7418A631m05L123R77j877M93r05j337j102M82J737r13l338M000J812l849J923
7402B452J714j764j501O51N49J637k158l16R23K153J538q15j077l411j41J714
7386B148K592K284l554m9j299J604P80J190M89n53l013J77p66k80K148R67j920
7369B945J640k018K740p23m915P65N776j466N73j164O35K43K506J667l180L24
7353F348l473R0M29j009r37J186L600M64m157j489J374K957J180k965l851K973
$$ y = [1434, 2575, 4213, 4668, 3798, 1649, 1271, 2108, 3790, 4912, 1050, -3183, -791, 75, 1744, 2355, -877, -539, 4795, 3014, 1186, -389, -593, 3452, 3237, -1592, -1128, 2832, 3323, 1233, 3405, 3445, 6166, 1733, 2748, 2572, 2078, -953, -1961, 2064, 3239, 1203, 657, 762, 3837, 4991, 1731, 3155, 3103, 1631, 1226, 4349, 5326, 3449, 3942, 3037, 1700, 598, 1080, 2817, 1904, -1434, 2566, 4378, 529, 2452, 4166, 2402, 901, 1552, 2101, 3738, 1580, 1264, 2187, 4340, 5878, 5063, 3986, 575, 434, 2148, 4740, 7024, 3470, 3421, 2122, 3726, 4506, 5696, 6185, 5632, 2619, 2796, 2030, 1750, 3898, 4865, 2945, 4585, 2567, 5307, 4584, -331, 434, 6210, 4744, 5317, 4153, 4788, 5031, 7537, 9204, 6024, 6348, 2875, 2965, 3394, 2385, 1448, 2634, 6234, 6698, 2541, 1052, 2426, 5383, 6563, 3598, -253, 2720]
7337B720R34K815k132j505K604O76n83j404M5J340K157L83k33r01L23N77j416
7320F400J220J348k050j702J164K92J763m879j795M227j261J373q28j255K934
7305F951j197m895J455J664R2J499m99k740K023K404q37k441J685m93M20J479
7289F570J303r03j88k897P80j41q99K014j547K466l335K827R07N61k151M280j013
7272H634l255O46j173k98m31L2K44L21N37l075R15L457J877J356l285l188j080
7255B234L459q66M31J907o72l019J26J427K87J636j717k845l020M158j966k250
7239f90J964L721J366J737J27k658K535k604j037K53L148J171k383l09j155M558
7223I744o84j530P93J205j459l306J580J287o31P13k301j603R66O74M492j118
$$ y = [2720, 3654, 6469, 4337, 2832, 5436, 6112, 5529, 4125, 4170, 5510, 7667, 8050, 7817, 6916, 7239, 7816, 6400, 7620, 8968, 6918, 5216, 6380, 6672, 8435, 3556, 1761, 5988, 4727, 6100, 5272, 4017, 6951, 5754, 859, 2314, 3978, 4070, 5569, 5070, 2330, 4353, 6757, 5920, 3479, 5164, 4671, 5091, 6570, 7873, 6970, 6782, 3885, 4665, 4524, 3625, 5639, 4092, 6558, 3223, 6050, 6957, 7518, 5367, 9647, 8634, 5379, 6025, 4852, 4554, 4123, 4155, 4399, 4720, 5257, 2182, 3097, 6554, 8431, 9787, 6502, 3314, 2234, 5693, 4827, 5258, 7165, 6493, 3474, 3600, 5027, 5314, 6950, 5233, 2388, -632, 3526, 1560, -690, 1274, 4995, 6361, 8098, 8225, 5567, 8102, 5498, 4461, 4714, 7862, 9033, 6650, 6341, 5186, 9744, 9060, 7530, 8323, 9528, 8069, 4763, 6343, 7630, 6999, 7712, 5411, 3808, 4774, 5448, 9940, 8822]
7207H822j022n72K090r0j373L95P52j596l105j939L717J467r69J403k901J355
7191F434K801r64J866R07k590k761N69K26L075m046k816K082P16k45N89J794J732
7174I369J370J277o27k730n00J031k107m09K310R08J601q07l992K630J774l550
7158G548l136J606Q96l358N15R64j82p76J524r72O15J631J106n091K540N193P88
7141A1411j642l193R71k37J85j068k539j06J861P42J844M57K797j969r37K674
7125A1251l823k629o23J099L649K518l465l938L074P175K54p105r96J856K856
7110A1153l99j643l084j107L782K586m71k456j087K770j044K921K48o72r65j612
7094H920O80K125k62j853J12J992O39k609n21o23L641j635r79J015L894l511k952
$$ y = [8822, 7800, 7228, 9318, 9228, 7855, 8250, 9002, 7406, 4301, 2362, 6079, 7546, 6577, 7980, 5079, 6434, 9235, 8271, 10137, 11044, 8454, 5693, 6262, 6488, 9563, 5517, 2701, 4783, 5499, 5254, 5843, 7637, 9369, 10739, 12016, 11389, 8659, 8159, 9190, 7083, 6674, 8984, 9892, 11493, 10686, 6694, 9324, 11098, 7548, 4412, 6018, 6914, 3556, 4071, 5035, 4853, 4077, 5601, 4629, 5244, 6875, 7981, 2890, 5430, 10623, 11411, 9769, 6576, 7547, 7310, 7495, 6427, 3888, 3782, 5643, 6385, 8229, 8686, 11483, 9514, 8577, 11251, 7428, 4799, 4176, 5275, 8924, 11442, 7977, 4039, 7113, 14288, 14542, 7437, 6441, 8297, 11153, 10754, 9111, 6027, 4920, 8702, 11288, 10817, 8361, 7274, 10044, 9000, 11921, 12169, 11497, 10532, 8920, 9600, 11725, 11463, 9610, 9722, 11714, 12353, 9744, 9223, 8600, 12241, 10606, 9627, 10642, 14536, 11025, 8073]
7077H073r88N296N97k873k975K595K683j679k119q03M091J562o396j330L677J800
7061A1211j399j3K640M962m625m360J440L013j68l535J226J158J353l87q79l865
7045G772M6J740K153N80Q48j627j199j663J42K258J759k78j003l62K205j198k695
7028I478j649M834j13o9j094j464K796o07j494k09M72K711K037l123j825K763
7012A3444J81l98N02j359K658J352k467o016o20K093N421r52j705m9k57J188j443
6995A1573J447L85J089R06l012L60L984k508j825Q13K223r49l571K406j013K685
6979A4993m304j153M201L289j223k820k313L006M121k645j326l127O056l066j534
6964A2155J115L625j589J382k211k364l43J04r04k34O79J974R42p26K039J091
$$ y = [8073, 7085, 12381, 12978, 10105, 7130, 9725, 12408, 10729, 8610, 7807, 11898, 13460, 7064, 5734, 9411, 11211, 9812, 9799, 12439, 17401, 12776, 8416, 9856, 12869, 12701, 9166, 10392, 11550, 12903, 12516, 11637, 7772, 7818, 9558, 11711, 12291, 13139, 11512, 10313, 8650, 8792, 11050, 12809, 12531, 11528, 11166, 13371, 12173, 9478, 7829, 12663, 12550, 12481, 11387, 9923, 12719, 12112, 10618, 10409, 10881, 13592, 15629, 12506, 10681, 13444, 13625, 13227, 13729, 12370, 15028, 16380, 13913, 7897, 7277, 9370, 14791, 13839, 12134, 12085, 11828, 13016, 11573, 13020, 13405, 14494, 15400, 12388, 12748, 16732, 14224, 12399, 13212, 15435, 14486, 10915, 13321, 12308, 14993, 10689, 9536, 13737, 17026, 15803, 12983, 10670, 13676, 17797, 15152, 13826, 10699, 16755, 13689, 12155, 13270, 16895, 15306, 16688, 14477, 12113, 11770, 11874, 10970, 10736, 11415, 13389, 14331, 13605, 15644, 16735]
6948A6735K490m082j824M246P27j648p47n67p14L36q93j887K140o92L19m16m88
6931A3035k07J422m088K922M383M16r12k043m515k998J791J429J736J643p97l427
6915I790j042K363N136L80k516n04L863l924k351M710j411O81J549o250N74K693
6899A3741L266j718r41L646l62P89j729K708r71k055K23k482R82J791k212J002
6883A5678Q22k662J612k70j373O78K709j232J411o95N7J335j825K76L289m74k893
6866A6443K196m180J725L071j255r5N68j738j634j50J816K669l60o63L44j175
6850A7582L342j921O93q58O19k855K077K567l76q98l699j043L030J943l566p30
6834A5907J679L462J149k016l63J241k04K1l178k048j435N017J53k181L39O99
$$ y = [16735, 19225, 15143, 13319, 17565, 18292, 16644, 15897, 15330, 14616, 14952, 14059, 12172, 14312, 13620, 13939, 13523, 13035, 12828, 14250, 10162, 13084, 17467, 17883, 16971, 14928, 10413, 7415, 9206, 10635, 12371, 14014, 13217, 9790, 8748, 11111, 16247, 16627, 14111, 13607, 17470, 13546, 11195, 15905, 14494, 15175, 16724, 10474, 11048, 13741, 17007, 15289, 14348, 17994, 17632, 18421, 16692, 19400, 18429, 16374, 16597, 14115, 15097, 16888, 14676, 15678, 16500, 13838, 15450, 15180, 13807, 14485, 17194, 15962, 17373, 16678, 16735, 18070, 16245, 16521, 19810, 19336, 16443, 18639, 14459, 16184, 19255, 18000, 17905, 18473, 16735, 15101, 14951, 16767, 19436, 19076, 18413, 18757, 17582, 20924, 19003, 19696, 18838, 19457, 16602, 18679, 21246, 20870, 19972, 16273, 15230, 18260, 20203, 16637, 15907, 17586, 21048, 22197, 20181, 19818, 21059, 20855, 20876, 17698, 15650, 14215, 19232, 19385, 17204, 17543, 18242]
6818A8242k53k794N01R80J989m1n27O28L277n4j687j49K29k54J16j033M10K90
6800A9870j539J5k25N175j556J318k70l458L7L257k213Q19J137J029N44n078O69
6783A9531j567J001J62J329K840k983N63L280J482j781l843J829Q97l8k540m11
6767A9751J459M37j04j560K92J76J315p63j083J042M424qj56m92k159P42j138
6750B2175O04K436J060k034l027N31K09n34m37J794M228K95l141L47j370J82L200
6733B6518m788j244o02j124M12K277N88Q36K345N04M96m30L51J322k570j875K015
6716B5031k629J519J057k472M419l59n960K631J509k23J992J299O74j21K73j298
6700B7342l761o18K598L177K639k186k918M50L774K698J131k014n072J963j846
$$ y = [18242, 17989, 15195, 15696, 16676, 18665, 18624, 18097, 18725, 22002, 21948, 20261, 20112, 20341, 20087, 20203, 19170, 19580, 19870, 18331, 18346, 18121, 23296, 21740, 23058, 22788, 19330, 19367, 22624, 20411, 21230, 22367, 23396, 23940, 18862, 19531, 17964, 18965, 19127, 20456, 23296, 20313, 20876, 24156, 25638, 23857, 20014, 21843, 22740, 22702, 20162, 19751, 21210, 21647, 21543, 19983, 20275, 20451, 21766, 21003, 19920, 20962, 25386, 25378, 25222, 24730, 22571, 23313, 22175, 22779, 25215, 26275, 24241, 21214, 21745, 21954, 21420, 20983, 22777, 27005, 27300, 24159, 24506, 23136, 23318, 26518, 21730, 20486, 19884, 18760, 19172, 21449, 22037, 22873, 25218, 25722, 26218, 25788, 26139, 27461, 24891, 23016, 25031, 22402, 23921, 24978, 22506, 26925, 26566, 20606, 23237, 24746, 24523, 26515, 27814, 28488, 28367, 28640, 27342, 23581, 22963, 25561, 28738, 31377, 29191, 26273, 26723, 30497, 33195, 34326, 32312, 27240, 29203, 27357]
6685B7357L411J397m075J688M1N62r42j948L316j961k514o87K184L075J147k056
6669B9995M84K568k198j924k385J858L984k567k587K653J259l67k305k511K884
6654B8841K081P28l085K51K101J628j577J28j596L385O21O16j37l336M091k525
6638C2215n95J625Q48j500k101j966J010q83K48m82j696J153M485l33J473M61
6622C3962L22K92P61j252n82j48m1R01L7N32o59k001K405j774R96j666J052L27
6604C3464k073L583l23j926K434k223k75M982j593k729R29n0qJ077l40j065J462
6587C5326K025J291j841O48j085K651l04p07J064k351m77J250j775O73K47k601
6571C4034j73J592m37p26p64J010L522J831k916k613K314K41j363l506L253J816
$$ y = [27357, 30768, 32165, 28090, 29778, 29819, 30381, 29439, 27491, 30807, 28846, 26332, 25645, 27829, 30904, 32051, 29995, 30479, 33047, 30849, 28925, 26540, 28398, 32382, 29815, 27228, 29881, 31140, 30773, 28468, 25957, 28841, 30922, 31650, 28565, 28816, 30917, 32545, 30968, 31096, 29500, 32885, 33506, 34122, 33985, 30649, 34740, 32215, 31620, 33245, 34093, 32593, 30492, 28526, 29536, 28653, 28901, 28419, 26723, 27876, 32361, 32028, 33501, 33962, 34284, 34576, 35337, 34085, 33503, 33355, 33314, 34215, 34252, 34784, 34125, 32124, 34529, 32755, 33751, 32085, 33137, 33464, 31391, 34974, 34651, 32725, 35159, 32936, 32661, 37643, 36050, 33321, 34250, 34200, 34192, 35269, 34929, 33864, 35326, 37351, 38642, 36801, 37449, 36364, 39015, 38711, 38004, 39068, 36717, 36240, 37490, 35715, 36388, 36635, 34034, 33861, 35453, 35016, 34290, 33526, 34536, 38058, 39889, 36973, 34360, 36674, 36915, 35552, 32046, 35299, 37115]
6555C7115K482j956J247P57N56j234j51M025p12m428P26J067N09j511j688K594
6539C9398j199q2M85K307M87j154k057K517o20j341J516m44l95N72J955j185j015
6522C9745O66M42j968L805p01N18J157K155l334R90J156q33n024L483j281j066
6506C9910j163P70J994m46l20K932Q81k703k459n67K973J502J348j587j067K309
6490D4307N058M9j622j405O39L81j521k607j627l08p88J07R53L016K151l247l91
6473D3145K500Q59j338o94k249M068j893r60q05J764o10j731J826J200R56l60
6457D5678j410k617K406K980J142k163r89Q95L17L72k055L143k566k53Q25K148
6441D7853M645k686l384M5Q59n25k843J245N483O9j596r81K22R36j781J622o50
$$ y = [37115, 39597, 37641, 38888, 39645, 40201, 38967, 38816, 42841, 42129, 37701, 38427, 39494, 40003, 38492, 36804, 39398, 38199, 38117, 38602, 40909, 41396, 40242, 38185, 40702, 40082, 38741, 40257, 39813, 39418, 39990, 41945, 40760, 39745, 40411, 40853, 38885, 42690, 41989, 42507, 43664, 45819, 42485, 43475, 44631, 43798, 38774, 42257, 40976, 39910, 38747, 39517, 41511, 41065, 40745, 43677, 44558, 41855, 39396, 38829, 41802, 43304, 44652, 43065, 41998, 44307, 49365, 49414, 47792, 46387, 47026, 47407, 45886, 43279, 41652, 41344, 40556, 40663, 41616, 44632, 46783, 43536, 43145, 45645, 46504, 45166, 44472, 42223, 46291, 44398, 43438, 42633, 44397, 43787, 42056, 43882, 45082, 46038, 45678, 44268, 41651, 44057, 47037, 48179, 46016, 45027, 45922, 46239, 46611, 44556, 47699, 45133, 44880, 45705, 47853, 52498, 49812, 46428, 46473, 47332, 46807, 43964, 45209, 50692, 50761, 49165, 48184, 48406, 49342, 47561, 49183, 48533]
6424D8533k180K239R84k411K550O65J293k590N64R80k831K181L87O77j481J480
6408E1040l255j21L291L734j924j67R83K469j149o39j541j863O42k20P03K186
6392E4169K236m640J501K405j428k424J446O41Q20K049p45j550j69M5N52J763
6376E6671N89j143P23O77O28n88N33k459j435M36q77m70J781k7O92N81o29Q22
6358E6505k822K527J274l9m54j319L630j143j41M52O27j808R88N82j171K214O47
6341F0549k477l07J188J483JQ08n90J836k263j60N99o37J279J332k153J720R65
6324F3173k201j363M32J519k275J553K199J912R2k12l87K053n05J938k493m59
6308F4976M26N85j482j313M35L146J281J470O15m870j514Q53J256O03l024J378
$$ y = [48533, 46353, 48592, 49576, 47165, 49715, 50380, 51673, 49083, 49647, 50627, 47796, 49977, 50364, 51041, 49560, 51040, 47785, 47664, 50955, 54689, 52765, 52598, 53581, 56050, 54901, 54262, 52721, 50858, 51500, 51280, 51983, 54169, 56405, 51765, 53266, 55671, 54243, 51819, 53265, 53906, 54726, 56775, 56030, 54480, 54311, 54356, 54908, 56671, 57260, 56117, 56840, 57517, 58145, 57557, 58090, 55631, 54196, 54632, 53755, 53285, 55066, 55039, 55731, 56312, 55683, 56505, 53683, 56210, 57484, 57445, 56991, 55672, 59302, 58159, 58018, 58470, 59097, 57289, 58277, 58859, 57688, 59902, 60549, 58072, 57765, 58953, 60436, 60437, 61245, 60655, 62491, 60228, 60068, 60667, 60030, 61309, 62641, 60488, 62208, 63173, 60972, 59609, 60041, 61560, 59285, 60838, 63037, 64949, 65041, 64829, 64442, 66495, 65990, 67928, 65435, 64976, 65402, 65987, 64505, 63192, 63627, 66773, 68054, 69524, 70139, 65269, 63755, 64608, 65864, 66467, 63443, 64821]
6292F4821o32M76J799J222j527K70J845J227k097L222j236k161P29R38P23n90
6276F9029J100n43J51p36j485R61j225o98L030K649M461k250p33n13j587N110
6260G6721J711l131j323j40L685k75k345k060k806J175J676J146L361q23k127
6245G4445J203L324J586k295l14K47n67p07J270k242P39M064n14j987j105Q72
6229G8019N02j10L921j855J635j249K83N698l431j61j127K575R89j121J028k711
6213H2885J312K60J617K39j788p66j73K0J478J471j066K242J734J208k548K777
6197I0902K84r42K776j891o86l9q84K914j779j344K466n38N54K185J036j941q69
6180I2204j735R43r70M774K879p232o45M682L048l100q83l190L18K591R15J446
$$ y = [64821, 64189, 64665, 66464, 67686, 66159, 66429, 68274, 69501, 67404, 70626, 69390, 67229, 67958, 68896, 69619, 69029, 70129, 69586, 69737, 69001, 67516, 68477, 67252, 66554, 69584, 72233, 76694, 74444, 73711, 73198, 71611, 76721, 78432, 75301, 73978, 73838, 77523, 77248, 74903, 72843, 70037, 71212, 72888, 74034, 77395, 76572, 74445, 75648, 78972, 80558, 78263, 77949, 78196, 77629, 76922, 78192, 75950, 76689, 80753, 80239, 78252, 77147, 78019, 78521, 78411, 82332, 80477, 82112, 80863, 81146, 86844, 83413, 83252, 82125, 84700, 85689, 84568, 85596, 82885, 84197, 84457, 86074, 86313, 84525, 83759, 83586, 83606, 85084, 86555, 85489, 87731, 89465, 90673, 88125, 90902, 91186, 90244, 93020, 91129, 90443, 90404, 89520, 92434, 90655, 89311, 91777, 91239, 91793, 93978, 95014, 93073, 92204, 90469, 91412, 90442, 95216, 98095, 90863, 90218, 94900, 97948, 94848, 93965, 90775, 91093, 93684, 94599, 96045]
6164I6045K222J420k792k52m10K748P81j909O871q7l49K201L270o80o315J68L036
6147A05968r47J038J49j47j53K764N05l799j918M589L289k825k648M300J603O76
6131A12444n59K957N38N44j733J609K819j155o4j346M45J776J049O13K551J498
6115A23986N31p62J743k546J605J02J696L958N42L32k523K149J448J612L364O82
6099A37919J883j994j029j86K628J868k145j240K283K048j005m57L730m70l41
6084A43492J529P99r38M30K948M65j147J666J718q07M340L800k288M96k591J520
6068A55432L671j270J15l65L396J25j378R00J584j512r13K034J440l74Q46J901
6052A65632K436p29p33K741J585K229r29j175J461Q72p30K560J267J596M1L111
$$ y = [96045, 98267, 99687, 96895, 96643, 96233, 98981, 99762, 97853, 104724, 104637, 104288, 106489, 109759, 109079, 102764, 102932, 105968, 105021, 106059, 106208, 106061, 105908, 108672, 109177, 105378, 103460, 108049, 111338, 108513, 105865, 110165, 111768, 112444, 111885, 114842, 115380, 115924, 114191, 115800, 118619, 117464, 117400, 116054, 116499, 118275, 119324, 119937, 122488, 123986, 124517, 123755, 125498, 122952, 124557, 124659, 126355, 130313, 130855, 131187, 128664, 130813, 132261, 133873, 137237, 137919, 139802, 137808, 136779, 136593, 139221, 141089, 138944, 137704, 139987, 142035, 141030, 140573, 144303, 143833, 143492, 145021, 145820, 144882, 145312, 148260, 148725, 147578, 149244, 150962, 150155, 154495, 158295, 156007, 156503, 153912, 155432, 159103, 157833, 157948, 157583, 160979, 161104, 159726, 160626, 162210, 160698, 159785, 161819, 163259, 162885, 163731, 165632, 168068, 167339, 166606, 169347, 170932, 173161, 172232, 171057, 172518, 173390, 172660, 175220, 176487, 178083, 178124, 181235]
6036A81235l93l372J86O732o20q94K704Q54k144Q4L144J450O42k550J088K876
6020A91022J846J898M592P3k4O77r54M030L348J218k27N217K489J740j307P34
6004B16372K801L745K985R18M426K652K12P47R71L112R34M560R52K272K042K376
5988B52077M062K644L769P6m041L193N391M103j51Q64K210M316J678R17J619K442
5972B85169K179m12M600R53L219L59K924p64K245M549M785J693J648J583J189
5957C15919L659N575J847J110Q39J765J545L575L37L899P242N037J322L648Q785
5942C66104M619J582M719O720P088M215O024M760N311M238M506O691P733P836
5928D42146L098K266R366Q220R860O948Q737R175J1127P866J0334J1206J1506
$$ y = [181235, 180842, 177470, 177656, 184388, 183768, 182874, 185578, 186432, 184288, 184372, 187516, 188966, 189608, 187058, 188146, 191022, 192868, 194766, 199358, 199431, 199407, 200084, 199130, 203160, 206508, 207726, 207499, 212716, 215205, 216945, 215638, 216372, 219173, 222918, 225903, 226821, 231247, 233899, 234111, 234858, 235829, 238941, 239875, 244435, 245387, 247659, 249701, 252077, 256139, 258783, 262552, 262628, 258587, 261780, 267171, 271274, 271123, 271987, 274197, 278513, 280191, 281108, 282727, 285169, 287348, 286936, 291536, 292489, 295708, 296067, 298991, 298227, 300472, 305021, 309806, 311499, 313147, 314730, 315919, 319578, 325153, 327000, 328110, 328949, 330714, 332259, 335834, 336171, 340070, 347312, 352349, 353671, 357319, 366104, 370723, 372305, 377024, 383744, 390832, 395047, 401071, 405831, 411142, 415380, 419886, 426577, 434310, 442146, 445244, 447510, 456876, 465096, 474956, 481904, 490641, 499816, 510943, 518809, 529143, 540349, 551855]
5915E51855J1873J1836J4630J8066J4533J7977J3026J2374J2272Q065J2861R108
5903G08476J3461J2370Q853J2975J4050J7637J6451J2614J1813J6488J7447J8998
5891H81633J8741J5831J5179J7637K1966K1790K4166K1418K0332J9850K3984K3040
5879A125567K4772K1761K0985K0927K0646K5775K9647K6021K6955L0219L0802
5868A404077K9833K8539L1298L6375L2874K9551L1703L4863L2191L3549L7190
5857A762043M2088M3929M0241M6088M5453M6766N8221N8748N1363N6159O3966
5846B315065O1845O6924P3536P3951P9925Q8723R7024J00837J10340J23197J37379
5835C328746J59234J72454J85899J96485K05517K27020K49468K66252K91676L14533
$$ y = [551855, 563728, 575564, 590194, 608260, 622793, 640770, 653796, 666170, 678442, 686507, 699368, 708476, 721937, 734307, 743160, 756135, 770185, 787822, 804273, 816887, 828700, 845188, 862635, 881633, 900374, 916205, 931384, 949021, 970987, 992777, 1016943, 1038361, 1058693, 1078543, 1102527, 1125567, 1150339, 1172100, 1193085, 1214012, 1234658, 1260433, 1290080, 1316101, 1343056, 1373275, 1404077, 1433910, 1462449, 1493747, 1530122, 1562996, 1592547, 1624250, 1659113, 1691304, 1724853, 1762043, 1804131, 1848060, 1888301, 1934389, 1979842, 2026608, 2084829, 2143577, 2194940, 2251099, 2315065, 2376910, 2443834, 2517370, 2591321, 2671246, 2759969, 2856993, 2957830, 3068170, 3191367, 3328746, 3487980, 3660434, 3846333, 4042818, 4248335, 4475355, 4724823, 4991075, 5282751, 5597284]
5825E597284L45787L71236L99666M43217M89463N34103N65843N73491N64430N01332
5815A0385852M01757L22580L06989K83487J38413j99666n88364q45095r09058
5806I296895q46298p49329o64334o06640n59063n17315m75665m35458l97492l60685
5796C684616l20794k80971k44689k10318j82015j57359j38558j27798j14381j01269
5786A806464r6891q7902p8316o8068o3902o0954n2953m8163m2203m4120m0803
5775A122189l9568l7017l6452l4671l2009k9543k8462k9073k5832k4732k2332
5764G82498k3003k0755j6144j4118j6090j9703j3015j3585j4751j5330j4233r940
5752E91831j1065j6631r888j0406j0807j1409j1334j0668r136r417j2361o117
$$ y = [5597284, 5943071, 6314307, 6713973, 7157190, 7646653, 8180756, 8746599, 9320090, 9884520, 10385852, 10787609, 11110189, 11417178, 11700665, 11839078, 11639412, 11051048, 10205953, 9296895, 8450597, 7701268, 7036934, 6430294, 5871231, 5353916, 4878251, 4442793, 4045301, 3684616, 3363822, 3082851, 2838162, 2627844, 2445829, 2288470, 2149912, 2022114, 1907733, 1806464, 1709573, 1621671, 1543355, 1475287, 1411385, 1350431, 1297478, 1249315, 1207112, 1162992, 1122189, 1082621, 1045604, 1009152, 974481, 942472, 912929, 884467, 855394, 829562, 804830, 782498, 759495, 738740, 722596, 708478, 692388, 672685, 659670, 646085, 631334, 616004, 601771, 591831, 580766, 564135, 554247, 543841, 533034, 521625, 510291, 499623, 490487, 481070, 468709, 462592]
5740D62592m418o293r653o514p344m369l353o831o444n346l752n601o063p412
5726C79199n697n670n748m457r78l883n138J151j513p670R6k052k297m805j242
5711C29296n96k901l122l164j774j894k076o85k96j554k426j666p323q748J21
5696B91192N004l006l256K474R77k639q50J229j74l205KL242j889k261j047j454
5680B84339k812K70J396k695j575N10J088l22K71r23o68k022P95R41M53l106j35
5663B75805o77O82m768k055L75L429N83o117K48Q92j526k321n16J11N34k199L2
5646B62512J14L011n183l425j247J909K03J174R78k137J391l111Q77J276K927
5631B61269J652j984O75J274J245J986J314K341K880j356k840O12K876l440N35
$$ y = [462592, 458174, 451881, 442228, 435714, 428370, 424001, 420648, 413817, 407373, 402027, 398275, 392674, 386611, 379199, 373502, 367832, 362084, 357627, 356649, 352766, 347628, 348779, 347266, 339596, 339692, 337640, 335343, 330538, 329296, 328700, 325799, 322677, 319513, 317739, 315845, 313769, 313084, 312788, 311234, 308808, 307142, 299819, 291071, 291192, 296196, 293190, 289934, 292408, 293385, 290746, 289896, 291125, 290951, 287746, 287748, 290990, 289101, 286840, 285793, 284339, 281527, 281797, 283193, 280498, 278923, 279433, 280521, 280199, 280470, 279547, 278879, 276857, 277652, 278593, 279046, 275940, 275805, 275128, 275810, 271042, 268987, 269362, 272791, 273374, 267257, 267505, 268397, 266871, 264550, 264034, 264145, 264679, 262480, 262512, 262626, 265637, 260454, 257029, 255782, 257691, 257894, 259068, 260046, 257909, 259300, 256189, 257066, 258342, 261269, 262921, 260937, 261612, 262886, 264131, 266117, 267431, 269772, 272652, 271296, 268456, 269068, 271944, 268504, 269039]
5616B69039M799K388l623k537J243L060m73j64L325J167J095R23j487M628Q52
5601B84235o307J566M389N19l482J716J689K4j243k681K591J875k67m63K605M03
5585B87169N36r41L273L054O99l573j265J542N050r47K023j709K401M211k857
5570B98666m148o1L669K419J394j133J78j671o61O420P23J776J980N865J006l306
5554C13116j808L94J507J612O070k448J690L194l879P65K707L192J557p43M004
5539C30930j051N20p33J45J274K769K410N72k54L261M254L52L051J959j715J134
5523C48878M829j036j33K631J240J43R98l61J66L572J894P70L015j113N113J732
5507C72338p06N078L413m109j74M270M617J972j194R13O919L579m684O336N207
$$ y = [269039, 273838, 276226, 272603, 270066, 271309, 274369, 273896, 273732, 277057, 278224, 279319, 280242, 278755, 283383, 284235, 277928, 279494, 283883, 284402, 280920, 282636, 284325, 284349, 283106, 280425, 283016, 284891, 284624, 284161, 286766, 287169, 287705, 286764, 290037, 293091, 293790, 290217, 288952, 290494, 295544, 294597, 296620, 294911, 297312, 301523, 298666, 294518, 294457, 298126, 300545, 301939, 300806, 300984, 299313, 298652, 305072, 305795, 307571, 309551, 315416, 316422, 313116, 311308, 311702, 313209, 314821, 320891, 318443, 320133, 323327, 319448, 320213, 322920, 326112, 327669, 326926, 330930, 329879, 330399, 329666, 329811, 331085, 333854, 336264, 336836, 336582, 339843, 344097, 344449, 347500, 349459, 347744, 348878, 353707, 352671, 352538, 355169, 356409, 356552, 357550, 357189, 357355, 360927, 362821, 363591, 366606, 365493, 370606, 372338, 371632, 376710, 380123, 376014, 375840, 380110, 384727, 386699, 385505, 386418, 393337, 396916, 392232, 398568, 403775]
5492D03775P14m876L406O800J139M89M159J892J227J639J845R03J389L25L216
5477D28042M219M559J884k464K435N068K313n95L363M763K839K492P62N431K306
5462D67417m13K602N203M364N28J41J198N293O056o87M802O096L466k616M091
5447E07541N966M673J121J873L705L226K757J140J562Q087K198L141N866N601
5433E58457K778K768O250Q693L216L607N622Q224O837O622L715J0991M519K885
5419F35184N056L074P593M139L356N871P099M240k88N926Q023L322K579M756M349
5404G04279O578k73L404R748O359j012L070P590N085L482Q278O173K374P075O904
5389G79114Q208Q292O755M019Q497J1515Q551L689L480J0141R439N10Q416R492
$$ y = [403775, 404489, 399613, 403019, 409819, 410958, 411447, 415606, 417498, 418725, 420364, 422209, 423112, 424501, 424826, 428042, 432261, 436820, 438704, 436240, 438675, 443743, 446056, 445461, 448824, 453587, 456426, 458918, 459680, 465111, 467417, 467004, 469606, 474809, 479173, 479701, 479842, 481040, 486333, 492389, 491702, 496504, 502600, 506066, 503450, 507541, 513507, 518180, 519301, 521174, 524879, 528105, 530862, 532002, 533564, 541651, 543849, 546990, 552856, 558457, 561235, 564003, 570253, 578946, 582162, 585769, 591391, 599615, 606452, 613074, 616789, 627780, 632299, 635184, 640240, 643314, 650907, 655046, 658402, 664273, 671372, 675612, 675324, 681250, 689273, 692595, 695174, 699930, 704279, 710857, 710584, 713988, 723736, 730095, 729083, 732153, 739743, 744828, 748310, 756588, 762761, 765135, 772210, 779114, 787322, 795614, 802369, 806388, 814885, 826400, 834951, 838640, 842120, 852261, 861700, 862210, 870626, 880118]
5375H80118R700L368O387R627J0189Q669J1991O886J0353O469O447Q510J3389
5362I92103P990P058J3925J3949R145R294J0389J5143J1981P883Q915J5037J1010
5349A133822J0885P934J5314J2787J1895J2215J5570J5472J0354J1361J7077J5321
5337A290007J0170J1464J7591J5811J5330J1260J4218J9111J8354J2164J5515
5326A450995K2277K1147J3721K2200J8090J9973J7169K2028K3845K2671K0173
5315A674289K1163K7582K6779K4115K5578K8227L2903L4095L5338L9035M8449
5304B017553M3210M7643N2739N6420N8780N7993O7283P6951Q4547Q3853R2781
5293B739753J06893J11860J13897J18649J20314J16833J04754R4508Q8113P1054
$$ y = [880118, 889818, 893186, 899573, 909200, 919389, 928058, 940049, 946935, 957288, 963757, 970204, 978714, 992103, 1000093, 1007151, 1021076, 1035025, 1044170, 1053464, 1063853, 1078996, 1090977, 1098860, 1107775, 1122812, 1133822, 1144707, 1152641, 1167955, 1180742, 1192637, 1204852, 1220422, 1235894, 1246248, 1257609, 1274686, 1290007, 1300177, 1311641, 1329232, 1345043, 1360373, 1371633, 1385851, 1404962, 1423316, 1435480, 1450995, 1473272, 1494419, 1508140, 1530340, 1548430, 1568403, 1585572, 1607600, 1631445, 1654116, 1674289, 1695452, 1723034, 1749813, 1773928, 1799506, 1827733, 1860636, 1894731, 1930069, 1969104, 2017553, 2060763, 2108406, 2161145, 2217565, 2276345, 2334338, 2401621, 2478572, 2563119, 2646972, 2739753, 2846646, 2958506, 3072403, 3191052, 3311366, 3428199, 3532953, 3627461, 3715574, 3786628]
5283C786628M0425k113m5170r4562j38872j58337j55500j40794j27284j09656
5273B854765r2098q0114p7768o7690n7309m6172m5539l7820l1598j9712j3766
5262B285179j4371j1203J460m16m317j193N153Q3L185P253J4059R708O299J1192
5248B312071J9415J6889R553R489K3035J6320J4130J4754K6285K2014J9985J7150
5236B521090K5834K3479J9747J5095K3516K2383J7917J9431J9192J4473J8070
5225B740227Q018K2472K2618J8970J5270K1587K7076K3692J4515K2335K7919K5272
5213B989971J7115K3383L1280K9082J9495K6198L6957K9055K1593K7140L4976
5202C286245L4008K8337L3104M1669L5625K5309L2453L9616L3185K3181K7006
$$ y = [3786628, 3827053, 3824940, 3779770, 3685208, 3546336, 3387999, 3232499, 3091705, 2964421, 2854765, 2762667, 2682553, 2604785, 2537095, 2479786, 2433614, 2388075, 2350255, 2318657, 2298945, 2285179, 2270808, 2259605, 2261065, 2260649, 2256332, 2255139, 2260292, 2260375, 2263560, 2270813, 2284872, 2294580, 2300879, 2312071, 2331486, 2348375, 2357928, 2367417, 2390452, 2406772, 2420902, 2435656, 2461941, 2483955, 2503940, 2521090, 2546924, 2570403, 2590150, 2605245, 2628761, 2651144, 2669061, 2688492, 2707684, 2722157, 2740227, 2748245, 2770717, 2793335, 2812305, 2827575, 2849162, 2876238, 2899930, 2914445, 2936780, 2964699, 2989971, 3007086, 3030469, 3061749, 3090831, 3110326, 3136524, 3173481, 3202536, 3224129, 3251269, 3286245, 3320253, 3348590, 3381694, 3423363, 3458988, 3484297, 3516750, 3556366, 3589551, 3612732, 3639738]
5191C639738L8982L5789K6574L1091M1018L5765K4927L1063L7081M4015L4997
5180D021040L2821M4371M7329M3150M5806O1903N6433M1430M1552N9571N4891
5169D550297M7833N0474O8232O8698N8850O1676P3933P5329N6135O4403P7816
5158E253676P0767O2495O6275Q3929P7116O4006O4979Q3321P5958O4497O7845
5147F034864Q4330Q0564P2073P1163Q5241P6474O2876N2409P4598P7189P2026
5136F843807P4493Q4461P4886O2351O6696R5238R4819Q0179P3231Q9731R1481
5125G731373Q0356Q1463J12286J03617Q7395Q6752J00644R2830Q3702R5825J28162
5114H784405J19767J15215J26465J52968J41307J32647J47411J68362J49304J42090
$$ y = [3639738, 3678720, 3714509, 3741083, 3772174, 3813192, 3848957, 3873884, 3904947, 3942028, 3986043, 4021040, 4053861, 4098232, 4145561, 4188711, 4234517, 4296420, 4352853, 4394283, 4435835, 4495406, 4550297, 4598130, 4648604, 4716836, 4785534, 4844384, 4906060, 4979993, 5055322, 5111457, 5175860, 5253676, 5324443, 5386938, 5453213, 5537142, 5614258, 5678264, 5743243, 5826564, 5902522, 5967019, 6034864, 6119194, 6199758, 6271831, 6342994, 6428235, 6504709, 6567585, 6619994, 6694592, 6771781, 6843807, 6918300, 7002761, 7077647, 7139998, 7206694, 7301932, 7396751, 7476930, 7550161, 7639892, 7731373, 7811729, 7893192, 8005478, 8109095, 8196490, 8283242, 8383886, 8476716, 8560418, 8656243, 8784405, 8904172, 9019387, 9145852, 9298820, 9440127, 9572774, 9720185, 9888547, 10037851, 10179941]
5104A0179941J65337J87474J79609J78945J76955J74763J69930J65635J79773
5095A1758362K01616J87558J90743K14901K37680K30866K40532K70704L01496
5086A3834458K95325L01533L46170L62980L43962L41078L56057L83161M05561
5077A6970285M36993M76313N27242N72395O03667O14328N55149M41735M18363
5068B1616470M36392M00565L45179L56538M28409M50396M69083N19172N32280
5059B5554484N01034M85826M92294M87919N17278N78194O09508O62181O81975
5050C0570693O98747O86188P30887P88084Q80424R00527P33303O20108O78904
5041C7287865P98407Q08119P14093O88258P03666P32768P94382R04289R71616
$$ y = [10179941, 10345278, 10532752, 10712361, 10891306, 11068261, 11243024, 11412954, 11578589, 11758362, 11959978, 12147536, 12338279, 12553180, 12790860, 13021726, 13262258, 13532962, 13834458, 14129783, 14431316, 14777486, 15140466, 15484428, 15825506, 16181563, 16564724, 16970285, 17407278, 17883591, 18410833, 18983228, 19586895, 20201223, 20756372, 21198107, 21616470, 22052862, 22453427, 22798606, 23155144, 23583553, 24033949, 24503032, 25022204, 25554484, 26055518, 26541344, 27033638, 27521557, 28038835, 28617029, 29226537, 29888718, 30570693, 31269440, 31955628, 32686515, 33474599, 34355023, 35255550, 35988853, 36608961, 37287865, 38086272, 38894391, 39608484, 40296742, 41000408, 41733176, 42527558, 43431847, 44403463]
5032D4403463R46012R43437J024320J036714J006355R87047J078303J131653J139978
5023E3697282J140154J141183J051511J100939J247301J354829J352492J350443
5015F3436134J478326J585873J584855J716831J843553J860390J758015J861804
5007G7125781K085528K250136K291855K367953K509735K701988K866713L142592
4999I7342281L398265L613146L941826M506541M949353N162900N011311N140379
4991A33066002N412666N912770O385802O681731O838005P235900P523426P629453
4983A86685755Q192434Q960758R659281R728323R137105Q564937P906479N829541
4975B54664613L270846L945941O872196Q374144K245639n957010j0651673j3791572
$$ y = [44403463, 45349475, 46292912, 47317232, 48353946, 49360301, 50347348, 51425651, 52557304, 53697282, 54837436, 55978619, 57030130, 58131069, 59378370, 60733199, 62085691, 63436134, 64914460, 66500333, 68085188, 69802019, 71645572, 73505962, 75263977, 77125781, 79211309, 81461445, 83753300, 86121253, 88630988, 91332976, 94199689, 97342281, 100740546, 104353692, 108295518, 112802059, 117751412, 122914312, 127925623, 133066002, 138478668, 144391438, 150777240, 157458971, 164296976, 171532876, 179056302, 186685755, 194878189, 203838947, 213498228, 223226551, 232363656, 240928593, 248835072, 254664613, 257935459, 261881400, 268753596, 277127740, 279373379, 273416369, 262764696, 248973124]
4967B48973124j2933368j1609197j0315106j0409001j0179376r786612r657354
4960A74083110r756120r437034r543816r704586q900729q027494p179677o535205
4952A04998449n839470n282024m868528m552543m261268l984082l711051l448641
4944F9050842l161183k907648k676720k488268k310084k150547j985368j843130
4936D9527894j720889j716285j676111j604084j528225j485341j416338j341157
4928C7039464j260899j194205j116484j049683r76048r40908q95925q83231q52656
4919B7869425q29400p82132p50540p11444o78384o35329o19870n94684n83021
4910B1684621n53347n63105n49234n42579n20422m99112m76042m66257m39607
$$ y = [248973124, 236039756, 224430559, 214115453, 203706452, 193527076, 183740464, 174083110, 164326990, 154889956, 145346140, 135641554, 126740825, 118713331, 111533654, 104998449, 99158979, 93876955, 89008427, 84455884, 80194616, 76210534, 72499483, 69050842, 65889659, 62982011, 60305291, 57817023, 55506939, 53356392, 51371024, 49527894, 47807005, 46090720, 44414609, 42810525, 41282300, 39796959, 38380621, 37039464, 35778565, 34584360, 33467876, 32418193, 31442145, 30501237, 29605312, 28722081, 27869425, 27040025, 26257893, 25507353, 24795909, 24117525, 23482196, 22862326, 22267642, 21684621, 21131274, 20568169, 20018935, 19476356, 18955934, 18456822, 17980780, 17514523, 17074916]
4901A7074916m29396m07169l97435l76267l70099l49066l39320l22736l22409
4892A3761019l03883l01313k84426k85437k77087k75992k61123k54675k44316
4883A1272767k41193k29063k27373k13746k06403j93031j93746j81358j80263
4874I406591j70403j68620j59436j68884j53810j53788j50567j48116j35784j39415
4864G857768j35930j33926j32646j32014j23983j24285j19161j15488j07743j09412
4854F623180j05221j04921r8759r5120q7933q7052q8994q9947q5157q1688p6099
4843E622289p9022q0968p7286p4114p5769p5662p9579p5854p5498p3907p2450
4832D782180p2853p1131p5577p1020p1115p2597p0869p1274p1972o9322o9758
$$ y = [17074916, 16645520, 16238351, 15840916, 15464649, 15094550, 14745484, 14406164, 14083428, 13761019, 13457136, 13155823, 12871397, 12585960, 12308873, 12032881, 11771758, 11517083, 11272767, 11031574, 10802511, 10575138, 10361392, 10154989, 9961958, 9768212, 9586854, 9406591, 9236188, 9067568, 8908132, 8739248, 8585438, 8431650, 8281083, 8132967, 7997183, 7857768, 7721838, 7587912, 7455266, 7323252, 7199269, 7074984, 6955823, 6840335, 6732592, 6623180, 6517959, 6413038, 6314279, 6219159, 6131226, 6044174, 5955180, 5865233, 5780076, 5698388, 5622289, 5543267, 5462299, 5385013, 5310899, 5235130, 5159468, 5079889, 5004035, 4928537, 4854630, 4782180, 4709327, 4638196, 4562619, 4491599, 4420484, 4347887, 4277018, 4205744, 4133772, 4064450, 3994692]
4821C994692o3721o4591o4633o3983n7186o2839o1501n4766n1031n1768m1843
4810C356830m4309m6657m7174m3153l9431k8028l0034k8140l2371l0925l5097
4799B951511k5038k3613k5845k0508j7389k0932r022j8015j8124j9861j1750j6237
4787B725177j0690o546o485j3492j1328j4286j2632j7335j3351j5483j4447j6658
4775B572444j2701j7480j2968j3461j6038j8533j6349j5914j6218j5423j4442
4764B402917j9326j9904j8650j7487k0160j1163j8187j4798j6956j5473j8695
4753B212118j7931j9974j7384j8091j5247j3031k1390j8512j2425j6690j7199
4742B024244j5639j3578j4748j5034j6326j2312j7321j5986j3089j2907j3301
$$ y = [3994692, 3930971, 3866380, 3801747, 3737764, 3680578, 3617739, 3556238, 3501472, 3450441, 3398673, 3356830, 3312521, 3265864, 3218690, 3175537, 3136106, 3108078, 3078044, 3049904, 3017533, 2986608, 2951511, 2926473, 2902860, 2877015, 2856507, 2839118, 2818186, 2809164, 2791149, 2773025, 2753164, 2741414, 2725177, 2714487, 2707941, 2701456, 2687964, 2676636, 2662350, 2649718, 2632383, 2619032, 2603549, 2589102, 2572444, 2559743, 2542263, 2529295, 2515834, 2499796, 2481263, 2464914, 2449000, 2432782, 2417359, 2402917, 2383591, 2363687, 2345037, 2327550, 2307390, 2296227, 2278040, 2263242, 2246286, 2230813, 2212118, 2194187, 2174213, 2156829, 2138738, 2123491, 2110460, 2089070, 2070558, 2058133, 2041443, 2024244, 2008605, 1995027, 1980279, 1965245, 1948919, 1936607, 1919286, 1903300, 1890211, 1877304, 1864003]
4731A864003j4056j1910j0812r878r744j1918j1690j3489r754j0212j2432r148
4719A728960p413q110q664q950o743p083r811n003n935q765q355n583o434l035
4705A629076m280o558n187k789P32j279l266j255P72J47n20k822m49O407L222
4690A611951K648K065L884N354P733P239J4271J1858J6322K1256K6938K3158K9708
4677A784385L0913L9927M1557M3590M8417N8383O5148P5578Q0263R0268J00912
4666B459341J09179J04935J06040J02097R1372P7311O4740M5512O067m5820r8942
4655C021832j41454j65330j69915j55384j42519j23631j16819j04769j02087r0525
4645A709399q3480p8606o6237n7417n1894m6997m2891l8343l6023k9513k7327
$$ y = [1864003, 1849947, 1838037, 1827225, 1817347, 1807603, 1795685, 1783995, 1770506, 1760752, 1750540, 1738108, 1728960, 1721547, 1713437, 1704773, 1695823, 1689080, 1681997, 1672186, 1667183, 1661248, 1652483, 1644128, 1638545, 1632111, 1629076, 1624796, 1618238, 1613051, 1610262, 1610994, 1609715, 1606449, 1605194, 1605966, 1606113, 1605593, 1602771, 1602322, 1608729, 1611951, 1614599, 1616664, 1620548, 1625902, 1633635, 1640874, 1655145, 1667003, 1683325, 1704581, 1731519, 1754677, 1784385, 1815298, 1855225, 1896782, 1940372, 1988789, 2047172, 2112320, 2187898, 2268161, 2358429, 2459341, 2568520, 2673455, 2779495, 2881592, 2972964, 3050275, 3115015, 3160527, 3166594, 3120774, 3021832, 2880378, 2715048, 2545133, 2389749, 2247230, 2123599, 2006780, 1902011, 1799924, 1709399, 1625919, 1547313, 1481076, 1423659, 1371765, 1324768, 1281877, 1243534, 1207511, 1177998, 1150671]
4634A150671k2862k5342k4326j9704j7456j7052j6728j7639j1699j3700j1191
4623I52972j4338j6959j4491j0128j2746j1964j1027r972q714q997j2592q878
4611H12166n512q777p530p687q345p090o119j0779l181o804r475q926p777m274
4597G09890m137o610p884p337m620l874l151l533o344n159n051l236p499n120
4583F36335o462k764k866n432n558o610j111p405m879m311o658n897m296j985
4569E70101l116m363k970n507m541n352k889k385l219p608k024m07j316p941o931
4554E09532n982l374m330k214l138l841l319l271m260l860l407o73l564l326m269
4539D56704l246k90l048p827r22P86k121m722n232m385m32m626k012j304J822
$$ y = [1150671, 1127809, 1102467, 1078141, 1058437, 1040981, 1023929, 1007201, 989562, 977863, 964163, 952972, 938634, 921675, 907184, 897056, 884310, 872346, 861319, 851347, 842633, 833636, 821044, 812166, 806654, 797877, 790347, 782660, 774315, 767225, 761106, 750327, 747146, 740342, 730867, 721941, 714164, 709890, 705753, 699143, 691259, 683922, 679302, 675428, 672277, 668744, 662400, 657241, 652190, 648954, 641455, 636335, 629873, 627109, 624243, 618811, 613253, 606643, 605532, 598127, 593248, 588937, 582279, 576382, 572086, 570101, 566985, 562622, 559652, 554145, 549604, 544252, 541363, 538978, 535759, 528151, 526127, 525720, 524404, 516463, 509532, 503550, 500176, 495846, 493632, 490494, 486653, 483334, 480063, 475803, 471943, 468536, 467863, 464299, 460973, 456704, 453458, 453168, 450120, 442293, 441371, 442157, 440036, 435314, 430082, 425697, 425265, 420639, 418627, 417323, 419145]
4524D19145j880k62n81j506j471r11L22J406J34J271j411k567m147k522k756M20
4508D02684j1k477m369j30k315K36m757m083l039m74n07l693k364j755k459j647
4492C68840j81k807m525n02R8n399m061l763Q26K221k064J060m152l854l478k181
4476C36078J001k253k663k448o67n22j961m44o39m281K411m879r33o59j032R16
4460C17025r20o298J327k577l092J56j824q26j034m980M33j442j515j020j278
4445B92135l553l017K593k333l049p14n003K325k00l749J205j623k917j159l8
4430B70903j320n246j476j433m5k609j48k81k520m42R18J291l310q10k239k063
4414B49170j77p69m417k075Q25p65k94k809j806o37K166j384k655l180J441k708
$$ y = [419145, 417265, 417003, 416422, 414916, 413445, 412534, 412856, 414262, 414396, 415667, 414256, 411689, 407542, 405020, 402264, 402684, 402673, 400196, 395827, 395697, 393382, 393618, 388861, 384778, 381739, 381265, 380758, 377065, 374701, 372946, 370487, 368840, 368659, 365852, 361327, 360825, 360923, 355524, 351463, 347700, 348526, 350747, 348683, 349743, 345591, 341737, 338259, 336078, 337079, 334826, 332163, 329715, 329048, 328526, 326565, 326121, 325482, 321201, 323612, 318733, 317800, 317141, 316109, 317025, 316105, 309807, 311134, 308557, 305465, 305621, 303797, 302971, 301937, 296957, 297390, 295948, 294433, 293413, 292135, 288582, 285565, 288158, 285825, 282776, 282062, 277059, 279384, 279184, 275435, 276640, 275017, 272100, 270941, 270903, 269583, 264337, 262861, 261428, 261383, 258774, 258626, 258345, 255825, 255383, 256301, 257592, 254282, 253472, 251233, 249170, 248993, 248224, 243807, 241732, 242557, 241792, 241498, 238689, 236883, 236246, 238412, 237028, 234373, 231193, 232634, 229926]
4398B29926j369j348k352J91Q53j169k880l380N32K432m90l589p75k038l7l357
4382B11150j553J229l310P28M28q50K495l661j408k249k866L69K264k958l067
4367A96741J123J135l193q73k648j576J595L31k046l44m416o37j986K474J077
4352A86757j083k154j798j071p72K521j786j101k579j28q8k409l570n932k906
4337A61901N814J497n72n69O86k357j032K89J151J204k57N68j088l101J784k936
4321A62982k341j100p25j758k9l842J643k359k220J132n8l446n47P48j324l595
4305A43161J367K321n67l941j455n766o46o4j051k823k077N94l008k265k441q95
4289A20444J819j585q93k391j495O29M765k342J128K495k189J925L758j689l02
$$ y = [229926, 228557, 227209, 224857, 225048, 225901, 224732, 221852, 218472, 219004, 221436, 220946, 217357, 216582, 214544, 214507, 211150, 209597, 210826, 207516, 208244, 208672, 207822, 210317, 206656, 205248, 202999, 200133, 200502, 202766, 199808, 196741, 197864, 198999, 195806, 194933, 192285, 190709, 192304, 192635, 190589, 190245, 185829, 185192, 183206, 185680, 186757, 185674, 183520, 181722, 180651, 179879, 182400, 180614, 179513, 176934, 176806, 176718, 174309, 170739, 164807, 161901, 167715, 169212, 168640, 168071, 168757, 166400, 165368, 165657, 166808, 168012, 167755, 168323, 167235, 164134, 165918, 162982, 160641, 159541, 158816, 157058, 157029, 153187, 154830, 152471, 150251, 151383, 151325, 147879, 147332, 148080, 146756, 143161, 144528, 146849, 146282, 142341, 140886, 135120, 134474, 134410, 133359, 130536, 128459, 129053, 126045, 123780, 121339, 120444, 122263, 120678, 119785, 117394, 115899, 116528, 121293, 118951, 120079, 122574, 120385, 122310, 126068, 124379, 124077]
4274A24077j48m07l059l91k812O66L97J320n09J03K001k88k554J54m15L967%m692
4256A17410J302J131J217j672j768j834n99j143k415N7J318L458j3n10p86j517
4240A13636K913k229k750m76J16K98N41p18j19n36N22l789r05K668k484m858K740
4223A04570p78J546K07J314J97l001l09r65L15J426j787n95O07K775J960j391
4207A06091j742k089j169k193n12p27m960L264K31j534j795n3J515J077K66q21
4191I4849M47K35j200K866k431k461n33L532n131k528k055N78L44j247j829J605
4175H5041j61R7k71P8k283L291M054K72N12j165j701J304l465P10k536j509j290
4158H0978J424j682k337j421K22k902q99J819J493L043%K261j435P54j584J494
$$ y = [124077, 123929, 123522, 120463, 120072, 117260, 117926, 118323, 119643, 119134, 119237, 121238, 120950, 118396, 118550, 118135, 122102, 122102, 117410, 118712, 119843, 121060, 119388, 117620, 115786, 115187, 114044, 111629, 111686, 113004, 116462, 116449, 115939, 115153, 113636, 116549, 114320, 111570, 111094, 111210, 111508, 112049, 111331, 111212, 110676, 111198, 107409, 106504, 109172, 106688, 101830, 104570, 103792, 105338, 105545, 106859, 107056, 104055, 103746, 102781, 103096, 104522, 102735, 102140, 102747, 105522, 107482, 106091, 104349, 102260, 101091, 98898, 98386, 97659, 92699, 95963, 96194, 94660, 92865, 92812, 94327, 95404, 95670, 94849, 95296, 95531, 94331, 97197, 94766, 92305, 91772, 95304, 90173, 87645, 85590, 86168, 86512, 85265, 83436, 85041, 84880, 84977, 84706, 84784, 82501, 85792, 89846, 90118, 90630, 89465, 87764, 89068, 85603, 86313, 83777, 82268, 80978, 82402, 80720, 78383, 76962, 77184, 74282, 73383, 75202, 76695, 79738, 79738, 81999, 80564, 81318, 79734, 81228]
4142H1228J503O24j343r2j286q28R61q6p81k246k155K12J371Q80J530J054l954
4125G6592j158J86M231j168r98N14j786l955o08r17j39j841k91J441N32j543J219
4108G0311j231l627J863N872l428K224j352j338K177m54k949J73O79k040J447
4093F8327l54J260j903K87j607o07j198r39M23j228M23k060L425M400j054j52
4077F7443M36J003o67M04L146m733K509j253k122p56j124J596j838n91J654l46
4061F4761j889J183J91N89K199j451m94Q15R26n61j663N64l6m815J373J515M53
4044F3660k209j502n35P8k12J90j080j401l196J061O91J29k274R33k186j115N855
4027E6887O2j049r8j663k009N56J944M19n54l051j613L708m4j652j815n1m04j834
$$ y = [81228, 82731, 83355, 82012, 81920, 80634, 79806, 80767, 80681, 79900, 77654, 75499, 75711, 77082, 77962, 79492, 80546, 76592, 75434, 75620, 79851, 78683, 77685, 78199, 76413, 72458, 71850, 70933, 70794, 68953, 68662, 70103, 70635, 69092, 70311, 69080, 65453, 67316, 73188, 69760, 71984, 70632, 69294, 71471, 71017, 68068, 68241, 68920, 66880, 68327, 67973, 69233, 67330, 67617, 66010, 65403, 64205, 63266, 63689, 62461, 62884, 60824, 64249, 68649, 67595, 67443, 67879, 68882, 68215, 68619, 71765, 67032, 69541, 68288, 66166, 65410, 64286, 65882, 64044, 63453, 65107, 64761, 62872, 64055, 64246, 64835, 67034, 65583, 65089, 65904, 66830, 66269, 64606, 65170, 65134, 60319, 61692, 63207, 63660, 61451, 59949, 59414, 59492, 59280, 59470, 58390, 56989, 53793, 54854, 55545, 55674, 53400, 54333, 52147, 51032, 56887, 56949, 55900, 55802, 54139, 52130, 52686, 54630, 55049, 54495, 51444, 49831, 53539, 53495, 51843, 50028, 49977, 49573, 47739]
4009D7739K736k30K56J314M18o4k052k457o88m19p23M17N02N06k610R04r47m41
3991D4161K101K17j756m73k57K625J80l041P01J79J815m521j752k0j916N07m59
3974C8291n78Q95M964k276p00j472J811p51L316J474j879k264J995l052q97q56
3958C8021n85l09L432K81k316J604j312m272K290K250M23j867Q22l280r27J512
3942C5767L297l878lJ152Q64j742K789l26m46l614j099N96L52n88q60J524k037
3925C1748P85j423K767N66j493j108M170K710k359k840n57r66K14q77j713R52
3909C0576M838l507l093N90m90J586q54l38J167L474k430P14m84k643j123k141
3893B5842J862Q74J409j682r48j533K342n001K217K850J103k498k556J126O81
$$ y = [47739, 50475, 50245, 50501, 51815, 52233, 52169, 50117, 47660, 46972, 46553, 45830, 46247, 46749, 47255, 44645, 45549, 44602, 44161, 46262, 46479, 44723, 44250, 43993, 46618, 46798, 43757, 44458, 44637, 46452, 41931, 40179, 40159, 38243, 38750, 38291, 37713, 38608, 43572, 41296, 40596, 39124, 40935, 40184, 43500, 44974, 43095, 40831, 42826, 39774, 38877, 38021, 37436, 37127, 40559, 40840, 38524, 40128, 38816, 34544, 36834, 39084, 39507, 37640, 38462, 35182, 34255, 35767, 39064, 35186, 35183, 36335, 37199, 35457, 38246, 37920, 37474, 33860, 32761, 33357, 33709, 33121, 32261, 33785, 31748, 32533, 31110, 33877, 34443, 32950, 31842, 36012, 38722, 36363, 33523, 32966, 32000, 32214, 31337, 29624, 30576, 35414, 31907, 28814, 29404, 28914, 30500, 29646, 29308, 30475, 33949, 31519, 32233, 31749, 29106, 27983, 25842, 27704, 28578, 29987, 28305, 27357, 25824, 28166, 23165, 25382, 28232, 29335, 26837, 24281, 25407, 26088]
3878B6088j3j79j9L730P34j624l55j230Q3j412k269J284J966p87j90J460m564
3861B2703J505P02j129k213J645j761l148p36J434K136J949l822J776j866r06
3846A8269K913J874k2l49j747K474K232p52n04L044k321o06K722Q6K483j379l600
3829B4817J066K734j647K771L045l77k768l62k81l30K949J143J221j206j577J448
3813C2646M42j88k642m411j221L860R51J2j479Q26P15R34p61p76j061P98J270
3796B9915R63j410M544J871j785j937k51l485P32K603L73j250j977J406j122J206
3780C0396L702L86l306j878J910M85k537O01j551M84L29J246K39j896O63l87k188
3763B6698p20P54N69J002j127j42k047J702L42J636M59l34k493L50J223L241k320
$$ y = [26088, 26075, 25896, 25877, 29607, 30341, 28717, 28362, 27132, 27215, 25803, 23534, 24818, 26784, 25997, 25807, 27267, 22703, 24208, 24910, 23781, 21568, 23213, 21452, 18304, 17568, 19002, 21138, 23087, 19265, 21041, 19175, 18269, 21182, 23056, 23034, 22685, 20938, 23412, 25644, 24892, 24388, 27432, 25111, 24505, 27227, 27313, 29796, 28417, 24817, 25883, 28617, 26970, 29741, 32786, 32409, 29641, 29279, 28998, 28668, 31617, 32760, 33981, 32775, 31198, 32646, 33088, 32900, 30258, 25847, 24626, 28486, 29437, 29449, 27970, 28796, 29511, 30445, 29684, 28908, 27847, 28645, 29915, 30878, 29468, 34012, 35883, 34098, 32161, 31910, 28425, 29157, 31760, 32133, 30883, 28906, 30312, 29190, 30396, 34098, 34484, 31178, 29300, 31210, 31695, 29158, 29759, 28208, 28692, 29021, 30267, 30506, 28610, 29273, 28886, 26698, 25978, 26732, 27301, 28303, 27176, 27034, 24987, 26689, 27031, 28667, 29126, 28792, 26299, 26649, 27872, 31113, 28793]
3746B8793L91J931k694k074K38L494Q03j545l196l549L057k084K149R41j294k24
3730B5137j188j193j369J244K568K788j810k752j370J120J327K33J430J157j888
3715B5434K178k576j195p29K029m21j324m5L3J450j497J518q64j461m394p8J384
3698A9442j044R93J112R72k155k127l69p4j052J231K289L412j836k592j953L368
3682A9617R14j748R55K976j101l264K85M35q97l416R81J638P5j581k931K346J193
3665A6477P83J530J9p67p62m43k826m23K616j099N64P91O04j225m160K671R7j760
3647A2687k28k87j261J154M60k308O82N94l985P31K155l8K961K39k373R88L11
3630A2482R42J586q12l341n48J227j831J94K07J597m11M53M13j643L510k187J613
$$ y = [28793, 29184, 31115, 28421, 26347, 26585, 30079, 30882, 29337, 26141, 22592, 25649, 23565, 25714, 26655, 25361, 25137, 23949, 22756, 21387, 22631, 25199, 27987, 26177, 23425, 22055, 23175, 24502, 24735, 26165, 27322, 25434, 27612, 25036, 23841, 23112, 25141, 24720, 23396, 23351, 23384, 24834, 23337, 24855, 23991, 22530, 18136, 18058, 19442, 18398, 19391, 20503, 21475, 19320, 17193, 16824, 16750, 15698, 16929, 19218, 22630, 20794, 18202, 16249, 19617, 20531, 18783, 19738, 22714, 21613, 18349, 18634, 19069, 18172, 14756, 15737, 17375, 17450, 15869, 12938, 15284, 16477, 17260, 18790, 18809, 18042, 17280, 16837, 14011, 13588, 16204, 15105, 15669, 16460, 17064, 15839, 11679, 14350, 14447, 12687, 12459, 12172, 10911, 12065, 12525, 10217, 10899, 11493, 7508, 8239, 10394, 10356, 13317, 13556, 11183, 12171, 12482, 13424, 15010, 14198, 10857, 10309, 11536, 9705, 9899, 10106, 11703, 11292, 11745, 12158, 10515, 14025, 11838, 13451]
3613A3451p1l424O01K333P92l461j115M73L437J231r41K708l34p493L913M22j398
3596A1124K609k12r92n46r12L036r24j027K198j808O9j222j785J745l778L312
3580A0887Q50j283q24J61j9L04J503J124k166L552j679k863J539R5j48q45J962
3563A2150m35k980m92K184J200l176K292K2l297j532j251J680L008J068J048l62
3547A1127l340K648J174k36j051k015J319J22m197m336K630M797r2L759k461J759
3531A1607j404p65j463J100j769K24L167O94n522K387J074K39j070O59Q43j846
3515H155l09j53L68k002j283J327L346j871k524M73J580J023k728K223L338j592
3499I371k804o94k64J239J925n95l156j249K32L90k384o14J794J753J739j737
$$ y = [13451, 13380, 9956, 10557, 12890, 13682, 10221, 9106, 9579, 13016, 14247, 13306, 16014, 15680, 8187, 12100, 12522, 11124, 13733, 13521, 12529, 11983, 11071, 14107, 13183, 12156, 14354, 12546, 12615, 11393, 9608, 11353, 7575, 10887, 11737, 10454, 9630, 9791, 9772, 10076, 11579, 12703, 10537, 14089, 12410, 9547, 11086, 11181, 11033, 10188, 12150, 11715, 8735, 8243, 10427, 11627, 8451, 10743, 10765, 7468, 5936, 4685, 6365, 9373, 10441, 11489, 11127, 7787, 10435, 11609, 11373, 10322, 8307, 9626, 9748, 5551, 1215, 3845, 8642, 8550, 12309, 9848, 11607, 10203, 9438, 7975, 9075, 7306, 7530, 10697, 11391, 5869, 8256, 9330, 9569, 8499, 9158, 10001, 8155, 7846, 7693, 8061, 6059, 4776, 6103, 9449, 7578, 5054, 5527, 7107, 8130, 5402, 7625, 10963, 9371, 6567, 5873, 5609, 6848, 8773, 8178, 5022, 3773, 4005, 4395, 2011, 1397, 3191, 4944, 6683, 4946]
3483D946k129K694K71J489qj761j503k437j17k92K017Q24J009q44k94j329J250
3466C786J015k563j853K153R80j25J03q34n94q44m73K008j408K501K099J006j579
3449E378k013j735K452j335k114K75M618j779J417j463j82n36J422O46j124n35
3433C392K410j32r02L484k085L57p0R93p60J775n75k886j825L084J536N39j772
3416F563j710l596m23j445k36L638L60j357R60J731j134p54J390J040l698r9M768
3399E998k20q46j169J323j854J824k827o63m82L387J611M59Q27P92m67m043L255
3382F905o23r57l41O43k299j214K162K944k11k574N28K186o23q41j301k036p48
3365A600j158K74K431Q06J435k635m36j367O99J466J958j236l263L591J08O20
$$ y = [4946, 2817, 5511, 5782, 7271, 7263, 5502, 3999, 1562, 1445, 1153, 3170, 3994, 5003, 4159, 3865, 2536, 3786, 4801, 2238, 385, 2538, 3518, 3393, 3496, 2662, 2068, 1224, 751, 2759, 1351, 3852, 5951, 6957, 5378, 3365, 1630, 4082, 2747, 633, 908, 5526, 3747, 5164, 3701, 3519, 2983, 4405, 5051, 3927, 3392, 5802, 5670, 4768, 8252, 6167, 6524, 6454, 7447, 6687, 8462, 7887, 5001, 3176, 6260, 7796, 8335, 6563, 4853, 1257, 834, -611, -847, 2791, 3151, 1794, 2754, 4485, 3351, 2597, 3987, 5027, 1329, 1230, 5998, 5778, 4932, 3763, 5086, 3232, 5056, 2229, 1566, 1084, 4471, 6082, 6541, 7368, 8160, 7693, 3650, 6905, 6282, 5325, 4984, 5627, 3328, 2114, 4276, 7220, 7009, 4435, 4963, 7149, 6526, 5685, 4384, 2348, 1600, 442, 716, 3147, 3953, 5388, 2753, 2317, 950, 1649, 3115, 5073, 3837, 574, 4165, 4273, 4893]
3349D893j643p03l6j731j766l068M436M146j6j962N37j618q62K062O85k974j903
3332a523L042N22j742M009k681k357J347k257K976o78k365M467K812j757r61Q50
3316C704J785j669m26k934P17M176j639j108r60l03K28m534K735K017m939j837
3300d987m52K930K308K878j171l094PJ557K736j113k577j035k54j835P3R74O53
3283b402m49J350K845j967J705r57j535J276J511j166o260Q51K341M67K403N54
3267E67k954j210l59j346K123J025J843j808j313J56j07l82L074K716l75k405
3251g55K049J07k028k615J163L251j244k432J755l97k5j378P08M240O18l985j411
3234b379L84k90J257k85M64j452K478j384K643q57j435J429N24j938K781k888
$$ y = [4893, 3250, 2547, 2511, 780, -986, -4054, 382, 4528, 4512, 2550, 3087, 1469, 607, 2669, 3354, 380, -1523, 1519, 2041, 299, 4308, 1627, -730, 617, -1640, 1336, 658, -1707, 2760, 5572, 3815, 2854, 3704, 5489, 3820, 3394, 460, 1177, 5353, 3714, 2606, 1646, 1343, 1571, -2963, -228, 1789, -3150, -4987, -5439, -2509, -201, 2677, 1506, -1588, -1581, -24, 2712, 1599, -978, -2013, -2267, -4102, -4029, -3055, -2402, -2851, -1501, 1344, -623, 1082, 125, -1410, -134, 1377, 211, -6049, -5198, -2857, -2390, 13, 567, -2387, -3597, -3956, -5302, -3179, -2154, -311, -2119, -3432, -3276, -3383, -3765, -691, 2025, 1650, -755, 1294, 1401, -627, -3242, -2079, 1172, -72, -2504, -749, -1146, -1171, -2549, -1841, 2399, 3017, -968, -2379, -1995, -2285, -1028, -1313, -849, -2301, 177, -1207, 1436, 579, -856, 573, 1097, -841, 1940, -948]
3218i48n2l303K021J624M67j676l245J836K044n27j944J271K288k694j206j110
3202e154P00K933K166j126J128J813j920j587Q29k797L52K517j721l845r80J122
3186e570J135j024J089k55M11J163J329P63k775K306M4R8k78j162J0k78j654K441
3168b207J544r44k593J180M28l42Q1Q70k353Q60K980r79l614K18K926J596l767
3151d116j22O12k33J821J038k228k977K738M889j231l071J598K218m363j133R52
3135c608M90n08J402J119R39J213p96j045M88r26R19k02N97j884n45k038O5K388
3117a932j344k25M5P48P39l51L615j223k547J35Q85J691O98n693j986M2J937k111
3099f877J224O65j648L391n85q84L670J072l473Q86O45n91j383J212k439J225
$$ y = [-948, -1000, -4303, -2282, -658, -191, -1867, -5112, -3276, -1232, -1759, -3703, -2432, -144, -2838, -4044, -5154, -4454, -1521, 645, -481, 647, 2460, 540, -1047, -218, -3015, -2663, -146, -1867, -5712, -6692, -5570, -4435, -5459, -4370, -4625, -4214, -3051, -1722, -959, -3734, -1428, -1384, -1286, -1564, -2726, -2716, -2994, -4648, -2207, -663, -1607, -4200, -3020, -2592, -2934, -2853, -1983, -4336, -3476, -496, -1475, -5089, -4871, -1945, -349, -4116, -4238, -3626, -3859, -2038, -1000, -3228, -6205, -3467, 1422, 191, -2880, -1282, 936, -3427, -4560, -3608, -3118, -3626, -2224, -1105, -166, 1047, 251, -794, -306, -1232, -313, -515, 82, -1802, -2347, -4385, -4320, -1932, -3276, -3501, -3456, -2708, -1969, -2320, 1295, 72, -2475, -2340, -1455, 236, 934, -4759, -6745, -6703, -4766, -6877, -5653, -4988, -6636, -3245, -3830, -4714, -1044, 28, -3445, -2559, -1914, -2505, -3888, -2676, -5115, -3890]
3083c890J482K49M70J783j656k879m0L799j228j046J439r40l742J123j414p52
3067g242K832M637O99k952j145N68P58j992M31j169j210K505L466J448l906K219
3051e3j178r65R34k994l127J483L769R82q25l190M12R67k250m89K983J424k707
3034d824k107Q43L942R90l283O51m99p71q2J041j616R3P57Q32K209L365n48l016
3016b023JK179j916j236j492l14Q84j349p7J820q63J300K021m101j600J897K822
2999b047o62M04L091M30k697k19j73j5j846q10J45K357j867r43m9Nj007M88n15
2980e930J671j552j778J759J230J025k73j261K232J350j459J04o22o30j202J576
2964c760j430k625K249r66j850K258J798Q68r17o66L01J652N97K357L22m720k321
$$ y = [-3890, -2408, -2159, -1689, 94, -1562, -4441, -4481, -682, -1910, -2956, -1517, -2457, -6199, -5076, -6490, -7242, -4410, 227, 926, -2026, -3171, -2603, -1845, -3837, -3406, -4575, -5785, -3280, 186, 1634, -2272, -53, -1231, -2196, -1262, -4256, -7383, -5900, -2131, -1149, -1974, -5164, -4752, -3785, -6035, -6524, -3541, -2117, -4824, -6931, -6088, -2146, -1156, -4439, -3788, -4287, -5058, -5140, -4099, -5715, -5622, -4865, -4033, -1824, 1541, 993, -2023, -2022, 157, -1759, -2995, -4487, -4801, -3917, -5266, -5343, -3523, -4386, -3086, -1065, -5166, -6766, -4869, -2047, -2709, -2305, 786, 1216, -1481, -1700, -1873, -1888, -3734, -4544, -4399, -2042, -3909, -4852, -4901, -4896, -5903, -5415, -5930, -4259, -5811, -7589, -5830, -4600, -3575, -3848, -5109, -2877, -1527, -2986, -2882, -3504, -4134, -5336, -3760, -5190, -7815, -5566, -6532, -8382, -6124, -4326, -3458, -4375, -5041, -4740, -3088, -2491, -134, 188, -4532, -6853]
2947f853J435L301m143K0O03k122J527J62R92j333n78L127l362j399J177j973
2931i419K678L957k304j861L236k500K404L272l307k425J044K010K042j966k124
2916e263j714J362N14j835R29L1O13p00n75O66J68M874J32j005P3J445K77k922
2898b930K2J156j343J097R28o61o75q36K248P32j731m815m88J874M88j489O81
2881e742k80l016N773m683M86L398K97K94k006l51O04P76r28o94L903J010j003
2864b162p45J67l453Q44L654j710l807L258N40J40K00O07K34j700M89p3l63j701
2846e581M69o71q78J256q9M085k37l404J316N18J727l108K614q15k967k25L830
2829b160Q66j621K383N4j749k8K24M53p99J91j753J433K060j196j282N47n83o40
$$ y = [-6853, -5418, -2117, -6260, -6240, -5637, -7759, -6232, -6070, -5078, -6411, -6989, -3862, -7224, -8623, -7446, -9419, -6741, -2784, -5088, -6949, -3713, -6213, -3809, -537, -3844, -6269, -5225, -3215, -1173, -3139, -5263, -6977, -5615, -5101, -6936, -6007, -5976, -5363, -6063, -6638, -5972, -5804, -930, -798, -1803, -1730, -285, -8, -2930, -2908, -1752, -3095, -1998, -1070, -1731, -2406, -3242, -994, -262, -1993, -6808, -7296, -5422, -4934, -6423, -5742, -6022, -9038, -3265, -7948, -7462, -4064, -3767, -3473, -5479, -5830, -5226, -4450, -5378, -6072, -2169, -1159, -2162, -2907, -2740, -6193, -5349, -1695, -3405, -7212, -3954, -3414, -3274, -3074, -2467, -2233, -3933, -3444, -3517, -3880, -5581, -5112, -5783, -6661, -5405, -5494, -1409, -1646, -5050, -3734, -3216, -1489, -4597, -1983, -2798, -5765, -5990, -2160, -1294, -2915, -532, -478, -2227, -2255, -2031, -1578, -2377, -2186, -3939, -2506, -446, -1642, -2924, -2377, -2960, -3600]
2811c600J371r40J297l68k74k138j857K311N11o21J455R63K08k333k223q85O60
2794f463K484j349m94l53K384J412l328k207N79R44K052R11N471j617l994J27
2778c441p58j096N076j224L80K61j042l287L46J279J066j399j66J931j016r01
2762c991l275K359L310j939j035k446K618J432Q15k431J31L99j837K165L4L97
2746c294O5j326k77J316o1p31R79N00o63p23p36M38j446J9J088J249j917n84L130
2727b974J177j225j049j425L204o70J265l215k909J329N587M12J320k487l042
2712d702q21J771J341l50O7j236j879J993Q29j776J374o77Q37j541j992J452K858
2695b452P54k697q80j47K011N33j799L52l201k237J096J242p41P15M08m63J620
$$ y = [-3600, -2229, -3169, -1872, -2240, -2514, -4652, -6509, -4198, -3687, -4308, -2853, -1890, -1682, -4015, -6238, -7123, -6463, -3979, -5328, -5822, -6175, -3791, -2379, -5707, -7914, -7335, -6391, -4339, -3428, 2043, 426, -3568, -3441, -4199, -5295, -219, -1443, -1063, -802, -1844, -5131, -4785, -3506, -2440, -3839, -4005, -2074, -3090, -3991, -7266, -4907, -1597, -3536, -4571, -7017, -4399, -2967, -2152, -4583, -4452, -4053, -5890, -3725, -3691, -3294, -3229, -4555, -4832, -3516, -3577, -4308, -3329, -2829, -3492, -4215, -4951, -4513, -5959, -5940, -4852, -3603, -5520, -6104, -2974, -1797, -3022, -4071, -5496, -2292, -2962, -1697, -4912, -7821, -6492, -905, -493, 827, -1660, -4702, -5523, -3752, -2411, -2761, -2694, -3930, -5809, -3816, -2987, -4763, -3389, -4066, -3229, -4770, -6762, -5310, -2452, -1698, -4395, -5275, -5422, -3411, -2878, -4677, -4325, -7526, -9763, -8667, -7425, -8166, -7451, -7043, -7506, -5886]
2678e886L170L474k365j692j75J749O17q22O63k085k371O32r30J067M30K906J542
2661g6K41j187j351j136k452J374J096N94n62K52j444k028M47J266O31R94J50
2644c191j561m54M947j150p31o75j872K131l70M37p63J538p37J05k821M34J439
2627c294J665o78j509n58l048J920n08J606J863p9o9l63L649j923k773J686o95
2610c108r73J064j895j726K145M382l1n138q75J876J012k399L412j943L176o4
2594a085m165J254K443L79J98j124k268n78J298Q55j38k297q80N44k20o97K668
2577c813Q13l16M03J004j966K126J023j793J75n07L236j797j889n63k492l057
2561i413K352K622o10m82j8O12J948j845Q49J323j652k236L518k83k326J715l9
$$ y = [-5886, -2716, 758, -1607, -3299, -3474, -1725, -1108, -1930, -1267, -3352, -5723, -5091, -6021, -4954, -4524, -1618, -76, 165, -1022, -2373, -3509, -5961, -4587, -3491, -2897, -3459, -3207, -4651, -6679, -6232, -4966, -4335, -3341, -3191, -4752, -5206, -259, -1409, -2140, -2815, -4687, -2556, -2926, -2489, -3252, -1714, -2451, -2346, -5167, -4733, -3294, -1629, -2307, -3816, -4374, -7422, -5502, -6010, -4404, -2541, -2620, -2689, -3052, 597, -1326, -4099, -2413, -3108, -4081, -3017, -4912, -6638, -4493, -111, -142, -5280, -6155, -4279, -3267, -5666, -2254, -4197, -1021, -1085, -5250, -3996, -1553, -1174, -976, -2100, -4368, -4946, -3648, -2793, -2931, -5228, -6108, -5564, -5784, -6481, -3813, -3000, -3316, -2913, -1909, -3875, -1749, -726, -2519, -2344, -2851, 385, -1412, -3301, -3864, -6356, -9413, -7061, -4439, -5049, -5531, -5549, -4937, -2989, -4834, -3985, -2662, -4314, -6550, -3032, -3315, -5641, -3926, -3965]
2544c965j187m61J032J323j096j036J081j186p92J833n06K875j495m324J800J92
2528e912j666n05p7L045J61k307K095j081P00k211p07J698J056K406J743j132
2512b694M77r44J15k898J177J065N54k575r48L691J109k33j569P18J263o34K3
2495b303k346q44J555k199J560m7k695J058N76K981j89r71k033M54K801j123J098
2478b667Q01R84J493j417r28M83K579K10l285M17j775r20m73K323n86K444J55
2461a62q52j266k19j93j288P71K027n55k61j125j119j236Q77m68K549L37k134
2444d317R01k31L02J5J907j070p66j143K738L57j939J385r0l488J805K711k830
2427c753q68K323r08m02P71N73o70j010K79K438J467l815M97k91R15o65j175K979
$$ y = [-3965, -5152, -5613, -4581, -3258, -4354, -5390, -4309, -5495, -6287, -4454, -4960, -2085, -3580, -7904, -6104, -5912, -7578, -8083, -8160, -5115, -4954, -7261, -5166, -6247, -5547, -7758, -8465, -6767, -5711, -3305, -1562, -2694, -2217, -3161, -3046, -5944, -4767, -3702, -3148, -5723, -6671, -2980, -1871, -2104, -3673, -2955, -1692, -2326, -2303, -4649, -5493, -3938, -6137, -4577, -4624, -7319, -6261, -5685, -2704, -2893, -3864, -5897, -5443, -2642, -3765, -2667, -1866, -882, 611, -806, -1734, -1251, 1328, 1538, -1747, -1330, -3105, -4025, -4498, -2175, -2761, -317, -162, -1014, -2280, -2499, -2692, -3980, -3209, -1182, -1737, -1998, -3123, -4242, -5478, -4601, -5069, -2520, -2183, -4317, -3416, -3647, -3345, -3330, -1423, -2493, -3259, -4402, -1664, -1307, -3246, -1861, -1951, -5439, -3634, -923, -3753, -4621, -2298, -3206, -3608, -2837, -2264, -2934, -3944, -3665, -1227, 240, -3575, -3078, -3369, -2454, -3119, -4294, -1315]
2409a315m6j670J044j235j08J042J289k351K958J953j586j495J106j106J654k335
2393b201j8l298j374m83R09L456k990J439n89K668k330J512p04j247K922J061
2377a267m24j483k338M3M311n8n61k46j365o93M471J43k430L86k864J078j2P72
2359b537k46j107K079J780n6Q95l773K249l47L43j407R48p51k234K451j070k49
2342c032j218L516r39j203J879k381N47P21o09j108k642K04K172J19K507J250
2326b17J968m338l932L151K023M228l538j044J014k591j41j990n21P35J615K806
2310g72M37k377R89K668k879k198p86J400J455j685J769k84j323p53K028n19J909
2293i21j471L84j677p96j71l801L726J674j544j126L868p08j460l02p4L40K625
$$ y = [-1315, -1361, -3031, -1987, -3222, -3330, -2288, -999, -3350, -392, 1561, -25, -1520, -414, -1520, 134, -2201, -2219, -5517, -6891, -7374, -6465, -3009, -5999, -4560, -5149, -2481, -4811, -3299, -4003, -5250, -2328, -1267, -1691, -3174, -5512, -5469, -1158, -1216, -1777, -2023, -3388, -4081, 390, 533, -1897, -1511, -4375, -3297, -3309, -2537, -2783, -3890, -1811, -31, -87, 808, -2965, -716, -1063, -720, -2127, -1179, -1930, -4164, -1713, -2783, -3032, -4250, -734, -1673, -2876, -997, -3378, -2831, -2110, -2719, -3827, -6469, -6265, -4093, -3974, -1467, -217, 1751, -2587, -6519, -3368, -1345, 2883, -655, -1699, -685, -3276, -3417, -5407, -5928, -5193, -3578, -772, -335, -2712, -1723, 945, -1934, -4132, -4918, -3518, -2063, -3748, -1979, -2263, -3586, -4339, -2311, -2830, -921, -2392, -2008, -3685, -4481, -4652, -8453, -4727, -3053, -4597, -5723, -1855, -2563, -4023, -4325, -4399, -4059, -1434]
2276a434K17l203J684O52p21K628Q58k683l265J760J775l159k270j4M290l947
2260f832J958K192j139N05m73J015N51j927Q79p75M71J699m46Q66j741J587K584
2243I74j310k245J969k919k014R92J084J239n06j78K335l442j038k1J945j770
2227d905j690M615R28k149J384N53k086r15J543k751L18J054J003K046L4L485
2211B467k508l846o69M71p2O22m12q88j540L362P3K40L509j839P50j963j282l823
2193g348K812J026J069L841k015N98n72o69k020j46K600o60r24k325M247J889
2177A403j936k155Q96j416k822J919J388R65M18j593m56N06L38R10j840l3L04
2160c204k746R79j768K249J443R82j008R06P47k898o52n01L63N191J761n300j28
$$ y = [-1434, -1217, -4420, -2736, -2084, -2805, -177, 681, -2002, -5267, -3507, -1732, -4891, -7161, -7175, -2885, -6832, -4874, -2682, -3821, -3316, -3789, -2774, -2223, -4150, -3271, -4046, -3575, -1876, -2322, -1456, -3197, -1610, 974, -336, -2581, -612, -3531, -5545, -4553, -3469, -2230, -2736, -2914, -579, -4021, -5059, -5080, -3135, -4905, -6595, -1980, -1052, -3201, -1817, -1264, -3350, -4265, -2722, -5473, -5155, -4101, -3098, -1052, -1018, 2467, -41, -3887, -4556, -4085, -4157, -3535, -3947, -4835, -6375, -3013, -2940, -2700, 809, -1030, -280, -2243, -3525, -7348, -4536, -3510, -2441, 1400, -615, -17, -589, -1258, -3278, -3424, -824, -1484, -2408, -4733, -486, 1403, -533, -2688, -1792, -3208, -6030, -4111, -2723, -1758, -1340, -2933, -3389, -2883, -2545, -1635, -3475, -3508, -3204, -5950, -4971, -6739, -4490, -3047, -2065, -3073, -2167, -1420, -4318, -4970, -5471, -5108, 83, 1844, -3456, -3584]
2143c584j105J541J171J463j580l127M971N30k536m73J61J421l162j176l95K360
2127c520M08J274j042k596k066M583P67k737j238K286L251n96J762j787l739P38
2111d252K214k152k679J985k459L478M61K532J322j325L31O2j466j441p7J457
2095b009O27j01k7K68L65j415R35j102J711J562j308j935j454L171j684J196K373
2078A173r30L92q47R69l338k15k12J715K682r06k806Q77L224m20m98j783k767
2061c690j410J638M81P85J324R13R98n02j477o07J157R24L8n41p41K75q61k011
2043c307j166j969K042k0M021J553l631K5J242r52k15M8j915M76O506L1l335l86
2025i52m00J783m03l04P79J510j863K94j115J399j565j859K056M52p4l08P8k311
$$ y = [-3584, -4689, -3148, -1977, -514, -2094, -5221, -250, 280, -2256, -2729, -2568, -1147, -4309, -5485, -5880, -3520, -3112, -1838, -2880, -5476, -7542, -2959, -2192, -4929, -6167, -3881, -630, -1226, 536, -1251, -4990, -4252, -2038, -4190, -6869, -4884, -7343, -3865, -3404, -872, 450, -875, -544, -482, -1948, -3389, -3466, -2009, -1382, -1483, -1510, -1242, -877, -2292, -1357, -2459, -748, 814, -494, -2429, -3883, -712, -2396, -1200, 1173, 243, 635, -212, 757, -2581, -2796, -3008, -1293, 1389, 483, -2323, -1446, 1778, 1358, 860, -923, -3690, -5100, -3462, -2981, -2196, -872, 41, 1039, 537, -940, -1547, -390, 534, 572, 31, -710, -435, -1296, -3307, -4473, -6442, -4400, -4420, -399, 1154, -2477, -2452, -1210, -2162, -2377, -2329, -4244, -3768, 2738, 2769, -566, -952, -1352, 431, 28, -276, 503, 2013, 150, 444, -671, 728, -837, -2696, -640, -188, -262, -570, -492, -2803]
2007b803j058L799m16j405J151k331j11M460K56j137J158M95j32k293q11k642
1991c820L362J713P77R00l94j076j439L78j235q55j97J303j054J402J23l695J45
1974c662K56K860N94j40o78L42k819N35K070p69j05K2J680N32j785J114j835q15
1956b603L27J131J032Q73k091p12j49l81J617K036m86j913J4l79k926J074J822
1939a714r78Q76l46O46J157r92J226j972j359J945o04J133J594J524NJ06j363
1922H84k08r36r30q67J520k738P30K220K861j591l230k322j160K132p53K99L82
1905c707J045K555j390l10K826K673j080n51j245P43M52k560k446r80j907K914
1889b968N93k49J758J843j130j299r66O72L305k963M70j561K47J288P77Q7K279
$$ y = [-2803, -3861, -62, -478, -1883, -732, -3063, -3174, 1286, 1542, 405, 1563, 2058, 1926, -367, -1178, -3820, -458, 1255, 2032, 2932, 2538, 1462, 23, 401, -834, -1689, -1886, -583, -1637, -235, -112, -3807, -3662, -3406, -546, 48, -92, -770, -428, -3247, -2712, -642, -1411, -1516, -1494, 186, 718, -1067, 47, -1788, -2603, -2276, -1145, -113, 760, -1331, -2043, -2192, -2573, -956, 1080, 594, -1319, -1305, -1684, -4610, -3536, -1714, -2692, -1816, -2162, -1516, -359, -1351, -125, -2097, -3456, -1511, -2115, -982, 612, 2136, 2141, 2247, 884, 676, -260, -1190, -2057, -537, -3275, -2545, -325, 2536, 945, -2285, -4607, -5767, -3635, -4388, -4089, -3707, -2662, -107, -1497, -1807, 1019, 3692, 2612, 2061, 816, 1559, 2011, -549, -2995, -3975, -5882, -2968, -2375, -2624, -866, 977, -153, -1452, -2418, -1746, 1559, -1404, -934, -2495, -2248, -960, -183, -96, 2183]
1872B183r34k033k29K627j256k553r16N30J322n86l61j348q54L501N37N51K962
1855C143Qq10J14K138k86J422l735o59j330n55j228j756J006J849P70n44k46J354
1837F55j31N5R12L97l292R4J954n22j176M82N95r1q64l855Q60L641O18K30J408
1818A970l429N00J113k324r28J205J952n30j054M60L10K39qr6K373q52j996N07
1800e88m0R92L53j428j788j68J651K640J691M48j318J17K65Q15j623k47K522P10
1782E004j225m68j232j664J295J731R75j729r32l067p6J877j987j703L80L591
1766G70K010o19j49k224J357R28J185j27j557K888M325j319l489m800r76Q39O349
1749E391K028n616n77k084j873l324j259k531M45J482L050K973K711J781j673
$$ y = [2183, 1249, -784, -1013, 1614, 358, -2195, -3111, -2581, -1259, -1845, -2206, -3554, -4408, -907, -370, 181, 3143, 3151, 2341, 2455, 4593, 4307, 5729, 1994, 1335, 5, -550, -1778, -3534, -2528, -679, 91, -453, -699, 655, 524, 579, 1491, 1888, -1404, -1310, 644, 122, -1054, -572, 23, -68, -932, -4787, -3927, -286, 332, 562, 1970, -1459, -959, 154, -2170, -3098, -1893, 59, -471, -1525, -1065, -755, -516, -524, -620, 1753, 901, -1095, -588, -628, 364, 717, -711, -2499, -2667, -1016, 1624, 3315, 3763, 2445, 2562, 2827, 3642, 2019, 1772, 4294, 5004, 3779, 3311, 2079, 415, 1710, 3441, 4416, 2687, 1755, -1312, -1388, 489, -1498, -3201, -2821, 770, 2780, 2161, 2012, -212, 1145, 2073, 3258, 3131, 1574, 4462, 8787, 7468, 3979, -821, -1797, -958, 5391, 7419, 1803, 1226, -858, -2731, -6055, -7314, -9845, -9400, -7918, -4868, -1895, 816, 2597, 924]
1734I24k781J676J484M134l713l333K665M379r46m104k658J795q10N9j027k220
1718d476J244j47L3p36n50M85q28K372L36j079K036K097N63k140j512K899J140
1701A737k050j665j327j840L309K998l068M27J300j761J987j88j877J618R3K645
1685B338K37m449J239L195l996L233j372l744k53n9K281P97k731K478M77K78K96
1668B45p95J014j503J807k2k211K396J65M10K79k625j681K68k63L97M43J052k131
1650b755J446K01l90N45N05J21R57M33K56K131m13k250k789J936K979j819j817
1633g23J61n09j093p18J844j040m1K914N71k04j207q47k757k257J985k79l467
1616g667K376M960R20m15j298k400p28K490l60j485J417j565j88k16M526J327
$$ y = [924, -1857, -181, 1303, 5437, 1724, -1609, 1056, 5435, 4489, 385, -2273, -478, -1288, -1229, -2256, -4476, -3232, -3379, -3346, -4082, -4632, -4147, -4975, -2603, -2267, -3346, -1310, 787, 1350, -790, -2302, 597, 1737, -313, -1978, -3305, -5145, -1836, 1162, -1906, -1479, -179, -1940, 47, -141, -2018, -400, -307, 2338, 2575, -1874, -635, 2560, -1436, 1797, 425, -3319, -3572, -3631, -1350, -553, -3284, -806, -329, -51, 245, -550, 464, -1039, 768, 746, -1465, 931, 1096, 1506, 1785, -840, -2521, -2253, -2516, -2119, -1676, -624, -2755, -1309, -1108, -1498, -953, -448, -327, 630, 1063, 1319, 3450, 3037, 787, -2002, -66, 2913, 1094, -723, -562, -1071, -2164, -2882, -1038, -2078, -2119, 795, 1366, 1162, -45, -892, -3649, -5906, -3921, -4200, -7667, -5291, -331, 589, 174, -1124, -3524, -4252, -1762, -2122, -3607, -2190, -3755, -3943, -4159, 367, 1694]
1600A694m517Q27J134R22M30K16k08N62k92j025J464J47l27J41j326p42K238m034
1582b696p19N91j966Q53R53M188L41j429J280j110Kk392J473P68n9j059l72L142
1564A789j56m91L79N1q32n88n516M240K305n00J597j463K55j98j02J397l015j467
1546b315q82j268O28j8J101L219J581j72k802O55q88k026L93o2K586M53L02j564
1528a079L36j61j943L385R96L318j930l437M034j498k851l343P88K323J365L65
1512F68N23K336l826l13j220j321J424M35K591K00l513K438J128M77q72J485j474
1495A166k20j2J007j174j571J431j128j345K301J07j526M648K32l653J58j990
1479a569N58J171q50K869j654j958n42K124o56j526R71M71M56J015p93R70L480
$$ y = [1694, -2823, -1996, -862, 60, 490, 706, 498, 1060, 768, -257, 1207, 1354, 1027, 1168, -158, -900, 1338, -2696, -3415, -2824, -4790, -3937, -2984, 1204, 1545, 116, 1396, 286, 288, -2104, -631, 137, 78, -981, -1353, 1789, 1633, 1142, 1521, 1572, 740, 152, -5364, -1124, 1181, 681, 2278, 815, 1070, 872, 770, 2167, -848, -2315, -3197, -4465, -3837, -3855, -2754, 465, 2046, 1874, -928, -273, -1161, -3187, -2794, -2856, -270, 183, 485, -1079, -743, -904, -2847, 538, 1534, 4852, 2922, -515, 3519, 2021, -830, -4173, -3385, -1062, 303, 668, 1191, 3527, -299, -612, -1832, -3153, -1729, -1294, 1297, 1497, -2016, 422, 1550, 2027, 1155, 2640, 1166, 946, 934, 1941, 767, -804, 627, -501, -1846, 455, 562, -964, 3684, 3916, 263, 421, -1569, -1011, 160, -690, 2179, 525, -1433, -1975, 149, -507, -2033, -1062, -591, -135, 880, 87, 1057, 4537]
1462D537j641q05j54p10P59M00j401j801J318J67L63p0J352j064k671j429k66
1445c116P21q48J993J616L565j526k769RK664l138M25j62j358L060j580J265j236
1428d15J962J634n5k830P20k491K034k019J350M94K104j608O85o44Q7K76j78j270
1410a64q74L446k5k939j400J45m46R6L51J567r39p36K281J340j914L864k616r98
1392C9J587J287k89J880K010k630k752J778J451Q64k793l13j364J40K933k970
1376H58L267j715N8j510l132K181L765n77l013r5j042n00K664J290j996J647p62
1359A388l505j443M598k37l76l372K466J651j628L659k30j198j015Q61k646q9
1343a116L53J150j479l4l15j139K955n26j91J237m20k50l061j228L394J853P87
$$ y = [4537, 2896, 2091, 1937, 1227, 1986, 2386, 985, -816, 502, 669, 1032, 962, 2314, 1250, -1421, -2850, -3116, -2395, -3243, -1250, 366, 3931, 2405, -364, -355, 2309, -829, -404, -566, -1924, 1136, -444, 821, -415, 1547, 3181, 3126, 296, 1016, -1475, 559, -1460, -110, 384, 2488, 880, 1565, 921, 1008, 1284, 1106, -164, -1038, 2408, 2383, -556, -1956, -1811, -2257, -2161, -1810, -243, -1182, -1918, 363, 1703, -211, 3653, 1037, 39, 1626, 2913, 2624, 4504, 6514, 3884, 1132, 2910, 4361, 5225, 2432, 2119, 755, 895, 3828, 858, 4125, 2410, 2468, 958, -2174, 7, 3772, 3195, 182, 87, -955, -1455, 1209, 2499, 503, 2150, 1388, -2117, -3560, 1038, 801, 425, -2947, -481, 1170, -458, 3201, 2971, 1773, 758, 1619, -1027, -1116, -763, 387, -1092, -1126, -1441, -2580, 375, -151, -342, 895, 475, 225, -2836, -4064, -670, 1183, 1970]
1326A970l04o21j50L403k068M66k406l82K847L35q75m19J022q91k62j655J012
1309A022k92j677LJ981j467N39j543k19K263k115J383O59K107P01k479m2J576
1292B400J06O77p95l027l50J246L404k37l295q89j64J091j727K216m51k67J45
1275H3k807K797K993k02j64O72j119m191N5N56J66j300K281j74q50M05K390L86
1257A977l233j708j383M834j60n95K633j059J208p84l487M68L041J491r77j423
1241H43M44k084j148K231K16m84L50J299J103j358J01l9J75L685Q97J681k468
1224E444l75o1k208L97J851k146n26J021K516j539k003O20l38j492O33K649l006
1207A437J343J512K509l903k116K827k376j6K055o74k109J00M94O02K269J215
$$ y = [1970, 1666, 1045, 895, 4298, 2230, 2696, 290, -92, 2755, 3090, 2215, 1796, 2818, 1927, 1665, 10, 1022, 730, -947, -944, 1037, -430, 109, -1434, -1653, 610, -1505, -122, 537, 2644, 3345, 866, 824, 2400, 2506, 3183, 2388, -639, -989, 257, 3661, 3424, 129, -760, -924, 167, -1560, 656, 205, -62, 83, -2724, 73, 3066, 2864, 2700, 3372, 2253, -1938, -1883, -1327, -1161, -2461, -180, -354, -1204, -799, 1591, 1977, -1256, -2964, -4347, 487, 327, -268, 2365, 1306, 2514, 1730, -1757, -1289, 1752, 3243, 2266, 843, 1287, -797, -1945, 286, 502, 18, 368, 1667, 2770, 1412, 1513, 1474, 1649, 5334, 6231, 7912, 5444, 5069, 5008, 2800, 3197, 5048, 2902, 2376, 3397, 5913, 4374, 2371, 2991, 2653, 1161, 1794, 4443, 1437, 2780, 4292, 6801, 2898, 782, 3609, 1233, 1217, 3272, 2598, 489, 589, 1083, 1685, 3954, 5169]
1191E169m592K218l178p24K054J615J714J49l254M02K493R03k88J092j601m283
1175a11r46J181J068m57l466q06K507j85o19L187k44q48L74j293J807M59j778
1158a70R51J136J25L11k056l17O37j847j934L276k31n60J244J876k939N12J762
1141A776J914l833p9j738m048J250J340n43J332J806K07M11J036J406m326k243
1125d332M450J626P01j179K062K248m575j666K128k15r28l37L517J395j789J911
1109E017j673k53j070j017P06j702k430M848J072N59m58K5j9m71k568J00L455
1092D121J41L96N80k846K467R58l109q81k290K36J191l32k942M022n77o63R61
1075A433n60j206n12K477J373j190J437m02r1j310q07J63Q10K262J217k375K77
$$ y = [5169, 577, 2795, -383, -1107, 947, 2562, 4276, 4425, 1171, 1573, 4066, 4969, 4681, 5773, 4172, -111, -1057, 124, 1192, 735, -2731, -3537, -1030, -1215, -1834, 1353, 1109, 261, 635, -658, 1149, 1608, -170, 781, 1917, 2042, 2353, 297, -20, 617, -1230, -3164, 112, -119, -679, 565, 2441, -498, 14, 1776, 3690, -143, -222, -1960, -6008, -4758, -3418, -3961, -2629, -823, -616, -205, 831, 2237, -2089, -4332, 118, 1744, 2445, 1266, 3328, 5576, 1001, -665, 1463, 1248, 320, -17, 3500, 4895, 3106, 5017, 3344, 3091, 2021, 1004, 1710, 8, -2422, 2426, 3498, 4057, 3599, 3624, 3605, 3134, 566, 666, 4121, 4262, 4658, 5238, 2392, 4859, 5817, 2708, 1827, -463, -227, 964, 632, -2310, 1712, 1135, 472, 1433, 873, -333, -845, 1632, 3005, 1815, 3252, 2850, 2759, 1449, 642, 805, 1615, 3877, 5094, 2719, 2996]
1058B996k503J377K693j293K761k161j775j89N83l038n1M46K22P55K041M28Q20
1041D112j024j063N11J087m017m26L36K142J041j986J511R38j985j556L72K749
1025B742L536k49J415l217j104m408L010J434l67n62R12k564LL68O49n4j361M99
1007F82r69K755J163k645L59K309k050j040o66K385L51K216m10k778r58j463K43
990e16L090k357J341O02j422K05P80J180o17j126j809O26L237n65R99l00l394
973d6J080j996j201j506K927J030o90K175l78L62q58q82j400k208J024J277K322
956A032K756j452r48j880J504k0l433l70K899K532Q3L50j205l432L067J266j493
939A256k98N4L70j286K47J722J547j126k692j346N49J619m65j193R35j023l676
$$ y = [2996, 493, 1870, 4563, 3270, 6031, 3870, 2095, 1906, 2489, -549, -600, -154, 68, 823, 2864, 3292, 4112, 3088, 2025, 2536, 3623, -394, -820, -484, 1658, 2699, 713, 2224, 3162, 1177, -379, -7, 2742, 6278, 6029, 7444, 4227, 3123, -1285, 1725, 3159, 2792, 2230, 3142, 578, 581, 949, 1598, 1544, 183, 682, -287, 2468, 3631, 986, 1345, 3654, 1604, 564, -102, 2283, 2634, 4850, 4440, 1662, 704, -759, -516, 2574, 217, 1558, 2160, 738, 943, 1723, 2903, 2286, 1160, -649, -23, 3214, 2649, 3648, 3348, -46, 1034, -962, -2163, -3669, -742, 288, -402, 1773, 1395, 1757, 899, 17, -1383, -3591, -2567, -1290, 1032, 3788, 2336, 1388, -492, 1012, 992, -2441, -2811, 88, 2620, 2703, 3053, 1848, -1584, 1483, 2749, 1256, 958, 1012, 1382, 96, 343, 2065, 3612, 2486, -206, -1552, -1003, 616, 151, -1042, -107, -1130, -4806]
922d806J390K229M90J495j31j523R21L38k093K210L176J258j472j445K098j253
906B882N93L86k282K71J019k642J145J842j667r87P97J528q18rj507L74L50J491
888B766n78J225j281J02K033k761k538j010N3P59L00J269k913K191N321o14j362
871B962k431N21K528j201m634L985N59q05K913j364m23j643M5R32p63J126K575
854D882k884j350K099N56k79k087j023L023j56N06p44k85J326r13J297k734k587
837a353N55J942K043k51j104M38l94k521J26o49J159K064k727K854o11k013p83
820a225r51k46Q80K995M39j226P45M6j810J124n9n97K146o62k014k08J713K125
802C215j186O0Q49q90k215n00K934K143m46P33j398j604P38j271J149J199k324
$$ y = [-4806, -3416, -1187, -697, 798, 667, -856, 65, 403, -1690, 520, 3696, 4954, 3482, 2037, 4135, 2882, 3475, 3861, 1579, 1850, 2869, 227, 1372, 3214, 1547, 560, 1357, 2885, 2067, 2058, 551, 925, 1275, 2766, 2188, 3413, 2132, 2234, 4267, 1506, -1032, -2042, -1989, -1230, -930, 339, -2574, -383, 4938, 4324, 2962, 531, 1052, 3580, 2379, -2255, 1730, 2289, 1484, 4397, 3033, 2610, 967, 1012, 1944, 1181, 2307, 4882, 1998, 648, 2747, 3303, 3024, 937, -86, 2937, 2781, 3287, 2543, 2258, 3584, 2671, 3968, 1234, -1353, -798, 1144, 3187, 2936, 1832, 2270, 1876, -645, -519, -1168, -9, 2055, -672, 2182, 1571, -442, -1225, -2176, -2422, -1542, 1453, 1892, 666, 1411, 1457, -353, 771, 712, 115, 2261, 1599, -415, -623, 1090, 3215, 2029, 2089, 2938, 2048, -167, -667, 2267, 4410, 3964, 4697, 3299, 1695, 2433, 1162, 2311, 3510, 1186]
785A186n86J498j00K164j554M36R36j16j350l98m87M53K262n58q50J294m67l23
767C440O48k272j956O68J474J17R40q29R27J64j657j585J430J608l41m6P25p29
749B726k063j211L604j900P30Q93j523l26J322q64K83j860j207L125J541k153
733A117M05k088J734o25n0J138j649j90R44K3j81o94K131N261l075l383m50L22
715F90n43O14j105j060o85J206J206J472k53J789j018O25K46l34J490k40k429
698A671K058J924q18j752l841J19K3J469K130n303K913r76j308L980o48j306J810
681B145M51K15l18K6J442j443j571j211Q22O60K403J235j735j814K885R0l097
$$ y = [1186, 600, 2098, 1998, 4162, 2608, 3044, 3980, 3864, 2514, 2116, 1629, 2082, 4344, 3786, 2936, 4230, 3763, 3440, 4088, 1816, -140, 528, 2002, 2119, 3059, 2230, 3157, 3321, 1664, 79, 1509, 3117, 2776, 2730, 3455, 2726, 663, -548, 3056, 1156, 1886, 2779, 1256, 930, 2252, 1388, 1671, -189, -1396, 1729, 3270, 1117, 1522, -566, 1168, 543, 493, 1631, -18, -208, 736, 759, 578, -116, 2015, 7276, 4201, 818, 368, 690, 147, 761, -344, -1404, -2089, -883, 323, 1795, 1542, 3331, 2313, 2938, 3184, 2850, 4340, 4100, 1671, 3729, 5653, 4835, 3083, -758, -639, -616, 853, 2983, -2320, 593, -383, -1691, 2289, 1641, 335, 2145, 2596, 2811, 2493, 2519, 3961, 2518, 947, -264, 558, 1218, 3621, 4856, 3121, 1307, 4192, 4282, 1185]
$$ [...]
##END NTUPLES=NMR SPECTRUM
##END=
