##TITLE=1H_CA-9261-2
 DMSO
 8 sc, 
 9.4.2024
##JCAMPDX= 6.0         $$ Bruker NMR JCAMP-DX V2.0
##DATA TYPE= NMR SPECTRUM
##DATA CLASS= NTUPLES
##ORIGIN= UXNMR, Bruker Analytische Messtechnik GmbH
##OWNER= root
$$ XWIN-NMR		Version 3.5
$$ Tue Apr  9 14:50:47 2024 Russian Standard Time (UT+4h)  she@DPX200
##.OBSERVE FREQUENCY= 200.1309
##.OBSERVE NUCLEUS= ^1H
##.ACQUISITION MODE= SIMULTANEOUS
##.ACQUISITION SCHEME= undefined
##.AVERAGES= 8
##.DIGITISER RES= 18
##SPECTROMETER/DATA SYSTEM= spect
##.PULSE SEQUENCE= zg30
##.SOLVENT NAME= CDCl3
##.SHIFT REFERENCE= (INTERNAL, CDCl3, 0, 15.6555)
##AUDIT TRAIL= $$ (NUMBER, WHEN, WHO, WHERE, WHAT)
$$ ##TITLE= Audit trail, XWIN-NMR		Version 3.5
$$ ##JCAMPDX= 5.01
$$ ##ORIGIN= Bruker BioSpin GmbH
$$ ##OWNER= she
$$ F:/spectra/data/she/nmr/H-F/1/pdata/1/auditp.txt
$$ ##AUDIT TRAIL=  $$ (NUMBER, WHEN, WHO, WHERE, WHAT)
(   1,<2024-04-09 14:49:52.03 +0400>,<she>,<DPX200>,
      <created by zg, POWCHK disabled, PULCHK disabled
       configuration hash MD5:
       00 E9 B6 7A A2 85 ED C7 34 08 36 98 17 FE 4E 26
       data hash MD5: 16K
       B1 46 F9 44 0D 55 52 F7 B0 43 4F 50 F2 24 58 F3>)
(   2,<2024-04-09 14:49:54.14 +0400>,<she>,<DPX200>,
      <Start of raw data processing
       efp BC_mod = 2 LB = 0.24 FT_mod = 6 PKNL = 1 PHC0 = -25383.4 PHC1 = 14.18731 SI = 16K 
       data hash MD5: 16K
       CA 2D E7 59 69 53 61 F3 59 7D 4A CC DC CD A8 9B>)
(   3,<2024-04-09 14:50:14.06 +0400>,<she>,<DPX200>,
      <pk PHC0 = -0.3368298 PHC1 = -0.2000001 
       data hash MD5: 16K
       DD 04 D4 F5 31 AF 38 B6 51 43 DF 56 27 5D AE 31>)
(   4,<2024-04-09 14:50:17.10 +0400>,<she>,<DPX200>,
      <abs ABSG = 5 
       data hash MD5: 16K
       DF 0E 55 FE 41 4E C7 F6 09 AB 9C F9 A5 1E 9C 82>)
$$ ##END=
$$ 
$$ hash MD5
$$ BA AB D2 B2 9A BE 6D CD 8E 25 3E 08 1D FE 58 31
##$RELAX= 
##$RELAX= 
##$RELAX= 
##$RELAX= 
##$RELAX= 
##$RELAX= 
$$ Bruker specific parameters
$$ --------------------------
##$DU= <F:/spectra>
##$EXPNO= 1
##$NAME= <H-F>
##$PROCNO= 1
##$TYPE= <nmr>
##$USER= <she>
##$AMP= (0..31)
100 100 100 100 100 100 100 100 100 100 100 100 100 100 100 100 100 100 
100 100 100 100 100 100 100 100 100 100 100 100 100 100 
##$AQSEQ= 0
##$AQ_mod= 1
##$AUNM= <au_zg>
##$AUTOPOS= <>
##$BF1= 200.13
##$BF2= 200.13
##$BF3= 200.13
##$BF4= 200.13
##$BF5= 200.13
##$BF6= 200.13
##$BF7= 200.13
##$BF8= 200.13
##$BYTORDA= 1
##$CFDGTYP= 0
##$CFRGTYP= 5
##$CHEMSTR= <none>
##$CNST= (0..31)
1 1 145 1 1 1 1 1 1 1 1 1 1 1 1 1 1 1 1 1 1 1 1 1 1 1 1 1 1 1 1 1 
##$CPDPRG= <>
##$CPDPRG1= <>
##$CPDPRG2= <>
##$CPDPRG3= <>
##$CPDPRG4= <mlev>
##$CPDPRG5= <mlev>
##$CPDPRG6= <mlev>
##$CPDPRG7= <mlev>
##$CPDPRG8= <mlev>
##$CPDPRGB= <>
##$CPDPRGT= <>
##$D= (0..31)
0 1.2 0 0 0 0 0 0 0 0.06 0 0.03 0 0 0 0 0.0002 0 0 0 0 0 0 0 0 0 0 0 0 
0 0 0 
##$DATE= 1712659791
##$DBL= (0..7)
120 120 120 120 120 120 120 120 
##$DBP= (0..7)
150 150 150 150 150 150 150 150 
##$DBP07= 0
##$DBPNAM0= <>
##$DBPNAM1= <>
##$DBPNAM2= <>
##$DBPNAM3= <>
##$DBPNAM4= <>
$$ [...]
##$SUBNAM3= <"">
##$SUBNAM4= <"">
##$SUBNAM5= <"">
##$SUBNAM6= <"">
##$SUBNAM7= <"">
##$SUBNAM8= <"">
##$SUBNAM9= <"">
##$SW= 18.0517689322627
##$SWIBOX= (0..15)
0 0 2 0 0 0 0 0 0 0 0 0 0 0 0 0 
##$SW_h= 3612.71676300578
##$TD= 16384
##$TD0= 1
##$TE= 0
##$TE2= 300
##$TE3= 300
##$TEG= 300
##$TL= (0..7)
0 120 120 120 120 120 120 120 
##$TP= (0..7)
150 150 150 150 150 150 150 150 
##$TP07= 0
##$TPNAME0= <>
##$TPNAME1= <>
##$TPNAME2= <>
##$TPNAME3= <>
##$TPNAME4= <>
##$TPNAME5= <>
##$TPNAME6= <>
##$TPNAME7= <>
##$TPOAL= (0..7)
0.5 0.5 0.5 0.5 0.5 0.5 0.5 0.5 
##$TPOFFS= (0..7)
0 0 0 0 0 0 0 0 
##$TUNHIN= 0
##$TUNHOUT= 0
##$TUNXOUT= 0
##$USERA1= <user>
##$USERA2= <user>
##$USERA3= <user>
##$USERA4= <user>
##$USERA5= <user>
##$V9= 5
##$VALIST= <valist>
##$VCLIST= <CCCCCCCCCCCCCCC>
##$VD= 0
##$VDLIST= <DDDDDDDDDDDDDDD>
##$VPLIST= <PPPPPPPPPPPPPPP>
##$VTLIST= <TTTTTTTTTTTTTTT>
##$WBST= 1024
##$WBSW= 4
##$XGAIN= (0..3)
0 0 0 0 
##$XL= 0
##$YL= 0
##$YMAX_a= 266972
##$YMIN_a= -291947
##$ZGOPTNS= <>
##$ZL1= 120
##$ZL2= 120
##$ZL3= 120
##$ZL4= 120
##$ABSF1= 15.65547
##$ABSF2= -2.39642
##$ABSG= 5
##$ABSL= 3
##$ALPHA= 0
##$AQORDER= 0
##$ASSFAC= 0
##$ASSFACI= 0
##$ASSFACX= 0
##$ASSWID= 0
##$AUNMP= <proc_1d>
##$AZFE= 0.1
##$AZFW= 0.1
##$BCFW= 0
##$BC_mod= 2
##$BYTORDP= 0
##$COROFFS= 0
##$CY= -3
##$DATMOD= 1
##$DC= 0
##$DFILT= <>
##$DTYPP= 0
##$F1P= 0
##$F2P= 0
##$FCOR= 1
##$FTSIZE= 16384
##$FT_mod= 6
##$GAMMA= 0
##$GB= 0
##$INTBC= 1
##$INTSCL= 3.70164e-10
##$ISEN= 128
##$LB= 0.24
##$LEV0= 0
##$LPBIN= 0
##$MAXI= 10000
##$MC2= 0
##$MEAN= 0
##$ME_mod= 0
##$MI= 1.114404
##$NCOEF= 0
##$NC_proc= -5
##$NLEV= 6
##$NOISF1= 3.799351
##$NOISF2= 2.8
##$NSP= 0
##$NTH_PI= 0
##$NZP= 0
##$OFFSET= 15.65547
##$PC= 1
##$PHC0= -25383.74
##$PHC1= 13.98731
##$PH_mod= 1
##$PKNL= yes
##$PPARMOD= 0
##$PSCAL= 0
##$PSIGN= 0
##$REVERSE= no
##$SF= 200.129573235993
##$SI= 16384
##$SIGF1= 3
##$SIGF2= 2
##$SINO= 5.538805
##$SIOLD= 16384
##$SREGLST= <1H.CDCl3>
##$SSB= 0
##$STSI= 16384
##$STSR= 0
##$SW_p= 3612.71676300577
##$SYMM= 0
##$S_DEV= 0
##$TDeff= 16384
##$TDoff= 0
##$TI= <>
##$TILT= no
##$TM1= 0
##$TM2= 0
##$TOPLEV= 0
##$USERP1= <user>
##$USERP2= <user>
##$USERP3= <user>
##$USERP4= <user>
##$USERP5= <user>
##$WDW= 1
##$XDIM= 16384
##$YMAX_p= 349272470
##$YMIN_p= -139389
$$ End of Bruker specific parameters
$$ ---------------------------------
##NTUPLES= NMR SPECTRUM
##VAR_NAME=  FREQUENCY,     SPECTRUM/REAL,   SPECTRUM/IMAG
##SYMBOL=    X,             R,               I
##VAR_TYPE=  INDEPENDENT,   DEPENDENT,       DEPENDENT
##VAR_FORM=  AFFN,          ASDF,            ASDF
##VAR_DIM=   16384,         16384,           16384
##UNITS=     HZ,            ARBITRARY UNITS, ARBITRARY UNITS
##FACTOR=    0.220516191357247, 1,           1
##FIRST=     3133.12250877705, 0,            0
##LAST=      -479.594254228724, 0,           0
##MIN=       -479.594254228724, -139389,     0
##MAX=       3133.12250877705, 349272470,    0
$$ Real data points
##PAGE= N=1
##DATA TABLE= (X++(R..R)), XYDATA
$$ [...]
8976g509K873l15K069j118J196j159k532K169r81K49q12J607J89k690j425J329
8960f860J209j743L877K465l27j432n55m35m879O89L328NJ887m393J206N35l49
8943e772j059K180l29l27k028K801n214j632L338K749R19k936K064N67j007k05
8927e891r16r56n20p78L34M287m95J355j174Q13k028O6J828k982j526K885N84
8910e114k527J56o4P20Q14J870J109j253k879M3o95o78N17K797J721n651k739
8893a1853K738J225J528Q44J407j730j5J605n71j585K058k79n53k145J250J220
8877d856k210j154o62M629m97J460p1n065m70L5K992K635J41j621n93k05j957
8860g469k477J202K449p76p30m3k669O541q85J760l938j506R70L310n79J935m87
$$ y = [-7509, -4636, -4951, -2882, -4000, -2804, -3963, -6495, -4326, -5307, -5058, -5870, -4263, -4074, -6764, -8189, -6860, -5651, -7394, -3517, -1052, -1379, -2811, -3366, -3801, -8680, -7991, -4663, -4658, -2771, -7164, -5958, -5423, -5772, -6831, -4651, -4980, -5307, -7335, -4534, -9748, -11380, -8042, -5293, -4374, -7310, -5246, -4679, -5686, -5891, -6807, -7763, -8283, -9061, -8727, -4440, -4935, -3580, -4754, -3941, -5969, -5903, -4075, -7057, -8583, -5698, -5114, -7641, -7485, -7549, -6829, -6015, -4145, -3036, -4289, -7168, -7125, -7820, -8498, -7981, -5184, -3463, -9114, -11853, -9115, -7890, -6362, -5518, -4111, -5841, -5856, -4251, -4822, -6407, -4349, -4628, -5181, -7326, -6076, -4856, -7066, -8220, -8882, -4253, -4750, -3290, -3361, -8426, -8896, -8861, -5869, -3234, -3093, -4714, -5307, -5512, -7469, -9946, -8744, -6295, -7071, -7801, -7844, -10513, -3972, -4857, -3097, -7035, -8541, -7571, -4261, -4840, -2905, -3392]
8843c392n731l450J984K086K015K703l430k036n7p48q23j178N58K063K697q3j915
8826h737K040j609N69P30K812k837M87J078j517K341j006k743k060J228K721j12
8810f615j918K420K044j966j885m46K316K46k807O81J752p54n15K594K253m53
8794c053l346l009N10n75J88k254K280K010K518k359l916K177J095R90J029J835
8778c880j509J993k908l834L92J042J915K43q59k324L610J984K162m256n165L068
8762h326K527k217R45j870j26l69k418K918M772P21j328K070j27j498Q06j357
8746d877j206L455k341L09j40p74J450n65q14J060k438m301J96O02M94K393P78
8729f719m04J527K335j401k688k472K65J367j780O83q83J64L931j672K60n28J873
$$ y = [-3392, -9123, -12573, -10589, -8503, -6488, -3785, -7215, -9251, -9308, -10056, -10879, -12057, -11499, -9436, -6739, -6822, -8737, -6697, -8306, -7737, -7007, -4195, -7032, -6545, -5467, -6984, -4643, -5649, -8392, -10452, -9224, -6503, -6615, -8533, -6113, -4069, -6035, -7920, -8366, -6050, -5804, -8611, -7930, -6178, -6932, -7447, -4853, -2600, -3053, -6399, -9408, -8898, -9473, -9285, -11539, -9259, -7249, -4731, -7090, -11006, -8829, -7734, -6744, -5715, -3880, -5389, -3396, -6304, -10138, -9746, -8704, -6789, -6546, -7405, -9729, -6119, -4135, -1973, -6229, -11394, -8326, -5799, -8016, -7071, -8941, -9067, -9436, -11854, -8936, -4164, -3443, -4771, -2701, -2828, -4326, -3520, -4877, -6083, -2628, -4969, -4660, -4800, -5574, -4124, -4689, -5503, -4443, -6881, -11182, -10986, -10384, -9890, -7497, -6719, -7123, -5596, -3261, -4662, -7350, -9822, -9557, -8190, -9970, -9287, -10170, -10006, -6075, -7747, -7487, -8015, -6142]
8712f142n33j500K484l282o6J95J461L275r08j305j246j753L204k244J814k009
8696h555J113J817p16j117K038m60k582J323Q94K023k294k578K808n02j939K916
8680e811K42n50K677r87j522J840L95j462j692J327j206N76L716J55q56n74l3
8663c765j91r97l175m74K524j401o92K409M21o75M86L572k481p89J092J074J500
8646a562Q0o274k692m41Q40r7K731j160o82j782j26m49o24L413O622k375j096
8629e674L294j536j229k78l138r5l28O10L804l110Q87K061K295k183m196m05J139
8612h082k358K757r66L61k264M93o91K190N51J312k586J451j556J134l25L015
8596e564m456k471j216L949m166L805K661L275p22J819o694L885r839N522p155
$$ y = [-6142, -6675, -8175, -5691, -8973, -9039, -8844, -7383, -4108, -5016, -6321, -7567, -9320, -6116, -8360, -6546, -8555, -7442, -5625, -6341, -7458, -5420, -5880, -8462, -7139, -6245, -4222, -6516, -9094, -6286, -6788, -8727, -5811, -5569, -6119, -3442, -4429, -5951, -4111, -3716, -5178, -6870, -5543, -6749, -6173, -2457, -2302, -3158, -3732, -3765, -3956, -4953, -8128, -8602, -6078, -7479, -8171, -5762, -5341, -6016, -5530, -1958, -4439, -5228, -4136, -3062, -1562, -1482, -7756, -10448, -10889, -10049, -10146, -7415, -8575, -9257, -11039, -11165, -11614, -12238, -8825, -2203, -4578, -5674, -2380, -3916, -5145, -5423, -8561, -8656, -8984, -8374, -4570, -7680, -6793, -4732, -2437, -4620, -8816, -9221, -8082, -10440, -7683, -8649, -8288, -10552, -10059, -10750, -8560, -8009, -6697, -9283, -7832, -9388, -8254, -8579, -5564, -10020, -12491, -13707, -9758, -13924, -10119, -7458, -4183, -4905, -3086, -9780, -5895, -15734, -10212, -17367]
8581a7367J0389j2886P2607K2706p3614J743o614N740q894P794j410L498m376
8568f84j648j847M87n015M205j034K881R86q77k650l78K857n35l671j160M36L436
8551d211j653M977n882K640M572l209l410K641n72k741j315O623q1j009l072L13
8535e389J120J34n10k999R33k479K77L469j397n96k907L445j396J86j676K280
8519g505J639N32r87N3L60k286L012J53j419m55N42l560K022K067M01l311L32
8502h410J048O10O50J478N78J732l874k821K709L027J2n9j143M570j904j339k762
8485e898k170K458J640J204l687J231J69j493k408n71N48J245L712l48K202j349
8469c515K477k651r53OJ002K310N24M60k736k037K906l102J314j240k174K124
$$ y = [-17367, -6978, -19864, 52743, 75449, 1835, 3578, -3036, 2704, -6190, 1604, 194, 3692, -684, -2332, -4179, -3692, -8707, -4502, -5536, -2655, -1669, -2546, -5196, -5574, -2717, -3252, -6923, -8083, -7647, -4211, -5864, -887, -6769, -4129, 443, -2766, -6176, -3535, -4107, -6848, -8163, -1540, -1621, -2630, -5702, -5389, -4269, -4135, -4645, -7644, -6711, -9190, -8913, -5444, -6841, -7437, -10344, -6899, -8295, -8109, -9785, -7505, -5866, -5334, -6321, -6268, -5908, -8194, -5182, -5029, -6448, -6903, -6361, -9921, -7899, -5832, -5431, -8742, -8410, -7362, -6752, -6102, -4624, -4046, -2314, -6188, -9009, -6300, -3273, -3261, -3320, -4463, 107, -1797, -3136, -5898, -8068, -5610, -3970, -2766, -6453, -5222, -5053, -6546, -8954, -9525, -8977, -7732, -4020, -4368, -2166, -3515, -1038, -3689, -4642, -4636, -3634, -1324, -800, -340, -3076, -5113, -2207, -5309, -3995, -5235, -7409, -5285]
8453e285K653k083j126J401L14r67K374J416O25o798j173k308Q17j54L883j529
8437g940O17J264K539P5o092J995L505j307k167l517M671j62k356O433j262rK162
8420a551K073k681n975J980N62l647L139k674J638J607K608l285r37J411J940
8405c792L731l239n064R97j445K663L784L063k587K086J9j052j03J66J816k213
8389a170l079P11j18K753k466K972J561j082K504k63k788k500q16j448M382j482
8373b329R67L044n661k904K079R39l290J877J768j200L58Q15l20n36Q57M46k845
8356e935K947k695n297Q2N264l019J184L544n38k206k718L106P06J228J778J236
8340a333l161Q13K666m729M628j527q091K621M102M783j046j46q94L047l390L930
$$ y = [-5285, -2632, -4715, -5841, -4440, -4126, -5093, -2719, -1303, -678, -7476, -8649, -10957, -10140, -10294, -6411, -7940, -7323, -6059, -3520, -3445, -9537, -7542, -4037, -5344, -7511, -11028, -6357, -6519, -8875, -2442, -3704, -3713, -1551, 522, -2159, -8134, -6154, -5592, -9239, -6100, -8774, -7136, -5529, -2921, -6206, -7143, -5732, -3792, -61, -3300, -8364, -7367, -8812, -6149, -2365, 698, -1889, 197, 216, -836, -939, -773, 1043, -1170, -4249, -3538, -3656, -903, -3369, -397, 1164, 82, 2586, 2323, -465, -2965, -3781, -5229, -847, -2329, -1362, 1682, -3979, -6883, -4804, -3865, -7155, -5278, -3510, -4710, -4352, -3537, -3857, -4393, -3536, -3090, -5935, -2988, -5683, -10980, -10898, -5634, -8653, -7469, -3925, -4463, -6669, -9387, -6281, -5575, -4347, -2569, -1333, -4494, -3681, -1015, -5744, -1116, -2643, -10734, -8113, -4011, 772, -274, -420, -1314, 1733, -1657, 2273]
8324B273O24q700O193J312n076K383n08l085j59M311p991K692N821j563r17k425
8308d815k059l03K532J61J395n071J17J862l57m49R68O40m49L204M536r81k552
8291a621M589k084l206j171L183m126m176K929K412K162m746J036m39j964l60
8276g582M941N108l499J939k513m63L070m523l511O781o96j679K064J374n163
8261d352o933N272J877M302k834M75K909j630r9l793j073J693k000J797J120k590
8245e859N104M064o043m57N061m185n694l655J322k529K002M402L376n389N18
8230g962M866m318j725M256O32M28k289L818J985l63j767J794L256n507P864q56
8214D112j685n050l143L416k402L811l506K444j1683o026P438P813K533J754p42
$$ y = [2273, 2897, -5803, 390, 1702, -3374, -991, -1499, -4584, -4743, -432, -8423, -5731, 90, -1473, -2390, -4815, -6874, -7177, -4645, -4484, -3089, -8160, -8043, -6181, -6538, -6987, -6019, -5379, -5828, -2624, 1912, 931, -1621, 2968, 884, -2322, -3493, -310, -4436, -8612, -5683, -3271, -1109, -5855, -4819, -5258, -7222, -7582, -2641, 2467, -1032, 907, -1606, -2069, 1001, -3522, -7033, -252, -948, -2627, -563, 811, -4352, -11285, -6013, -4136, 166, -2668, -2193, 716, -914, -1013, -4806, -5879, -4186, -6186, -4389, -3269, -5859, -755, 3309, -2734, -3191, 1870, -2315, -8009, -11664, -10342, -12871, -10869, -6467, -3091, -8480, -7962, -3096, -7414, -9139, -4883, -4251, -3823, -6112, -2294, -309, -672, -2439, -645, 2611, -2896, 4968, 4112, 2427, -2623, -5766, -2350, -4752, -941, -4447, -2003, -13686, -19712, -12274, -4461, -1928, -174, -916]
8199i16r817j784j2516R660O991K5722l1045O5071N2830p4970j8544r960p865
8186g143R098J1012m637r110J425O05k303j1758K681J2899m751K954j1001O319
8172c710N980L814O00r297L068L282j666R059j251l578n290o803L316j28K694
8157I0N100o837J558J1126q58n045j0881j051L574L04J199M40k434J824P905L384
8141I398m273n958N10l434J145M660K680P42n851l088N126L316k188j41m077n475
8125f908N867Q02J29K811j004L519l509k737O770o267k874j844N114K704l528
8110i55N5m96J105m08M650p04q004m739J181P88K272K216Q01K682o438j238M268
8093b964L225k126N243j835J006L174o578J379l531P676J29p628L709L433m626
$$ y = [-916, -10733, -12517, -25033, -15373, -8382, 17340, -13705, 51366, 104196, 29226, 10682, 722, -7143, 1955, 12967, 8330, -780, 645, 1250, -1053, -12811, -10130, 2769, -1982, 972, -10029, -3710, 2270, 6084, 6684, -2613, 455, 3737, 2071, 11130, 9879, 6301, 1011, -5792, -2476, -2604, 90, 5190, -1647, -89, 11037, 10179, 5134, -5747, -6798, -3224, -2920, -1721, -1281, -3715, -1891, 6014, 9398, 5125, -833, -323, -3757, -2612, 2048, 4728, 5470, -381, -3469, 1657, 4973, 2785, 2644, -1433, -6908, -1041, -239, -110, 2701, 1697, 5216, 1707, -1030, 5740, -527, -3401, -5245, -131, 2573, -955, -900, -1396, -291, -699, 3951, 3247, -4757, -9496, -8315, -7527, -5255, -3039, -2238, 444, -5994, -7232, -2964, 261, -1865, 3378, 1543, 2549, 5723, -855, 524, -3007, 4669, 4798, -2830, 879, 4312, -314]
8078c14L485j345m856J698L712l909L408k210k055J449k691l439P683q55k700
8063b939P42l82M10N023l844k443J39j834K591M826k792J63L282J325J861l30
8047E798k78k246L824j869k218m502K065J537j286j818J119K185k999J36K954
8032B402N07J125l084j784L029L850l961R9j286l400J612L735K647k280m817R00
8016g06K845J571J804j619q45L700N32k155k212l020K401N401n441k454K032j681
8000A53J029O57j111j104k319P459P5K655n633l615L67l044N001J524n10j730
7984a46Q80K079l596j618J880N64j348j18K829l83k730k027J377L16K320k664
7968b385K754K469m853J242N013j882J903J975j630R21l380J099j309Q16k04l571
$$ y = [-314, 3171, 1826, -3030, -1332, 2380, -1529, 1879, -331, -2386, -937, -3628, -7067, 616, -239, -2939, -2197, -2579, -2169, 2854, -990, -3433, -3294, -5128, -2537, 2289, -503, -340, 2942, 4267, 6128, 5798, 5520, 3274, 7098, 5229, 3011, -1491, 574, 2111, 825, -993, 126, 2311, -688, -552, 2402, 2909, 4034, 950, -834, 2195, 6045, 2084, 2183, 897, -2503, -891, 2844, 5491, 3211, -1606, -706, 2139, 3710, 5514, 3895, 3050, 6750, 7282, 5127, 2915, -105, 2296, 7697, 2256, -198, 1834, 153, 1182, 1839, 728, -376, -2695, 4764, 4839, 7494, 1861, -1754, -1387, -4431, 570, 2094, 1584, -146, 734, 2813, -783, -2401, -521, 43, -1305, -1423, 1406, 1023, -1707, -3734, -2357, -2041, 279, -2385, 369, 2838, -2015, -773, 4240, 2358, 4261, 6236, 4606, 5527, 2147, 3246, 1937, 2753, 2549, -1022]
7952a022Q60j841o85K785K00P67j794k672j330L715p86J480O88J205k216L054
7936B408K824l638k86o61L457l140r8L272m443L720J555m472K307m23r2K715r12
7919D093l693J388K152L072l875j852K406j384q94N23r50j675l70M835o59l163
7903d6K43K480q25M461k569k286K000L560m823J880J799j064l547J036J703k781
7887A221j820J439J05J023j316K408K781m014j506k1L565R35j653J633N79j459
7871C900k027j120n224Q38K634J561j142K572j290j401p80L306q83L95j315J658
7855A682j97M235j559k3Q44k082R78j514l72P54M87p79M34K446O92k293J201k510
7837B424j485k281R29J258L882j879L019q29l669L607j623o187K366M375J41j390
$$ y = [-1022, -162, -2003, -2688, 97, 297, 1064, -730, -3402, -4732, -1017, -1803, -323, 365, 1570, -646, 2408, 5232, 1594, 1308, 647, 4104, 964, 866, 4138, -305, 3415, 4970, 498, 2805, 2382, 2290, 5005, 4093, 400, 1788, 3940, 7012, 3137, 1285, 3691, 2307, 1413, 1936, 986, -689, -1059, 3776, 3117, -46, 197, 2677, 1852, 6313, 3744, 1458, 3458, 7018, 2195, 4075, 5874, 4810, 1263, 2299, 4002, 1221, -599, 840, 945, 1968, 652, 3060, 5841, 1827, 321, 300, 3865, 4800, 3147, 4780, 5359, 3900, 1873, 753, -4471, -3633, -999, 562, -580, 1992, 702, -699, -1479, 1827, 944, 1339, 24, 1682, 1485, 5720, 4161, 4138, 4982, 2900, 3878, 2364, 1992, 2746, 3233, 2454, 2888, 5334, 6026, 3733, 4934, 2424, 939, -1342, -413, 845, 4727, 2848, 5867, 5038, 1369, 4976, 3353, -2834, -468, 3907, 4048, 2658]
7821B658j012m904M318m02O4J641K190o438p39k843K026j0325k478k3740l187
7806d3171r6218Q1165P9355j6461J1097j0677P613o097K215m753M751n283N622
7793I158k272j284m173L876L66m69J58K218k611M305n824K403K888L942p444K62
7777E499m253O029m03P7m605K060L242L309m750k060j230K564j510M95P27M310
7761I501N63l364k977J396J311K81K70O39j104K697l501K368j54o69l712p01M305
7744G149K913j703J288M28r31j721J2k8o55n5L2L67J787J816o27n024j847L29
7726C530L818L809j650j59m602j589J777o7K415J120l15K231p22R87J404m702
7710G285l296j441Q58L514K019J897l763n80l49K585j429k166J072L581l676K453
$$ y = [2658, 1646, -3258, 1060, 658, 722, 2363, 4553, -1885, -2624, -5467, -3441, -13766, -16244, -39984, -43171, -139389, -58224, 21131, 4670, 15767, 5090, 12703, 6606, 8821, 4068, 8819, 3536, 9158, 6886, 5602, 1429, 5305, 5671, 5202, 5360, 7578, 4967, 9272, 3448, 5851, 8739, 12681, 5237, 5499, 1246, 7275, 6872, 6949, 2344, 4404, 7646, 10955, 6205, 4145, 2915, 5479, 3969, 4464, 5191, 9501, 10064, 6700, 3723, 5119, 6430, 6711, 6981, 7620, 6516, 9213, 5712, 8080, 7926, 7257, 3545, 2844, 7149, 10062, 8359, 9647, 10075, 9144, 7423, 7435, 7407, 6752, 6697, 6729, 7096, 8883, 10699, 10072, 5048, 3201, 3530, 7348, 11157, 9507, 9348, 4746, 3157, 4934, 4867, 7282, 8402, 8087, 10318, 9596, 10583, 11987, 7285, 3989, 2548, 3406, 6920, 8939, 10836, 7073, 6493, 6144, 8729, 7300, 5134, 6206, 9787, 6111, 8564]
7694H564o21j495j508J514k334M781R32j887J347k884j159N41K881K202j521J451
7678A0804K116j334j431j147O05Q06J611N67l802k572k64M228O51Lm462K744j874
7661G249l636K434J371K703K064m521j619K441L271L759j419k764l93p21q20j157
7645H242K781j276k011L011l130j759L494Q59O77j509m53R21pQ4j295Q47l74j004
7627H098j34j192J879L60J9J633J036k233J143k78J687n88j50Q98m410R85K001
7610A0754m422N15K195n41k106K638J790M32N57j172j031P71k865J379K69K044
7594A1207m58l145M044q47J479P05m041J21L30K21o30j686j415J422M20K065J818
7577A1610k954J027j441l5k058j715j542N061Q87P78j937K338J832j590o319k58
$$ y = [8564, 7943, 6448, 4940, 6454, 4120, 8901, 9833, 7946, 9293, 6409, 5250, 5791, 8672, 10874, 9353, 10804, 12920, 11586, 10155, 9008, 9613, 10419, 12030, 12597, 8795, 6223, 5959, 10187, 10838, 10841, 6379, 9123, 7249, 3613, 6047, 7418, 10121, 12185, 7664, 6045, 8486, 11757, 15516, 14097, 11333, 10940, 10219, 9399, 8242, 11023, 9747, 7736, 10747, 7617, 5858, 9352, 10211, 10888, 9379, 8926, 9847, 9840, 9924, 8629, 9476, 9102, 8098, 7964, 6772, 8651, 9011, 9030, 10663, 11699, 9466, 10609, 10331, 12018, 11430, 11280, 12178, 7768, 8753, 10754, 6332, 6847, 9042, 8501, 6395, 9033, 10823, 11255, 11812, 10640, 9609, 10380, 7515, 8894, 9163, 11207, 10749, 7604, 11648, 10801, 12280, 12985, 8944, 9065, 9395, 9616, 8986, 7300, 5885, 7307, 7727, 9792, 11610, 8656, 9683, 8242, 8207, 6149, 4434, 2892, 7953, 8840, 9618, 7681, 10019, 11851, 10261, 3942, 3684]
7561C684j59M475K447R96k946k301j221j226L186K499k048K763J368J79j162j191
7545I343j126l25o38N680j031K075k948jJ850j552q00J009K230j054j883K013
7529A2842m109O22J88k602M83p6P46J085j995M390l550K473k402k668j795N443
7513I075o464K5314L5774l0536q723p266j077l565K575J020p11j771J233Q88m83
7498A5283r75K022m061J65M429J039k294J97j614J347J523K276m717r17J46j600
7482A2249K92L762K154l390j391j434K714q34Q83L053k043j760J070k363M85j72
7466A3275o94K067j06K120r89l0J076n34N09l629J270k82m66J496J631j57k917
7449A3640j6l103j29J504J928k583J955q14k855K515j98J281l543R56j026N67
$$ y = [3684, 3525, 8000, 10447, 11443, 8497, 6196, 4975, 3749, 6935, 9434, 7386, 10149, 11517, 11696, 10534, 9343, 8217, 7892, 7254, 12934, 11903, 13978, 11030, 11029, 12879, 11327, 10527, 11536, 13766, 12712, 10829, 12842, 8733, 9355, 9543, 6941, 7424, 7348, 8094, 9179, 7184, 11574, 8024, 10497, 8095, 5427, 3632, 9075, 2611, 27925, 63699, 33163, 24440, 17174, 16097, 12532, 15107, 16127, 15416, 13645, 14878, 15766, 15283, 14308, 16330, 12269, 12434, 16863, 17902, 15608, 15805, 14191, 15538, 17061, 19337, 14620, 13703, 13849, 12249, 12541, 16303, 18457, 15067, 13676, 12242, 14956, 14122, 15005, 18058, 16015, 14255, 15325, 12962, 13447, 13275, 12581, 14648, 14542, 16662, 15673, 15643, 16719, 16185, 16694, 13065, 14335, 14053, 13587, 15083, 16714, 16557, 13640, 13624, 10521, 10392, 11896, 13824, 11241, 13196, 12382, 9527, 12042, 11844, 13125, 9582, 10538, 9512, 10079]
7433A0079K032p33J982j435J709O78m87P88q71K0J427O31l54N37L90q24L000j230
7415A7339o729J353K12J585P79L76J550j08j022o0J452m25l70J885l917k901N398
7398A6397k580M654R39k733j558l08K414m394J737K668J968K86N85k432m28L018
7382B0233j721l471k92l23J316j336J336K024Q13r27n21j00j205j068K806p6k077
7365A5411K203l923J192K005J423P46Q07K04m281j142p49J121K913R11k69n031
7349A3541j060K19L091p54j620L881J017j017J024P52j171J790l472K460J200
7334A9881J601k347k512j057J273J541m428j860K528K538L736l45j575J299ol27
7318A9940n14J441J470n605K072L68j875K831k033l22l83Q26J866o9R98P18j270
$$ y = [10079, 12111, 11378, 13360, 11925, 13634, 14312, 13825, 14613, 13742, 13762, 15189, 15820, 15466, 16003, 16393, 15569, 18569, 17339, 10610, 11963, 12175, 13760, 14539, 14915, 16465, 16357, 15335, 15275, 16727, 16302, 15932, 17817, 13900, 10999, 16397, 13817, 18471, 19410, 16677, 15119, 14811, 17225, 12831, 14568, 17236, 19204, 19490, 20075, 17643, 17215, 20233, 18512, 15041, 14749, 14426, 15742, 14406, 15742, 17766, 18579, 17652, 17131, 17031, 15826, 14758, 17564, 17488, 15411, 17614, 13691, 14883, 16888, 18311, 19057, 19864, 20068, 15787, 14645, 13896, 15017, 17930, 18841, 18572, 13541, 12481, 12700, 15791, 15037, 13417, 17298, 18315, 17298, 18322, 19074, 17903, 19693, 16221, 18681, 19881, 21482, 19135, 16623, 15566, 16839, 18380, 13952, 12092, 14620, 17158, 20894, 20549, 18974, 20273, 20267, 19940, 19426, 20867, 22337, 16732, 18804, 19172, 17297, 20128, 18095, 17773, 17390, 18216, 20082, 20013, 21011, 21729, 20459]
7301B0459p86r27J355L057j536j649m70o98n79k226L30J214J6M242K926j813k076
7284B0839J567j325o71j956M086m96j779J72l153M628j88k82j838M3J247J568
7268B2462j404j376j23j780j085P81N243j927j351N26L87o23L025K572k812Q94
7252B3409q59L37J239j291l350j543M99J514j769K491K166L249j693k307m52K66
7236B1906j263l33L099K225j766p6k349L09j312J620P77j509M11K104J297mj730
7219B3406K47J150o29o57q97j988q65J4o96K834J177l273J317M007q04l963j280
7202A9100M110j563J286K353r04L72k146k88j595l83J61J685L00k713K821J91
7186B2787l2J714R44K271j154l52J09k88J8p87l408k149K161K927k129R13K013
$$ y = [20459, 19673, 18746, 20101, 23158, 21622, 19973, 19503, 18805, 18226, 16000, 16330, 17544, 17560, 21802, 24728, 22915, 20839, 22406, 21081, 20410, 18454, 22540, 22044, 20265, 20437, 17284, 21912, 21724, 21442, 19604, 19647, 20894, 22462, 21058, 19682, 19559, 17779, 16694, 17475, 22718, 20791, 19440, 19966, 20353, 19730, 22755, 25327, 22515, 23409, 22550, 22887, 24126, 22835, 19485, 17942, 18441, 19955, 18186, 20677, 22843, 26092, 24399, 22092, 21640, 21906, 20643, 20310, 23409, 25634, 23868, 23792, 21443, 21752, 20440, 22060, 22837, 21328, 21739, 23843, 25140, 25136, 23406, 23653, 24803, 24174, 23517, 22620, 20632, 19767, 19781, 19085, 21919, 23096, 19823, 21140, 25147, 24343, 20380, 19100, 23210, 21647, 22933, 25286, 24382, 24754, 22608, 22320, 20725, 20342, 20503, 22188, 22488, 19775, 22596, 22787, 22755, 24469, 25413, 27684, 26530, 26178, 26287, 25999, 26017, 25230, 21822, 19673, 21834, 24761, 22632, 23545, 25558]
7169B5558r96k56j843K006k587l44M1K338P17j242q9j337L564k38K07k145N01
7152B3855R94j893K066K030m43l217J412K81K710m410J97P4j923J17m99K094j393
7135B2052r47L681j982J30Q70O70p71j866l176j494J850L125L094L95R27m496
7119B2062l89K370J59L301n28M03r88K626k5k205k731j0L819N17k711J068j33
7102B6605N1l753Q09J766R85k335j327L255l75j057J469O93N38J860r83j490j732
7085B4979Q80M09k205k031J812J011j168k99K684K01J055k280K980L116p73L21
7069C0692r34n14M64j370O58j172l775M95K918l081j931r668R161O764L46o84
7053B8369L38l869o85N445r00M7k426J943L211o17l629K27j568j082R22J540J660
$$ y = [25558, 24562, 24306, 22463, 24469, 21882, 21538, 21579, 23917, 24634, 23392, 23303, 21966, 25530, 25292, 25499, 23354, 23855, 24849, 22956, 25022, 27052, 26609, 23392, 24804, 25085, 27795, 23385, 23582, 23656, 21733, 21850, 21351, 23445, 22052, 21105, 24786, 22804, 22934, 23804, 24474, 23703, 21837, 18661, 17167, 19017, 22142, 25236, 25631, 26558, 22062, 21673, 24043, 24202, 27503, 26975, 27378, 26390, 29016, 28991, 26786, 24055, 24045, 27864, 28381, 25670, 26738, 26605, 26656, 22903, 23712, 25478, 26463, 24128, 22801, 26056, 25681, 24624, 26093, 26786, 27324, 29184, 28201, 26711, 24979, 25859, 26268, 24063, 22032, 23844, 24855, 23687, 23388, 26072, 26273, 27328, 25048, 28028, 31144, 30371, 30692, 29758, 29244, 29708, 28338, 28996, 27824, 24049, 24544, 27462, 24381, 22450, 12782, 21943, 28707, 29053, 28369, 28707, 24838, 24153, 29598, 28698, 28745, 26319, 28262, 31473, 30856, 27227, 27454, 25886, 24804, 25726, 27266, 28926]
7036B8926R64R51K901J299l338l268j85J480K05P80L69K339o4m825M451j407n396
7019B6182J83l7O06j125K067K273q07n90r16j793R04J341J241M53k028M77M265
7002C2696j49k628j693Q90L467J175J121Q79j288l021N7j669J402O55j58K33L885
6985C5854l32j267o27l449L86J611k09K137N32J818J320L94j642m131K284k301
6969C2378m31N710k37k040m70k390K684J54j558j177K609Q32N02j548J062m70
6953C5610jp61l406J812L59K300q92J854M7l350J87K660K57J901L780O19n733
6936C7243m129L949j425r05J516P78j03K283P47q40O11k533J571N2j483L38j062
6919C6608J366j388j023K76K657L089j615R19K210k178k570j36r61J606K21o50
$$ y = [28926, 29890, 30841, 33742, 35041, 31703, 28435, 28250, 29730, 29935, 30715, 31084, 33423, 33359, 28534, 32985, 31578, 26182, 26365, 26328, 26934, 25809, 27876, 30149, 29342, 28752, 27836, 26043, 26947, 28288, 29529, 29982, 27954, 28431, 32696, 32547, 29919, 28226, 29116, 32583, 33758, 34879, 35758, 34470, 31449, 31506, 29837, 31239, 31894, 31736, 31969, 35854, 35522, 34255, 33628, 30179, 30565, 32176, 31967, 34104, 34636, 36454, 37774, 38168, 36526, 32395, 34679, 32378, 31947, 37657, 37420, 35380, 34910, 32520, 35204, 35358, 33800, 32623, 35232, 36064, 36566, 35018, 36080, 35610, 35609, 34848, 31442, 33254, 33613, 35913, 35021, 36875, 36922, 33572, 33759, 36419, 36676, 38577, 42357, 42976, 37243, 33114, 37063, 35638, 34733, 36249, 37027, 36924, 39207, 39954, 39114, 39725, 37192, 38763, 38815, 37332, 37670, 36608, 37974, 36586, 35563, 35839, 38496, 41585, 39970, 40889, 43099, 40921, 38351, 38215, 37254, 38860, 39081, 38431]
6903C8431j359M17k148K017M111k06j900k927J143K783J590r54m617N059L251
6888D4691k245k001K780k379l78J331o49J829J1J801l910J043J213j824J866o8
6872D3111m474j474K063K051R61n15j388K04p70L483K632j991J892n95k117P22
6856D3795k958J277K46K475J138j435l642j657J564n20R01O78M438l433j826m28
6840D0613J817k98j939j464J324J627J40k080j230N842K002k552K039j40P3l335
6824D2439N22p61L23M750j08k170k212j059L764K816j905%j666J98J081J34k781
6807D3365j207J985P99J72J268l023O62K313J988l13L79J337Kn5K783n546J82
6790D7091o54j030q12l01J447J774P79k297O16K192J310j35l57r0n83L235O5k0
$$ y = [38431, 37072, 37489, 35341, 37358, 41469, 41263, 39363, 36436, 37579, 40362, 41952, 40998, 36381, 41440, 44691, 42446, 40445, 43225, 40846, 40468, 41799, 41150, 42979, 42990, 44791, 40881, 41924, 43137, 41313, 43179, 43111, 38637, 37163, 39226, 41277, 42238, 41723, 40335, 40539, 39769, 43252, 45884, 43893, 45785, 45190, 43073, 43795, 40837, 42114, 42360, 44835, 45973, 44538, 40896, 39239, 40803, 40283, 41184, 41862, 46300, 42867, 41041, 40613, 42430, 42132, 40193, 38729, 40053, 41680, 41820, 39740, 38510, 44352, 46354, 43802, 45841, 45701, 45774, 42439, 42961, 42200, 42523, 47273, 47165, 44995, 42783, 41724, 45488, 48304, 46399, 46399, 44733, 44931, 46012, 46146, 43365, 42158, 44143, 44942, 45114, 46382, 43359, 44021, 46334, 48322, 48009, 48388, 49725, 49727, 49672, 52455, 46909, 47091, 46437, 45407, 44595, 44294, 45741, 47515, 48294, 45997, 46613, 48805, 50115, 49980, 49623, 49533, 48950, 52185, 52250, 52230]
6772E2230l93N79j680o7N17k166k131l24L529J164l53j124L46J848O4O03K548
6755E5190l723L58p55l570r81K578l10m30L356r70n15J839J977L076j350j110
6739E4660j660M26k206j948P98J285J746k367j062k20J831j55J473K536j36k213
6723E2788J953j295k948K771q71j007O90l88O12J576M335P0j128j234N4J258J079
6706E8315j018N00r13N89K703k909j807N57j366L03N795k932J077J832M44k887
6690E8283L274k07l59J043j807k362j04R99m8n53o17M98k191m38R97k041L601
6673E7968K741m41M90o86j071N9j060j845Q47M924K31J125l648M66m01k935L490
6656F0254l8j453N127N1p30L87o42k512J314J773k105J807J14M5j770j347k399
$$ y = [52230, 51837, 52416, 50736, 50669, 51186, 49020, 46889, 46565, 50094, 51258, 50905, 49781, 50127, 51975, 52039, 52642, 55190, 51467, 51825, 51070, 47500, 46519, 49097, 48787, 48357, 51713, 50743, 50228, 52067, 54044, 57120, 55770, 54660, 53000, 53426, 51220, 49272, 50070, 51355, 53101, 50734, 49672, 49452, 51283, 51128, 52601, 55137, 55001, 52788, 54741, 53446, 50498, 53269, 52398, 51391, 52081, 51693, 52305, 53881, 58216, 58286, 57158, 55924, 55978, 57236, 58315, 57297, 57797, 56884, 57473, 60176, 57267, 55460, 56017, 54651, 54954, 60749, 57817, 58894, 60726, 61170, 58283, 61557, 61350, 60991, 62034, 60227, 57865, 57761, 58760, 58712, 58159, 57542, 58040, 55849, 55411, 56408, 54367, 57968, 60709, 60268, 60758, 60072, 59001, 59060, 58000, 56155, 57002, 61926, 62157, 63282, 59634, 60100, 59699, 56764, 60254, 60216, 58763, 63890, 63941, 63211, 63598, 62956, 60444, 61758, 63531, 61426, 63233, 63347, 63392, 61622, 60275, 57876]
6639E7876R95K153L035l581K839N7J702P26k526K092j502k772R38K692l113j667
6623E9944r97J496J815j391R14P02j567N08J675J024J536r80P98j968k618J358
6607F2249J975J70j633K433L423l212j305L79J890j982K142l15K33O03m2l423
6591F3585J609K207k023J537M881n46j352n24K233l165j498J058L08r72L794k688
6575F8444k382J110j279J015l09K431k055J4K348M201k205m125J75J930r62J394
6559F9745J266j422O10J670m06P01q45K465k129k143p76R66J781L88r69K97O89
6542G1888r4j85Q53m75k13q59J692Q64J438l811k020L151J045j025k438J417K833
6525G4061J588q44j318l359L307o31l638K023N295j645j968L8K876K892j589n74
$$ y = [57876, 58871, 61024, 64059, 60478, 63317, 63374, 65076, 65802, 63276, 65368, 63866, 61094, 62032, 64724, 61611, 59944, 58947, 60443, 62258, 60867, 61781, 62483, 60916, 61424, 63099, 64123, 65659, 64679, 65477, 63509, 60891, 62249, 64224, 64394, 62761, 65194, 68617, 65405, 64100, 64479, 66369, 64387, 66529, 66214, 66447, 67050, 67008, 63585, 65194, 67401, 65378, 66915, 71796, 71250, 69898, 69374, 71607, 68442, 66944, 68002, 68310, 67338, 71132, 68444, 66062, 67172, 65893, 66908, 66599, 69030, 66975, 66989, 69337, 73538, 71333, 67208, 67383, 69313, 68351, 69745, 71011, 69589, 70199, 71869, 71463, 72164, 71319, 73784, 71655, 69512, 68736, 69702, 71483, 71871, 70902, 71199, 71888, 71794, 71609, 72462, 71987, 71774, 70915, 72607, 73471, 74909, 71098, 69078, 72229, 73274, 72249, 69811, 71228, 74061, 75649, 74805, 73487, 70128, 73435, 72804, 69166, 71189, 76484, 74839, 72871, 72909, 75785, 78677, 77088, 76514]
6509G6514k976j247J277L493K12J511k330l653o40L05n50K857L416K471j71k083
6493G8406k365j528K010K135J134O7n6J46J239j265l682L471J867L614j605j088
6477H2500K458j240l314l94L383N29j282p3P79J690k487l875K434J265k97j66
6461H1910K952j206n13K498n20j267K043r32j253R4M7l377L565J531p28J641J453
6444H7938J443l654m52L671K148j829j743j288m53L84J782j165k262K221J470
6429H8211j035J531p71L92Q90j290J433R8K97m93r42k047L508J472j730J63K774
6412I2461K392q29P07j3O37L37k180J296k451J87q09J40J994J89L09r59j310j903
6394I0195K565j670j556L409O203k454l255L15r6L396N41j209m26P35J349J55
$$ y = [76514, 73538, 72291, 73568, 77061, 77273, 78784, 76454, 72801, 72161, 72466, 71916, 74773, 78189, 80660, 80489, 78406, 76041, 74513, 76523, 78658, 79792, 79859, 79803, 79949, 81188, 79923, 76241, 79712, 81579, 85193, 83588, 82500, 84958, 83718, 80404, 80010, 83393, 83922, 82640, 82567, 83346, 85036, 82549, 78674, 81108, 82373, 82076, 81910, 84862, 83656, 83143, 85641, 85121, 83854, 85897, 84965, 83712, 83806, 83853, 80476, 84041, 85572, 84844, 86485, 87938, 89381, 85727, 85275, 88946, 91094, 89265, 87522, 86234, 85781, 86165, 87947, 86782, 84520, 86741, 88211, 87176, 88707, 87936, 88328, 89218, 87928, 89361, 89459, 89756, 89263, 88321, 86274, 89782, 91254, 89524, 89687, 92461, 94853, 94024, 94731, 94718, 95355, 95692, 93512, 94808, 92357, 92544, 91735, 91875, 93869, 94058, 94367, 93408, 92098, 90195, 92760, 91090, 89534, 92943, 99146, 96692, 93437, 93752, 93656, 97052, 97593, 96384, 95958, 96693, 98042, 98197]
6378I8197l44j373J706J463P53K84k21M87k720l55J283O54j598M10M993q39N22
6361A03302J25m067M63K668J356l310q69j920J312J968O02j658J449M167j3K54
6345A05829j960j193M61m276L955M274j045K385K580j091m444L190O05j024j708
6330A06538m99k369L275P44q61J59L20K328R91K6j074L088K257R56j974R09k530
6313A12284R76L058l95p71k74l87L54k499l14O05R44L528q61J408k673k8L079
6296A18034K00m025M32n66J710L287j771n8k6P57J746L154p48l998j26k11P59
6279A18550j409J455K246R82K275k025J570J633N18j479l05k206j830J048L111
6264A24134J131l094J91J970J384J11J725M82j245l095J575Q93N63j46q46K57
$$ y = [98197, 97853, 96480, 98186, 99649, 100402, 100686, 100465, 100952, 98232, 97877, 99160, 99814, 98216, 98626, 103619, 102780, 103302, 103427, 99360, 99823, 102491, 103847, 100537, 99668, 97748, 99060, 101028, 101630, 99972, 101421, 105588, 105575, 105829, 103869, 102676, 103137, 98861, 102816, 107090, 106045, 108430, 111010, 109919, 105475, 108665, 109270, 108246, 106538, 106039, 103670, 106945, 107689, 106828, 106987, 107307, 109635, 110626, 110652, 109578, 112666, 114923, 115879, 113905, 114814, 112284, 113260, 116318, 115923, 115152, 114878, 114491, 114845, 112346, 112032, 112637, 113581, 117109, 116248, 117656, 114983, 114955, 118034, 118234, 114209, 114641, 114075, 115785, 119072, 117301, 117243, 117217, 117974, 119720, 122874, 122126, 118128, 118002, 117791, 118550, 117141, 118596, 120842, 121824, 124099, 122074, 123644, 125277, 125795, 124316, 124011, 121805, 119975, 121023, 124134, 125265, 122171, 122362, 124332, 125716, 125827, 127552, 128034, 126789, 123694, 125269, 126162, 126725, 126579, 125733, 125990]
6248A25990L595j388L70k160J128J295l062j409M88K783qJ305L347j037J310R56
6232A33503M96k113K60K575j617J015p00J750k240K838J05J044P69L314l476J187
6216A38710J423m284L97k27J534J390L047M24j64J030k502L35m0N52J692J961
6200A45278L66J855n66j373j227K489m49m36j925K055M711q99M41J079M54q96
6184A50957J865K204J526K64q85J898j029K52j3l063J638K152k896l604K737N879
6168A59882K086n32p44j431N26j999j101j9O56K582J605j702L611J160J753O08
6152A66941M04l181K610K721j769j255L452J169k349O41J733PQ37o5j568L852
6136A74180j383R53R51q91o10N093N43L215J884K38K761r40L828l277l8j372n31
$$ y = [125990, 129585, 128197, 128567, 126407, 127535, 128830, 125768, 124359, 124847, 127630, 127622, 128927, 132274, 131237, 132547, 133503, 133999, 131886, 132146, 134721, 133104, 134119, 133419, 135169, 132929, 135767, 135872, 136916, 137685, 140999, 137523, 138710, 140133, 135849, 136246, 136019, 137553, 138943, 141990, 142414, 142250, 143280, 140778, 141113, 141073, 141625, 143317, 145278, 145644, 147499, 146933, 145560, 144333, 146822, 146373, 145937, 144012, 146067, 150778, 149879, 150320, 151399, 151853, 150957, 152822, 155026, 156552, 156816, 155931, 157829, 156800, 157052, 157039, 153976, 155614, 157766, 154870, 151266, 154003, 159882, 161968, 161436, 160692, 159261, 159787, 157788, 156687, 156668, 157324, 159906, 161511, 159809, 163420, 164580, 166333, 166941, 167345, 164164, 166774, 169495, 167726, 166471, 169923, 171092, 168743, 169384, 171117, 171124, 171961, 171896, 170328, 174180, 172797, 173750, 174701, 173810, 173200, 178293, 178836, 182051, 183935, 184173, 186934, 185994, 189822, 186545, 186507, 185135, 184604]
6119A84604K614J381j67m81M60P85P77n42J94Q70M465J078k309L363j587K91L85
6102A96181n72J169L613l30p0k640J507O068R67J236K406j030R94M964P23l851
6086B11335q44N577K780l80J940j237m72K576P49l47q7J591K775J793k327P56
6070B26178L224L208j298J916p22J824K15M038R19o56q98J148K077J864M75L842
6054B47354k064R86J689k771K761N17K412L176k492J54N82L654o65j303M920J080
6038B59990L936J749J536j482K072L018J057K474K123j341n66M462M59K586J929
6023B84002R16K174R4J313L824k03Q15o33j569J563J215J859M053J705O04J897
6007C03629J678M160K588M672J961L228K444J744J111L356K869N29Q84L147N087
$$ y = [184604, 187218, 188599, 188432, 187951, 188411, 189196, 189973, 189431, 189625, 190495, 194960, 196038, 193729, 197092, 195505, 195796, 196181, 195609, 196778, 200391, 200061, 199991, 197351, 198858, 204926, 205893, 207129, 209535, 208505, 209499, 214463, 215186, 211335, 210491, 216068, 218848, 218468, 220408, 219171, 218699, 221275, 222024, 221677, 221590, 223181, 225956, 227749, 225422, 226178, 229402, 232610, 231312, 233228, 232506, 234330, 234545, 238583, 239502, 238846, 237948, 239096, 241173, 243037, 243512, 247354, 245290, 246276, 247965, 245194, 247955, 248472, 250884, 254060, 251568, 251722, 252304, 255958, 255293, 253990, 258910, 259990, 263926, 265675, 267211, 265729, 267801, 270819, 271876, 274350, 276473, 275132, 274566, 279028, 279487, 282073, 284002, 284918, 287092, 287186, 288499, 292323, 292120, 292935, 292302, 290733, 292296, 293511, 295370, 299423, 301128, 301732, 303629, 305307, 309467, 312055, 316727, 318688, 321916, 324360, 326104, 327215, 330571, 333440, 333969, 334853, 338000, 343087]
5992C43087n3M67M404L546K778J344K561J437N756N979J80L875N880J699M583
5977C87523J403L713L772k403R5L481k118J830L682L091N235J552l3L966P81J431
5961D17001P152M052L539L760m30P432L389K419K239R73P253k49N046M120P903
5946D75599N759K967L183L797P796L371O83M973L377M409P588M543O690L115N709
5931E43559P136N343M782P375O475Q535L130P356P767P647R234L158R961Q108
5917F39566P294P282J1005J0245J2004J3398R868J4725J5292J1379J1244J4128
5905G77430J5002J4009J4684J5376J6704J6257J6820J8748J9618J8319J3901J3751
5893I70619J6598J0200J5469J6324J6719J6198J8514J9178J6130K7008K0702K1560
$$ y = [343087, 343034, 343501, 347905, 351451, 354229, 355573, 358134, 359571, 365327, 371306, 371486, 375361, 381241, 382940, 387523, 388926, 392639, 396411, 394008, 394103, 397584, 395466, 397296, 400978, 404069, 409304, 410856, 410823, 414789, 415570, 417001, 424153, 428205, 431744, 435504, 435074, 442506, 445895, 448314, 450553, 451526, 458779, 458530, 463576, 467696, 475599, 481358, 484325, 487508, 491305, 499101, 502472, 503155, 508128, 511505, 515914, 523502, 528045, 534735, 537850, 543559, 550695, 556038, 560820, 568195, 574670, 583205, 586335, 593691, 601458, 609105, 618339, 621497, 631458, 639566, 646860, 654142, 665147, 675392, 687396, 700794, 710662, 725387, 740679, 752058, 763302, 777430, 792432, 806441, 821125, 836501, 853205, 869462, 886282, 905030, 924648, 942967, 956868, 970619, 987217, 997417, 1012886, 1029210, 1045929, 1062127, 1080641, 1099819, 1115949, 1142957, 1163659, 1185219]
5881A185219K6510K7948K7243K4140L0533K7893L1068L1472L1731L5447L9115
5870A518319L5325L4230L3270L6658L9118M1760M3131M1986L9602M5163M5889
5859A954451M4028M8636M7963N3377N6575N4532N1492N1667N5870N7197N7993
5848B533781O1119O1775O4267O7103O7828P8816Q4072R3685R9598J12782J23550
5837C448376J40489J54637J67005J89435K16247K40149K64821L02311L43332M01196
5827E867998M58917N20883N80865O48918P31370Q39011R54352J076537J177729
5818A2856580J205676J128380R41388O18619J45780m40469j020064j418957j556675
5809A2460258j488612j318980j118879r32535p79320o52488n52347m72682m15808
$$ y = [1185219, 1211729, 1239677, 1266920, 1291060, 1321593, 1349486, 1380554, 1412026, 1443757, 1479204, 1518319, 1553644, 1587874, 1621144, 1657802, 1696920, 1738680, 1781811, 1823797, 1863399, 1908562, 1954451, 1998479, 2047115, 2095078, 2148455, 2205030, 2259562, 2311054, 2362721, 2418591, 2475788, 2533781, 2594900, 2656675, 2720942, 2788045, 2855873, 2934689, 3018761, 3112446, 3212044, 3324826, 3448376, 3588865, 3743502, 3910507, 4099942, 4316189, 4556338, 4821159, 5123470, 5466802, 5867998, 6326915, 6847798, 7428663, 8077581, 8808951, 9647962, 10602314, 11678851, 12856580, 14062256, 15190636, 16132024, 16750643, 16896423, 16455954, 15435890, 14016933, 12460258, 10971646, 9652666, 8533787, 7601252, 6821932, 6169444, 5617097, 5144415, 4728607]
5800D728607l65735l26780k90861k59112k28428k02099j78415j64014j49871j36471
5790B426821j23075j11506j01898r6529q7353p8887p5081p2173o7972o4776o1081
5779A486490n6539m8568m4401m3126m1743m1882l3064l3077l2938l0649k7619
5768A052884l0466k7329k5016k5476k3878k1206k0865k2999j7457j6587j5530
5757H06075j7045j4487j2806j3083j4524j9233j2085j7671j2173j2283j0886q557
5745F41242j3160r446p592j1859q706m964o336r654r654p488o027o573n884n885
5731E28014o445q044m667l419m875l667k740k160m761m132l275k758m125m670
5717D68276p400l587k106k429l401m944j915k626k794n560J632l19j838p53J30
$$ y = [4728607, 4362872, 4036092, 3745231, 3486119, 3257691, 3055592, 2877177, 2713163, 2563292, 2426821, 2303746, 2192240, 2090342, 1993813, 1906460, 1827573, 1752492, 1680319, 1612347, 1547571, 1486490, 1429951, 1381383, 1336982, 1293856, 1252113, 1210231, 1177167, 1144090, 1111152, 1080503, 1052884, 1022418, 995089, 970073, 944597, 920719, 899513, 878648, 855649, 838192, 821605, 806075, 789030, 774543, 761737, 748654, 734130, 714897, 702812, 685141, 672968, 660685, 649799, 641242, 628082, 618636, 611044, 599185, 590479, 585515, 579179, 569525, 559871, 552383, 546356, 539783, 533899, 528014, 521569, 513525, 508858, 505439, 500564, 496897, 494157, 491997, 487236, 483104, 479829, 477071, 472946, 468276, 460876, 457289, 455183, 452754, 449353, 444409, 442494, 439868, 437074, 431514, 433146, 432827, 430989, 430236, 430366]
5702D30366m971k968k630J282k080P087j122j2851p03m614j230m251K082k203
5688D01194j088j92k560K663J548m534l072k58K449j826k917k560K25k533k622
5673C83917J257K523J572k282m963J7o15l54n00r25J62j685j892n14k561m575
5657C68582J566M21l353L33l141l489j049p21o59R50L154J450L708M11L136K865
5641C74164L012l624N47N699Q04k094k744K207K365O80J868l7k79J654j33K80
5625C84369L547j160o1K897L171J76m09k38L464N52l45J286M05j317j678M213
5609C98872N03J825L028J586J009l337n85J914L353N523Q2j060J38J091L345K52
5593D17539J663J089P24j515J762J690j380K604J151J520L229l0J676M707j203
$$ y = [430366, 425395, 422427, 419797, 421079, 418999, 426086, 424964, 412113, 411410, 406796, 405566, 401315, 403397, 401194, 400106, 399914, 397354, 400017, 401565, 397031, 393959, 393701, 396150, 394324, 391407, 388847, 389072, 386539, 383917, 385174, 387697, 389269, 386987, 382024, 382041, 381426, 381072, 380572, 379647, 379809, 378124, 376232, 375718, 373157, 368582, 370148, 370569, 367216, 367549, 364408, 360919, 359870, 359149, 358490, 359440, 362594, 364044, 367752, 368163, 371299, 374164, 377176, 373552, 374099, 379798, 380602, 378508, 375764, 377971, 380336, 381016, 382884, 382847, 382568, 384222, 384089, 384369, 387916, 386756, 386695, 389592, 392763, 392939, 392530, 392292, 395756, 396308, 395963, 397249, 397654, 396337, 394659, 398872, 399375, 401200, 404228, 405814, 406823, 403486, 402901, 404815, 408168, 413691, 413773, 412713, 412851, 413942, 417287, 417539, 419202, 420291, 421015, 419500, 421262, 422952, 421572, 424176, 425327, 426847, 430076, 430046, 431722, 436429, 435226]
5578D35226p7L721K263l109J080J475N71M727J841j941M98J215M814n91R79J814
5562D54506k88L718P22r7J134L024J396K768j615Q25M061P5K441K213J363L81
5546D76627K230j123N516k9j502L365K902J975j304L861M55K773J556J851L312
5531E02465J882J496M2K646J154K30P71M004j5M285J061J013J349Q67J463J51
5515E24864K974M887Q85R84q9K195N766K15N442K779j849K356L431K193M177K441
5499E63651j523K03K725L389K304J329L363L936K171JL44M330L427M20K163J256
5483E93489N058j138N439J967J549M716L405L117L165K98K038J455K582L859J621
5468F32620K852O476L474L210M505M467K327j396O095Q18L280M188K485N32M063
$$ y = [435226, 435149, 438870, 441133, 438024, 439104, 440579, 441150, 445877, 447718, 445777, 446275, 447490, 452304, 451713, 452692, 454506, 454218, 457936, 458658, 458561, 459695, 462719, 464115, 466883, 465268, 466093, 470154, 470229, 472670, 474883, 476246, 476627, 478857, 477734, 483250, 483221, 481719, 485084, 487986, 489961, 488657, 492518, 492973, 495746, 497302, 499153, 502465, 504347, 505843, 505885, 508531, 509685, 509915, 510686, 514690, 514675, 518960, 520021, 521034, 522383, 523250, 524713, 524864, 527838, 532725, 533610, 534594, 534505, 536700, 542466, 542681, 548123, 550902, 549053, 551409, 554840, 557033, 561210, 563651, 562128, 562331, 565056, 568445, 570749, 572078, 575441, 579377, 581548, 581549, 581893, 586223, 589650, 590070, 592233, 593489, 598547, 597409, 602848, 604815, 606364, 611080, 614485, 617602, 620767, 621065, 623103, 624558, 627140, 630999, 632620, 635472, 641948, 645422, 648632, 653137, 657604, 659931, 658535, 664630, 665448, 668728, 672916, 675401, 675933, 679996]
5453F79996L312J439L629N274O937L666M234P81L474M001J207N073O296L275K998
5438G35592P93L820Q503N201J714M732L448L006L971N639K759L025L715L526L525
5423G92969P012L545L714N374K377N858N920N359M518L372O770O148O377R612
5409H68925J629J870N070Q818O731L488N594N385O089O979L428N248K731O179
5395I38164O352O835O489N983Q274M508N377J0579M533K055O795P886J0680O502
5381A031012M325O178O638P709J0351N693N248O094P892Q291J0305O749P926J0318
5367A134729O213P274Q518J0366P977J1027Q187R116P962J2796J2183J4037Q320
5354A258705R098J1426J0281J0879J2819J0752Q980Q273Q893J0720J0171J1435
$$ y = [679996, 683308, 684747, 688376, 693650, 700587, 704253, 708487, 709268, 712742, 716743, 717950, 723023, 729319, 732594, 735592, 736385, 740205, 748708, 753909, 755623, 760355, 763803, 766809, 770780, 776419, 779178, 782203, 785918, 789444, 792969, 799981, 803526, 807240, 812614, 814991, 820849, 826769, 832128, 836646, 840018, 846788, 852936, 859313, 868925, 870554, 872424, 877494, 886312, 893043, 896531, 902125, 907510, 913599, 920578, 924006, 929254, 931985, 938164, 944516, 951351, 957840, 963823, 972097, 976605, 981982, 992561, 997094, 999149, 1005944, 1013830, 1024510, 1031012, 1035337, 1041515, 1048153, 1055862, 1066213, 1071906, 1077154, 1083248, 1091140, 1099431, 1109736, 1116485, 1124411, 1134729, 1140942, 1148216, 1156734, 1167100, 1175077, 1186104, 1194291, 1203407, 1211369, 1224165, 1236348, 1250385, 1258705, 1267803, 1279229, 1289510, 1300389, 1313208, 1323960, 1332940, 1341213, 1350106, 1360826, 1370997, 1382432]
5342A382432J3545J0891J2872J4832J4778J3098J3100J4638J1805J3199J7555
5331A532745J2007J1603J7151J7443J5388R329J7806J4494J5552J7907J8506J6996
5319A716927J7466J9253J6055J9327K0182J9436K0378K1477K0678J8397J8781
5308A928357K0815K1896K4629J9777J8172K2885K6310K5894K7220K8438K7557
5297B191950L0174L3372L8024L5232M3023M7803M5649M8528N6553O4224O9894
5286B704426P8096Q7286R5504J05765J17783J37710J49050J69385J89742K12794
5276D047541K28077K33234K22072J88262J31166M9955l7531j28231k02013k45190
5266D487342k55332k43173k14651j78170j47159j17409r4153p5979o1871n2419
$$ y = [1382432, 1395977, 1406868, 1419740, 1434572, 1449350, 1462448, 1475548, 1490186, 1501991, 1515190, 1532745, 1544752, 1556355, 1573506, 1590949, 1606337, 1615666, 1633472, 1647966, 1663518, 1681425, 1699931, 1716927, 1734393, 1753646, 1769701, 1789028, 1809210, 1828646, 1849024, 1870501, 1891179, 1909576, 1928357, 1949172, 1971068, 1995697, 2015474, 2033646, 2056531, 2082841, 2108735, 2135955, 2164393, 2191950, 2222124, 2255496, 2293520, 2328752, 2371775, 2419578, 2465227, 2513755, 2570308, 2634532, 2704426, 2782522, 2869808, 2965312, 3071077, 3188860, 3326570, 3475620, 3645005, 3834747, 4047541, 4275618, 4508852, 4730924, 4919186, 5050352, 5100307, 5062776, 4934545, 4732532, 4487342, 4232010, 3988837, 3774186, 3596016, 3448857, 3331448, 3237295, 3161316, 3099445, 3047026]
5256C047026m7421l9215l1453k6750j9371j2972j1446n835n724j190k028L268
5244B846889P184J0049P771O963J2754J6155J6717K0082K1246J9529K3468K3190
5232C031997J9991K2970K5552K0819K2387J7258J8915K1842K1850K1763K4223
5221C269567K4161K1124K2797K7198K1920J9982K0230K2445K4502K5997K4401
5210C524324K6537K8727K8808L0805L0793L2086L1384K8779K8547K3529K6338
5199C840657L0541L0415K9393L0341L7097L5847L1065L4023L2348L2605L4506
5188D198838L5262L5157L8068L8687L9481M2669M2859L9013M3469M5923M5616
5177D645042M4822M5440M6564M4763M3216M5634M4096M5978M3680M3639M2536
$$ y = [3047026, 2999605, 2960390, 2928937, 2902187, 2882816, 2869844, 2858398, 2852563, 2846839, 2845649, 2843621, 2846889, 2854073, 2864122, 2871893, 2878856, 2891610, 2907765, 2924482, 2944564, 2965810, 2985339, 3008807, 3031997, 3051988, 3074958, 3100510, 3121329, 3143716, 3160974, 3179889, 3201731, 3223581, 3245344, 3269567, 3293728, 3314852, 3337649, 3364847, 3386767, 3406749, 3426979, 3449424, 3473926, 3499923, 3524324, 3550861, 3579588, 3608396, 3639201, 3669994, 3702080, 3733464, 3762243, 3790790, 3814319, 3840657, 3871198, 3901613, 3931006, 3961347, 3998444, 4034291, 4065356, 4099379, 4131727, 4164332, 4198838, 4234100, 4269257, 4307325, 4346012, 4385493, 4428162, 4471021, 4510034, 4553503, 4599426, 4645042, 4689864, 4735304, 4781868, 4826631, 4869847, 4915481, 4959577, 5005555, 5049235, 5092874, 5135410]
5166E135410M4207M0251M6807M8999M7023M4836M5489N1228N3486N4757N7825
5155E670318O6093O2227O6417O6234O3241O3646O6201O8788P4472P7375P4404
5144F419416Q1032P8169Q3960P8393P7353P5962P3880P5370Q0066Q1482Q0920
5133G286003Q8034R0823R1142R5454J03833J01392J01385J01822R8492Q9354Q9582
5122H337316Q7465Q7908R2327R2970Q5229Q6681Q5644Q9149Q8180R1950R5208
5111I320027J01741J00945J15120J22404J27170J25027J22415J24115J26575J17829
5101A0503368J17290J22601J26806J34485J35016J31143J28914J39686J48430
5092A1687739J50585J53193J51773J47053J41003J42708J51976J67385J80203
$$ y = [5135410, 5179617, 5219868, 5266675, 5315674, 5362697, 5407533, 5453022, 5504250, 5557736, 5612493, 5670318, 5736411, 5798638, 5865055, 5931289, 5994530, 6058176, 6124377, 6193165, 6267637, 6345012, 6419416, 6500448, 6578617, 6662577, 6740970, 6818323, 6894285, 6968165, 7043535, 7123601, 7205083, 7286003, 7374037, 7464860, 7556002, 7651456, 7755289, 7856681, 7958066, 8059888, 8158380, 8247734, 8337316, 8424781, 8512689, 8605016, 8697986, 8783215, 8869896, 8955540, 9044689, 9132869, 9224819, 9320027, 9421768, 9522713, 9637833, 9760237, 9887407, 10012434, 10134849, 10258964, 10385539, 10503368, 10620658, 10743259, 10870065, 11004550, 11139566, 11270709, 11399623, 11539309, 11687739, 11838324, 11991517, 12143290, 12290343, 12431346, 12574054, 12726030, 12893415, 13073618]
5083A3073618J87301J91817J94144J94795J99447K08733K10179K11734K24704
5074A4896472K33658K41267K56201K69332K80169K81228K80414K79154K89354
5065A7307249K98543L11631L29091L54588L78920M01110M20596M34775M41000
5056B0677503M36998M44101M74630N17338N42806N34625N23124N45958N79858
5047B5276941O01883O12482O10114N97547N58309N23260M97378N07980N41122
5038C0327016N72797N80090N86270N96408O19528O77863P13716P39870P83798
5029C6197356Q13771Q31714Q58271Q82027R29555R91213J013130J034206J091153
5020D4642396J171834J248074J273368J250071J199983J182490J214108J284189
$$ y = [13073618, 13260919, 13452736, 13646880, 13841675, 14041122, 14249855, 14460034, 14671768, 14896472, 15130130, 15371397, 15627598, 15896930, 16177099, 16458327, 16738741, 17017895, 17307249, 17605792, 17917423, 18246514, 18601102, 18980022, 19381132, 19801728, 20236503, 20677503, 21114501, 21558602, 22033232, 22550570, 23093376, 23628001, 24151125, 24697083, 25276941, 25878824, 26491306, 27101420, 27698967, 28257276, 28780536, 29277914, 29785894, 30327016, 30899813, 31479903, 32066173, 32662581, 33282109, 33959972, 34673688, 35413558, 36197356, 37011127, 37842841, 38701112, 39583139, 40512694, 41503907, 42517037, 43551243, 44642396, 45814230, 47062304, 48335672, 49585743, 50785726, 51968216, 53182324, 54466513]
5012E4466513J314071J299668J309645J337686J317496J329566J461966J594260
5004F5430871J658795J693742J702869J683478J683589J703895J776534J829038
4996G9162811J872293J992359K052197J960137J973806K159332K416497K695672
4988I6285104K925834L175022L519472L838663M129350M485208M865301N363973
4980A28587927N954659O459203O867059P368345Q210305R273961J0260219J1008086
4972A93989764J1479907J1942398J2623529J3623541J4747570J5687357J6298318
4965B90392384J5959072J4342546J2115178R350221N824653J288416l941726r352858
4957C35977886j4455442j7851986j9030676j8640938j7592018j6189737j4830473
$$ y = [54466513, 55780584, 57080252, 58389897, 59727583, 61045079, 62374645, 63836611, 65430871, 67089666, 68783408, 70486277, 72169755, 73853344, 75557239, 77333773, 79162811, 81035104, 83027463, 85079660, 87039797, 89013603, 91172935, 93589432, 96285104, 99210938, 102385960, 105905432, 109744095, 113873445, 118358653, 123223954, 128587927, 134542586, 141001789, 147868848, 155237193, 163447498, 172721459, 182981678, 193989764, 205469671, 217412069, 230035598, 243659139, 258406709, 274094066, 290392384, 306351456, 320694002, 332809180, 342159401, 347984054, 349272470, 345330744, 335977886, 321522444, 303670458, 284639782, 265998844, 248406826, 232217089, 217386616]
4950B17386616j3548910j2169071j1005124j0230819r730333r260688q681520
4943A42760151q006612p362729o786110o297088n837187n396873m982313m612431
4935I3478808m302388m036470l759643l511399l293210l087483k881310k710724
4927F5896181k577355k459834k351684k244777k126824k001102j872743j758502
4919D8503360j661691j591600j540440j470955j388992j303450j235138j170041
4911C7141053j097880j047631j017635r85751r37518q86048q45734q26530q21013
4902B8675313q13665p95554p69333p37222p05202o81224o55739o34485o20150
4893B2262739o00061n79189n58264n29178n09624m84807m65318m47354m34502
$$ y = [217386616, 203837706, 191668635, 180663511, 170432692, 160702359, 151441671, 142760151, 134753539, 127390810, 120604700, 114307612, 108470425, 103073552, 98091239, 93478808, 89176420, 85139950, 81380307, 77868908, 74575698, 71488215, 68606905, 65896181, 63318826, 60858992, 58507308, 56262531, 54135707, 52134605, 50261862, 48503360, 46841669, 45250069, 43709629, 42238674, 40849682, 39546232, 38311094, 37141053, 36043173, 34995542, 33977907, 32992156, 32054638, 31168590, 30322856, 29496326, 28675313, 27861648, 27066094, 26296761, 25559539, 24854337, 24173113, 23517374, 22882889, 22262739, 21662678, 21083489, 20525225, 19996047, 19486423, 19001616, 18536298, 18088944, 17654442]
4884A7654442m18578m07026l93560l74500l61310l45085l37347l28467l18415
4875A4370154l09838k92743k80670k73367k65863k61569k61350k50395k38719
4866A1935640k37505k27506k15285k14741k03324j96192j96752j87995j84542
4857A0071798j81526j72624j67095j65349j64486j64247j52760j51021j46135
4848H606555j46026j46615j37066j36258j35939j29753j31060j30392j26738j21414
4838G265294j18042j18788j10777j08733j08737j05517j04675r6714r6947r6184
4828F200180r5172r4965r2507q6756q8540q6033q7459q8640q4202q5355q0908
4817E229643q2013p9774p8003p8644p6328p6347p7421p3836q0941p9681q0168
$$ y = [17654442, 17235864, 16828838, 16435278, 16060778, 15699468, 15354383, 15017036, 14688569, 14370154, 14060316, 13767573, 13486903, 13213536, 12947673, 12686104, 12424754, 12174359, 11935640, 11698135, 11470629, 11255344, 11040603, 10837279, 10641087, 10444335, 10256340, 10071798, 9890272, 9717648, 9550553, 9385204, 9220718, 9056471, 8903711, 8752690, 8606555, 8460529, 8313914, 8176848, 8040590, 7904651, 7774898, 7643838, 7513446, 7386708, 7265294, 7147252, 7028464, 6917687, 6808954, 6700217, 6594700, 6490025, 6393311, 6296364, 6200180, 6105008, 6010043, 5917536, 5830780, 5742240, 5656207, 5568748, 5480108, 5395906, 5310551, 5229643, 5147630, 5067856, 4989853, 4911209, 4834881, 4758534, 4681113, 4607277, 4526336, 4446655, 4366487]
4806D366487q5226q5765r0407q7291q6489q3479q3268p7961o2616n7733n1602
4795C514650m4413l5105k9058k4685k0805j4208j9806k7854k5213k6066k8577
4784C218860k7967k6531k6621k5982j9862k5273k7507k6976k1515k2702j9986
4773B947938k4661k3542j8852k1676j9648j6403j6590j7640k0446j8310k2332
4762B727838k6283k6338k5405k6456k4931k3635k4388k3735k2945j8675k1181
4751B463866k1151j8512j4825j7252j3691j5645j1734j3499j5786j5833j3355
4740B292583j4120j8116j5114j5411j1588j3242j6593j3079j1658j3599j6780
4729B133283j1094r599j1981j8305j5834j4416j3334j1746j4432j6815j3238j1855
$$ y = [4366487, 4281261, 4195496, 4105089, 4017798, 3931309, 3847830, 3764562, 3686601, 3623985, 3566252, 3514650, 3470237, 3435132, 3406074, 3381389, 3360584, 3346376, 3326570, 3298716, 3273503, 3247437, 3218860, 3190893, 3164362, 3137741, 3111759, 3091897, 3066624, 3039117, 3012141, 2990626, 2967924, 2947938, 2923277, 2899735, 2880883, 2859207, 2839559, 2823156, 2806566, 2788926, 2768480, 2750170, 2727838, 2701555, 2675217, 2649812, 2623356, 2598425, 2574790, 2550402, 2526667, 2503722, 2485047, 2463866, 2442715, 2424203, 2409378, 2392126, 2378435, 2362790, 2351056, 2337557, 2321771, 2305938, 2292583, 2278463, 2260347, 2245233, 2229822, 2218234, 2204992, 2188399, 2175320, 2163662, 2150063, 2133283, 2122189, 2112590, 2100609, 2082304, 2066470, 2052054, 2038720, 2026974, 2012542, 1995727, 1982489, 1970634]
4717A970634r759j2139j3288j5355j2592j2290j2143r352q512q593q855j1339
4705A836417r193r165j0571o195n748o047o390p703l884n007l986n843l201l037
4691A750447n001K434k955K8J441m53L144Lj004J036J892J216P31K013K532M98
4675A758002j58Q861Q007N815Q577Q503R774J4865J8126K3530K6607L0823M0110
4662A961442N0642N3921O7542Q0198R2275J05982J24722J45627J67995J89382
4652C039728K12473K24730K19705J90857J41737O6001k8735j25171j97999k50363
4642C492963k65731k58111k41510k05814j72122j48445j26859j06974r0398p9350
4632A797649p5636o3394n8324n2857n3107m2932l7253l7385l4712l1815l0606
$$ y = [1970634, 1960875, 1948736, 1935448, 1920093, 1907501, 1895211, 1883068, 1873716, 1865204, 1856611, 1847756, 1836417, 1827224, 1818059, 1807488, 1801293, 1795545, 1789498, 1783108, 1775405, 1771521, 1766514, 1762528, 1756685, 1753484, 1750447, 1745446, 1747880, 1744925, 1744953, 1746394, 1745941, 1749085, 1749088, 1748084, 1749120, 1751012, 1752228, 1752959, 1754972, 1757504, 1758002, 1757844, 1766705, 1774712, 1780527, 1789104, 1797607, 1807381, 1822246, 1840372, 1863902, 1890509, 1921332, 1961442, 2012084, 2066005, 2133547, 2213745, 2306020, 2412002, 2536724, 2682351, 2850346, 3039728, 3252201, 3476931, 3696636, 3887493, 4029230, 4095231, 4066496, 3941325, 3743326, 3492963, 3227232, 2969121, 2727611, 2521797, 2349675, 2201230, 2074371, 1967397, 1876999, 1797649, 1722013, 1658619, 1600295, 1547438, 1494331, 1451399, 1414146, 1376761, 1342049, 1310234, 1279628]
4621A279628k8889k5934k1974k4219j9663j8842k2589k2681j7342j6476j4299
4610A046720j6882j5817j0754j2602j4837j0390r727j2414j0894r058r675r954
4598I03716j1841r867j1767j2075k461p698o509q534j0398n154m954j0570r871
4585G92017p814l306q497r514n881n138n919p892n800l942l756k457q509p701
4571G05891p296m768n111q303o537l006n846j0497n887k679m721m376n585l257
4557F28022l734n192k907q856m925l211j447m304n557l704k940p428o312p73k803
4542E63929l052l453m572m553l180j373n356l343j295m262l597k643o37n679n420
4527E11514j704m294m743j667l644k984q74m500l090n851m209r93k926j191k180
$$ y = [1279628, 1250739, 1224805, 1202831, 1178612, 1158949, 1140107, 1117518, 1094837, 1077495, 1061019, 1046720, 1029838, 1014021, 1003267, 990665, 975828, 965438, 955711, 943297, 932403, 923345, 913670, 903716, 891875, 882008, 870241, 858166, 855705, 848007, 841498, 832964, 822566, 817412, 812458, 801888, 792017, 784203, 780897, 772400, 762886, 757005, 751867, 745948, 738056, 732256, 728314, 724558, 722101, 713592, 705891, 698595, 693827, 688716, 680413, 673876, 670870, 665024, 654527, 648640, 645961, 641240, 636864, 631279, 628022, 624288, 619096, 616189, 607333, 602408, 599197, 597750, 593446, 587889, 584185, 581245, 573817, 567505, 566732, 563929, 560877, 557424, 552852, 548299, 545119, 543746, 538390, 535047, 533752, 529490, 525893, 523250, 522613, 516934, 511514, 509810, 505516, 500773, 499106, 495462, 492478, 491604, 487104, 484014, 478163, 473954, 472961, 470035, 468844, 466664]
4512D66664m039m689o59l880k571J968k649m192k820j551l035j567l684k465k418
4497D28413l022k713O91l669k833j60j293l387m093k483q94k519l311l396n390
4482C89941m794K161j526j816l093k023j644k019k742o83j243j108j365m529n13
4467C63004j75j025o476m478Q40J260l213j447l68Q75l637n228j585P46l133o89
4451C35271q77k089l244O06m28l274l916Q08n70k463l157k942j135p29j842J084
4435C11103l794m279O19j099k856l120J396m54l353j258Q66k765l766m831J780
4420B84189K759l148L59j071o93m8j839k696j163O6l93m901j280k794j410j257
4404B64680k098j165j372k832P12J476m498r34k1R06j971j3l611l873j239l25
$$ y = [466664, 462625, 457936, 457277, 453397, 450826, 452794, 450145, 445953, 443133, 441582, 438547, 436980, 433296, 430831, 428413, 425391, 422678, 423369, 419700, 416867, 416707, 415414, 412027, 407934, 405451, 404557, 402038, 398727, 395331, 389941, 385147, 387308, 385782, 383966, 380873, 378850, 377206, 375187, 372445, 371762, 370519, 369411, 368046, 363517, 363004, 362829, 361804, 355328, 350850, 351690, 352950, 349737, 348290, 347922, 348797, 345160, 339932, 338347, 339093, 335960, 335271, 334394, 332305, 329061, 329667, 329239, 325965, 322049, 322857, 322287, 319824, 316667, 313725, 312590, 311861, 310019, 311103, 307309, 303030, 303649, 302550, 299694, 296574, 297970, 297516, 294163, 292905, 293771, 291006, 287240, 282409, 284189, 286948, 283800, 284159, 283088, 282395, 282347, 280508, 277812, 276649, 276715, 276322, 271421, 270141, 267347, 265937, 264680, 262582, 261417, 260045, 257213, 257925, 259401, 254903, 253969, 253948, 254854, 252883, 252870, 249259, 245386, 244147, 243822]
4388B43822l178j905n59p53K18J8J077Q50l590k179o45m015l44j514J086j220
4372B27169l635J762k116j368J035j748k391J125j299p07j980O66N44k625l319
4357B11113j99J069n185j680O61k393K391q47j292J334n40j362j171N31k468k991
4341A96971O8p27N15M93l264k857k587r11r6R68K551l097M30l433K403l146l056
4324A81225P58k021j211N24J836q05J788m122k276Q38j44p78j275P69O14k793
4308A72927l74o38j180k22j046j72k227k657k89J458j498o38j343K53K623J466
4292A66443m636j493Q75k695o07n23j158J09k817k260Q8k531K422O39J648k560
4276A50944m818J014K414m181J78j516Q19j542K309k407k5n80j013k740j223j165
$$ y = [243822, 240644, 238739, 238180, 237427, 237645, 237663, 238740, 239590, 236000, 233821, 233176, 229161, 228817, 227303, 228389, 227169, 223534, 225296, 223180, 221812, 222847, 221099, 218708, 219833, 218534, 217827, 215847, 216513, 217057, 214432, 211113, 210914, 211983, 206798, 205118, 205779, 203386, 205777, 204930, 203638, 204972, 204432, 203070, 201899, 202430, 199962, 196971, 197039, 196312, 196827, 197320, 194056, 191199, 188612, 187701, 187605, 188573, 191124, 188027, 188457, 185024, 187427, 184281, 181225, 181983, 179962, 178751, 179275, 181111, 180306, 182094, 177972, 175696, 176534, 176390, 175612, 174337, 175106, 175720, 172927, 172553, 171915, 170735, 170513, 169467, 169295, 167068, 164411, 164122, 165580, 164082, 163444, 162101, 162354, 164977, 166443, 161807, 160314, 161189, 158494, 157887, 157364, 156206, 156315, 153498, 151238, 151326, 148795, 151217, 151856, 153504, 150944, 146126, 147140, 149554, 145373, 145551, 144035, 144854, 143312, 145621, 143214, 143189, 142609, 141596, 138856, 137633, 136468]
4260A36468q2M56j684J689n18j502L17J460j605k17J646p16m530j515L311j643
4244A31335j448l54l702l09k058L251K679n02K97l603J162k036k649jJ291j113
4228A22240j266j116j268o33L539j6j377%l935Q8k331J955J452j044k448j01R34
4211A14673J175q30j204r38j782J621K577j091K186n63j551r09l326o77n11n574
4195A03276J443k154j750m153L265J308k280Q29K36P59K859j212n78J050l960
4180I8938m17j598J1j475j952k32Q71K095J250Nk857J161R44j649q68R87j547
4163I3667k392J50K17o21P81l762k587O74K300J625L356k76Q45j200j916j665
4147H9196j643j417j648j004r74l153l333K623Q06N333l145L735j333J474K00
$$ y = [136468, 136386, 136842, 135158, 136847, 136329, 134827, 135144, 136604, 134999, 134782, 136428, 135712, 131182, 129667, 132978, 131335, 129887, 129533, 125831, 125522, 123464, 126715, 129394, 128892, 129189, 125586, 126748, 124712, 122063, 122062, 123353, 122240, 120974, 119858, 118590, 117957, 121496, 121480, 120103, 120103, 116168, 116256, 113925, 115880, 117332, 116288, 113840, 113739, 114673, 115848, 115018, 113814, 112876, 111094, 112715, 115292, 114201, 116387, 115824, 114273, 113364, 110038, 109361, 108850, 103276, 104719, 102565, 100815, 96662, 99927, 101235, 98955, 99784, 100020, 100779, 103638, 102426, 101848, 102898, 98938, 98521, 96923, 96934, 95459, 93507, 93275, 94146, 96241, 97491, 97496, 94639, 95800, 96744, 95095, 94227, 95214, 93667, 91275, 91425, 91642, 91021, 91802, 88040, 85453, 86127, 88427, 90052, 93408, 93132, 93977, 92777, 90861, 89196, 87553, 86136, 84488, 83484, 82510, 79357, 76024, 78647, 79453, 84786, 81641, 85376, 84043, 85517, 85717]
4132H5717j29K779m29k903j838l818l706p79l236o84M11k361O4M231K679N46K159
4115G8703J369L288L67L086q4m505p13k416j902l740K020M235k430K370R16o76
4099G9888j712J249j002k424k065n353k033k454O85l167Q72J365L669L687J308
4084G2513K007j641k32N91j250J192l425k660J726J019l470l012k286o63j074
4069E9335k77L862J450K372O58J885j62o67J440J656k211m446L84O94m70p75m793
4052E9935n47J151M315j11l071J962J166j903l405L462k307o26j776m92j979j498
4036E4276N01K528K258P27J728k338J908j016K04l549l80j578k852J103k285j601
4020D9634J552J744k146J108K720o17K218j740k208j867q8K483j614l077l37J824
$$ y = [85717, 85588, 88367, 87938, 85035, 83197, 79379, 75673, 74894, 71658, 70974, 71385, 69024, 69088, 73319, 75998, 76544, 78703, 80072, 83360, 83727, 86813, 86729, 82224, 81511, 79095, 77193, 73453, 75473, 79708, 77278, 79648, 80564, 79888, 78176, 79425, 78423, 75999, 73934, 68581, 66548, 64094, 64779, 61612, 62484, 63849, 67518, 71205, 72513, 74520, 72879, 72647, 73238, 71988, 73180, 69755, 67095, 68821, 69840, 66370, 63358, 61072, 60409, 59335, 59058, 62920, 64370, 66742, 67400, 69285, 69123, 68456, 69896, 71552, 69341, 64895, 65279, 65973, 65503, 64728, 59935, 59388, 60539, 64854, 64743, 61672, 63634, 64800, 62897, 59492, 62954, 60647, 60021, 58245, 57753, 55774, 54276, 54777, 57305, 59563, 60290, 62018, 59680, 61588, 60572, 60776, 57227, 56847, 55269, 52417, 53520, 51235, 49634, 51186, 52930, 50784, 51892, 54612, 53995, 56213, 54473, 52265, 50398, 50310, 52793, 51179, 48102, 47765, 49589]
4004D9589j541J56k596j501L733J429J649R7j351J866L50l37M67l841j434J323
3988D8058n90K271n391J65M159r84M24r85r03N99m85J308j476k369K901q77k137
3971D3688K382j90j030q44l157N00L937j634m149K00m0j617p98L447P5L653j951
3954D2472k077k187J694K218j478j209k441K987j533K422j898J111k61q04k717
3939C6299J81O13k77k127R36Q60K637K16j067J479j134j146j699R22Q01k69q12
3922C6413P37M22l505R64K422j403K387J02m58n34k112O80j782J142O96j195j397
3905C3579k243J376J28J866k318R91n16J88j361m68j461L138k573k26J469O35
3889C2204j39k614j019J427o83N61k581J315M339l449J67n86O08N378j379m886
$$ y = [49589, 48048, 48204, 45608, 44107, 47840, 49269, 50918, 51015, 49664, 51530, 51880, 51543, 52010, 48169, 46735, 48058, 47468, 49739, 44348, 44513, 48672, 47688, 48112, 47127, 46224, 46823, 46338, 47646, 46170, 43801, 46702, 45825, 43688, 46070, 45880, 44850, 44006, 40849, 41349, 45286, 43652, 39503, 39703, 39663, 38046, 37248, 40695, 40770, 44423, 42472, 40395, 38208, 39902, 42120, 40642, 39433, 36992, 39979, 38446, 40868, 38970, 40081, 39820, 39016, 36299, 36480, 37093, 36816, 34689, 35625, 36485, 39122, 39338, 38271, 39750, 38616, 37470, 35771, 36693, 37494, 37225, 36413, 37150, 37572, 34067, 35031, 37453, 36050, 38437, 38539, 38081, 37547, 35435, 36115, 34333, 35475, 36171, 34976, 33579, 31336, 32712, 32840, 34706, 32388, 33379, 32863, 33051, 31690, 31222, 29761, 32899, 30326, 30100, 31569, 32204, 32065, 29451, 28432, 29859, 29176, 29737, 27156, 28471, 32810, 29361, 29528, 28942, 29550, 34928, 33549, 28663]
3873B8663k399j336L363M220j957N20k043j826K173M30J240j213J887r96p61q25
3857B9140k66P56J503m65Q84k92k346k881J649k354J076K295N10O84j327L011
3841C1577j969k657j855J053M532K163r18k067j705k34K771j215k015J441l406
3826B5496k515J909J145J213j232J598m42L148k12l048K219l179M25l51K669K796
3810C1639j505k596l204K332J870K665j24M06K11k31r45J519P91j098r79m52K060
3793C2359O54j686k522K09L83K150l052k629R01J045Q9o8j398J321j06L10P34
3776B8694K194j717P51L754L17J134j092J517K541J068j396j432r54J990k462
3761C4907j491O04m899k281J873J234L870j323K91K899k580j113j134p13R77J616
$$ y = [28663, 26264, 24928, 28291, 32511, 30554, 31074, 29031, 27205, 29378, 29808, 31048, 29835, 31722, 30726, 29965, 29140, 28874, 29630, 31133, 30668, 31552, 31260, 28914, 26033, 27682, 25328, 26404, 28699, 29209, 29893, 28566, 31577, 29608, 26951, 25096, 26149, 30681, 32844, 31926, 29859, 28154, 27920, 30691, 29476, 27461, 28902, 25496, 22981, 24890, 26035, 27248, 26016, 27614, 27172, 30320, 30108, 27060, 29279, 26100, 26525, 26174, 28843, 31639, 30134, 27538, 24334, 26666, 28536, 31201, 31077, 31483, 31694, 31463, 30518, 32037, 32828, 31730, 30751, 30299, 32359, 33013, 31327, 28805, 29014, 29397, 31547, 28495, 25866, 26767, 27812, 27901, 27833, 26435, 27756, 27650, 27960, 28694, 30888, 29171, 29922, 33676, 33993, 35127, 34035, 35552, 38093, 39161, 37765, 36333, 35379, 37369, 34907, 33416, 34020, 29121, 26840, 28713, 29947, 33817, 32494, 32785, 35684, 33104, 31991, 30857, 30144, 31121, 32737]
3745C2737N35L107o29l227O262k71L7K943O68J038j190n02P94m29j180j60r34
3728C9599q25n83k059K126K50k141l021J63R39m376J078J640J226j256Q97J980
3712C5637l315l643J186O81K15J52J711m84J850J030j530R33n7k098j384j197
3696B9687l97O62l828j813j840j079J800J448k492J07J998p44j832k848K74J773
3680B0876m00l91j621j376J733k240J199J641N05o92l85l15k027J207j176J264
3664A7802N36k368J625q60J348J891k781r38K713j715l678J19J347q77l045Q86
3648A2005J528M5n47M698p39k733L339J684l153j897r8J146j16j583j570N48K009
3631A4566j736k743O57K052j749j7J742J277J840L79k450m47J50j039j74j016
$$ y = [32737, 33272, 36379, 35750, 32523, 38785, 38514, 38551, 41494, 42162, 43200, 42010, 41508, 42302, 41873, 40693, 40533, 39599, 38774, 38191, 36132, 38258, 38508, 36367, 33346, 33509, 34448, 30072, 31150, 32790, 34016, 32760, 33657, 35637, 32322, 28679, 29865, 30546, 30761, 30913, 32624, 32140, 33990, 35020, 33490, 34423, 34366, 32268, 30884, 29687, 29290, 29952, 26124, 24311, 22471, 21392, 23192, 24640, 22148, 22255, 24253, 23509, 21677, 18829, 19103, 20876, 20476, 20085, 18464, 17088, 18821, 16581, 17780, 19421, 19926, 19234, 18849, 18534, 16507, 17714, 16538, 17802, 18338, 15970, 17595, 16735, 18083, 19974, 17193, 16255, 18968, 17253, 13575, 13694, 15041, 14164, 11119, 12005, 13533, 13578, 13031, 17729, 16990, 14257, 17596, 19280, 16127, 14230, 14132, 15278, 15162, 13579, 12009, 12557, 14566, 12830, 10087, 10744, 12796, 11047, 11030, 12772, 14049, 15889, 16268, 13818, 13371, 13521, 12482, 12308, 11292]
3615A1292j743J556j317J414L77k24k338k063K196M400J592k271j844J057k515
3600I569j149P99p51J617r81R49m73L00q93K156k221Q62l39N82R06j98l39J827
3582A2223j516Q3L292n037j114L100Q36P11p76k948J88m06r95J459J270K08m66
3565A0112l459O49J026J367L568Q54j756n2k839Q68j018l080J068k3j91J191j8
3548H267O79R42j163M87J58o05j479k622Q44J279m97n65J397j67l46k485P56r39
3530C941J131L036J78J116j413j363J139j6j809K92m05O85K604P05l228m072K854
3513E375O61j712K759J16P34k366j09j657K188l56r09K56J308J085k347K572k03
3496G395m79K9n89J453j375M99j03J985l938k90J072J359k294j484M342J843k865
$$ y = [11292, 9549, 11105, 9788, 11202, 11579, 11355, 9017, 6954, 9150, 13550, 15142, 12871, 11027, 12084, 9569, 8420, 9219, 8468, 10085, 9104, 10053, 9580, 9880, 8987, 11143, 8922, 9784, 9445, 10027, 10933, 10735, 10396, 12223, 10707, 10790, 14082, 9045, 7931, 11031, 11867, 12578, 11802, 8854, 9042, 8636, 7641, 9100, 10370, 10578, 10112, 6653, 7302, 8328, 9695, 13263, 14117, 12361, 12309, 9470, 10338, 9320, 6240, 7308, 7285, 7094, 8285, 8267, 8946, 9888, 8725, 9212, 9370, 8765, 7286, 4664, 5508, 6787, 6290, 5725, 7122, 6955, 6609, 4124, 4880, 3941, 5072, 8108, 8286, 9402, 7989, 6626, 7765, 7749, 5940, 6232, 5827, 6512, 9116, 9821, 6593, 2521, 5375, 6036, 4324, 7083, 7199, 7933, 5567, 5458, 3801, 5989, 5633, 4724, 4980, 6288, 7373, 5026, 7598, 7395, 6916, 6945, 6356, 7809, 6434, 6933, 6830, 8815, 4877, 4587, 5659, 7018, 4724, 3240, 7582, 9425, 6560]
3479F560k663J272J111n69k409J410j792p47J922L0M333l89k272J349j736L396
3463H806k74j423j671J012j396Q33J055K862j192k216j049o74J186k58k701L051
3447E951J747l222J888K135r30j464j578J426J842J139k875j566R89R75K62r3
3431F626M609j771L20j173k344K109K66k178J385J094K440O5j401R11P28k285
3415I401K667M471j521m101J439l64j638j147K43K791M7j981j448N30j054O5N013
3398A3413P85J297K128k78m99J147M22o276R65k679j945Q30p80j84K030k109j336
3381F931J775J395k324j15M29q44J015j960q24M64r92k310K329p87l606J987J583
3364D146o54l31o62J691Q91P89K19q58j365j357j802k550L379J667m0L04j720
$$ y = [6560, 3897, 5169, 6280, 5711, 3302, 4712, 2920, 2173, 4095, 4125, 8458, 8069, 5797, 7146, 5410, 8806, 8532, 7109, 5438, 6450, 5054, 5887, 6942, 9804, 8612, 6396, 5347, 4673, 5859, 5601, 2900, 5951, 7698, 4476, 6364, 8499, 7569, 6105, 4527, 5953, 7795, 8934, 6059, 4493, 5482, 6457, 6719, 6626, 11235, 9464, 9784, 8611, 6267, 8376, 8642, 6464, 7849, 8943, 11383, 11448, 10047, 10958, 11686, 9401, 12068, 16539, 15018, 10917, 12356, 11992, 10354, 9207, 9450, 12241, 12288, 10307, 8859, 9389, 8335, 8400, 13413, 14198, 15495, 17623, 17345, 16846, 17993, 18415, 12139, 13104, 10425, 8480, 9310, 8530, 8346, 10376, 8267, 6931, 8706, 10101, 7777, 7662, 8091, 7247, 8262, 6302, 5478, 5942, 4950, 2640, 4969, 4182, 576, 2563, 4146, 3492, 3161, 2499, 4190, 5081, 5870, 6089, 5231, 3866, 2509, 707, -1843, 1536, 3203, 3163, 3467, 1747]
3347A747N59Q46k252K709K39J638N50n185R27K165j237k869j392J001J322p27
3331D1J544J806j1k874k425K973k71k276Q19P16N92o32R44K422j444k443k085
3314b604q27j858K51M075J145K559l174L72J95k270J003L868l59k784n86m223
3298e217J764J711L89M617q45P75k412J191O30m892k09J085R49J502J236j44j147
3281I83m23m170K67l78J08P19n56N179j826l100n91K670J30n33Q68j458L608k588
3263a091p26P18l283L262p94j832m20K316n78N74J042m4R4J880k039j531k340
3246d792J820Q37l828P04K509l09k85R13k031K453N70P78j464L371k135l676K333
3229b232R06j204J266L064k821k706J607j546j882L833J892j273Q88Q73j779j502
$$ y = [1747, 2306, 3152, 900, 3609, 3848, 5486, 6036, 851, 1778, 3943, 2706, -163, -1555, -554, 768, 41, 1585, 3391, 3380, 506, -1919, 1054, 783, -1493, -674, 42, 634, 2, 946, 3368, 1924, -519, -2604, -3431, -5289, -5038, -963, 182, 2741, -433, -61, 134, -2136, -1133, 2735, 2376, -408, -994, -5217, -3453, -1742, -1353, 3264, 2419, 3194, 782, 1973, 2603, -2289, -2498, -1413, -464, 1038, 2274, 2130, 983, 560, -3610, -3343, -3721, -3613, -2894, -3450, 1729, -97, -3197, -3788, -1118, -988, -1521, -653, -2111, 1497, -1091, -1817, -1099, -4382, -1120, -1914, -3746, -4166, -1850, -2428, -1854, -812, -856, -762, 1118, -921, -2452, -4792, -2972, -2135, -5963, -5259, -2750, -3059, -3344, -2431, -4462, -2009, -1439, -661, -2125, 1246, -889, -4565, -2232, -1326, -2530, -1264, 1800, -1021, -3727, -2120, -3666, -5548, -1715, 177, -1096, -208, 665, -1114, -2616]
3213b616J254J369L253k71j523m44j744r01j11J289j616M102Q49m152K38K606
3197A582j963K94k250j450K386P63k995j056M06K289l81k663J416K466k63m19
3181a838R23K230j244r05J342m036j527R64J503P06j334J969k108J338J550k2
3165d89j651l55k42Q99l904l463O484J63J720j338l997J627K005k53k25k26J155
3148b090k154r37p00N149J194m279k989P98oo90r08K352K482M71J441j626n17
3131c009J47p31l029R34J712P6L38J214L35J609r58P36j769q09J418j423j704
3114d913J069L467Q74J020o1q91m460K511j209j816J196j817J133P5j786R77J263
3097c368J516j355l77j17Q79K69K048j278q72j009Q15j798k580L361j065Q59J669
$$ y = [-2616, -1362, 7, 3260, 2989, 1466, 1022, -722, -1623, -1734, -445, -2061, 2041, 2890, -1262, -1024, 1582, -381, -87, -2337, -3787, -1401, -638, -3633, -4689, -4283, -1994, -2375, -5038, -3622, -1156, -1419, -1838, -915, 1315, 71, -834, 508, -3528, -5055, -4091, -2588, -1882, -3216, -1247, -3355, -2017, -467, -489, -2140, -2495, -2737, -1838, -5742, -9205, -2721, -2558, -838, -2176, -6173, -4546, -2541, -2794, -3019, -3245, -2090, -4244, -5181, -5881, -732, 462, -3817, -6806, -6008, -6014, -6704, -7612, -5260, -2778, -2307, -866, -2492, -3009, -2862, -3593, -6622, -5688, -3976, -3900, -3562, -2348, -2013, -404, -1362, -626, -2395, -3204, -1786, -3209, -4913, -3844, -377, 497, 1517, 1456, 565, -3895, -1384, -2593, -4409, -3213, -5030, -3897, -3822, -5608, -4631, -3368, -1852, -3207, -3584, -3701, -2822, -2553, -505, -1783, -2655, -3664, -2849, -4647, -7227, -3866, -4931, -4072, -2403]
3080b403K115p39n67J091l292n91k58J294j7R20k17q95M9L71J37J911j802L90
3062b503k030J373J248k472p08J476K193k747j806j623N019j739j173L377R67
3047a148j583N82k068qj325L27m25N64j917J579N51K79j530O43l39j48j523J555
3029e934M79L524J541L68k350l71l00r75L382k189k134j647L60K095J576j063
3013c638J546J574J356k350j122J74j361l516K539P68J221J82j227k251J79k367
2997h293J555K414p77K229J248k171J58K866k638n87K581K40j729k44O95J941
2981e12k048l19L63m223K473M688o12k353j534N53J198L9j231j643J169J059J033
2964a900j253l603K340j800n281L667K827K77M54J521k999P2L280k972K519k12
$$ y = [-2403, -288, -1027, -1594, -503, -3795, -4386, -4644, -3350, -3367, -2447, -2664, -3559, -3510, -3139, -3002, -1091, -2893, -2503, -4533, -3160, -1912, -4384, -5092, -3616, -1423, -4170, -5976, -7599, -2580, -4319, -5492, -2115, -1148, -2731, -2149, -4217, -4225, -5550, -5223, -5648, -5084, -7001, -5422, -4871, -4592, -6122, -5479, -5818, -5966, -7489, -5934, -5455, -1931, -390, -22, -2372, -2743, -3043, -4018, -636, -2825, -4959, -6606, -6246, -4151, -2575, -3638, -2092, -518, 838, -1512, -2634, -2460, -3821, -7337, -4798, -4030, -2809, -2627, -3854, -6105, -5926, -8293, -6738, -4324, -5101, -2872, -1624, -3795, -3637, -771, -3409, -3996, -1415, -1175, -2904, -3148, -2453, -512, -2560, -2879, -2516, -6739, -4266, 422, -190, -2543, -4077, -3524, -2326, -2287, -3518, -5161, -3992, -2933, -1900, -3153, -6756, -4416, -6216, -11497, -7830, -5003, -4726, -4272, -2751, -5750, -5678, -2398, -5370, -2851, -3063]
2948c063j079K84n14k682J061L079O05o2o03j813j509K121l53L397M95k110K47
2931b499j448P30J479J93O86l176K554n95k695K031J563P6k67k111R43R41J82
2914a413Q06k312J878L842j326l248Q60j064n57k194j087L915j228K21l02r00
2898d109m374J359M630J615P16p47O39l602m28L826n68L03L041l864q91J52J57
2881b145J062n68j956R91n67K492L192j458j766P78j276k849j043l74J52J425
2865c910k126J94K327J421Q12Q48L36j528Q17L171r18l227M49L459k149K132k686
2848e78j324Q4l22J967j522l07r16K021j590J09M98K15K572r80m0j67k702L62
2830b620K243j454j648K024j555J659j268K21K237L937k373o26l371m97j390N02
$$ y = [-3063, -4142, -3858, -4372, -7054, -5993, -2914, -2309, -2371, -2974, -4787, -6296, -4175, -4528, -1131, -636, -2746, -2499, -3947, -3217, -1738, -1545, -859, -4035, -1481, -2076, -4771, -2740, -1177, -1101, -1368, -3479, -2536, -1595, -1413, -607, -2919, -1041, 2801, 1475, -1773, -913, -1977, -2534, -4728, -5815, -1900, -3128, -2907, -3209, -4109, -8483, -7124, -2494, -879, -163, -910, -271, -3873, -4301, -475, -1043, -740, 2301, -1563, -2454, -2302, -2145, -1083, -1651, -3607, -2616, -3183, -691, 2501, 1043, -723, 55, -1221, -4070, -5113, -5487, -5335, -3910, -6036, -5842, -3515, -2094, -1282, -434, -98, -1626, -809, 2362, 1444, -1783, -1334, 2125, -24, 2108, -578, -1902, -1818, -2140, -173, -1695, -2002, -2918, -897, -2487, -2378, -1880, -1665, 907, -73, -113, -280, -2982, -2620, -377, -1831, -3479, -1455, -3010, -1351, -2619, -2398, -161, 3776, 1403, 777, -2594, -3091, -4481, -3979]
2814c979K522K186k189O0p94K06k13q91J671J659q59r74p89o7M100l727N1L186
2796A159p26j937J015j271l241j566J152k66m19J033M86J034k05l4p55J68K216
2779b157M69J404k732M53O05J041j576R39q54k693j533P72M213lL23J738l511
2762c102J60N01P37k6J092n68J559J61j435l905L82J814o79k570J513J016o82
2745d032j789R95O56J826q50n419K024K232j57J220l15j128j667J020N57l56J301
2728c882O98o67k410q4R33Q6J033r32K928K272l672j55K501k124J47K879J231
2711G82R73k344j395k067J404k419J466j615M59l470K492R85J066j699K699K970
2695B87j803j327K41k300o8o56J511l32j077j211N50L41J238m17k603R0J071O26
$$ y = [-3979, -1457, 729, -1460, -1400, -2194, -1988, -2201, -3092, -1421, 238, -621, -1595, -2384, -2451, 1649, -2078, -2027, 1159, 433, -1504, -489, -1760, -5001, -6567, -5415, -5681, -6100, -5067, -4581, -3547, -3752, -3786, -4541, -4373, -2157, -1688, -284, -3016, -2563, -1958, -917, -2493, -1554, -2408, -5101, -6634, -5862, -1649, -1652, -1329, 409, -3102, -2942, -2441, -1704, -1730, -638, -1206, 353, 514, -921, -4826, -4444, -2630, -3309, -5879, -4366, -3350, -4032, -5821, -4826, -4170, -2344, -3194, -8613, -6589, -4357, -4514, -3294, -3609, -4737, -6404, -5384, -4827, -5183, -3882, -3184, -3851, -6261, -6345, -5412, -5326, -4293, -5225, -2297, -25, -3697, -3852, -1351, -3475, -3328, -449, 782, 1755, -589, -1984, -4051, -2647, -5066, -3600, -5215, -4756, -8226, -5734, -4749, -3683, -5382, -2683, 287, -1516, -2843, -2602, -4902, -4970, -5626, -4115, -4447, -5524, -6735, -6185, -5844, -4606, -5023, -7626, -7536, -6465, -5839]
2677e839q85j987K042K074j683N80J945J088q20R74j377J483j74k352J71L33k051
2660f478j395o91O125j253l085K214K314j72k91R0J813k716k402k50K437J170
2644b570k189J924J666j46j425l400O15K065R3R4j198m49R20K133l00q00q4P75
2626b276O64N11k490j682L876M45j204k352P42j867j783M317J31j182J302l398
2610f246l17J720j195m89L65J776J304R58j491r15k27J592o50j561j016L25K897
2593c170J048Q18o96K901j327j194j14M94J412q99k298K1J07K192L95j229J334
2576b05l202L88L023k270k341j680J338M359J772k467l468j823L241J63L923j27
2560F24j670l302J409K535K152l79m423P3J774j066k122K396Q53k99j678N19j562
$$ y = [-5839, -6724, -8711, -6669, -4595, -6278, -5698, -3753, -2665, -3485, -2511, -3888, -2405, -2579, -4931, -4760, -4427, -6478, -7873, -8564, -2439, -3692, -6777, -4563, -2249, -2421, -2712, -2622, -809, -3525, -5927, -6177, -3740, -2570, -4759, -2835, -1169, -1315, -2740, -6140, -5525, -3460, -3367, -3273, -4471, -4920, -4000, -1867, -2167, -2967, -3051, -2276, -1612, -1101, -3591, -5273, -1397, -952, -2156, -4508, -3766, -5633, -7416, -3099, -2968, -4150, -2848, -6246, -6563, -4843, -6038, -6527, -6162, -4386, -3082, -2124, -3615, -4530, -4757, -3165, -3815, -5376, -6392, -6067, -3170, -2122, -1304, -2000, 901, -426, -1620, -1734, -1240, 172, -727, -3025, -3004, -2897, -705, -310, -1539, -205, -3407, -3019, 4, -2266, -4607, -6287, -4949, -590, 1182, -1285, -4753, -6576, -3335, -3172, 751, 624, -1046, -4348, -2939, -404, 1748, 1369, -3054, -2981, -1207, -2273, -4395, -1999, -1146, -1445, -3123, -2604, -4166]
2543d166P3j297j379M81N51K393N02j106K687M121j244n184J516R34J922l143
2527b339l27K859q47k323J085J804P95l496L742L79l930m898K002K193L7K878
2511c86p39j465K36K037j047j702L62J109K217J561l446K404j463p76l10q05K53
2494a960J083J376l668m6K756L95l85K50j474O24L030J32k044o95l241p58J423
2477c202j241J711K865J016j686j421J090j020m39J233L10N91l1m40k845j178
2461d687K704q00l345K328j138m143K018K650J188m59p19K149l335O19L845k89
2445a414j146j312J994J560j539j629k126J779K209l057M30K573J994l326q77
2430c887j244J237q6j972O62J362P73K124p04l738K181J916Q5Q94J153l449m324
$$ y = [-4166, -4093, -5390, -6769, -6288, -5737, -3344, -2842, -3948, -1261, 2860, 1616, -3568, -2052, -1118, 804, -2339, -2666, 193, -654, -2977, -1892, -88, 707, -2789, 953, 1332, -2598, -7496, -5494, -3301, -3264, -386, -1125, -2590, -2354, -317, -1364, -3066, -2704, -1595, 622, 2183, -1263, 1141, -322, -1098, -1408, -2213, -1960, -877, 499, -3169, -3215, -459, -64, -449, -199, -1673, -1049, 1981, 2113, 69, -626, -3867, -4625, -3202, -4443, -2732, 133, 1149, -537, -1958, -868, -1888, -2327, -1094, -784, -193, -224, -664, -3509, -4687, -1983, -2783, -6128, -3800, -4938, -9081, -7063, -4413, -3225, -3684, -4403, -2254, -5589, -4970, -1125, -1414, -2560, -3872, -1878, -318, -1857, -3486, -5612, -3833, -1624, -4681, -4251, -1678, 316, -3010, -3887, -5131, -3894, -3980, -5952, -5290, -3928, -3155, -1031, -1735, -5473, -3292, -1376, -1291, -397, 756, -2693, -7017]
2413g017J548N08j072M149K20j146J13J084l375j199L400k00j588j042N261O36
2397B80j436j427j845Q81j650j44K775K975j799j523k054M470K846o52l231o98
2381b232J804m664j53l2M80J100k188K121o99L798J778l763l296K004J847m59
2365b554L563k77J100k945p76k021j4O81K20K852p3j060j238J825oj809j426J403
2347b555k304K509j731J222J297R30m57l9r30j16M37L15J4j095K162k912m93q32
2329d578o83K097p17M49L871N33l480J20O38j539j942P61J453J246p30L629J376
2312B504j567k445l261q68K047J903k057N03j204J548k012K144k945K207K373
2297a130k171o42N36j748Q98K693l00j223k80J894L978j610l437k842L401j582
$$ y = [-7017, -5469, -4961, -6033, -1884, -1664, -2810, -2697, -1613, -4988, -6187, -2787, -2987, -4575, -5617, -356, 280, -1156, -2583, -4428, -3547, -5197, -5341, -2566, 409, -1390, -2913, -4967, -497, 2349, 1697, -1534, -2232, -428, -5092, -5245, -5277, -4797, -3697, -5885, -3764, -4463, -665, 1113, -2650, -5946, -3942, -2095, -2554, 1009, 732, 1832, -1113, -1889, -3910, -3924, -3243, -3023, -171, -244, -1304, -2542, -717, -723, -2532, -3958, -2555, -4859, -2350, -4081, -2859, -1562, -632, -1089, -1128, -2058, -2174, -1737, -1422, -1408, -2503, -341, -3253, -3746, -4578, -5261, -3164, -3881, -3432, 439, 972, -2508, -2388, -1750, -3289, -5231, -4470, -3017, -1771, -2501, 1128, 2504, 937, -1508, -4769, -5637, -3590, -1687, -3744, -3241, -4445, -2897, -4909, -2765, -5710, -3503, -1130, -3301, -3943, -3407, -5155, -4257, -1564, -1864, -3087, -3367, -1473, 2505, 895, -2542, -5384, -1983, -3565]
2281c565O75J019L12r93J38L787J86o58J057k200m520O2M060L42k451J733l177
2264d193k79L77j827j703J569O15j201K984j82m21O61k476K68J144o18j49M06
2247e025J21K856K950K062r09l873k68k759K624J263k716q65j262m95J504o13
2231e405K375k81N57K97n64q35O11K298m113K927L77J176j998N66Q72k774j141
2214e055N8O08J10L358J935l202o37L71o01l846K393J554M51j107k045K670P34
2197b251j389K653j040k26k226L04K839N46j182k412J90J238r98K380M55L4l0
2180a115N72J738j059j424j325L994j071l621P52o52O62K304j929K332J551l629
2164a920j363l67J529J373o04j738Q74J042J609qk585j628R63n53j74K564J584
$$ y = [-3565, -2890, -1871, -1559, -2552, -2414, 1373, 1559, 901, 1958, -242, -4762, -4700, -640, -298, -2749, -1016, -4193, -4472, -4095, -5922, -7625, -6056, -5441, -6642, -3658, -3840, -4261, -3600, -6076, -5808, -4664, -5282, -5431, -5025, -4904, -2048, 902, 2964, 2055, -1818, -2086, -4845, -2221, -958, -3674, -4539, -5801, -6296, -4792, -5405, -3030, -3311, -2754, -2457, -3021, -3856, -3245, -947, -5060, -2133, -1756, -580, -2578, -2012, -1140, -3914, -5055, -4997, -4389, -4279, -921, 1014, -2188, -2825, -2454, -3055, -6901, -4508, -2954, -2503, -3610, -5655, -2985, -2251, -3640, -987, -2027, -2253, -4479, -4175, -1336, -790, -1972, -4384, -4194, -2956, -3954, -1574, -1119, -1085, -1115, -543, 1195, 136, -1288, -2613, 1381, 310, -3311, -2559, -3211, -2549, -245, -2174, 158, 1709, -1920, -3283, -3650, -2121, -748, -1352, -3090, -2216, -1174, 435, 427, -2158, -3786, -2823, -3376, -3550, -986, 598]
2147E98r22k126J464l109J023P93J688J956k261K29j05j239m36J81K208r53J451
2130D40L211m73j425r16j578J771l9l300L602j453j339j70R51L39J375J325m105
2113a784o20J427j231J456o75J280l24k032k017K701N94J781K138r99J119l280
2097d66j083k82J214k702k341L449L064j855J666p78j196K9K142J89k383R32R21
2080E20k219j109P32J361q65J943J066J193Q53j009M24j05k971j8o16l173L541
2063d52M152m974J519j172N97K375j318j059k217j23q36k014J671n11L045o63
2047a980J476J132J109k171m328j82J783q66J733K008q37L79R62J843l102k305
2031c346J030L614r51n98l13K860r02K8K15m1J793q23l749k67o64J876j719n56
$$ y = [598, -324, -2450, -986, -4095, -3072, -2279, -591, 1365, -896, -667, -772, -2011, -2447, -2266, -58, -1011, 440, 3651, 3178, 1753, 837, -741, 1030, 991, -2309, 1293, -160, -1499, -1669, -718, -379, 996, 2321, -1784, -2404, -977, -2208, -752, -1427, -147, -471, -2503, -4520, -1819, -1225, 556, 2694, 1695, 2814, -466, -1549, -1831, -617, -3319, -5660, -2211, 853, -1002, 664, -114, -1310, -1281, 861, 1050, -1333, -401, 520, -1699, -2808, -2076, -715, -1580, 363, 1429, 2622, 3475, 2466, 2890, 2785, -186, -204, -820, -3993, -452, 3700, -1274, 245, -927, -330, 2045, 727, -332, -2549, -2672, -3508, -5522, -3851, -4362, -1317, -1980, -504, 628, 1737, -434, -4762, -4944, -3161, -4027, -2294, -286, -1123, -744, 218, 2061, -1041, -3346, -2316, 1298, 347, -251, -564, 2296, 1394, 1422, 1637, 1596, 3389, 2566, -1183, -1450, -2114, -238, -1957, -2513]
2013b513K189Q74K07R95R43K566l512p05N0p36j486J873J408O09l643k129O70
1996b340J437k003Q72p55J804K680k974r03m90K692j440J139L518J08l714j10
1980d79J25j110o67Q85j063K0K102M12o8J536J63N58L59j667p99N27r54j587P95
1961i12p76k455j539K096K44K852K227K5k341j431J319l590r38L22j414L127Q60
1944b324l536M231R06j675J579K109l746j369j351l4j066L221L012l706p14J620
1928b843J897o78n86k90P96m15K049J68L228o2N72j638k025k73r37Q08J604O19
1910A994j433l429K174J530r03J008j858J447O51P30J8P72j695m283K97R29M64
1893a587M296k515j128K957j540n53O85N84j77l83p19N18J290j446Kk609O56Q47
$$ y = [-2513, -324, 550, 757, 1752, 2695, 5261, 1749, 1044, 1094, 358, -1128, 745, 2153, 2762, -881, -3010, -2340, -903, -2906, -2034, -2789, -985, 1695, -1279, -2182, -2672, 20, -1420, -281, 3237, 3345, -369, -479, -354, -1464, -2131, -1246, -2309, -2289, -187, 225, 157, 1693, 1856, 2414, 2773, 1106, 307, 834, -120, -1707, -912, -1688, -4143, -5682, -3586, -3342, -490, 1737, 1762, -579, -2010, -691, -4281, -5219, -4897, -6311, -3184, -2324, -5860, -1629, -723, -2398, -819, 1290, -2456, -3825, -5176, -5210, -6276, -3055, -43, -3749, -4463, -2843, -946, -1624, -2210, -2500, -1704, -2119, -70, 98, 3326, 3264, 3836, 2198, 173, -100, -1037, -229, 1375, 1994, 561, -2868, -694, 836, -67, 941, -917, 530, 1181, 1911, 1929, 2701, 1006, -3277, -2980, -2051, -1587, 2709, 194, -934, 2023, 483, -70, 615, 1199, 1022, 639, -80, 438, 1728, 282, 284, -2325, -1669, -822]
1875h22K335q63p15n31j472M63K038O63j712q75J205L082M08J51k74J582j527
1858C136k537k368k178J54L0J642q0p32N58n23K240Q40m76k92J015N039k403j186
1840A879r94J90K034j528k958O84R1o58k578q71j49K298P66j303J686p03j621
1823c735J600L456J36j62l38j695J425k83j172q65L048l47o02J918k802K136q79
1806H39l291j449Q07P27m65j440q12K579J035j5k06l9Q57j511P85l396L278l60
1788b077j095J574k23k42M95r04M556K627l732k840l45K20K507J48l429Q59L800
1771A899L46j948L7J844j361k844n76L727j87m76r31J123K074k416L3J375k966
1754a247J564L21l85j383L9N010k740O07j740j787J807O33m832K58J059L93R62
$$ y = [-822, 1513, 650, -65, -596, -2068, -1605, 433, 1096, -616, -1491, -286, 2796, 3204, 3355, 3081, 4663, 3136, 599, -1769, -3947, -3793, -3763, -2121, -2201, -2933, -2375, -2898, -658, 182, -294, -586, 429, 5468, 3065, 1879, 885, 1075, 3109, 1581, -1377, -693, -602, -1260, -3838, -4709, -4858, -2560, -1794, -3097, -1411, -2114, -3735, -2135, 1321, 1457, 1295, 957, -738, 687, 404, -768, -1633, 1415, 1068, 466, 2384, -418, 1718, 839, -2452, -3901, -3094, -2367, -2832, -4272, -5084, -2505, -1470, -1485, -1691, -1730, -873, -2384, -1599, -4995, -1717, -2077, -3172, -1598, -1821, -2063, -1568, -2472, 2084, 4711, 979, -1861, -2206, -1986, 521, 669, -2760, -1901, 1899, 2245, 297, 334, 2178, 817, -2027, -2603, 1124, 937, 461, -470, 653, 2727, 311, 344, 1719, -1247, 317, 638, 253, -1130, -1091, 3919, 1179, 1786, 46, -1741, 66, 699, -4133, -3875, -2816, -2423, -1461]
1737a461M640k336l264Q66q19j55L275J336k764J727L238m71n312Q16k352k082
1721e118R03K860K91K606L92J008m088R34K60j745Q02K510R10K43m49m17O13k259
1703B56k111o50J875k152M465k974J014k731n50M815r4k536J536N92J082k53O43
1686B227m06q69j988r95J096J971K082j00k876J006L054P30k835q32p06q33k67
1669e41j87m005j49L194l27L109K325k563p62K395j128m32L189k323j697J626
1653A724k31M21j075k99n10j140L04J256J333k062J306Q77k717j717N5J901M033
1636C459r80l219k425J052K761l670L70K338K306J111N34m086M248k294N21r26
1620A100k83j156J958j287j313K203l89m36k796K889J003Q17K802j96k912j263
$$ y = [-1461, 3179, 843, -2421, -1555, -2374, -2529, 746, 2082, -682, 1045, 4283, 3812, -1500, -684, -3036, -5118, -4215, -1355, -1064, 1542, 1934, 2942, -1146, -212, 48, -1697, -895, 1615, 2525, 2768, 2319, 1902, 2515, 256, -1855, -2505, -630, -2782, 1683, -1291, -277, -3008, -3558, 1257, 1163, -1373, 163, 755, 1837, 1584, 2227, 1821, 952, -1036, -2031, -935, 1036, 3118, 3018, 142, 1148, 4202, 4932, 2097, 1265, 559, -274, -541, -728, -4733, -4882, -1688, -2015, 1094, 3419, 856, 94, 2489, 1361, 929, 4118, 1795, 98, 1724, 1493, 1914, 839, 540, 30, -1110, -806, 450, 1783, -279, 1027, 1904, -813, -2530, -2475, -574, 3459, 2479, -740, -3165, -2113, 648, -3022, -2652, -314, 1992, 3103, 3637, -449, 3799, 1505, 2026, 1100, 817, -339, 1619, 332, -981, 1222, 833, 397, -2399, 490, 1493, 2310, 5112, 4916, 2004, 741]
1604G41j536L814J227p15j339l444J718J047J064j478r85O1r00j513M70K892J742
1587B866m99l233k801L043M148l754j153K653j577m70L00J429K039l54j371j250
1571A6q75N78P75J965J465n61q76j295J524j780j246j096O48M611O72k563l63
1554A599K663j031j803K865j611k070R65r9N8K645l865q55p41m70L016L81j073
1537E74l26J728l325M48J360j231J565J316j540o06j19L4m65J880R57j967J120
1520A403J457P44k507J235J270J12j434j72j847r75K997O89j16j042j666K386
1504B534q53%Q54r69L96j875k355k58M435o04l22j15J028K888k13p08M88J064
1486E415k111j740j244j933n89p20K755K133J510j428J248R2k006j357J98R64
$$ y = [741, -795, 3019, 4246, 3531, 2192, -1252, 466, 1513, 2577, 1099, 114, 175, -725, -2238, -1768, 1124, 2866, 2367, -866, -3667, -624, 3524, -230, -1383, 1270, -307, -777, -477, 952, 2991, 2637, 1266, 16, -859, -281, 494, 2459, 3924, 3363, 2487, 1192, 2716, 936, -310, -1406, -758, 3853, 4525, 1962, 1599, 4262, 3231, 1428, 4293, 2682, 612, 1577, 1478, 1536, 4181, 316, -539, -1280, -1750, 1266, 1647, 574, 248, 1976, -1349, -901, 459, -772, 793, 2109, 569, -37, -156, -122, -587, 1293, 2250, 283, 1403, 2860, 3604, 1097, 2332, 3602, 3714, 2280, 2108, 261, -714, 2283, 2972, 2856, 1814, 148, 2534, 1681, 1681, 2535, 1566, 1962, 87, -2268, -2526, 1909, 1305, 983, 868, 1896, 4784, 4571, 3863, 4351, 5415, 3304, 1564, 320, -1613, -2202, -2922, -167, 1966, 3476, 2048, 3296, 3388, 1382, 25, 223, 1187]
1470A187L25p37j107P58L85o24J500K24k716K95K65K125k492m2k420K112K072
1453A110r48m08j407R76k102k71J113K152L346k081j850L226p96p11J367K27L2
1436B975N6J40J796J850l250K62J975O90m594j91K223k467k324L242J448k675
1420A156J973j17J173k015M67k94P63m357k05L35p6J436j23J199J613l67j094
1403A467J767j323j430L074k272J116J070k056R41P44k069J416K843k5k637k298
1387C28M32K437J413n153J357Q5J138K312K158M70k619N47N54k998j833j630j129
1370b131Q88N36J357l3l53k619J785K263j115j794j12J592R92L507l618J532j001
1353A676L382K18l714K728O31j401K58Q47q53Q39r3Q45J58N11j195l547j138j46
$$ y = [1187, 1512, 775, -332, 426, 811, 187, 1687, 1911, -805, -510, -245, 1880, -612, -654, -3074, -962, 1110, 162, -246, -1653, -677, -2779, -3050, -1937, 215, 3561, 1480, -370, 2856, 2060, 1349, 2716, 2943, 2975, 3031, 3171, 4967, 6817, 3567, 3829, 5804, 6494, 1900, 1709, 3932, 1465, -859, 2383, 3831, 1156, 3129, 3012, 4185, 2170, 2637, 2343, 3106, -1251, -1456, -1121, -1197, 239, 116, 1315, 2928, 2561, 1467, 3234, 1911, 481, 3555, 1283, 2399, 3469, 1413, 2354, 3098, 1029, 2445, 5288, 5263, 2626, 328, 760, 3197, 4610, -543, 814, 899, 2037, 4349, 6507, 6977, 4358, 4905, 5459, 2461, 628, -1002, -2131, -1243, -707, 650, 617, 264, -2355, -570, 1693, 578, -1216, -1328, 264, 1256, 4763, 1145, 2677, 1676, 5058, 5276, 1562, 4290, 4921, 3520, 3778, 4625, 3772, 4611, 4518, 5363, 5521, 6032, 4837, 1290, 152, 6]
1335FO79j598j092m06L422L383p70k459J8j489J957K464j55o55J273j323l524
1318b69K155J209m73k568j50P54J902j972j563j325j68j388l80J797M456J561
1302C578m99P55k702p79p12K24J467j190j755Q52k403J118L020J633J600k034
1286B173K153j809L09q06L75r88L62J865j797N31R8j202Q86q72o86R68k561L070
1268B069k61O36k143j445J170J813J916j794j262O49J46Q90m84l65O09j050L381
1251D475k33k05J128j986n82j29Q8L472l009j087j077j097J849M94j158K725K347
1234F015j632L10J6n237M8K527J021q23j377J411K630j019j958R3j910N75K5q05
1216i0j722L054l93j922J53L700J495Q85k701l130K858L040j225k464rj251j448
$$ y = [6, 685, -913, -2005, -2411, 1011, 4394, 3624, 1165, 1183, -306, 1651, 4115, 3960, 3305, 4578, 3255, -269, 1886, 3095, 2622, 54, -96, 658, 2560, 588, -975, -2300, -2468, -3856, -4236, -2439, 2017, 3578, 3079, 3834, 1132, 353, -359, -135, 1332, 142, -1613, -761, -3164, -2046, 974, 2607, 4207, 2173, 4326, 2517, 2826, 2020, 2395, 1407, 1769, 3634, 1837, 2368, 2466, 1264, 2150, 1278, 592, 1560, -1001, 2069, 1808, 2444, 301, -1144, 26, 1839, 3755, 1961, 699, 1348, 1494, 2384, 1900, 1535, 2144, 1094, 4475, 4242, 4037, 5165, 3179, 2597, 2468, 2556, 6028, 3019, 1932, 855, -242, 1607, 2101, 943, 3668, 6015, 4383, 4693, 4709, -528, -480, 2047, 3068, 2245, 868, 2279, 4909, 3890, 1932, 2025, 115, 690, 715, -90, -1812, 1242, 849, -1073, -920, 2780, 4275, 5160, 2459, -671, 2187, 5227, 4002, 1538, 1529, 278, -1170]
1199a170K380j204J015r58J780J845k872L157k096J77m12j128K278J555k28j152
1183B967P60m99m074J691q17M23j443j291o23O12K095j212K54L281l281j423J836
1166g44j336L492j711M604n51k393L8j223R01o63j553j02J099O99j794N27m48
1149a158J002O04J471J08j248j169k311J193K575j4N23J612K226J9p25k215q34
1132A659K019L022j426J753k621k703K701j430K61l565M67K067l21N09o80j02
1116A610Q59J42k605R68N58j019J504M63J591k311M96N7J626R93r11j625o41q29
1098I26P66j671m50M36J713M79j041k524J004J115m85m81J042k324J696K952m71
1081B682J072m103k370L428J375K55l017j30N07J490K378k544m26mk066J273K357
$$ y = [-1170, 1210, 6, 1021, 63, 1843, 3688, 816, 3973, 1877, 2054, 1642, 514, 2792, 4347, 4119, 2967, 3727, 3228, -846, 845, 28, 451, -992, -2283, -2906, -2294, -199, -1411, -1157, 2124, -1157, -2580, -744, -2080, 1412, -299, 4305, 3754, 1361, 1399, 176, 1077, 414, -1139, -1241, -142, 557, -1237, -710, -1158, -156, 448, 1919, 2027, 779, -390, -2701, -1508, 1067, 1053, 1576, 3188, 5414, 5433, 4708, 2493, 1659, 3678, 6700, 5274, 7027, 4406, 1703, 4404, 2974, 3235, -330, 137, 2204, 1883, 2392, 1712, 1610, 2469, 2611, 6, 974, 1532, 513, 2017, 2480, 4071, 1760, 2256, 2313, 3939, 4932, 4021, 2396, 1755, 926, 1692, 21, -429, 7, 1720, 2199, 1158, -1366, -362, 753, 268, -213, 829, -1495, 201, 3153, 2682, 3754, -349, -2719, 709, 2084, 2339, -678, -808, -301, 1189, 3567, 1023, 597, 593, -1473, -200, 2157]
1064B157K412j403n57J729k07O16k11K248k122j886j188O78J636o45J494j236
1048C515J016j724m235J013J504P76k529R78r46M646L17j83q21k380k185m13M675
1031C024L605m333q43J568J320k77j04k108k070K370J482j779K358k831j593j697
1015a908j240J88L5L843l69l77j651N898P99j697k55j315j334O9K392R13n360
998a369K489L971m522k011l80L711j220r00R04k712N16R55J955K34o29P75j281
981D86j614K054j455o09J051n62J51J881k17q37K043l083p15J939M06J09j852
964h24j01L286n6j304J876r03J298k101j869Q0K639M28j140o12j1J433J381r15
946B585R82k713j251J240K417N94k318L14J810p24m51k688O58J557P03J69m705
$$ y = [2157, 4569, 3166, 2609, 4338, 4131, 4747, 4536, 6784, 4662, 2776, 1588, 2266, 3902, 3257, 4751, 3515, 4531, 2807, -1428, -415, 1089, 1865, -664, 314, -632, 4014, 4331, 4148, 3327, 947, -1238, -1651, 3024, 6629, 2296, 1453, 3021, 4341, 4064, 3960, 1852, -218, 2152, 3634, 1855, 4213, 1382, -211, -1908, -3148, -2960, -2925, 918, 549, 172, -1479, 4419, 5218, 3521, 3266, 1951, 617, 686, 3078, 3991, -1369, 1120, 5091, 569, -1442, -1822, 1889, 669, -231, 673, -2039, -1523, -568, 1387, 1621, 992, 1767, 486, -1128, 926, -529, -1138, -87, -649, -498, 1383, 1166, 329, 2372, -711, -1426, 513, 919, 1028, -824, -925, 2361, 2305, 1001, 2877, 1974, 3272, 1171, -698, -618, 2021, 2449, 1309, 697, 686, 2119, 3500, 2585, 3567, 854, -397, 843, 3260, 3854, 1536, 1850, 3660, 2936, 2485, -203, 455, 2012, 2715, 2884, -1821]
929a821J562L384J070k085P67q28k119J133K787l743j163J044p80J79P74R2j665
912a412O47K113N0J853J629j740l073k361k353K437K409J743K858r08k478J190
896B604K23l051J370j581J132K085R18m845Q15K924j964j303l347J290K324j336
880a742R1N272l760R39K259K511k31l342o23j595j769J072M076p19q86O18q84
863A287k396J342M028Ok847o63J109j769N27J291k244J30K967k023O08K39j454
846A38l88k322N38N354q30o89p36J578J36j186j291o64l7J69J150q61K065Q4k885
827f77J052K337j218j233Q21M10q14k254p93K303J105J188j49p82j627m58j481
810b270K880p21M332R83k021j617j242K551j544l443K92o40K060k044j76K036
$$ y = [-1821, -259, 3125, 4195, 2110, 2877, 2049, -70, 1063, 3850, 107, -1056, -12, -792, -613, 161, 253, -1412, -765, 1348, 1398, 3251, 4880, 3140, 67, -2294, -4647, -2210, 199, 1942, 4800, 3892, 1414, 2604, 2827, -224, 1146, -435, 697, 2782, 3700, -1145, -330, 2594, 630, -673, -4020, -2730, -406, -1742, -1651, 3621, -139, 800, 3059, 5570, 5339, 1997, 1374, -221, -1990, -918, 3158, 2439, 1553, 2171, 1287, -1109, 233, 4261, 4267, 1420, 757, 1866, 97, 624, 1915, -329, -199, 2768, 745, 1353, 1592, 138, -250, -2572, -2034, 3320, 2490, 1801, 1065, 2643, 2779, 1593, 302, -362, -399, -230, 920, 59, 2124, 2208, -677, 375, 2712, 1494, 261, 1082, 1492, 678, -1576, -2369, -66, 1039, 2227, 2078, 1296, -331, -789, -2270, 610, -111, 4221, 5204, 3183, 1566, 324, 2875, 1331, -2112, -1820, -2460, -400, -2444, -2620, -584]
794e84N39J274p67J091p77l92L4K716l27l772k230J610M828M87j234K053j776
777B773m88R50J547j697K318k125k087q90k309R69J162N57j936R68k879N218k019
760C2q11P43K242j136j113R32J557k039j67k84j575J863L337l141p16M230m540
743e86k03K218O92j885PL5o4N98r62Q95r4o74P30n69J282J30K474J321q85j676
723B784q66j130j29N13K128N80p36j85L22j537r24j198o13j898Q2J786J393O14
705I86j07J758O05m594J160J527K871O39j834j923J11J147j179q25K69k818M433
688B226J637N22k671l001J896K41K225J338l257m70L920j625R19k400j005J423
672A918j578j413Q24L384K48P90J621l338l370J970l22k493K544J665j805k988
$$ y = [-584, -45, 1229, 462, 1553, 776, 384, 418, 3134, 2807, -965, -3195, -1585, 3243, 3730, 2496, 4549, 2773, 2285, 3235, 4782, 3085, 5403, 3278, 1191, 301, -2008, -1039, 123, 680, -1256, -288, -3167, 2051, 32, -779, -36, 2206, 1070, -43, 889, 2446, 407, 240, -44, -1619, 244, 3581, 440, -276, 3954, -586, -789, 1429, 2121, 236, 243, 278, 214, 812, -150, 745, 651, -23, 707, 138, 1420, 1550, 4024, 5345, 4460, 2784, 1918, 788, 659, 1172, 3300, 3880, 3144, 2959, 3281, 1744, 820, -378, -991, -2889, -2807, -1021, 372, 986, 879, 2637, 3242, -1352, -192, 1335, 4206, 4845, 3011, 1088, 1199, 2346, 1167, 342, 611, -2207, 2226, 3863, 4385, 1714, -1287, 609, 850, 3075, 4413, 1156, 686, 4606, 2981, 3900, 1500, 495, 1918, 340, -1073, -249, 3135, 3383, 4173, 5794, 2456, -914, 1056, 734, -1759, 785, 2450, 645, -2343]
$$ [...]
##END NTUPLES=NMR SPECTRUM
##END=
