##TITLE=1H_CA-9261-1
 DMSO
 8 sc, 
 8.4.2024
##JCAMPDX= 6.0         $$ Bruker NMR JCAMP-DX V2.0
##DATA TYPE= NMR SPECTRUM
##DATA CLASS= NTUPLES
##ORIGIN= UXNMR, Bruker Analytische Messtechnik GmbH
##OWNER= root
$$ XWIN-NMR		Version 3.5
$$ Mon Apr  8 14:19:06 2024 Russian Standard Time (UT+4h)  she@DPX200
##.OBSERVE FREQUENCY= 200.1309
##.OBSERVE NUCLEUS= ^1H
##.ACQUISITION MODE= SIMULTANEOUS
##.ACQUISITION SCHEME= undefined
##.AVERAGES= 8
##.DIGITISER RES= 18
##SPECTROMETER/DATA SYSTEM= spect
##.PULSE SEQUENCE= zg30
##.SOLVENT NAME= CDCl3
##.SHIFT REFERENCE= (INTERNAL, CDCl3, 0, 15.683)
##AUDIT TRAIL= $$ (NUMBER, WHEN, WHO, WHERE, WHAT)
$$ ##TITLE= Audit trail, XWIN-NMR		Version 3.5
$$ ##JCAMPDX= 5.01
$$ ##ORIGIN= Bruker BioSpin GmbH
$$ ##OWNER= she
$$ F:/spectra/data/she/nmr/H-F/1/pdata/1/auditp.txt
$$ ##AUDIT TRAIL=  $$ (NUMBER, WHEN, WHO, WHERE, WHAT)
(   1,<2024-04-08 14:17:44.64 +0400>,<she>,<DPX200>,
      <created by zg, POWCHK disabled, PULCHK disabled
       configuration hash MD5:
       00 E9 B6 7A A2 85 ED C7 34 08 36 98 17 FE 4E 26
       data hash MD5: 16K
       59 2F 3F 04 E7 39 F6 96 2C BB 27 9D EF B5 16 C4>)
(   2,<2024-04-08 14:17:57.73 +0400>,<she>,<DPX200>,
      <Start of raw data processing
       efp BC_mod = 2 LB = 0.24 FT_mod = 6 PKNL = 1 PHC0 = -25382.35 PHC1 = 12.18731 SI = 16K 
       data hash MD5: 16K
       38 87 ED 2A 3D 29 7E 45 1D FF D0 43 8D 4F C1 70>)
(   3,<2024-04-08 14:18:17.89 +0400>,<she>,<DPX200>,
      <pk PHC0 = -2.108835 PHC1 = 3 
       data hash MD5: 16K
       E2 78 B2 36 8F 2C 66 0C 36 90 2F 4A 3E 62 1C 67>)
(   4,<2024-04-08 14:18:22.04 +0400>,<she>,<DPX200>,
      <abs ABSG = 5 
       data hash MD5: 16K
       12 37 38 3D E2 DD 8D 37 98 76 4B DC 71 8A DE CE>)
$$ ##END=
$$ 
$$ hash MD5
$$ 0A 66 47 47 38 94 35 C7 C4 9F 27 BB 32 E9 2D B9
##$RELAX= 
##$RELAX= 
##$RELAX= 
##$RELAX= 
##$RELAX= 
##$RELAX= 
$$ Bruker specific parameters
$$ --------------------------
##$DU= <F:/spectra>
##$EXPNO= 1
##$NAME= <H-F>
##$PROCNO= 1
##$TYPE= <nmr>
##$USER= <she>
##$AMP= (0..31)
100 100 100 100 100 100 100 100 100 100 100 100 100 100 100 100 100 100 
100 100 100 100 100 100 100 100 100 100 100 100 100 100 
##$AQSEQ= 0
##$AQ_mod= 1
##$AUNM= <au_zg>
##$AUTOPOS= <>
##$BF1= 200.13
##$BF2= 200.13
##$BF3= 200.13
##$BF4= 200.13
##$BF5= 200.13
##$BF6= 200.13
##$BF7= 200.13
##$BF8= 200.13
##$BYTORDA= 1
##$CFDGTYP= 0
##$CFRGTYP= 5
##$CHEMSTR= <none>
##$CNST= (0..31)
1 1 145 1 1 1 1 1 1 1 1 1 1 1 1 1 1 1 1 1 1 1 1 1 1 1 1 1 1 1 1 1 
##$CPDPRG= <>
##$CPDPRG1= <>
##$CPDPRG2= <>
##$CPDPRG3= <>
##$CPDPRG4= <mlev>
##$CPDPRG5= <mlev>
##$CPDPRG6= <mlev>
##$CPDPRG7= <mlev>
##$CPDPRG8= <mlev>
##$CPDPRGB= <>
##$CPDPRGT= <>
##$D= (0..31)
0 1.2 0 0 0 0 0 0 0 0.06 0 0.03 0 0 0 0 0.0002 0 0 0 0 0 0 0 0 0 0 0 0 
0 0 0 
##$DATE= 1712571464
##$DBL= (0..7)
120 120 120 120 120 120 120 120 
##$DBP= (0..7)
150 150 150 150 150 150 150 150 
##$DBP07= 0
##$DBPNAM0= <>
##$DBPNAM1= <>
##$DBPNAM2= <>
##$DBPNAM3= <>
##$DBPNAM4= <>
##$DBPNAM5= <>
$$ [...]
##$SUBNAM3= <"">
##$SUBNAM4= <"">
##$SUBNAM5= <"">
##$SUBNAM6= <"">
##$SUBNAM7= <"">
##$SUBNAM8= <"">
##$SUBNAM9= <"">
##$SW= 18.0517689322627
##$SWIBOX= (0..15)
0 0 2 0 0 0 0 0 0 0 0 0 0 0 0 0 
##$SW_h= 3612.71676300578
##$TD= 16384
##$TD0= 1
##$TE= 0
##$TE2= 300
##$TE3= 300
##$TEG= 300
##$TL= (0..7)
0 120 120 120 120 120 120 120 
##$TP= (0..7)
150 150 150 150 150 150 150 150 
##$TP07= 0
##$TPNAME0= <>
##$TPNAME1= <>
##$TPNAME2= <>
##$TPNAME3= <>
##$TPNAME4= <>
##$TPNAME5= <>
##$TPNAME6= <>
##$TPNAME7= <>
##$TPOAL= (0..7)
0.5 0.5 0.5 0.5 0.5 0.5 0.5 0.5 
##$TPOFFS= (0..7)
0 0 0 0 0 0 0 0 
##$TUNHIN= 0
##$TUNHOUT= 0
##$TUNXOUT= 0
##$USERA1= <user>
##$USERA2= <user>
##$USERA3= <user>
##$USERA4= <user>
##$USERA5= <user>
##$V9= 5
##$VALIST= <valist>
##$VCLIST= <CCCCCCCCCCCCCCC>
##$VD= 0
##$VDLIST= <DDDDDDDDDDDDDDD>
##$VPLIST= <PPPPPPPPPPPPPPP>
##$VTLIST= <TTTTTTTTTTTTTTT>
##$WBST= 1024
##$WBSW= 4
##$XGAIN= (0..3)
0 0 0 0 
##$XL= 0
##$YL= 0
##$YMAX_a= 226224
##$YMIN_a= -246200
##$ZGOPTNS= <>
##$ZL1= 120
##$ZL2= 120
##$ZL3= 120
##$ZL4= 120
##$ABSF1= 15.68302
##$ABSF2= -2.36887
##$ABSG= 5
##$ABSL= 3
##$ALPHA= 0
##$AQORDER= 0
##$ASSFAC= 0
##$ASSFACI= 0
##$ASSFACX= 0
##$ASSWID= 0
##$AUNMP= <proc_1d>
##$AZFE= 0.1
##$AZFW= 0.1
##$BCFW= 0
##$BC_mod= 2
##$BYTORDP= 0
##$COROFFS= 0
##$CY= -3
##$DATMOD= 1
##$DC= 0
##$DFILT= <>
##$DTYPP= 0
##$F1P= 0
##$F2P= 0
##$FCOR= 1
##$FTSIZE= 16384
##$FT_mod= 6
##$GAMMA= 0
##$GB= 0
##$INTBC= 1
##$INTSCL= 3.70164e-10
##$ISEN= 128
##$LB= 0.24
##$LEV0= 0
##$LPBIN= 0
##$MAXI= 10000
##$MC2= 0
##$MEAN= 0
##$ME_mod= 0
##$MI= 1.114404
##$NCOEF= 0
##$NC_proc= -6
##$NLEV= 6
##$NOISF1= 3.799351
##$NOISF2= 2.8
##$NSP= 0
##$NTH_PI= 0
##$NZP= 0
##$OFFSET= 15.68302
##$PC= 1
##$PHC0= -25384.46
##$PHC1= 15.18731
##$PH_mod= 1
##$PKNL= yes
##$PPARMOD= 0
##$PSCAL= 0
##$PSIGN= 0
##$REVERSE= no
##$SF= 200.129567721928
##$SI= 16384
##$SIGF1= 3
##$SIGF2= 2
##$SINO= 5.538805
##$SIOLD= 16384
##$SREGLST= <1H.CDCl3>
##$SSB= 0
##$STSI= 16384
##$STSR= 0
##$SW_p= 3612.71676300577
##$SYMM= 0
##$S_DEV= 0
##$TDeff= 16384
##$TDoff= 0
##$TI= <>
##$TILT= no
##$TM1= 0
##$TM2= 0
##$TOPLEV= 0
##$USERP1= <user>
##$USERP2= <user>
##$USERP3= <user>
##$USERP4= <user>
##$USERP5= <user>
##$WDW= 1
##$XDIM= 16384
##$YMAX_p= 448376589
##$YMIN_p= -186093
$$ End of Bruker specific parameters
$$ ---------------------------------
##NTUPLES= NMR SPECTRUM
##VAR_NAME=  FREQUENCY,     SPECTRUM/REAL,   SPECTRUM/IMAG
##SYMBOL=    X,             R,               I
##VAR_TYPE=  INDEPENDENT,   DEPENDENT,       DEPENDENT
##VAR_FORM=  AFFN,          ASDF,            ASDF
##VAR_DIM=   16384,         16384,           16384
##UNITS=     HZ,            ARBITRARY UNITS, ARBITRARY UNITS
##FACTOR=    0.220516191357247, 1,           1
##FIRST=     3138.63594073976, 0,            0
##LAST=      -474.08082226601, 0,            0
##MIN=       -474.08082226601, -186093,      0
##MAX=       3138.63594073976, 448376589,    0
$$ Real data points
##PAGE= N=1
##DATA TABLE= (X++(R..R)), XYDATA
$$ [...]
$$ plain form
8686 -4978 -4774 -7627 -9945 -11712 -16360 -19337 -14854 -10576 -11327 -17588 -10867 -7007 -11254 -13498 -8430
8671 -8430 -2151 -8449 -15929 -15469 -12756 -11739 -12025 -20077 -16635 -8371 -7865 -11155 -9131 -14379 -13240 -16720
8655 -16720 -11746 -12044 -15169 -15648 -12464 -6223 -12466 -13766 -13805 -12504 -6102 -5898 -9475 -9316 -12866 -15185
8639 -15185 -9183 -11697 -12858 -18456 -25670 -20444 -8990 -6088 -11176 -15756 -14106 -12909 -16388 -15882 -18357
8624 -18357 -8331 -10146 -5308 -13411 -10503 -6462 -8296 -8305 -12159 -11942 -9256 -18259 -21866 -16786 -11484
8609 -11484 -15638 -22306 -24117 -13631 -18664 -10349 -13369 -14332 -16760 -14484 -23786 -18704 -29099 -24792
8595 -24792 -24107 -10198 -20362 -15961 -20393 -14638 -33157 -34043 -42793 -40588 -59724 -50214 -83110 -77887
8581 -77887 -186093 -90325 160082 66751 59769 31813 29293 10517 17741 9774 20186 11820
$$ packed form
8686d978K04k853k318j767m648k977M483M278p51o261O721L860m247k244N068
8671h430O279o298p480M60K713J017k86q052L442Q264N06l290K024n248J139l480
8655a6720M974k98l125m79L184O241o243j300l9J301O402K04l577J59l550k319
8639a5185O002k514j161n598p214N226J1454K902n088m580J650J197l479N06k475
8624a8357J0026j815M838q103K908M041j834rl854K17K686r003l607N080N302
8609a1484m154o668j811J0486n033Q315l020r63k428K276r302N082j0395M307
8595b4792O85J3909j0164M401m432N755j8519q86q750K205j9136R510l2896N223
8581g7887j08206R5768K50407r3331o982k7956k520j8776P224p967J0412q366
$$ plain form
8569 11820 9387 1434 2569 3012 6710 5448 3115 -4296 465 -2740 2386 1658 530 2947 985
8554 985 -5363 -9105 -9289 -7090 -4005 -9433 -7064 -6157 -5229 -3062 -5730 -5782 -4833 -9416 -10585 -13161 -12045
8537 -12045 -3665 -4744 -14620 -20397 -18533 -7928 -4365 -10167 -11687 -12901 -14001 -9397 -11714 -9735
8523 -9735 -9977 -4724 -8344 -10344 -12578 -11306 -12517 -7056 -9343 -6965 -16938 -13134 -7278 -8920 -10617
8508 -10617 -13537 -16372 -20465 -12761 -12019 -9240 -10510 -12200 -11768 -17668 -14525 -12920 -7694 -6724 -6712 -15519
8492 -15519 -16392 -22558 -23894 -15684 -10146 -8350 -5705 -5974 -13205 -11666 -8382 -2338 294 -5546 -4768
8477 -4768 -5541 -13914 -14501 -13692 -16266 -18564 -12246 -11590 -9181 -13249 -19413 -15111 -17396 -10226 -13153 -10821
8461 -10821 -5628 -4266 -5128 -9998 -12386 -8307 -7661 -11237 -8536 -10372 -10855 -12167 -8594 -4728 -6611
$$ packed form
8569A1820k433p953J135M43L698j262k333p411M761l205N126p28j128K417j962
8554I85o348l742j84K199L085n428K369R07R28K167k668n2R49m583j169k576J116
8537a2045Q380j079r876n777J864J0605L563n802j520j214j100M604k317J979
8523i735k42N253l620k000k234J272j211N461k287K378r973L804N856j642j697
8508a0617k920k835m093P704P42K779j270j690M32n900L143J605N226R70J2q807
8492a5519q73o166j336Q210N538J796K645k69p231J539L284O044K632n840P78
8477d768p73q373n87Q09k574k298O318O56K409m068o164M302k285P170k927K332
8461a0821N193J362q62m870k388M079O46l576K701j836m83j312L573L866j883
$$ plain form
8446 -6611 -9337 -7154 3675 797 -1889 -4009 -5873 -6589 -5487 -2867 -7409 -7182 -6652 -8863 -1459
8431 -1459 -2566 -12632 -10852 -5374 -8358 -12046 -5346 -6037 -6583 -12404 -10911 -6543 -5296 -3371 -7090
8416 -7090 -12466 -13384 -15376 -5969 -4443 -5129 -4870 -9582 -3722 -5825 -13136 -17685 -7451 -7392 -5283 -6072
8400 -6072 -8519 -8012 -15553 -10765 -10134 -2887 -3086 -5201 -5077 -12492 -8972 -4795 -10396 -3914 -297 -16307
8384 -16307 -17354 -13499 -12435 -15174 -11116 -8051 -11552 -13773 -13987 -10861 -9716 -8421 -9516 133 -6017
8369 -6017 -10498 -10220 -10598 -6495 -5131 -7230 -11847 -14345 -15139 -15025 -12641 -10343 -9169 -8145 -5389 -8249
8353 -8249 -6048 -1045 -10946 -16591 -18235 -8481 -8928 -13596 -18860 -14486 -9768 -10102 -4722 -2354 -3375
8338 -3375 -3684 -5856 -1723 -11288 -17895 -15916 -4760 2501 -11713 -14808 -13746 -4527 -5900 -11387 -8860
$$ packed form
8446f611k726K183J0829k878k686k120j864p16J102K620m542K27N30k211P404
8431a459j107j0066J780N478k984l688O700o91n46n821J493M368J247J925l719
8416g090n376r18j992R407J526o86K59m712N860k103p311m549J0234N9K109p89
8400f072k447N07p541M788O31P247j99k115J24p415L520M177n601O482L617j6010
8384a6307j047L855J064k739M058L065l501k221k14L126J145J295j095R649o150
8369f017m481K78l78M103J364k099m617k498p94J14K384K298J174J024K756k860
8353h249K201N003r901n645j644R754m47m668n264M374M718l34N380K368j021
8338c375l09k172M133r565o607J979J1156P261j4214l095J062R219j373n487K527
$$ plain form
8323 -8860 -12329 -8801 -10706 -9613 -8467 -8262 -3309 -6605 -1299 -7254 -11659 -1762 -622 -4575 -4612 -8537
8307 -8537 -8666 -14382 -16609 -14293 -10529 -1982 -6470 -11708 -8143 -10924 -8393 -9615 -10270 -509 2041
8292 2041 3104 -1727 -1186 2357 -5273 -12312 -7403 -6777 -15389 -11821 -4246 -3429 -5732 -6531 -2725 -6238
8276 -6238 -16060 -16631 -20093 -8302 -6517 -707 -7021 287 -4491 -6471 -5905 -14528 -2746 7330 7762
8261 7762 -4950 -3359 -3818 -6260 -18741 -12710 -8391 -14298 -20055 -14812 -11769 -11525 -16744 -23800 -17155
8246 -17155 -12070 -21168 -8290 3957 2937 -757 -7522 -8866 -1530 953 -3583 2660 8601 1005
8232 1005 -626 -8033 -15028 -28507 -24843 -10582 -12742 -18472 -20774 14 -7693 -9331 -9517 -5298
8218 -5298 -6657 3499 -5508 -16988 -10346 -5168 -3711 4406 -16021 -29667 -34972 597 12359
$$ packed form
8323h860l469L528j905J093J146K05M953l296N306n955m405R897J140l953l7l925
8307h537j29n716k227K316L764Q547m488n238L565k781K531j222o55R761K550
8292B041J063m831N41L543p630p039M909O26q612L568P575Q17k303p99L806l513
8276f238r822n71l462J1791J785N810o314P308m778j980N66q623J1782J0076M32
8261G762j2712J591m59k442j2481O031M319n907n757N243L043K44n219p056O645
8246a7155N085r098J2878J2247j020l694o765j344P336K483m536O243N941p596
8232A005j631p407o995j3479L664J4261k160n730k302K0788p707j638j86M219
8218e298j359J0156r007j1480O642N178J457Q117k0427j3646n305L5569J1762
$$ plain form
8205 12359 -9251 -3973 -2177 19026 -4934 -27492 -36108 25807 30356 526 -74007 -78458 -30598
8192 -30598 79517 169098 41921 23386 47702 51473 55752 -6472 -33007 -3469 5735 8511
8180 8511 5518 -2364 -11593 15873 691 -18760 7156 -10282 -3558 -4015 -14634 -22141 -18791 -5512
8166 -5512 9387 10243 -217 -4910 8577 1666 -12352 -6544 -1171 11716 17273 16327 16775 13462
8152 13462 2929 7753 16493 3719 2271 -1914 -674 13871 12180 12983 5123 10165 10561 10151 16130
8137 16130 19398 15463 12948 19581 -3416 -7507 197 -2879 -3624 -1040 -9492 -4403 -8976 -26519
8123 -26519 -14279 -9796 -9374 -7042 -9960 -20721 -2679 4312 8045 9574 8450 8744 1860 -2553
8109 -2553 -2951 -5441 -8654 -8388 -7852 -6690 -2071 1931 7723 8844 -4275 5295 8531 6767 6250 2063
$$ packed form
8205A2359k1610N278J796K1203k3960k2558q616O1915M549k9830p4533m451M7860
8192c0598J10115Q9581j27177j8535K4316L771M279o2224k6535K9538R204K776
8180H511k993p882r229K7466j5182j9451K5916j7438O724m57j0619p507L350J3279
8166e512J4899Q56j0460m693J3487o911j4018N808N373J2887N557r46M48l313
8152A3462j0533M824Q740j2774j448m185J240J4545j691Q03p860N042L96m10N979
8137A6130L268l935k515O633k2997m091P704l076p45K584q452N089m573j7543
8123b6519J2240M483M22K332k918j0761J8042O991L733J529j124K94o884m413
8109b553l98k490l213K66N36J162M619M002N792J121j3119R570L236j764n17m187
$$ plain form
8093 2063 -3419 3877 3385 -4267 833 6137 7593 2084 -5312 -2920 -9003 -10651 -3011 -5963 -9916
8078 -9916 -13502 -14940 -10031 -9958 -9120 -3607 -4427 -10556 -9406 -1144 4359 6635 5282 -1869 -5236 -5391
8062 -5391 -9686 -7108 -11678 -11114 -1274 -5292 -3468 -699 -2593 906 9166 -836 -3725 -1996 -2689
8047 -2689 549 -1384 3892 12002 5699 -10015 -5421 2986 5727 -11139 -1452 906 5 3375 4776
8032 4776 -2917 -4159 -6789 -6259 -8176 -12919 -10945 -3991 -3511 -3178 5386 2336 -3269 532 1090 -123
8016 -123 4967 13856 7959 643 801 2918 2541 -1582 -1894 -3189 -4787 -3936 3134 -3209 -4703 -618
8000 -618 4424 745 8024 6094 10410 5681 510 4442 2232 303 -773 -4867 -8001 -1754 297
7985 297 4564 6318 -2888 -6385 -7899 -2279 -4980 -1356 -2467 -5692 -9725 -3461 4309 2935 1521
$$ packed form
8093B063n482P296m92p652N100N304J456n509p396K392o083j648P640k952l953
8078i916l586j438M909P3Q38N513q20o129J150Q262N503K276j353p151l367j55
8062e391m295K578m570N64R840m018J824K769j894L499Q260j0002k889J729o93
8047b689L238j933N276Q110o303j5714M594Q407K741j6866R687K358r01L370J401
8032D776p693j242k630N30j917m743J974O954M80L33Q564l050n605L801N58j213
8016a23N090Q889n897p316J58K117l77m123l12j295j598Q51P070o343j494M085
8000f18N042l679P279j930M316m729n171L932k210j929j076m094l134O247K051
7985B97M267J754r206l497j514N620k701L624j111l225m033O264P770j374j414
$$ plain form
7970 1521 1557 7306 11427 5835 -2771 -857 -5191 -1200 1574 1277 7770 3845 3585 9876 2615 9748
7954 9748 11273 13245 9399 4880 8201 6938 3231 -935 4126 12082 12074 15589 11999 10422 9483 8491
7938 8491 8804 10535 7718 14021 13527 10782 18427 12020 10123 2782 5340 8258 8749 5128 5065 8890
7922 8890 -450 -3516 -3847 2170 4191 6393 5400 600 2934 3332 3222 -1327 33 4999 5117 3323
7906 3323 2867 969 2192 5012 8308 9864 13660 8657 10782 3908 3177 2377 1134 1271 14006 11120
7890 11120 14147 9789 2872 5088 7865 1202 -2243 4039 3281 3693 4456 10733 7954 7346 9542 8757
7874 8757 10368 4269 2543 6047 8272 6075 763 3386 7283 8524 7261 7369 3616 5399 7027
7859 7027 7338 5477 1639 7320 6331 15086 17134 16423 19008 11090 11916 19200 10570 2420 2700 6782
$$ packed form
7970A521L6N749M121n592q606J914m334L991K774k97O493l925k60O291p261P133
7954I748J525J972l846m519L321j263l707m166N061P956qL515l590j577r39r92
7938H491L13J731k817O303m94k745P645o407j897p341K558K918M91l621o3L825
7922H890r340l066l31O017K021K202r93m800K334L98j10m549J360M966J18j794
7906C323m56j898J223K820L296J556L796n003K125o874p31q00j243J37J2735k886
7890A1120L027m358o917K216K777o663l445O282p58M12P63O277k779o08K196p85
7874H757J611o099j726L504K225k197n312K623L897J241j263J08l753J783J628
7859G027L11j861l838N681r89Q755K048p11K585p918Q26P284q630q150K80M082
$$ plain form
7843 6782 6150 3283 5015 7490 13769 8240 10447 15386 17373 21163 20059 7144 7430 9685 17941
7828 17941 19426 22220 23431 16581 21743 26385 15486 24867 27603 22899 25141 33531 22771 31837
7814 31837 42099 48793 41067 52872 52655 72352 77528 114378 151635 263851 38823 -159707
7802 -159707 -86802 -81422 -53829 -53365 -35236 -41151 -28659 -29281 -18259 -20718 -11854 -15676 -7660 -15565
7788 -15565 -12335 -9098 -6012 -8400 -9861 -10223 -11630 -11262 -8646 -10980 -4238 -3995 1527 1555 -2620 -13532
7772 -13532 -7356 -5564 -2616 4357 2463 993 5776 245 -6603 -3741 4968 4290 4336 4360 9540 3813
7756 3813 2011 2720 -2188 1280 -1693 -4994 679 3374 3023 4694 4090 -375 4366 1714 -2948 4237
7740 4237 9861 6721 8438 1611 5170 4102 3000 7336 13200 9298 3745 6561 7024 6024 3695
$$ packed form
7843F782o32k867J732K475O279n529K207M939J987L790j104j2915K86K255Q256
7828A7941J485K794J211o850N162M642j0899R381K736m704K242Q390j0760R066
7814C1837J0262O694p726J1805k17J9697N176L6850L7257J12216k25028j98530
7802a59707P2905N380K7593M64J8129n915J2492o22J1022k459Q864l822Q016p905
7788a5565L230L237L086k388j461l62j407L68K616k334O742K43N522K8m175j0912
7772a3532O176J792K948O973j894j470M783n531o848K862Q709o78M6K4N180n727
7756C813j802P09m908L468k973l301N673K695l51J671o04m465M741k652m662P185
7740D237N624l140J717o827L559j068j102M336N864l902n553K816M63j000k329
$$ plain form
7725 3695 6667 95 5766 7883 6143 1834 2748 4754 5721 5955 -283 4546 6782 10105 9519 -382
7709 -382 -320 -2273 9539 9616 5869 67 -1676 2255 5962 4350 6451 5182 9022 11844 3035 2616
7693 2616 2974 9290 8376 7381 12471 8485 2378 -1892 -4799 3542 5095 -1383 7802 3988 1428 4087
7677 4087 3986 7889 10644 4449 12022 16528 7293 8463 7783 5697 10586 10568 8443 20538 16259 8681
7661 8681 6769 3592 5605 -1733 4412 5096 -1062 -437 7888 14684 11562 9507 3569 8617 14558
7646 14558 10181 15326 16258 10600 6558 7454 -189 423 2626 5609 1870 3869 8427 8178 7357 9102
7630 9102 8295 8554 8901 8253 3459 8146 8557 10968 17982 13332 13110 13591 16052 9463 13558 14250 8935
7613 8935 10758 9498 12466 13111 12809 18042 6438 467 8985 5802 7302 6834 11358 6755 7074 9686
$$ packed form
7725C695K972o572N671K117j740m309R14K006R67K34o238M829K236L323n86r901
7709c82O2j953J1812P7l747n802j743L931L707j612K101j269L840K822q809m19
7693B616L58O316r14r95N090l986o107m270k907Q341J553o478R185l814k560K659
7677D087j01L903K755o195P573M506r235J170o80k086M889j8k125J2095m279p578
7661H681j912l177K013p338O145O84o158O25Q325O796l122k055n938N048N941
7646A4558m377N145R32n658m042Q96p643O12K203K983l739J999M558k49q21J745
7630I102q07K59L47o48m794M687M11K411P014m650k22M81K461o589M095O92n315
7613H935J823j260K968O45l02N233j1604n971Q518l183J500m68M524m603L19K612
$$ plain form
7597 9686 1405 4440 13562 14153 11637 7932 10627 15069 12940 11420 8506 6860 4363 6257 5867
7582 5867 3129 14517 16434 3919 5781 6173 12207 10624 7106 6995 8845 14019 18924 12823 6095
7567 6095 10432 12117 10837 10394 7011 10740 7776 13951 5819 7449 5268 -213 5592 14068 13171
7552 13171 17556 15501 14545 18234 15335 16902 10510 9255 13215 10351 11747 19634 20146 16871 11700
7537 11700 10742 7164 8528 7551 8001 11084 7887 9858 12237 10185 7685 12285 13741 15120 16901
7522 16901 11551 7972 7628 14459 11103 8288 8955 3951 9406 -2822 2679 29160 24615 22176 21331
7507 21331 20489 16323 21067 21852 16379 13282 14841 11858 12576 11259 16221 14281 9721 14016 22767
7492 22767 20065 16896 18259 21519 20384 15415 21069 18411 14094 16373 22605 19517 16133 12831 20734
$$ packed form
7597I686q281L035R122N91k516l705K695M442k129j520k914j646k497J894l90
7582E867k738J1388J917j2515J862L92O034j583l518j11J850N174M905o101o728
7567F095M337J685j280m43l383L729k964O175q132J630k181n481N805Q476q97
7552A3171M385k055r56L689k899J567o392j255L960k864J396P887N12l275n171
7537A1700r58l578J364r77M50L083l197J971K379k052k500M600J456J379J781
7522A6901n350l579l44O831l356k815O67n004N455j2228N501K6481m545k439q45
7507B1331q42m166M744P85n473l097J559k983P18j317M962j940m560M295Q751
7492B2767k702l169J363L260j135m969N654k658m317K279O232l088l384l302P903
$$ plain form
7477 20734 15719 18666 19430 20394 19805 17468 16832 20926 21609 18874 23346 21934 27146 24257 17021 20786
7461 20786 21055 23427 20126 19427 13758 12250 14101 11230 13700 17899 16737 13319 15466 13398 7335
7446 7335 14202 19797 18597 20515 19577 14551 16089 26538 24251 21296 19084 18158 16164 15007 19875
7431 19875 21230 20391 21147 18623 18240 20331 23089 21058 18830 21649 26632 28902 24601 23662 28554 24434
7415 24434 19605 20641 20811 22646 23464 20230 21161 16008 20053 24343 28845 21485 19059 17965 19951
7400 19951 18477 21238 23645 26577 22352 22943 20160 14931 16893 21691 20888 27311 30848 27445 21748
7385 21748 21252 25001 18983 18432 22197 25727 26955 19937 14306 18545 16022 16475 23613 23919 24479 24907
7369 24907 22904 21126 20014 23360 18166 13418 23174 29657 27255 21371 14812 13265 17801 24269 21078
$$ packed form
7477B0734n015K947P64R64n89k337o36M094O83k735M472j412N212k889p236L765
7461B0786K69K372l301o99n669j508J851k871K470M199j162l418K147k068o063
7446G335O867N595j200J918r38n026J538J0449k287k955k212r26j994j157M868
7431A9875J355q39P56k524l83K091K758k031k228K819M983K270m301r39M892m120
7415B4434m829J036J70J835Q18l234R31n153M045M290M502p360k426j094J986
7400A9951j474K761K407K932m225N91k783n229J962M798q03O423L537l403n697
7385B1748m96L749o018n51L765L530J228p018n631M239k523M53P138L06N60M28
7369B4907k003j778j112L346n194m748R756O483k402n884o559j547M536O468l191
$$ plain form
7354 21078 23777 18567 20637 19440 23107 27367 30777 32325 23315 24000 24948 20528 23320 20684 22281
7339 22281 23297 25769 24983 29351 24451 21568 26568 26641 25413 22275 18249 20968 22910 28116 27451 24885
7323 24885 25331 31218 35159 33422 27999 20580 29647 32237 29680 27058 28198 28704 27513 31055 31404
7308 31404 26697 21667 27374 25452 24493 23651 25891 27289 27315 21972 20836 24616 30383 27621 25984 28469
7292 28469 31715 33991 29642 34173 34846 34286 34158 37687 35328 33762 31895 35855 33447 24004 21840
7277 21840 27754 31218 35374 30544 24641 28742 27230 24471 25439 29070 34088 31587 31874 36398 29863
7262 29863 27504 29894 33271 33826 32186 29877 28645 30665 29215 24233 27208 25879 25492 30255 31584
7247 31584 30167 27882 28328 27995 27006 25847 25784 28088 33893 32357 36303 34472 33342 31340 31370 28810
$$ packed form
7354B1078K699n210K070j197L667M260L410J548r010O85R48m420K792k636J597
7339B2281J016K472p86M368m900k883N000P3j228l138m026K719J942N206o65k566
7323B4885M46N887L941j737n423p419R067K590k557k622J140N06j191L542L49
7308C1404m707n030N707j922r59q42K240J398K6n343j136L780N767k762j637K485
7292B8469L246K276m349M531O73n60j28L529k359j566j867L960k408r443k164
7277B1840N914L464M156m830n903M101j512k759R68L631N018k501K87M524o535
7262B9863k359K390L377N55j640k309j232K020j450m982K975j329l87M763J329
7247C1584j417k285M46l33r89j159o3K304N805j536L946j831j130k002L0k560
$$ plain form
7231 28810 31114 30660 30722 27371 33878 36173 35298 35903 33428 33252 38583 39461 32951 34374 35886 35673 34035
7214 34035 31677 27212 30289 29076 31098 36615 34215 32471 32613 33422 35993 35802 38144 37560 39453 39124
7198 39124 36712 34792 31941 34480 32311 28557 35525 37447 37583 35838 30333 33376 34731 34273 38745
7183 38745 36293 29267 37611 40808 38389 39157 42384 41149 40802 37154 40277 33841 33522 39273 35058
7168 35058 31567 33207 39413 42704 38317 26188 30017 34383 41591 42410 37905 32505 29657 33503 42782
7153 42782 40587 35935 35830 39631 39056 37274 34417 38845 40764 33621 39713 45354 49496 41764 34929
7138 34929 34417 35954 45996 46894 40492 37306 40522 40928 44727 46219 40105 37964 46123 43010 36464
7123 36464 31808 39790 46673 47235 50170 52636 48377 44482 47519 48790 50947 54440 48290 47075 50943
$$ packed form
7231B8810K304m54O2l351O507K295q75O05k475j76N331Q78o510J423J512k13j638
7214C4035k358m465L077j213K022N517k400j744J42Q09K571j91K342n84J893l29
7198C9124k412j920k851K539k169l754O968J922J36j745n505L043J355m58M472
7183C8745k452p026Q344L197k419P68L227j235l47l648L123o436l19N751m215
7168C5058l491J640O206L291m387j2129L829M366P208Q19m505n400k848L846R279
7153D2782k195m652j05L801n75j782k857M428J919p143O092N641M142p732o835
7138C4929n12J537J0042Q98o402l186L216M06L799J492o114k141Q159l113o546
7123C6464m656P982O883N62K935K466m259l895L037J271K157L493o150j215L868
$$ plain form
7108 50943 50882 54990 47222 35647 35961 40884 46264 48517 42892 44749 48706 51198 50680 48168 51069
7093 51069 50226 40959 45305 41942 38530 44399 43204 48995 48522 52607 47023 43565 46753 49504 54113
7078 54113 45794 53200 55622 54211 48088 42404 39086 44232 45561 44575 43776 46995 46938 50255 48460 46658
7062 46658 45948 51351 53006 85643 87876 52839 56709 49521 43784 43224 50879 47431 43813 50464 53020
7047 53020 50497 46289 50543 48076 45494 46924 41346 43896 50134 52025 49862 49735 47539 51055 51255
7032 51255 48305 51055 58325 59527 56424 53591 57776 52355 51345 56438 61030 56408 52944 56035 48606
7017 48606 48186 51082 53898 51890 50920 55375 52984 53996 59458 56596 54065 51326 48426 49703 53948
7002 53948 50228 50888 52722 49935 52572 53471 59948 55130 56088 56971 60458 54788 56167 56361 52677 54571
$$ packed form
7108E0943o1M108p768j1575L14M923N380K253n625J857L957K492n18k512K901
7093E1069q43r267M346l363l412N869j195N791m73M085n584l458L188K751M609
7078E4113q319P406K422j411o123n684l318N146J329r86p99L219n7L317j795j802
7062D6658p10N403J655L2637K233l5037L870p188n737n60P655l448l618O651K556
7047E3020k523m208M254k467k582J430n578K550O238J891k163j27k196L516K00
7032E1255k950K750P270J202l103k833M185n421j010N093M592m622l464L091p429
7017D8606m20K896K816k008r70M455k391J012N462k862k531k739k900J277M245
7002E3948l720O60J834k787K637Q99O477m818R58Q83L487n670J379J94l684J894
$$ plain form
6986 54571 50490 46564 50513 56466 55832 50977 56991 63029 61980 60158 54856 55000 56213 55761 53431
6971 53431 60325 64570 62645 57395 61025 64337 64203 62766 61805 61153 63294 57709 53497 55277 56288
6956 56288 55446 53489 56423 58058 51457 54471 51834 64776 68585 57187 61279 63452 65826 65709 60559
6941 60559 63953 58890 57534 59177 62307 56671 49011 50665 60928 65836 69113 68290 64571 60179 58911
6926 58911 56584 54911 61889 60613 61694 63991 65279 66076 63836 60015 67988 69991 68784 61920 56263
6911 56263 55515 58264 61684 57559 53570 59854 60978 58856 64013 63535 60826 62751 64933 65170 59326
6896 59326 59345 67382 63958 66028 70007 67298 66039 63221 57524 58201 64123 68421 74362 68937 66797
6881 66797 66069 63115 65101 70399 71165 71333 66011 65869 65146 52724 63195 64655 62763 63256 63583 65427
$$ packed form
6986E4571m081l926L949N953o34m855O014O038j049j822n302J44J213m52k330
6971E3431O894M245j925n250L630L312j34j437r61o52K141n585m212J780J011
6956E6288q42j957K934J635o601L014k637J2942L809j1398M092K173K374j17n150
6941F0559L394n063j356J643L130n636p660J654J0263M908L277q23l719m392j268
6926E8911k327j673O978j276J081K297J288P97k240l821P973K003j207o864n657
6911E6263p48K749L420m125l989O284J124k122N157m78k709J925K182K37n844
6896E9326J9Q037l424K070L979k709j259k818n697O77N922M298N941n425k140
6881F6797p28k954J986N298P66J68n322j42p23j2422J0471J460j892M93L27J844
$$ plain form
6865 65427 66840 70269 61787 64535 66594 72011 75589 68915 64037 68996 73669 70515 71902 78167 77154
6850 77154 78114 74373 76058 73757 71827 72029 69996 75149 73946 71733 72330 70166 77516 80279 77247
6835 77247 70951 70991 71598 75214 81837 71084 69673 66608 67165 63883 66735 73482 72934 80398 72316 71043
6819 71043 73684 69968 71075 69199 74573 78238 83858 80689 77600 72241 77338 76119 71856 70437 65345
6804 65345 71496 73414 77774 84613 82115 75823 78570 84018 82325 76791 78901 86727 85241 85390 88120
6789 88120 83415 74967 73336 81723 77322 84249 85861 88677 91520 89625 85148 82509 80346 79621 75930
6774 75930 77859 85988 92066 88537 81955 81960 78904 84208 83674 88836 89294 86832 93127 85145 81613 87084
6758 87084 85147 81260 81219 83029 82289 85247 82984 82794 80828 82013 82331 84160 86561 85770 84145 82128
$$ packed form
6865F5427J413L429q482K748K059N417L578o674m878M959M673l154J387O265j013
6850G7154R60l741J685k301j930K02k033N153j203k213N97k164P350K763l032
6835G7247o296M0O07L616O623j0753j411l065N57l282K852O747n48P464q082j273
6819G1043K641l716J107j876N374L665N620l169l089n359N097j219m263j419n092
6804F5345O151J918M360O839k498o292K747N448j693n534K110P826j486J49K730
6789H8120m705q448j631Q387m401O927J612K816K843j895m477k639k163p25l691
6774G5930J929Q129O078l529o582Nl056N304n34N162M58k462O295p982l532N471
6758H7084j937l887m1J810p40K958k263j90j966J185L18J829K401p91j625k017
$$ plain form
6742 82128 82777 80980 80983 83116 87571 91883 86794 85146 94252 93118 88524 83639 86969 93546 93438 95591
6726 95591 99728 96384 91360 97819 98989 94386 93971 91377 92345 96763 90754 95986 92290 87743 85515
6711 85515 93903 91772 98641 94991 90173 99203 100667 95474 93715 91675 94607 97943 90857 93342 96665
6696 96665 99820 98556 93114 90934 89800 90467 91773 95440 95328 91006 98012 99209 95275 98509 98089
6681 98089 95837 97108 96202 94792 91013 89512 90701 97388 94057 98825 97297 97569 93550 91977 95916
6666 95916 97348 96672 104149 105611 106050 103457 103019 102311 99585 100857 104353 104581 106006 105665 100668 98509
6650 98509 101133 100266 99004 101388 106270 104495 101979 105207 102472 107496 112415 110726 109298 108845 103618
6635 103618 112385 113886 110242 107937 105317 102545 109306 112794 110593 114779 113029 110035 113905 113887 112354
$$ packed form
6742H2128O49j797LK133M455M312n089j648R106j134m594m885L330O577j08K153
6726I5591M137l344n024O459J170m603m15k594R68M418o009N232l696m547k228
6711H5515Q388k131O869l650m818R030J464n193j759k040K932L336p086K485L323
6696I6665L155j264n442k180j134O67J306L667j12m322P006J197l934L234m20
6681I8089k252J271r06j410l779j501J189O687l331M768j528K72m019j573L939
6666I5916J432o76P477J462M39k593m38p08k726J272L496K28J425l41m997k159
6650I8509K624q67j262K384M882j775k516L228k735N024M919j689j428m53n227
6635A03618Q767J501l644k305k620k772O761L488k201M186j750k994L870j8j533
$$ plain form
6620 112354 115108 120289 114583 106926 108621 107409 110803 117110 123421 124784 125219 126972 127103 124276 119592
6605 119592 99903 104722 117446 114725 117400 116937 112407 113748 116339 115040 116033 120385 118128 117293 118707
6590 118707 120687 123231 121427 127678 124451 122592 123639 123537 119405 120090 122324 118592 118988 121573 120814
6575 120814 132964 130075 129125 129388 129933 121742 118783 122354 126730 125589 122767 125522 124298 126155 127142
6560 127142 130480 129775 128402 126251 128021 127411 128696 132404 130850 138535 140533 133018 125850 129469 133113
6545 133113 129015 129757 131030 127919 123256 124355 126827 130413 128467 130778 131527 136945 135434 132889 134135
6530 134135 139977 142208 146701 140189 140996 136302 135801 138450 137441 134837 138901 133266 133104 133683 133318 131527
6514 131527 137731 138567 139702 144004 136561 137224 137524 137943 137573 147037 145952 142072 141923 152311 151453 149619
$$ packed form
6620A12354K754N181n706p657J695j212L394O307O311J363M35J753J31k827m684
6605A19592j9689M819J2724k721K675m63m530J341K591j299R93M352k257q35J414
6590A18707J980K544j804O251l227j859J047j02m132O85K234l732L96K585p59
6575A20814J2150k889r50K63N45q191k959L571M376j141k822K755j224J857R87
6560A27142L338p05j373k151J770o10J285L708j554P685J998p515p168L619L644
6545A33113m098P42J273l111m663J099K472L586j946K311P49N418j511k545J246
6530A34135N842K231M493o512Q07m694n01K649j009k604M064n635j62N79l65j791
6514A31527O204Q36J135M302p443O63L00M19l70R464j085l880j49J0388q58j834
$$ plain form
6498 149619 146146 147093 149164 146170 142431 143761 146560 150798 152449 153816 156517 151089 143550 151075 154856
6483 154856 150934 151608 150818 152574 149807 152783 152812 149869 154709 151183 152430 153846 154680 156932 155842 155053
6467 155053 160008 156777 159327 157756 161014 158523 164168 174269 166423 165561 164666 161725 170285 168179 163164
6452 163164 166911 168628 167566 167570 164589 165881 169952 163476 169187 168339 164219 166509 169152 174684 174757 167564
6436 167564 168322 171193 178069 181245 173333 164677 171795 179075 175039 180428 182729 180042 182961 183025 174269
6421 174269 172044 178809 179579 184718 185442 181199 179608 177298 178887 177997 178857 182155 181245 185421 181420 184991
6405 184991 184801 183019 187529 181719 189507 191276 191695 199201 193879 188616 188559 191773 193100 189726 187882
6390 187882 187625 185699 186542 192959 197502 190409 196136 198125 195050 195948 199082 202295 200899 198360 194673
$$ packed form
6498A49619l473R47K071k994l739J330K799M238J651J367K701n428p539P525L781
6483A54856l922O74p90J756k767K976K9k943M840l526J247J416Q34K252j090p89
6467A55053M955l231K550j571L258k491N645J0101p846q62q95k941Q560k106n015
6452A63164L747J717j062Mk981J292M071o476N711q48m120K290K643N532P3p193
6436A67564P58K871O876L176p912q656P118P280m036N389K301k687K919O4q756
6421A74269k225O765P70N139P24m243j591k310J589q90Q60L298r10M176m001L571
6405A84991j90j782M510n810P788J769M19P506n322n263n7L214J327l374j844
6390A87882k57j926Q43O417M543p093N727J989l075Q98L134L213j396k539l687
$$ plain form
6375 194673 195329 193700 189541 191467 197412 200449 201382 205316 203916 201023 207758 210641 209397 209613 206236
6360 206236 209258 208925 211126 209173 209855 214280 214515 218167 217076 217712 218580 219090 214958 221600 223745 226936
6344 226936 224388 227255 230356 226835 226026 228208 235478 235892 229307 230298 230690 229314 231200 234000 234912 236450
6328 236450 234055 230776 231414 238455 238375 237570 240986 238342 237927 236883 239702 243689 244581 241968 242533 242261
6312 242261 247702 254982 255011 253385 255653 254965 252530 246340 250421 259827 259101 263007 266234 260099 256251
6297 256251 255804 262662 267835 273048 270336 278014 277603 275091 277004 278242 280768 277910 278094 279211 280977
6282 280977 285660 282357 284033 284933 281564 285193 291388 288524 289265 297073 296449 296429 305967 304597 308477 303678
6266 303678 298469 293487 297643 305181 305220 309105 312499 314817 310198 310430 307856 312097 314389 317642 318054
$$ packed form
6375A94673O56j629m159J926N945L037R33L934j400k893O735K883j244K16l377
6360B06236L022l33K201j953O82M425K35L652j091O36Q68N10m132O642K145L191
6344B26936k548K867L101l521q09K182P270M14o585R91L92j376J886K800R12J538
6328B36450k395l279O38P041q0q05L416k644m15j044K819L987Q92k613N65k72
6312B42261N441P280K9j626K268o88k435o190M081R406p26L906L227o135l848
6297B56251m47O858N173N213k712P678m11k512J913J238K526k858J84J117J766
6282B80977M683l303J676R00l369L629O195k864P41P808o24k0R538j370L880m799
6266C03678n209m982M156P538L9L885L394K318m619K32k574M241K292L253M12
$$ plain form
6251 318054 322048 319496 318783 316992 324749 323790 325402 327639 334557 337187 339644 343805 344023 345177 342987
6236 342987 347604 351865 344246 348080 355523 357235 349879 355754 355615 356206 359788 364915 366968 370226 372111
6221 372111 370068 369580 375278 375875 375070 382749 385625 385185 385735 387939 389048 394812 396274 398695 408811
6206 408811 409674 404709 402337 403908 405141 407641 414073 419240 420594 423974 429816 430998 430566 429383 434841
6191 434841 435973 436490 435114 438886 445364 446857 449009 453364 455406 466371 469808 475655 480854 480044 482072
6176 482072 487420 491209 487924 484957 494503 497145 500865 499220 508120 511645 511924 515562 521729 525320 532480
6161 532480 529511 535856 534159 542654 549618 552065 552728 561864 559710 580506 590247 566189 572604 577790
6147 577790 588923 588921 593942 591882 599174 607700 612841 614343 614539 618878 625016 634742 645779 642559 642459
$$ packed form
6251C18054L994k552p13j791P757r59J612K237O918K630K457M161K18J154k190
6236C42987M617M261p619L834P443J712p356N875j39N91L582N127K053L258J885
6221C72111k043m88N698N97q05P679K876m40N50K204J109N764J462K421J0116
6206D08811Q63m965k372J571J233K500O432N167J354L380N842J182m32j183N458
6191D34841J132N17j376L772O478J493K152M355K042J0965L437N847N199q10K028
6176D82072N348L789l285k967R546K642L720j645Q900L525K79L638O167L591P160
6161E32480k969O345j697Q495O964K447O63R136k154K0796R741k4058O415N186
6147E77790J1133kN021k060P292Q526N141J502J96M339O138R726J1037l220j00
$$ plain form
6132 642459 650966 661748 667357 672461 673347 667178 675373 685799 688442 693018 695495 698789 701294 703071
6118 703071 703546 703857 707417 713202 710716 714686 718010 717711 722970 730863 738300 742803 743302 743746 747392 757686
6102 757686 759413 761924 769496 776582 778345 780266 791331 796562 807819 815722 822258 833217 837090 839076
6088 839076 838341 841290 850683 862446 865656 860805 875689 887958 886153 889007 895970 910033 926254
6075 926254 931380 938722 944974 956915 972332 977436 984923 992805 1000745 1011248 1020518 1026523 1037363
6062 1037363 1043633 1054919 1074486 1087995 1095688 1109185 1122904 1139283 1151313 1162819 1173821 1186488
6050 1186488 1199692 1213000 1227119 1239495 1250804 1264524 1285384 1292859 1307878 1328502 1347766 1362391
6038 1362391 1377570 1396819 1415223 1434293 1462834 1481397 1492870 1516672 1539296 1562107 1586907
$$ packed form
6132F42459Q507J0782N609N104Q86o169Q195J0426K643M576K477L294K505J777
6118G03071M75L11L560N785k486L970L324k99N259P893P437M503M99M44L646J0294
6102G57686J727K511P572P086J763J921J1065N231J1257P903O536J0959L873J986
6088H39076p35K949R393J1763L210m851J4884J2269j805K854O963J4063J6221
6075I26254N126P342O252J1941J5417N104P487P882P940J0503R270O005J0840
6062A037363O270J1286J9567J3509P693J3497J3719J6379J2030J1506J1002J2667
6050A186488J3204J3308J4119J2376J1309J3720K0860P475J5019K0624J9264J4625
6038A362391J5179J9249J8404J9070K8541J8563J1473K3802K2624K2811K4800
$$ plain form
6027 1586907 1610554 1636016 1658960 1688570 1715061 1743237 1770792 1798999 1830906 1862954 1890773
6016 1890773 1928308 1955211 1986918 2028938 2061072 2101267 2147864 2189901 2229145 2274950 2320524
6005 2320524 2370551 2421842 2473366 2526389 2578860 2634689 2692203 2749854 2808614 2863443 2919611
5994 2919611 2983377 3046169 3097559 3157709 3215142 3271134 3327024 3390020 3446999 3508009 3571316
5983 3571316 3645026 3718512 3790787 3865938 3938601 4002734 4079773 4155021 4218356 4296759 4372675
5972 4372675 4448357 4534157 4619751 4698695 4782165 4876196 4966283 5052299 5147765 5247303 5343533
5961 5343533 5447590 5549947 5656663 5762246 5871519 5995898 6120635 6244841 6383120 6529398
5951 6529398 6678329 6833783 6996479 7164780 7331025 7514960 7706397 7904898 8112340 8331905
$$ packed form
6027A586907K3647K5462K2944K9610K6491K8176K7555K8207L1907L2048K7819
6016A890773L7535K6903L1707M2020L2134M0195M6597M2037L9244M5805M5574
6005B320524N0027N1291N1524N3023N2471N5829N7514N7651N8760N4829N6168
5994B919611O3766O2792N1390O0150N7433N5992N5890O2996N6979O1010O3307
5983C571316P3710P3486P2275P5151P2663O4133P7039P5248O3335P8403P5916
5972D372675P5682Q5800Q5594P8944Q3470R4031R0087Q6016R5466R9538R6230
5961E343533J04057J02357J06716J05583J09273J24379J24737J24206J38279J46278
5951F529398J48931J55454J62696J68301J66245J83935J91437J98501K07442K19565
$$ plain form
5941 8331905 8562533 8802623 9045739 9301050 9569376 9851930 10144538 10452537 10776628 11107655
5931 11107655 11462903 11839777 12235680 12660428 13114449 13596357 14111618 14656487 15232109
5922 15232109 15842491 16482503 17156299 17867030 18629813 19431642 20283330 21192739 22156245
5913 22156245 23185786 24283983 25436425 26645334 27902582 29217558 30588923 32003320
5905 32003320 33445889 34899813 36295180 37554965 38553739 39136468 39146246 38513860 37259974
5896 37259974 35484500 33353092 31061592 28761626 26565833 24529642 22667435 20994874
5888 20994874 19499787 18157908 16944339 15859709 14880544 13985596 13164485 12418832 11732082
5879 11732082 11097307 10508730 9967912 9469443 9009473 8582525 8192588 7824169 7481979
$$ packed form
5941H331905K30628K40090K43116K55311K68326K82554K92608L07999L24091L31027
5931A1107655L55248L76874L95903M24748M54021M81908N15261N44869N75622
5922A5232109O10382O40012O73796P10731P62783Q01829Q51688R09409R63506
5913B2156245J029541J098197J152442J208909J257248J314976J371365J414397
5905C2003320J442569J453924J395367J259785R98774N82729R778o32386j253886
5896C7259974j775474k131408k291500k299966k195793k036191j862207j672561
5888B0994874j495087j341879j213569j084630r79165q94948q21111p45653o86750
5879A1732082o34775n88577n40818m98469m59970m26948l89937l68419l42190
$$ plain form
5870 7481979 7155615 6856708 6585705 6333993 6091044 5862129 5642435 5438826 5246553 5065509
5860 5065509 4893958 4720075 4567164 4418570 4270454 4133308 4003427 3882887 3768890 3664646
5850 3664646 3564981 3461282 3366047 3280488 3201777 3127075 3055491 2982480 2908217 2839166 2771883
5839 2771883 2706195 2646352 2585306 2527557 2470383 2420037 2363695 2313670 2267485 2221194 2186578
5828 2186578 2141046 2094789 2052578 2013268 1971999 1945378 1914450 1874768 1840942 1808171 1776408
5817 1776408 1744275 1717746 1687534 1659118 1632298 1603465 1574638 1544478 1516878 1490078 1469133
5806 1469133 1445736 1427156 1407067 1386397 1372350 1354517 1340414 1321230 1305498 1290209 1278576
5795 1278576 1267388 1247055 1227366 1205344 1189266 1179746 1171808 1164205 1146416 1132227 1119300 1109731
$$ packed form
5870G481979l26364k98907k71003k51712k42949k28915k19694k03609j92273j81044
5860E065509j71551j73883j52911j48594j48116j37146j29881j20540j13997j04244
5850C664646r9665j03699r5235q5559p8711p4702p1584p3011p4263o9051o7283
5839B771883o5688n9843o1046n7749n7174n0346n6342n0025m6185m6291l4616
5828B186578m5532m6257m2211l9310m1269k6621l0928l9682l3826l2771l1763
5817A776408l2133k6529l0212k8416k6820k8833k8827l0160k7600k6800k0945
5806A469133k3397j8580k0089k0670j4047j7833j4103j9184j5732j5289j1633
5795A278576j1188k0333j9689k2022j6078r520p938p603j7789j4189j2927r569
$$ plain form
5783 1109731 1101883 1093995 1077869 1064029 1055338 1049454 1049252 1036486 1029364 1017978 1005258 994879 990231
5770 990231 979213 968628 968135 961260 956318 949014 942196 925896 912509 905012 896350 891322 889538 883553
5756 883553 873315 868256 859417 857168 845042 838124 832453 835336 827642 822638 817976 809646 808239 808628
5742 808628 808726 806705 807137 800812 796844 786433 783835 784549 786742 777308 772891 772416 767989 764688 762611
5727 762611 756456 751532 750996 743345 733952 732446 723685 718537 719866 720138 724645 714513 707090 705398 701767
5712 701767 697450 698828 693577 692614 693033 687864 685185 680145 678998 677451 668921 671432 671919 686291 672672
5697 672672 661285 665251 662493 668174 661543 660647 656763 659363 658618 662985 659516 658651 656660 654766 655737
5682 655737 653605 656583 652693 654118 651073 641552 642535 639733 646604 649783 648332 643560 641554 640172 641641
$$ packed form
5783A109731p848p888j6126j3840q691n884k02j2766p122j1386j2720j0379m648
5770I90231j1018j0585m93o875m942p304o818j6300j3387p497q662n028j784n985
5756H83553j0238n059q839k249j2126o918n671K883p694n004m662q330j407L89
5742H08628R8k021M32o325l968j0411k598P14K193r434m417m75m427l301k077
5727G62611o155m924n36p651r393j506q761n148J329K72M507j0132p423j692l631
5712G01767m317J378n251r63M19n169k679n040j147j547q530K511M87J4372j3619
5697F72672j1387L966k758N681o631q96l884K600p45M367l469q65j991j894R71
5682F55737k132K978l890J425l045r521R83k802O871L179j451m772k006j382J469
$$ plain form
5667 641641 641016 642359 645906 641137 633933 635835 639412 644503 643717 644017 644743 640867 636495 635163 639601
5652 639601 637893 636071 636193 639017 638103 643070 644877 638956 637213 642741 649832 650302 646421 639779 635863
5637 635863 636672 642389 644864 647224 642534 650895 649765 648968 651007 652256 654632 655979 654839 657424 656488
5622 656488 653163 659605 660723 661957 662266 658037 655761 662568 663586 656118 663390 675834 671724 667542
5608 667542 663117 660794 658535 654375 656272 660590 657361 657363 657821 667258 662139 666366 666040 664337 663890 666507
5592 666507 665118 666304 668861 668634 667884 669173 665239 673283 675105 672551 670124 675109 682288 680635 685072
5577 685072 681721 685662 683217 680708 680724 684256 688009 686789 692412 699721 704035 702903 703842 708717 706274
5562 706274 706473 708223 706767 712855 712229 714019 713272 715632 720342 721480 722304 722847 729267 732528 730431 729192
$$ packed form
5667F41641o25J343L547m769p204J902L577N091p86L00P26l876m372j332M438
5652F39601j708j822J22K824r14M967J807n921j743N528P091M70l881o642l916
5637F35863Q09N717K475K360m690Q361j130p97K039J249K376J347j140K585r36
5622F56488l325O442J118J234L09m229k276O807J018p468P272J2444m110m182
5608F67542m425k323k259m160J897M318l229KM58R437n119M227l26j703m47K617
5592F66507j389J186K557k27p50J289l934Q044J822k554k427M985P179j653M437
5577F85072l351L941k445k509J6L532L753j220N623P309M314j132R39M875k443
5562G06274J99J750j456O088o26J790p47K360M710J138Q24N43O420L261k097j239
$$ plain form
5546 729192 735288 739201 739971 740755 748081 744674 748669 750487 746613 755035 762085 764689 765040 760688 765295
5531 765295 773435 771261 769836 773496 776829 782082 783798 786332 793726 789032 792992 801002 805623 806647
5517 806647 805345 802941 803781 812239 813957 819096 824950 829759 831873 832998 835466 831646 832869 837654 843756
5502 843756 849558 846087 846906 847545 855135 858489 863146 862156 869867 870935 876886 885453 881444 879568 885089
5487 885089 889477 889824 895462 899088 900434 906399 904981 907682 913021 916955 927527 928102 933019 936377 932105
5472 932105 932179 943534 952834 955238 963074 961119 963352 969693 973833 980076 982207 986519 987673 992835 994795
5457 994795 1005890 1009662 1018145 1021603 1024417 1020888 1031051 1039114 1035786 1044441 1046890 1049478 1064638 1072245
5443 1072245 1072006 1077980 1081413 1084153 1083976 1090184 1095141 1106709 1112479 1112949 1119819 1130161 1127339 1129293
$$ packed form
5546G29192O096L913P70P84P326l407L995J818l874Q422P050K604L51m352M607
5531G65295Q140k174j425L660L333N253J716K534P394m694L960Q010M621J024
5517H06647j302k404Q40Q458J718N139N854M809K114J125K468l820J223M785O102
5502H43756N802l471Q19O39P590L354M657r90P711J068N951Q567m009j876N521
5487H85089M388L47N638L626J346N965j418K701N339L934J0572N75M917L358m272
5472I32105P4J1355R300K404P836j955K233O341M140O243K131M312J154N162J960
5457I94795J1095L772Q483L458K814l529J0163Q063l328Q655K449K588J5160P607
5443A072245k39N974L433K740j77O208M957J1568N770M70O870J0342k822J954
$$ plain form
5429 1129293 1139991 1149248 1153199 1159516 1164889 1170703 1176244 1183729 1188621 1194055 1200812 1206130 1210564 1220088
5415 1220088 1229330 1233241 1236774 1248542 1248826 1251234 1261879 1273347 1272830 1275354 1281035 1289933 1302651 1306949
5401 1306949 1312471 1320997 1334391 1338952 1343983 1353065 1364957 1375048 1383204 1388860 1396893 1404534 1421548
5388 1421548 1432276 1447842 1454767 1458057 1472275 1489847 1502432 1515796 1525591 1535620 1548350 1561163
5376 1561163 1569277 1578087 1592666 1604598 1614084 1621623 1628260 1637771 1645957 1660186 1667595 1672814 1685845
5363 1685845 1704133 1719473 1731595 1743639 1755971 1764409 1776380 1791958 1804518 1815598 1825367 1835310
5351 1835310 1851221 1869465 1878673 1887819 1907232 1921202 1935331 1951296 1960848 1980977 1995600 2006114
5339 2006114 2022896 2038388 2055154 2068541 2078244 2093926 2117802 2131761 2151597 2168540 2186484 2207160
$$ packed form
5429A129293J0698R257L951O317N373N814N541P485M892N434O757N318M434R524
5415A220088R242L911L533J1768K84K408J0645J1468n17K524N681Q898J2718M298
5401A306949N522Q526J3394M561N031R082J1892J0091Q156N656Q033P641J7014
5388A421548J0728J5566O925L290J4218J7572J2585J3364R795J0029J2730J2813
5376A561163Q114Q810J4579J1932R486P539O637R511Q186J4229P409N219J3031
5363A685845J8288J5340J2122J2044J2332Q438J1971J5578J2560J1080R769R943
5351A835310J5911J8244R208R146J9413J3970J4129J5965R552K0129J4623J0514
5339B006114J6782J5492J6766J3387R703J5682K3876J3959J9836J6943J7944K0676
$$ plain form
5327 2207160 2219785 2232963 2251912 2272824 2293124 2316380 2327046 2343669 2361167 2378797 2392028
5316 2392028 2413523 2435746 2457148 2475086 2494396 2515741 2539814 2565754 2586199 2599622 2623706
5305 2623706 2644787 2670183 2691641 2712582 2747331 2772007 2797133 2821754 2851806 2873737 2902004
5294 2902004 2934731 2970617 3005995 3036978 3064513 3094380 3131398 3160130 3197968 3235035 3274368
5283 3274368 3312742 3353358 3397795 3432919 3469658 3515167 3565790 3613203 3662463 3718307 3773866
5272 3773866 3826424 3877259 3929752 3994722 4056680 4120225 4187661 4258277 4332766 4414632 4495392
5261 4495392 4573507 4661280 4751301 4855861 4953094 5060970 5181738 5296134 5420707 5545666
5251 5545666 5684827 5824046 5965524 6118796 6268801 6432545 6575253 6704384 6819501 6904720
$$ packed form
5327B207160J2625J3178J8949K0912K0300K3256J0666J6623J7498J7630J3231
5316B392028K1495K2223K1402J7938J9310K1345K4073K5940K0445J3423K4084
5305B623706K1081K5396K1458K0941L4749K4676K5126K4621L0052K1931K8267
5294B902004L2727L5886L5378L0983K7535K9867L7018K8732L7838L7067L9333
5283C274368L8374M0616M4437L5124L6739M5509N0623M7413M9260N5844N5559
5272C773866N2558N0835N2493O4970O1958O3545O7436P0616P4489Q1866Q0760
5261D495392P8115Q7773R0021J04560R7233J07876J20768J14396J24573J24959
5251E545666J39161J39219J41478J53272J50005J63744J42708J29131J15117Q5219
$$ plain form
5241 6904720 6941215 6930189 6872840 6767941 6629134 6465462 6294578 6124475 5965479 5827117
5231 5827117 5704825 5597414 5504869 5432695 5374671 5321019 5278697 5241354 5207961 5186166 5169929
5220 5169929 5158092 5158456 5160228 5164697 5170755 5186616 5189722 5206211 5235200 5260182 5287582 5320453 5342594
5207 5342594 5374853 5406932 5439875 5471715 5504656 5541360 5576472 5612293 5650356 5681121 5711618
5196 5711618 5747224 5780350 5818075 5855776 5896584 5934863 5976531 6015165 6062160 6109437 6155095
5185 6155095 6200452 6243575 6288273 6347138 6396958 6450667 6496610 6549599 6604943 6652330 6700836
5174 6700836 6751715 6801349 6851854 6906790 6958090 7010590 7061124 7110254 7162717 7220244 7272706
5163 7272706 7327073 7384263 7443417 7511471 7578520 7641511 7711671 7782039 7851956 7922247 7989939
$$ packed form
5241F904720L6495j1026n7349j04899j38807j63672j70884j70103j58996j38362
5231E827117j22292j07411r2545p2174n8024n3652m2322l7343l3393k1795j6237
5220E169929j1837L64J772M469O058J5861L106J6489K8989K4982K7400L2871K2141
5207E342594L2259L2079L2943L1840L2941L6704L5112L5821L8063L0765L0497
5196E711618L5606L3126L7725L7701M0808L8279M1668L8634M6995M7277M5658
5185F155095M5357M3123M4698N8865M9820N3709M5943N2989N5344M7387M8506
5174F700836N0879M9634N0505N4936N1300N2500N0534M9130N2463N7527N2462
5163G272706N4367N7190N9154O8054O7049O2991P0160P0368O9917P0291O7692
$$ plain form
5152 7989939 8051624 8110432 8166530 8227362 8287336 8340668 8400926 8460865 8525968 8595973 8656543
5141 8656543 8726161 8788326 8848245 8926678 8995502 9072706 9143172 9219534 9311490 9398068 9490611
5130 9490611 9581254 9670108 9758518 9846513 9939883 10037925 10133722 10230891 10332369 10439549 10540516
5119 10540516 10644805 10749409 10860404 10968523 11074042 11182383 11291412 11403677 11515183
5110 11515183 11635483 11752157 11874914 12005413 12137119 12275274 12428010 12575838 12725135
5101 12725135 12875568 13028517 13187007 13343501 13508792 13665415 13824079 13988480 14155982
5092 14155982 14330187 14511979 14693288 14880373 15079776 15277083 15473823 15680775 15902435
5083 15902435 16122630 16338541 16565248 16800078 17039104 17283431 17535903 17795875 18059175
$$ packed form
5152G989939O1685N8808N6098O0832N9974N3332O0258N9939O5103P0005O0570
5141H656543O9618O2165N9919P8433O8824P7204P0466P6362R1956Q6578R2543
5130I490611R0643Q8854Q8410Q7995R3370R8042R5797R7169J01478J07180J00967
5119A0540516J04289J04604J10995J08119J05519J08341J09029J12265J11506
5110A1515183J20300J16674J22757J30499J31706J38155J52736J47828J49297
5101A2725135J50433J52949J58490J56494J65291J56623J58664J64401J67502
5092A4155982J74205J81792J81309J87085J99403J97307J96740K06952K21660
5083A5902435K20195K15911K26707K34830K39026K44327K52472K59972K63300
$$ plain form
5074 18059175 18316974 18585216 18856696 19140503 19431867 19732162 20033571 20346135 20662554
5065 20662554 20987775 21326792 21671761 22024500 22391348 22768956 23157468 23556689 23968378
5056 23968378 24390261 24832176 25279081 25743778 26225553 26715960 27233018 27759560 28303849
5047 28303849 28855592 29417301 29981982 30573406 31182555 31804609 32453658 33142887 33853014
5038 33853014 34586663 35346620 36134569 36947776 37772088 38610161 39471459 40359235 41267625
5029 41267625 42176796 43095900 44020033 44935179 45844476 46745085 47636571 48505714 49360805
5020 49360805 50208664 51089508 52011143 52964042 53976271 55042473 56145018 57249875 58337704
5011 58337704 59410715 60478861 61559514 62663142 63795987 64942159 66097718 67293638
$$ packed form
5074A8059175K57799K68242K71480K83807K91364L00295L01409L12564L16419
5065B0662554L25221L39017L44969L52739L66848L77608L88512L99221M11689
5056B3968378M21883M41915M46905M64697M81775M90407N17058N26542N44289
5047B8303849N51743N61709N64681N91424O09149O22054O49049O89229P10127
5038C3853014P33649P59957P87949Q13207Q24312Q38073Q61298Q87776R08390
5029D1267625R09171R19104R24133R15146R09297R00609Q91486Q69143Q55091
5020D9360805Q47859Q80844R21635R52899J012229J066202J102545J104857J087829
5011E8337704J073011J068146J080653J103628J132845J146172J155559J195920
$$ plain form
5003 67293638 68525629 69771438 71026195 72292472 73596570 74930083 76279098 77670234
4995 77670234 79101791 80559876 82047949 83534329 85025486 86588997 88259561 90008844
4987 90008844 91802779 93668037 95640770 97726124 99924853 102214893 104562520 106965258
4979 106965258 109429204 111951551 114548210 117257707 120115801 123103183 126197322 129377691
4971 129377691 132643410 136044375 139604091 143331427 147197261 151200342 155321408 159571464
4963 159571464 164010204 168705619 173652279 178829634 184301696 190097260 196174899 202509400
4955 202509400 209056746 215870805 222960140 230296548 237898998 245797642 254056206 262694082
4947 262694082 271718524 281110742 290881676 301072285 311675998 322557233 333564694
$$ packed form
5003F7293638J231991J245809J254757J266277J304098J333513J349015J391136
4995G7670234J431557J458085J488073J486380J491157J563511J670564J749283
4987I0008844J793935J865258J972733K085354K198729K290040K347627K402738
4979A06965258K463946K522347K596659K709497K858094K987382L094139L180369
4971A29377691L265719L400965L559716L727336L865834M003081M121066M250056
4963A59571464M438740M695415M946660N177355N472062N795564O077639O334501
4955B02509400O547346O814059P089335P336408P602450P898644Q258564Q637876
4947B62694082R024442R392218R770934J0190609J0603713J0881235J1007461
$$ plain form
4940 333564694 344747573 356256506 368171018 380397153 392857704 405497959 417959393
4933 417959393 429587387 439407480 446115660 448376589 445435404 437404102 425078823 409501249
4925 409501249 391905040 373502824 355115041 337193471 320006336 303782643 288566160
4918 288566160 274296254 260956239 248522570 236937496 226070107 215772516 206011552
4911 206011552 196781876 188052984 179820052 172093737 164841533 157995671 151520378 145405789
4903 145405789 139631786 134167131 129002485 124123988 119512232 115149401 111034502 107148654
4895 107148654 103460904 99961432 96629674 93460943 90439593 87542835 84772490 82124832
4887 82124832 79598193 77177919 74854664 72616950 70466827 68412128 66460709 64609091
$$ packed form
4940C33564694J1182879J1508933J1914512J2226135J2460551J2640255J2461434
4933D17959393J1627994R820093O708180K260929k941185q031302j2325279j5577574
4925D09501249j7596209j8402216j8387783j7921570j7187135j6223693j5216483
4918B88566160j4269906j3340015j2433669j1585074j0867389j0297591r760964
4911B06011552r229676q728892q232932p726315p252204o845862o475293o114589
4903A45405789n774003n464655n164646m878497m611756m362831m114899l885848
4895A07148654l687750l499472l331758l168731l021350k896758k770345k647658
4887H2124832k526639k420274k323255k237714k150123k054699j951419j851618
$$ plain form
4879 64609091 62851705 61180794 59596947 58073870 56605593 55188149 53826182 52506368
4871 52506368 51224702 49981221 48780280 47612123 46485452 45397204 44341318 43328609
4863 43328609 42345012 41395816 40478482 39589619 38736435 37903925 37084952 36289832 35515873
4854 35515873 34766925 34047923 33342376 32647865 31970320 31318350 30686232 30071445 29472416
4845 29472416 28893234 28326663 27765758 27224383 26696856 26181602 25671078 25172881 24691677
4836 24691677 24221791 23772975 23344665 22930143 22534348 22153789 21786923 21430625 21080850
4827 21080850 20738726 20397058 20062316 19737048 19432192 19129490 18830455 18550648 18262601
4818 18262601 17989842 17714892 17440380 17180245 16925448 16682077 16435146 16193642 15965546
$$ packed form
4879F4609091j757386j670911j583847j523077j468277j417444j361967j319814
4871E2506368j281666j243481j200941j168157j126671j088248j055886j012709
4863D3328609r83597r49196r17334q88863q53184q32510q18973p95120p73959
4854C5515873p48948p19002p05547o94511o77545o51970o32118o14787n99029
4845B9472416n79182n66571n60905n41375n27527n15254n10524m98197m81204
4836B4691677m69886m48816m28310m14522l95795l80559l66866l56298l49775
4827B1080850l42124l41668l34742l25268l04856l02702k99035k79807k88047
4818A8262601k72759k74950k74512k60135k54797k43371k46931k41504k28096
$$ plain form
4809 15965546 15738118 15521130 15302166 15083639 14868398 14662497 14457289 14251870 14057641
4800 14057641 13867451 13682594 13496424 13307480 13134777 12958884 12775534 12593944 12422194
4791 12422194 12250663 12087161 11919664 11750622 11599033 11445610 11297088 11155114 11017821
4782 11017821 10882250 10747245 10625264 10492695 10366150 10248649 10128609 10005278 9899221
4773 9899221 9785598 9672309 9564881 9463510 9362571 9251338 9152186 9053465 8952471 8851432
4763 8851432 8745356 8639855 8543894 8448827 8358811 8277197 8191933 8109345 8020087 7932719 7846840
4752 7846840 7761420 7681035 7596648 7506736 7419730 7340061 7258533 7183978 7106900 7035383 6967211
4741 6967211 6897439 6826664 6760519 6695556 6636533 6574559 6508390 6446571 6392046 6329433 6265960
$$ packed form
4809A5965546k27428k16988k18964k18527k15241k05901k05208k05419j94229
4800A4057641j90190j84857j86170j88944j72703j75893j83350j81590j71750
4791A2422194j71531j63502j67497j69042j51589j53423j48522j41974j37293
4782A1017821j35571j35005j21981j32569j26545j17501j20040j23331j06057
4773I899221j13623j13289j07428j01371j00939j11233r9152r8721j00994j01039
4763H851432j06076j05501r5961r5067r0016q1614q5264q2588q9258q7368q5879
4752G846840q5420q0385q4387q9912q7006p9669q1528p4555p7078p1517o8172
4741F967211o9772p0775o6145o4963n9023o1974o6169o1819n4525o2613o3473
$$ plain form
4730 6265960 6205740 6142221 6080658 6026936 5968785 5907692 5853529 5801021 5745428 5691906 5648266
4719 5648266 5592735 5544624 5494844 5445935 5398035 5348412 5302695 5253814 5211984 5170477 5138478
4708 5138478 5097133 5055128 5013151 4969790 4932177 4902921 4863931 4827873 4793960 4756110 4721209
4697 4721209 4682992 4643951 4611147 4578235 4544538 4515456 4480472 4450368 4425312 4398233 4373206
4686 4373206 4344509 4313456 4290168 4267608 4237399 4212713 4185495 4160328 4137580 4113586 4083736
4675 4083736 4065071 4046716 4016130 3994073 3974171 3961046 3942455 3922460 3902822 3885227 3873116
4664 3873116 3857222 3850870 3836908 3829226 3818175 3814693 3809683 3810319 3808206 3799759 3799125 3798587 3801605 3805830
4650 3805830 3806103 3808412 3825650 3836773 3850799 3868509 3884500 3897958 3916898 3945389 3974988 4000158
$$ packed form
4730F265960o0220o3519o1563n3722n8151o1093n4163n2508n5593n3522m3640
4719E648266n5531m8111m9780m8909m7900m9623m5717m8881m1830m1507l1999
4708E138478m1345m2005m1977m3361l7613k9256l8990l6058l3913l7850l4901
4697D721209l8217l9041l2804l2912l3697k9082l4984l0104k5056k7079k5027
4686D373206k8697l1053k3288k2560l0209k4686k7218k5167k2748k3994k9850
4675D083736j8665j8355l0586k2057j9902j3125j8591j9995j9638j7595j2111
4664C873116j5894o352j3962p682j1051l482n010O36k113q447o34n38L018M225
4650C805830K73K309J7238J1123J4026J7710J5991J3458J8940K8491K9599K5170
$$ plain form
4638 4000158 4038638 4076152 4119146 4162779 4213829 4266134 4313857 4380578 4452829 4534915 4616791
4627 4616791 4703055 4795287 4894893 4995907 5112428 5230348 5349425 5469358 5570886 5644914
4617 5644914 5677774 5679571 5619090 5507735 5350354 5161954 4955961 4743487 4539354 4352245
4607 4352245 4176584 4013707 3865723 3738296 3620961 3505013 3403444 3315478 3228377 3147827
4597 3147827 3075781 3013635 2951167 2883508 2824750 2776062 2731330 2689439 2641988 2603290 2557916
4586 2557916 2517203 2484788 2450539 2420335 2384923 2356006 2327669 2297297 2271330 2237846 2214571
4575 2214571 2191130 2162614 2137886 2115911 2093191 2072965 2052670 2034486 2017932 1996998 1977522
4564 1977522 1960211 1945791 1926567 1908438 1891698 1876982 1859696 1848428 1829874 1812049 1793896
$$ packed form
4638D000158L8480L7514M2994M3633N1050N2305M7723O6721P2251Q2086Q1876
4627D616791Q6264R2232R9606J01014J16521J17920J19077J19933J01528P4028
4617E644914L2860J797o0481j11355j57381j88400k05993k12474k04133j87109
4607D352245j75661j62877j47984j27427j17335j15948j01569q7966q7101q0550
4597C147827p2046o2146o2468o7659n8758m8688m4732m1891m7451l8698m5374
4586B557916m0713l2415l4249l0204l5412k8917k8337l0372k5967l3484k3275
4575B214571k3441k8516k4728k1975k2720k0226k0295j8184j6554k0934j9476
4564A977522j7311j4420j9224j8129j6740j4716j7286j1268j8554j7825j8153
$$ plain form
4553 1793896 1780277 1773233 1760565 1744688 1726496 1717438 1706120 1695226 1681756 1671130 1653863 1635302
4541 1635302 1623248 1616301 1606960 1591799 1575499 1556590 1550880 1549115 1535050 1522411 1514381 1497717
4529 1497717 1489654 1475583 1469645 1462934 1448582 1438952 1422668 1411463 1408144 1399901 1388694 1377652 1371540
4516 1371540 1362380 1351779 1336651 1331586 1322907 1311299 1304610 1298150 1288673 1283212 1275240 1269258 1260890
4503 1260890 1252088 1244789 1235101 1234093 1225269 1216439 1204167 1196406 1195938 1187085 1178449 1171160 1166794 1159749
4489 1159749 1147925 1143554 1141244 1138320 1129061 1120924 1117666 1117876 1111267 1103112 1098442 1099656 1097682 1089990
4475 1089990 1085388 1083974 1082912 1084041 1085770 1077010 1068399 1066802 1057774 1057397 1053952 1050335 1039331 1025834
4461 1025834 1021565 1018096 1022445 1014365 1010789 1006570 998102 993050 987885 983883 977398 976561 973823 963741
$$ packed form
4553A793896j3619p044j2668j5877j8192r058j1318j0894j3470j0626j7267j8561
4541A635302j2054o947r341j5161j6300j8909n710j765j4065j2639q030j6664
4529A497717q063j4071n938o711j4352r630j6284j1205l319q243j1207j1042o112
4516A371540r160j0601j5128n065q679j1608o689o460r477n461p972n982q368
4503A260890q802p299r688j008q824q830j2272p761m68q853q636p289m366p045
4489A159749j1824m371k310k924r259q137l258K10o609q155m670J214j974p692
4475A089990m602j414j062J129J729q760q611j597r028l77l445l617j1004j3497
4461A025834m269l469M349q080l576m219q468n052n165m002o485q37k738j0082
$$ plain form
4447 963741 959090 952985 949780 946087 940100 933413 929384 924266 929032 918846 907638 903347 893766 886743
4433 886743 886509 882413 873391 870924 867412 863841 862496 861906 853482 851085 846434 837161 829941 833187 827235
4418 827235 824058 821026 816408 809094 806948 804731 796001 787257 788177 783552 782606 783481 778069 773387 764309
4403 764309 760800 756025 752034 749099 745295 742097 740280 733408 733662 732055 730668 726167 722499 722657 711546
4388 711546 707095 708439 703800 707230 707283 697427 686206 689378 685438 682795 676984 675179 670693 664654 661849
4373 661849 659487 657900 659574 653300 649004 639841 643895 650925 642582 635091 630863 629097 624877 623930 618290
4358 618290 620661 613859 614768 618559 618321 605596 597849 596430 593974 596316 595741 587091 589262 583964 584488
4343 584488 583244 582179 580238 572846 571544 580926 568135 556312 554462 554909 556919 548061 544173 541301
$$ packed form
4447I63741m651o105l205l693n987o687m029n118M766j0186j1208m291r581p023
4433H86743k34m096r022k467l512l571j345n90q424k397m651r273p220L246n952
4418H27235l177l032m618p314k146k217q730q744R20m625r46Q75n412m682r078
4403G64309l509m775l991k935l804l198j817o872K54j607j387m501l668J58j1111
4388G11546m451J344m639L430N3r856j1221L172l940k643n811j805m486o039k805
4373F61849k362j587J674o274m296r163M054P030q343p491m228j766m220r47n640
4358F18290K371o802R09L791k38j2725p747j419k456K342n75q650K171n298N24
4343E84488j244j065j941p392j302R382j2791j1823j850M47K010q858l888k872
$$ plain form
4329 541301 541724 539432 535896 533604 532505 528963 531418 529259 521883 521602 516822 513861 519066 513941 507907
4314 507907 511758 509208 500352 496014 491790 496284 495142 497162 497294 492928 489609 487862 490217 487053 486170
4299 486170 485008 484252 478969 471883 469417 469951 464079 461006 464784 461479 467746 466341 457477 457015 454648
4284 454648 451226 447606 450024 447801 441940 439236 433972 433459 433974 439355 440398 425639 421544 419949 416560
4269 416560 417368 414774 413924 410465 405462 402944 411483 403923 396686 396120 401351 397444 395203 390138 387342
4254 387342 389888 386155 378945 368567 369616 370671 370356 369686 363560 357661 360109 361315 363559 362662 359816
4239 359816 354474 356699 355306 354292 356267 354699 356664 357829 356412 352511 352826 354075 354966 349548 345736
4224 345736 342480 338684 337183 333895 330083 337911 341429 339952 342554 340012 337987 337646 336719 336771 334876
$$ packed form
4329E41301M23k292l536k292j099l542K455k159p376k81m780k961N205n125o034
4314E07907L851k550q856m338m224M494j142K020J32m366l319j747K355l164q83
4299D86170j162p56n283p086k466N34n872l073L778l305O267j405q864m62k367
4284D54648l422l620K418k223n861k704n264n13N15N381J043j4759m095j595l389
4269D16560Q08k594q50l459n003k518Q539p560p237n66N231l907k241n065k796
4254C87342K546l733p210j0378J049J055l15o70o126n899K448J206K244q97k846
4239C59816n342K225j393j014J975j568J965J165j417l901L15J249Q91n418l812
4224C45736l256l796j501l288l812P828L518j477K602k542k025l41r27N2j895
$$ plain form
4209 334876 326430 327376 326144 328334 328888 327221 323880 323860 322383 322896 313651 316292 318752 319341 313116 303663
4193 303663 306421 300781 307901 308524 301109 299128 304732 309688 302881 298408 300800 298180 294137 303874 303888
4178 303888 299313 298497 296280 298676 295729 296243 293076 295049 290671 290629 286419 285262 285813 276394 277010 279759
4162 279759 276512 279426 278477 277215 274773 269050 269877 279904 273678 271921 269167 268592 267779 263293 260103
4147 260103 266488 268668 264833 270845 268113 261031 262712 264229 252566 256531 258668 255897 259954 259972 254408
4132 254408 253429 254085 255289 248456 251203 248438 250151 251182 252946 250430 246680 246488 240041 244202 239319
4117 239319 233996 236329 236185 241662 239123 235281 236358 238645 238061 242425 241554 237267 234791 230021 224545
4102 224545 225661 232315 233634 232599 230008 226981 231861 234664 230424 228939 223274 223553 227738 227448 224692
$$ packed form
4209C34876q446R46j232K190N54j667l341k0j477N13r245K641K460N89o225r453
4193C03663K758n640P120O23p415j981N604M956o807m473K392k620m043R737J4
4178C03888m575q16k217K396k947N14l167J973m378m2m210j157N51r419O16K749
4162B79759l247K914r49j262k442n723Q27J0027o226j757k754n75q13m486l190
4147B60103O385K180l835O012k732p082J681J517j1663L965K137k771M057J8n564
4132B54408r79O56J204o833K747k765J713J031J764k516l750j92o447M161m883
4117B39319n323K333j44N477k539l842J077K287n84M364q71m287k476m770n476
4102B24545J116O654J319j035k591l027M880K803m240j485n665K79M185k90k756
$$ plain form
4087 224692 221893 220722 221727 220359 219028 216447 216778 215265 209834 209949 215462 206980 200798 201886 199634
4072 199634 202096 201658 207364 206616 200683 205200 209957 205646 206776 210099 205931 201981 204981 200793 201150
4057 201150 198723 199291 197539 194724 192683 188776 186643 188287 190832 187184 192999 191704 186492 183735 190014
4042 190014 188532 187764 195221 188642 187825 192132 186940 186736 180536 181038 184203 182001 179259 174457 179306
4027 179306 181581 176427 177366 182932 182480 181911 179302 186438 194004 194236 194287 189337 189185 180597 177177 174950
4011 174950 168720 167083 172139 168354 162925 173541 175068 169082 168671 167477 177402 174547 173451 176822
3997 176822 174937 171672 174635 170292 173168 176671 173116 167998 159478 148951 149915 152005 144132 145277
3983 145277 150608 150844 151575 154305 145720 142534 147305 149355 156476 160250 162120 160077 156597 165512 164374
$$ packed form
4087B24692k799j171J005j368j331k581L31j513n431J15N513q482o182J088k252
4072A99634K462m38N706p48n933M517M757m311J130L323m168l950L000m188L57
4057B01150k427N68j752k815k041l907k133J644K545l648N815j295n212k757O279
4042A90014j482p68P457o579q17M307n192k04o200N02L165k202k742m802M849
4027A79306K275n154R39N566m52n69k609P136P566K32N1m950j52q588l420k227
4011A74950o230j637N056l785n429J0616J527n986m11j194R925k855j096L371
3997A76822j885l265K963m343K876L503l555n118q520j0527R64K090p873J145
3983A45277N331K36P31K730q585l186M771K050P121L774J870k043l480Q915j138
$$ plain form
3968 164374 173427 174301 164788 162139 162725 160858 152629 156189 149752 148865 153698 155214 159271 154774 156451
3953 156451 159610 162996 162325 157296 145466 146712 141155 145461 137688 136254 138822 129326 128379 131693 131609
3938 131609 132007 132097 127566 124362 130408 136954 137922 139090 140430 145744 145295 139377 144697 141021 135487 143855
3922 143855 140028 129098 123540 123375 122480 121248 118588 124605 116902 116291 117233 119696 128654 128279 132682
3907 132682 133901 127207 128564 132406 135564 130412 129149 128371 124901 126199 122845 123689 120483 117307 112527
3892 112527 114066 117112 116766 120538 120732 121477 122983 116894 110741 114925 123302 122547 120668 118338 110298
3877 110298 112211 111866 106985 106397 109044 101347 103819 108726 108307 107761 106946 109794 105615 104435 109741 113601
3861 113601 111746 108684 108461 111284 109755 107664 105949 109277 107535 105040 108418 109374 107790 104012 100023
$$ packed form
3968A64374R053Q74r513k649N86j867q229L560o437q87M833J516M057m497J677
3953A56451L159L386o71n029j1830J246n557M306p773j434K568r496r47L314q4
3938A31609L98R0m531l204O046O546R68J168J340N314m49n918N320l676n534Q368
3922A43855l827j0930n558j65q95j232k660O017p703o11R42K463Q958l75M403
3907A32682J219o694J357L842L158n152j263p78l470J298l354Q44l206l176m780
3892A12527J539L046l46L772J94P45J506o089o153M184Q377p55j879k330q040
3877A10298J913l45m881n88K647p697K472M907m19n46q15K848m179j180N306L860
3861A13601j855l062k23K823j529k091j715L328j742k495L378R56j584l778l989
$$ plain form
3846 100023 97339 97239 97744 95394 99967 98828 100859 103927 102351 104908 106715 105624 101163 102197 101163
3831 101163 99688 96842 95476 96157 98420 104726 102409 95749 96714 93098 93251 92370 95525 93168 89571
3816 89571 97242 98905 97800 91351 90171 90339 91096 86364 90347 96397 86818 85313 86191 85274 90363 94517
3800 94517 92543 85246 81592 88503 91558 88311 87259 92451 95376 91288 91123 92366 97096 95824 90506
3785 90506 86330 84199 90562 93408 92171 87205 86931 93073 93286 89325 93410 89416 93723 95508 91366
3770 91366 92204 87029 90641 91708 91108 88026 87801 92802 92610 92368 94636 93406 90937 98503 91341 90283
3754 90283 86833 86984 90472 83387 89247 97002 97856 99231 99893 91920 90852 92382 94239 86258 91783
3739 91783 95207 91430 93181 93160 90915 87736 87538 90303 91321 88849 89333 83659 86428 92873 93581 89935
$$ packed form
3846A00023k684j00N05k350M573j139K031L068j576K557J807j091m461J034j034
3831A01163j475k846j366O81K263O306k317o660R65l616J53q81L155k357l597
3816H9571P671J663j105o449j180J68P57m732L983O050r579j505Q78r17N089M154
3800I4517j974p297l654O911L055l247j052N192K925m088j65J243M730j272n318
3785I0506m176k131O363K846j237m966k74O142K13l961M085l994M307J785m142
3770I1366Q38n175L612J067o00l082k25N001j92k42K268j230k469P566p162j058
3754I0283l450J51L488p085N860P755Q54J375O62p973j068J530J857p981N525
3739I1783L424l777J751k1k245l179j98K765J018k472M84n674K769O445P08l646
$$ plain form
3723 89935 85915 92006 97930 96446 91975 97420 99443 95674 92133 91185 97964 93469 89446 86340 85295
3708 85295 92123 87992 85841 89226 87691 85892 80273 78295 84256 84853 81137 83035 87204 89468 86397
3693 86397 85339 83519 82182 81555 81817 87214 85386 85478 85208 79987 85729 90514 83512 80811 83159 82416
3677 82416 80966 82139 78541 82615 82754 80798 87661 82774 80793 85152 81148 83032 81315 79815 82729
3662 82729 79076 81068 86836 85259 77038 75065 78524 75320 77996 81131 85047 83673 73875 70019 73387
3647 73387 74664 75349 82357 82625 78098 74540 76981 79987 76852 75749 76211 78104 83150 83238 82737 76626
3631 76626 73586 72088 77479 79886 81744 82405 82616 78637 76458 79183 80206 86339 82039 83614 85226
3616 85226 82179 74568 75469 80458 79570 79417 78261 80739 84470 85860 86262 80855 80600 86706 80576 79226
$$ packed form
3723H9935m020O091N924j484m471N445K023l769l541r48O779m495m023l106j045
3708H5295O828m131k151L385j535j799n619j978N961N97l716J898M169K264l071
3693H6397j058j820j337o27K62N397j828R2k70n221N742M785p002k701K348p43
3677H2416j450J173l598M074J39j956O863m887j981M359m004J884j717j500K914
3662H2729l653J992N768j577q221j973L459l204K676L135L916j374r798l856L368
3647G3387J277O85P008K68m527l558K441L006l135j103M62J893N046Q8n01o111
3631G6626l040j498N391K407J858O61K11l979k179K725J023O133m300J575J612
3616H5226l047p611R01M989q88j53j156K478L731J390M02n407k55O106o130j350
$$ plain form
3600 79226 79219 73410 80357 82430 75636 79985 81953 77920 71637 71965 75515 77344 78096 79066 78282 73256
3584 73256 76275 68661 69756 73792 74577 73233 76413 81942 84025 83512 81862 80232 73649 75454 76332
3569 76332 76121 71693 74165 75336 73653 68574 64736 69099 73947 70780 65819 64865 64588 66091 68248
3554 68248 60548 57395 60223 54362 55739 60719 69613 65655 68306 67883 70908 64990 62714 63762 59418
3539 59418 60619 53551 59112 54766 60288 55352 55989 52566 55092 60751 54836 48412 51241 55664 52570
3524 52570 53244 55747 52818 52092 56000 56147 57793 49129 46801 52954 49214 45941 43320 46305 55919
3509 55919 51172 47204 47822 46177 42528 44806 45807 46944 50497 47383 40955 40638 41476 39882 39760 44834
3493 44834 52172 46984 38644 38648 40098 41563 44539 37435 39897 37202 37826 41659 37390 46487 48659 49057
$$ packed form
3600G9226pn809O947K073o794M349J968m033o283L28L550J829P52R70p84n026
3584G3256L019p614J095M036P85j344L180N529K083n13j650j630o583J805Q78
3569G6332k11m428K472J171j683n079l838M363M848l167m961r54k77J503K157
3554F8248p700l153K828n861J377M980Q894l958K651m23L025n918k276J048m344
3539E9418J201p068N561m346N522m936O37l423K526N659n915o424K829M423l094
3524E2570O74K503k929p26L908J47J646q664k328O153l740l273k621K985R614
3509E5919m747l968O18j645l649K278J001J137L553l114o428l17Q38j594j22N074
3493D4834P338n188q340MJ450J465K976p104K462k695O24L833m269R097K172L98
$$ plain form
3477 49057 44730 34212 37038 44256 44522 43707 45508 43978 37745 41502 45814 47345 39660 37364 41045
3462 41045 40689 36039 35277 33812 33360 33645 33248 29599 35234 34470 35756 34003 38036 36986 35950 32677
3446 32677 28054 32884 34778 33195 34287 33950 34704 31352 30307 38156 36041 30656 26038 33483 32549
3431 32549 33833 39684 34903 30145 31266 30767 29811 30200 33235 35057 35498 30273 34632 31676 28640 32668
3415 32668 35750 33423 26893 30845 34165 30766 26233 31898 35243 29469 29805 22255 19698 27456 34446
3400 34446 33696 34425 29566 28500 24887 27306 29087 28112 22605 21046 29621 30420 31585 30928 27072 26552
3384 26552 30987 32966 32186 28962 28865 34743 30619 28094 27419 29568 30470 25464 28691 36650 36317 36761
3368 36761 33066 34862 35466 31155 32949 31974 32556 26617 25938 28968 26456 24040 31242 26715 24922 23177
$$ packed form
3477D9057m327j0518K826P218K66q15J801j530o233L757M312J531p685k296L681
3462D1045l56m650p62j465m52K85l97l649N635p64J286j753M033j050j036l273
3446C2677m623M830J894j583J092l37P54l352j045P849k115n385m618P445r34
3431C2549J284N851m781m758J121m99r56L89L035J822M41n225M359k956l036M028
3415C2668L082k327o530L952L320l399m533N665L345n774L36p550k557P758O990
3400C4446p50P29m859j066l613K419J781r75n507j559Q575P99J165o57l856n20
3384B6552M435J979p80l224r7N878m124k525o75K149R02n006L227P959l33M44
3368C6761l695J796O04m311J794r75N82n939o79L030k512k416P202m527j793j745
$$ plain form
3352 23177 20830 24551 24028 23567 24046 23403 25957 29112 31163 26751 24430 23110 24172 22123 19843 21053
3336 21053 20562 23918 23170 22332 19505 18372 22308 19130 22230 27664 24128 21984 29819 32296 31101
3321 31101 27841 25368 24159 22004 26339 35811 28995 27872 31758 30372 29264 22405 22516 22729 18286
3306 18286 19665 23135 23842 27220 30908 28964 29236 31084 28280 21300 18487 20678 19274 13712 17078
3291 17078 23844 19747 14792 14888 11314 8711 15035 19758 22810 20306 18513 17217 18592 20349 21162
3276 21162 19485 14075 10165 18530 24190 18084 18419 22439 17913 20234 21382 22313 20787 24558 19039
3261 19039 26125 26698 16408 18497 17393 12591 12513 14210 13547 17385 13342 17176 17568 15936 11707 13448
3245 13448 15479 18173 19471 13072 10094 10500 13686 12172 9456 7353 11534 12425 13680 14289 15413
$$ packed form
3352B3177k347L721n23m61M79o43K554L155K051m412k321j320J062k049k280J210
3336B1053m91L356p48q38k827j133L936l178L100N434l536k144P835K477j195
3321C1101l260k473j209k155M335R472o816j123L886j386j108o859J11K13m443
3306A8286J379L470P07L378L688j944K72J848k804o980k813K191j404n562L366
3291A7078O766m097m955R6l574k603O324M723L052k504j793j296J375J757Q13
3276B1162j677n410l910Q365N660o106L35M020m526K321J148R31j526L771n519
3261A9039P086N73j0290K089j104m802p8J697o63L838m043L834L92j632m229J741
3245A3448K031K694J298o399k978M06L186j514k716k103M181Q91J255O09J124
$$ plain form
3230 15413 20379 17252 17036 14403 18276 17095 16867 18065 14982 19721 17688 14827 15474 16587 13250
3215 13250 10484 14993 14749 10349 8086 15594 16564 11873 8607 11307 16801 19592 20016 17365 16113
3200 16113 12957 12514 12130 12636 14585 13431 7102 6824 3272 5053 14674 16532 10747 11072 11328 19412
3184 19412 17851 22053 20218 11807 15386 12436 9601 9995 12112 16383 19379 11129 16399 15155 8842
3169 8842 9391 8862 10849 11572 12527 17231 13535 8390 10849 12347 12496 14223 12372 10432 6045 4771
3153 4771 11696 7707 2098 2954 7462 12362 15884 21602 18069 13608 14107 18374 19349 17395 10822 16916
3137 16916 21191 18989 18720 15005 10649 12517 12371 6857 7115 9346 8342 19034 18406 16426 13888
3122 13888 5764 9064 9564 9619 11058 10423 11809 12266 10875 15677 15577 10782 13222 13805 11770 13667
$$ packed form
3230A5413M966l127k16k633L873j181k28J198l083M739k033k861O47J113l337
3215A3250k766M509k44m400k263P508R70m691l266K700N494K791M24k651j252
3200A6113l156m43l84N06J949j154o329k78l552J781R621J858n785L25K56Q084
3184A9412j561M202j835q411L579k950k835L94K117M271K996q250N270j244o313
3169H842N49n29J987P23R55M704l696n145K459J498J49J727j851j940m387j274
3153D771O925l989n609Q56M508M900L522N718l533m461M99M267R75j954o573O094
3137A6916M275k202k69l715m356J868j46n514K58K231j004J0692o28j980k538
3122A3888q124L300N00N5J439o35J386M57j391M802j00m795K440N83k035J897
$$ plain form
3106 13667 7296 5830 9377 10054 8855 4515 1413 5476 6291 726 1646 7075 8216 11139 7921
3091 7921 10071 15132 16985 12082 17712 15534 9574 3711 7111 9635 -1278 2250 3301 4315 3659
3076 3659 7418 7786 5968 10832 6802 8481 9876 10354 11721 8521 8923 10172 6603 5653 9855 13964
3060 13964 8714 8977 4265 1561 3660 2380 221 3543 1715 4498 5867 3611 5911 8988 11477
3045 11477 10908 13326 13398 9614 6257 5226 6404 4896 4521 5602 169 -752 -2271 -1964 -955 5571
3029 5571 2421 2451 1955 5513 9886 3664 39 2398 2465 9310 9965 6349 2101 2886 4018 9812 5469
3012 5469 2521 10639 4736 1715 11744 7921 4490 3501 7101 7049 5782 8598 4058 36 5477
2997 5477 9788 9836 4339 2476 10441 12801 10952 1931 -855 -3461 -569 -2988 -261 4161 5833
$$ packed form
3106A3667o371j466L547O77j199m340l102M063Q15n565R20N429J141K923l218
3091G921K150N061J853m903N630k178n960n863L400K524j0913L528J051J014o56
3076C659L759L68j818M864m030J679J395M78J367l200M02J249l569r50M202M109
3060A3964n250K63m712k704K099j280k159L322j828K783J369k256K300L077K489
3045A1477n69K418P2l784l357j031J178j508l75J081n433r21j519L07J009O526
3029E571l150L0m96L558M373o222l625K359O7O845O55l616m248P85J132N794m343
3012E469k948Q118n903l021J0029l823l431r89L600n2j267K816m540m022N441
2997E477M311M8n497j863P965K360j849r021k786k606K892k419K727M422J672
$$ plain form
2982 5833 2137 -1374 -3930 -663 429 -143 -3761 144 7291 6588 3260 376 955 8056 6536 -2239
2966 -2239 -4703 -2539 8761 5064 7196 9161 2518 3235 -563 -2882 -6891 -6147 1321 9473 10348
2951 10348 2829 2564 -2346 928 3700 3858 -1915 523 3067 1418 9585 10708 10088 5548 5552 5803
2935 5803 2259 3139 -3631 581 2104 -36 3211 1125 1029 -1042 2489 1433 4652 427 -2652 -2213
2919 -2213 -1669 1369 4385 5686 1512 -3037 -2984 -1716 -720 5051 6724 -832 2261 1098 -6391 -4901
2903 -4901 -1451 -219 2998 89 -1158 -806 -636 769 1836 6771 4202 3362 1572 2814 -1052 -1752
2887 -1752 -3602 -4426 -1878 -2318 -2337 -8057 -6701 -63 2248 -1243 2502 4067 767 -838 -1374 -189
2871 -189 3034 7222 5509 6209 8238 4837 1789 726 -2675 1101 -720 -1336 -1952 -870 1873 -6303
$$ packed form
2982E833l696l511k556L267J092n72l618L905P147p03l328k884N79P101j520q775
2966b239k464K164J1300l697K132J965o643P17l798k319m009P44P468Q152Q75
2951A0348p519k65m910L274K772J58n773K438K544j649Q167J123o20m540MK51
2935E803l544Q80o770M212J523k140L247k086r6k071L531j056L219m225l079M39
2919b213N44L038L016J301m174m549N3J268R96N771J673p556L093j163p489J490
2903d901L450J232L217k909j247L52J70J405J067M935k569q40j790J242l866p00
2887a752j850q24K548m40j9n720J356O638K311l491L745J565l300j605n36J185
2871a89L223M188j713P00K029l401l048j063l401L776j821o16o16J082K743q176
$$ plain form
2855 -6303 -7339 -1491 -3550 -4305 -3301 -4273 -330 -5605 -2967 -5350 -9121 -2935 -5034 -5979 -5068 -7464
2839 -7464 -2728 2020 1901 2519 1350 1599 -1484 -531 -1719 -2089 -760 -2090 -2772 -3049 483 -5121 -6969
2822 -6969 -8596 -8349 -1000 5784 1904 -6214 -3420 -705 -477 -374 -146 -7948 -13991 -8471 -7318 -7902
2806 -7902 -5347 -5836 -2888 -2968 -1947 -1315 -3928 -5675 -9260 -9042 -4343 -5258 -4706 -6217 -6397 -6827 -2761
2789 -2761 -4187 -3447 -5192 -1840 -566 -1537 -5670 -4195 -933 -3141 1381 -2634 -4742 -2903 -2328 -6620
2773 -6620 -6759 -6364 -5836 -737 2671 -90 -2316 -849 3012 -596 -6204 -10354 -7664 -3596 -1221 242
2757 242 -7726 -7975 -6528 -5014 -6822 -3043 -363 31 7078 -1764 -6065 -2924 3805 3276 2314 3718
2741 3718 1780 -6161 -8596 -5484 -6009 -6204 1438 2196 4372 6975 6491 1228 879 -2212 -7659 -4807
$$ packed form
2855f303j036N848k059p55J004r72L943n275K638k383l771O186k099r45R11k396
2839g464M736M748j19O18j169K49l083R53j188l70J329j330o82k77L532n604j848
2822f969j627K47P349O784l880q118K794K715K28J03K28p802o043N520J153n84
2806g902K555m89K948q0J021O32k613j747l585K18M699r15N52j511j80m30M066
2789b761j426P40j745L352J274r71m133J475L262k208M522m015k108J839N75m292
2773f620j39L95N28N099L408k761k226J467L861l608n608m150K690M068K375J463
2757B42p968k49J447J514j808L779K680L94P047q842m301L141O729n29r62J404
2741C718j938p941k435L112n25j95P642P58K176K603m84n263l49l091n447K852
$$ plain form
2725 -4807 -1616 984 -3765 -7868 -9258 -9173 -10972 -4962 -119 536 -2186 -836 1651 -2510 171 -31
2709 -31 800 -3739 -4782 -4556 -4650 -2944 -6829 -3896 -8024 -5593 -10682 -5904 -4634 -2222 -908 2620
2693 2620 5712 3913 -1647 3409 5170 2831 3147 -5196 -2586 -4395 -5550 -4587 -1159 -701 -836 3385
2677 3385 862 -1096 -1125 -4874 -3414 -4958 4665 -1861 -2002 -1623 -1871 281 1709 24 1640 2228
2661 2228 -469 -4410 1336 -4585 -2542 -6564 -6238 646 -6382 -8241 -3009 101 416 2918 2634 4363
2645 4363 -218 2903 -2220 -6387 -4418 -733 -3459 364 4934 8059 288 -6436 -8638 -5215 -13150
2630 -13150 -10674 -6987 -5952 -6013 -4032 -5649 -9162 -5642 -2841 -4371 -5434 -4743 -1397 4707 3406
2615 3406 -1539 -2235 -1689 -8249 -5759 -492 1898 5039 3045 4418 -1706 -2318 -242 -5708 -3969 -2466
$$ packed form
2725d807L191K600m749m103j390Q5j799O010M843O55k722J350K487m161K681k02
2709c1Q31m539j043K26r4J706l885K933m128K431n089M778J270K412J314L528
2693B620L092j799n560N056J761k339L16q343K610j809j155R63L428M58j35M221
2677C385k523j958k9l749J460j544R623o526j41L79k48K152J428j685J616N88
2661B228k697l941N746n921K043m022L26O884p028j859N232L110L15K502k84J729
2645D363m581L121n123m167J969L685k726L823M570L125p771o724k202L423p935
2630a3150K476L687J035o1J981j617l513L520K801j530j063O91L346O104j301
2615C406m945o96N46o560K490N267K390L141j994J373o124o12K076n466J739J503
$$ plain form
2599 -2466 -5707 -6065 -7513 -3888 3563 -1656 120 -2963 -6133 -10788 -11387 -5560 -2006 -6129 -8105
2584 -8105 -3332 -11228 -16068 -8572 316 2541 -1235 -6096 -2764 2949 1512 -1945 4911 -1194 -1136
2569 -1136 5558 2930 5371 -2879 -2748 -340 -6326 -6435 -4295 -3497 1500 -1989 -4489 -2968 -4546 1368
2553 1368 -854 -1717 -1692 -3546 -1856 -3512 -9386 -10456 -8666 -5034 2981 -458 1109 -548 -6946 652
2537 652 -1530 -411 -2239 -4102 -1399 -7894 4584 -3221 -6917 -1161 -2916 -9066 -12081 -10759 -7144
2522 -7144 -5531 -4428 -2902 -463 -1302 -4330 -6600 -4601 -4307 -1489 -4126 -4519 -7316 -8987 -2166 -4322
2506 -4322 -3444 -6190 -7215 -9005 -3801 1773 4 -1930 -3795 -5918 -3927 -5139 3545 1966 -840
2491 -840 -2858 -1107 -6589 -4389 -2518 -2419 1621 2423 -991 -4542 -500 -3259 -6484 -8557 89 565
$$ packed form
2599b466l241l58j448L625P451n219J776l083l170m655n99N827L554m123j976
2584h105M773p896m840P496Q888K225l776m861L332N713j437l457O856o105N8
2569a136O694k628K441q250J31K408n986j09K140P98M997l489k500J521j578N914
2553A368k222q63K5j854J690j656n874j070J790L632Q015l439J567j657o398P598
2537F52k182J119j828j863K703o495J2478p805l696N756j755o150l015J322L615
2522g144J613J103J526K439q39l028k270J999K94K818k637l93k797j671O821k156
2506d322Q78k746j025j790N204N574j769j934j865k123J991j212Q684j579k806
2491h40k018J751n482K200J871R9M040Q02l414l551M042k759l225k073Q646M76
$$ plain form
2475 565 2116 885 1245 -5592 -6778 -1222 5874 2688 -2818 -4999 -4291 -1895 -835 -1607 -2097 -7919
2459 -7919 -6294 617 1937 6318 545 -2905 -5212 -5994 -11645 -10358 -3816 -894 -3349 -2974 -4550
2444 -4550 -1875 -1468 -7759 -11481 -11324 -14596 -10002 -9811 -3968 -4967 -5729 -5875 -8530 -4910 -2735 509
2428 509 -2855 1447 7363 -968 -2410 -4831 -1939 947 -4064 -1028 -3002 -119 -3528 -4472 -225
2413 -225 -171 679 -2557 -4503 -136 -5728 -6398 -5449 -7841 -6332 -275 2503 -1877 2 1323 -4219
2397 -4219 4261 3988 -4036 -2131 -436 -2058 -1343 -4588 2532 -1538 -1310 3060 -1654 -4170 -10061 -9026
2381 -9026 -4121 5026 1657 1243 -2864 -4363 -4394 4682 2706 89 -4303 -8142 -5830 -10612 -5517 -6894
2365 -6894 -7516 -5972 -5332 -6690 -6100 1911 4135 2115 2500 2915 4115 6123 -808 -6438 -2147 -2918
$$ packed form
2475E65J551j231L60o837j186N556P096l186n506k181P08K396J060p72m90n822
2459g919J625O911J320M381n773l450k307p82n651J287O542K922k455L75j576
2444d550K675M07o291l722J57l272M594J91N843r99p62j46k655L620K175L244
2428E09l364M302N916q331j442k421K892K886n011L036j974K883l409r44M247
2413b25N4Q50l236j946M367n592o70R49k392J509O057K778m380J879J321n542
2397d219Q480k73q024J905J695j622P15l245P120m070K28M370m714k516n891J035
2381i026M905R147l369m14m107j499l1R076j976k617m392l839K312m782N095j377
2365f894o22J544O40j358N90Q011K224k020L85M15J200K008o931n630M291p71
$$ plain form
2349 -2918 1132 956 -2994 -8542 -5990 -1658 -3053 -5356 -3987 -1618 -1102 -3363 -5917 -1526 58
2334 58 755 -2232 -1890 -5121 -2113 -4552 -7074 -4118 -6123 -4251 -4212 -8135 -6341 -6098 -2904 -3734 -6563
2317 -6563 -869 -7222 -6441 -724 -5664 -6145 -2822 879 -2092 -3970 2275 -5467 -10925 -11415 -11716 -10677
2301 -10677 -1505 -7296 -12087 -8123 -12083 -14392 -7905 -2600 -3991 -9424 -10198 4362 6507 3034 -1124
2286 -1124 -2494 -585 -1023 -5178 -5973 -1901 218 -734 -5580 -4627 -1909 -8086 -10369 -12057 -11470 -176
2270 -176 3244 -5742 -1819 2933 -2494 -2505 1224 -5840 -11484 -3814 -3850 -7986 -8649 -1798 2426 4131
2254 4131 -3225 -3086 -4175 -4093 1519 3688 3493 4456 -4038 -6089 -1372 2652 3032 -1200 -2312 -5785
2238 -5785 -28 -958 -9389 -9486 -9843 -9715 -4416 -810 2286 -3400 -715 -1524 -5512 -9845 -2594 -3820
$$ packed form
2349b918M050j76l950n548K552M332j395k303J369K369N16k261k554M391J584
2334E8O97k987L42l231L008k439k522K956k005J872L9l923J794K43L194q30k829
2317f563N694o353P81N717m940m81L323L701k971j878O245p742n458m90l01J039
2301a0677R172n791m791L964l960k309O487N305j391n433p74J4560K145l473m158
2286a124j370J909m38m155p95M072K119r52m846R53K718o177k283j688N87J1294
2270a76L420q986L923M752n427j1L729p064n644P670l6m136o63O851M224J705
2254D131p356J39j089Q2N612K169j95R63q494k051M717M024L80m232j112l473
2238e785N757r30q431r7l57J28N299L606L096n686K685q09l988m333P251j226
$$ plain form
2222 -3820 -6794 4035 -1656 -7264 -328 -2021 -5319 -1649 -2311 -4525 -5291 -1607 -6198 -8203 -4482
2207 -4482 -1567 -3271 -6677 -3556 -2186 964 -1562 -3259 668 270 -438 -465 -2315 -3269 -6573 -3395
2191 -3395 -1327 -7535 -3464 3983 -7015 -8048 -11639 -14778 -7972 1 -4699 -8188 -7355 -5890 -5410
2176 -5410 -3247 -4322 -3078 1739 -6837 -11249 -5564 -4955 -7597 -8001 -6968 -5816 -6263 -4016 -3276 -1505
2160 -1505 -12373 -7456 -7582 -7536 -5880 -1495 -6602 -3644 -2019 -5121 -8397 -11249 -9127 -7124 -2947
2145 -2947 -1312 -3220 -4326 -1508 -4982 -3486 -5697 -3480 -4609 -10121 -11942 -9841 -8780 -9076 -736
2130 -736 -1052 -10696 -13398 -10424 -3923 -753 -3076 -7861 -3227 -4567 -2570 -3 -5853 -5286 -4333 -5675
2114 -5675 -7268 -2909 -3855 -3739 -8491 -14101 -10347 -8418 -8786 -1760 3180 1367 -4941 -4264 -9442 -14489
$$ packed form
2222c820k974J0829n691n608O936j693l298L670o62k214p66L684m591k005L721
2207d482K915j704l406L121J370L150k526j697L927l98p08k7j850r54l304L178
2191c395K068o208M071P447j0998j033l591l139O806P973m700l489Q33J465M80
2176e410K163j075J244M817q576m412N685O09k642m04J033J152m47K247P40J771
2160a505j0868M917j26M6J656M385n107K958J625l102l276k852K122K003M177
2145b947J635j908j106K818l474J496k211K217j129n512j821K101J061k96Q340
2130g36l16r644k702K974O501L170k323m785M634j340J997K567n850N67R53j342
2114e675j593M359r46J16m752n610L754J929l68P026M940j813o308O77n178n047
$$ plain form
2098 -14489 -9109 -4004 -6737 -6077 624 -4232 2133 -1550 -3070 -6174 -1420 5638 2203 -3856 -4737
2083 -4737 -4001 -3791 -799 -2515 -6252 -6489 -2284 -237 3509 -1654 -5893 -6352 -3070 -1920 -4330 -2481
2067 -2481 2613 4383 -2601 -7056 -2501 4434 2974 -1586 -2159 -651 -5455 -1297 -372 372 -2091 -7680
2051 -7680 265 -6388 -8753 -5441 -7570 -6560 -3419 -2788 -6543 -6130 -6735 -6146 -5478 -4973 -670 3336
2035 3336 806 2671 2285 -5527 -7560 -3236 -3454 -3331 -8110 -7429 -1997 -4457 -41 -3932 -4266 -6802
2019 -6802 -8927 -9644 -7638 -7436 -5933 -2733 -5711 -4061 -4533 -4784 -3710 -1859 1510 68 2476 -2840
2003 -2840 -2634 -3866 -5574 -2461 -4696 -8376 -5353 12 -1531 -1253 -5177 3 -598 -3264 -4785 -1110
1987 -1110 -4056 -6153 -642 -5011 870 -5636 -6157 -6906 -2874 1 -4590 -1580 -3248 -4756 -6473
$$ packed form
2098a4489N380N105k733O60O701m856O365l683j520l104M754P058l435o059q81
2083d737P36K10K992j716l737k37M205K047L746n163m239m59L282J150k410J849
2067b481N094J770o984m455M555O935j460m560n73J508m804M158R25P44k463n589
2051g680P945o653k365L312k129J010L141O31l755M13o05N89O68N05M303M006
2035C336k530J865l86p812k033M324k18J23m779O81N432k460M416l891l34k536
2019f802k125p17K006K02J503L200k978J650m72k51J074J851L369j442K408n316
2003b840K06j232j708L113k235l680L023N365j543K78l924N180o01k666j521L675
1987a110k946k097N511m369N881o506n21p49M032K875m591L010j668j508j717
$$ plain form
1972 -6473 -4570 -1345 -5347 -3839 753 -1216 441 -1174 -4102 -5190 -5331 -3539 -4315 -7733 -8187 -7915
1956 -7915 -5094 -2153 -1755 1127 3509 -5423 -9678 -8183 -6482 -11415 -11319 -2858 -11196 -10071 -5213 -3829
1940 -3829 -6949 -7085 -5134 -5913 -7810 -5113 1530 -47 -5176 -6649 -1601 -7670 -2942 -3110 -8914 -12859
1924 -12859 -4770 -2562 -2633 -5608 -6773 -8125 -8852 -5699 -6672 -10017 -10664 -8394 -3169 967 527 293
1908 293 -5073 -7977 -5811 -7431 -13929 -11968 -7244 -1150 3863 -1371 -6009 -4090 -1126 -1581 -10249
1893 -10249 -6622 -4837 -3600 -3822 1588 -2658 -3048 -1214 -6179 69 103 -1672 -5155 -5308 -2386 4065
1877 4065 328 -2832 -848 -1214 -3052 -2117 186 -1241 -5782 -4543 822 -7284 -11376 -7964 -7094 -6796
1861 -6796 105 -1023 -3650 -5961 -2129 -3421 -8795 -9097 -10316 -9810 -7034 -11708 -17040 -12462 -4079
$$ packed form
1972f473J903L225m002J508M592j969J657j615k928j088j41J792p76l418m54K72
1956g915K821K941L98K882K382q932m255J495J701m933R6Q461q338J125M858J384
1940c829l120j36J951p79j897K697O643j577n129j473N048o069M728j68n804l945
1924a2859Q089K208p1k975j165j352p27L153r73l345o47K270N225M136m40k34
1908B93n366k904K166j620o498J961M724O094N013n234m638J919K964m55q668
1893a0249L627J785J237k22N410m246l90J834m965O248L4j775l483j53K922O451
1877D065l737l160J984l66j838R35K303j427m541J239N365q106m092L412Q70K98
1861f796O901j128k627k311L832j292n374l02j219N06K776m674n332M578Q383
$$ plain form
1846 -4079 -2705 -1289 -5413 -4971 -4720 -630 9606 2638 546 -3543 -3884 -9389 -5640 -6727 -6586 -548
1830 -548 7490 -290 -3206 1420 4634 -3496 -3340 -2677 -4611 -3109 -9895 -3227 -851 432 -483 3356
1814 3356 -3515 -5990 -4621 -183 3271 5150 -591 -3004 3633 -419 -3445 -141 -1160 -455 -943
1799 -943 -928 -3014 -1919 -2108 -2224 -1296 -4938 -1923 -2829 -3139 4825 4817 -3563 -8104 -6451 -7188 -6520 -2869
1781 -2869 -4852 -4239 -2704 -5176 -848 -2254 -3085 -1758 4004 5809 2755 9857 6107 -1604 -1042 916
1765 916 -5672 792 3731 -4487 -4498 -7443 -1303 -5928 -8754 -6871 -6424 -8715 -6844 -6946 -3237 -5111
1749 -5111 -2065 854 -3435 -5685 -5194 -2033 -451 2899 -1941 -5817 -4587 -6663 -1597 4437 -3865
1734 -3865 -7937 -10285 -3659 -4862 -3509 -2174 -6434 -7655 -3769 -4484 5189 5147 -1691 512 531 -4442
$$ packed form
1846d079J374J416m124M42K51M090J0236o968k092m089l41n505L749j087J41O038
1830e48Q038p780k916M626L214q130J56O63j934J502o786O668K376J283r15L839
1814C356o871k475J369M438L454J879n741k413O637m052l026L304j019P05m88
1799i43J5k086J095j89j16R28l642L015r06l10P964qq380m541J653p37O68L651
1781b869j983O13J535k472M328j406q31J327N762J805l054P102l750p711N62J958
1765I16o588O464K939q218j1k945O140m625k826J883M47k291J871j02L709j874
1749e111L046K919m289k250M91L161J582L350m840l876J230k076N066O034q302
1734c865m072k348O626j203J353J335m260j221L886p15R673m2o838K203J9m973
$$ plain form
1718 -4442 -5920 -7178 -810 3416 -1471 -2562 -5332 -5749 -2728 1311 2478 5141 4390 4391 3902 4147 4829
1701 4829 -997 1608 -1845 -7933 -12410 -5402 -1462 2168 -2564 -9295 -4972 -4780 -7307 -13205 -7338
1686 -7338 -8596 -10600 -6298 -1071 8873 11740 4985 3871 7156 7727 2830 4826 9256 7805 10309
1671 10309 10119 10148 5906 5157 6543 5612 -1731 455 -1601 -8330 -8672 -8243 -6525 -5204 -2202 -3957
1655 -3957 -6624 -4399 1055 6063 7366 4679 2983 956 4658 4624 7349 4669 5246 5122 -4799 -6739
1639 -6739 -5744 -5564 -4024 -3069 3195 265 -2979 -4264 -987 -3710 -4925 -2779 -3816 -2733 -3175 -2494
1623 -2494 -519 -167 296 358 -57 4175 6238 7734 3562 -4928 -2487 -939 -6987 -7680 -8411 -2683 1516
1606 1516 2496 3958 5190 -1027 1623 6130 3767 -2326 -10548 -3714 -1624 1614 3510 1118 4283
$$ packed form
1718d442j478j258O368M226m887j091k770m17L021M039J167K663p51Jm89K45O82
1701D829n826K605l453o088m477P008L940L630m732o731M323J92k527n898N867
1686g338j258k004M302N227R944K867o755j114L285N71m897J996M430j451K504
1671A0309j90K9m242p49J386r31p343K186k056o729l42M29J718J321L002j755
1655c957k667K225N454N008J303k687j696k027L702l4K725k680N77j24r921j940
1639f739R95J80J540R55O264k930l244j285L277k723j215K146j037J083m42O81
1623b494J975L52M63O2m15M232K063J496m172q490K441J548o048o93p31N728M199
1606A516R80J462J232o217K650M507k363o093q222O834K090L238J896k392L165
$$ plain form
1591 4283 72 1021 3791 -316 3099 995 -969 -1963 3565 -1421 -3856 -684 -5034 -3902 -5336
1576 -5336 -4667 363 2821 2569 1237 3164 2410 2658 2693 -1750 -899 4444 6411 4650 5087 402 2160
1559 2160 1996 -2322 -336 -2722 -2073 -7002 -2242 -3271 -6520 -3892 -2291 -4269 -4761 -1047 1594 586
1543 586 -3627 413 5892 -718 -3269 887 -2052 -4323 -5939 -6836 -8040 -8774 -1930 3490 -3128 -3794
1527 -3794 -7820 -5282 -2678 -5554 -4758 -2146 4296 6514 5782 2151 -5187 -5599 -4680 -4365 -5942 -4280
1511 -4280 -6741 -875 -1516 -3764 -6389 -6481 -5478 -5479 -4468 -9306 -3058 -3841 311 1949 -6968 -5337 -1960
1494 -1960 445 721 5554 -92 -4830 -6074 -5146 -6981 -8130 -7655 -6161 -4990 -14 3826 3174 9149
1478 9149 2066 2715 -774 -3122 -1343 -941 2966 1215 -1962 -3649 467 854 -2166 -4000 -6689 -1395
$$ packed form
1591D283m211R49K770m107L415k104j964r94N528m986k435L172m350J132j434
1576e336O69N030K458k52j332J927p54K48L5m443Q51N343J967j761M37m685J758
1559B160j64m318J986k386O49m929M760j029l249K628J601j978m92L714K641j008
1543E86m213M040N479o610k551M156k939k271j616q97j204p34O844N420o618o66
1527c794m026K538K604k876P96K612O442K218p32l631p338m12R19L15j577J662
1511d280k461N866o41k248k625r2J003jJ011m838O248p83M152J638q917J631L377
1494a960K405K76M833n646m738j244R28j835j149M75J494J171M976L840o52N975
1478I149p083O49l489k348J779M02L907j751l177j687M116L87l020j834k689N294
$$ plain form
1462 -1395 -973 -16 1715 3186 4179 1667 -1643 -2282 -1337 -4385 -1376 -2452 -6374 -5790 -2045 -5053
1446 -5053 -10359 -11382 -5059 -7016 -1444 389 -508 -1920 -4357 -387 8679 5275 -3 4393 -2799
1431 -2799 -3904 854 2964 -292 32 -2174 -7164 -9009 -5273 -2908 -5209 -2146 3730 2349 2305 6884
1415 6884 6049 897 -334 -3727 -4438 -6185 -1037 -204 2283 8429 3791 2842 -554 -51 -5673 -7192
1399 -7192 -7642 -6792 -1053 -519 -5110 -8098 -7623 -4951 -2950 -4338 3223 1869 -464 351 -1793 3151
1383 3151 815 -6231 -6400 -3550 -359 -3715 -220 -3591 473 -2991 -6219 -2963 -3306 -7091 -5497
1368 -5497 -7514 -6996 -6915 -4181 -3730 -4789 -7023 -2623 1342 896 1781 4406 -12 -2594 -3649 -7467
1352 -7467 -2493 -1696 399 -6670 -6915 -2985 -861 -5939 -1699 -327 -6165 -2590 -507 -7650 -10046
$$ packed form
1462a395M22R57J731J471R93k512l310o39R45l048L009j076l922N84L745l008
1446e053n306j023O323j957N572J833q97j412k437L970R066l404n278M396p192
1431b799j105M758K110l256L24k206m990j845L736K365k301L063N876j381m4M579
1415F884q35n152j231l393p11j747N148Q33K487O146m638r49l396N03n622j519
1399g192m50Q50N739N34m591k988M75K672K001j388P561j354k333Q15k144M944
1383C151k336p046j69K850L191l356L495l371M064l464l228L256l43l785J594
1368e497k017N18Q1K734M51j059k234M400L965m46Q85K625m418k582j055l818
1352g467M974P97K095p069k45L930K124n078M240J372n838L575K083p143k396
$$ plain form
1337 -10046 -4145 -5740 -5010 -510 1480 4283 1307 -3578 -6199 -429 -150 -3113 -2591 -1403 -5540
1322 -5540 -1394 1372 4772 169 -5134 657 -1836 -4620 -4090 -1465 -6108 -2008 -1495 -1480 869 1808
1306 1808 3642 2481 -242 9140 13209 5428 2153 -1277 -7825 -3855 -3790 -5085 -5135 -3697 -8982 -9205
1290 -9205 1316 -3213 -3693 3148 -1177 -8313 -1295 -2497 2219 839 -3362 -2897 -773 -881 -2154
1275 -2154 -2151 1038 5877 6477 4466 3244 2297 4031 381 -5340 -4263 -2460 -7032 -3707 -3358 -5701
1259 -5701 -6835 -4566 -2877 1010 -1549 -3090 -325 -512 -648 4190 789 -2092 -2560 0 1439 -7404
1243 -7404 -11570 -12061 -8594 -6134 -2883 -6143 -9577 -295 3044 -1263 -1271 753 -5405 -5584 -5217 590
1227 590 5483 6196 2455 732 -326 330 1569 1385 1763 -1687 39 -409 -2604 -2323 -1548 -3163 -5893
$$ packed form
1337a0046N901j595P30M500J990K803k976m885k621N770K79k963N22J188m137
1322e540M146K766L400m603n303N791k493k784N30K625m643M100N13J5K349R39
1306A808J834j161k723R382M069p781l275l430o548L970O5j295n0J438n285k23
1290i205J0521m529m80O841m325p136P018j202M716j380m201M65K124j08j273
1275b154LL189M839O00k011j222r47J734l650n721J077J803m572L325L49k343
1259e701j134K269J689L887k559j541K765j87j36M838l401k881m68K560J439q843
1243g404m166m91L467K460L251l260l434R282L339m307qK024o158j79L67N807
1227E90M893P13l741j723j058O56J239j84L78l450J726m48k195K81P75j615k730
$$ plain form
1210 -5893 -1830 1872 -4315 -5942 -792 1513 -790 -863 -3568 -5239 -5314 -2065 -4868 -830 -7084 -1598
1194 -1598 -288 -4501 -2718 2560 3635 3261 -3509 774 4093 3296 6061 4715 2381 5150 6046 6681
1178 6681 6410 7031 -4176 -5971 2514 3788 234 2389 3302 3128 7426 5822 -1802 -2313 -352 -6663
1162 -6663 -6054 1527 1626 2859 -2975 -4037 1462 2072 -708 -1843 326 -2222 -2845 -769 2633 -482
1146 -482 -4356 -9341 -5834 -5145 -4356 2437 10980 9663 6652 2067 4288 -1225 2086 -1211 -530 5129
1130 5129 3176 -87 -1662 -5975 -2689 3392 7049 8686 842 265 -4526 532 1931 -2567 2282
1115 2282 654 2371 -2781 -6868 -1812 -1841 1460 -1299 -2848 -5013 -338 2466 1197 4413 2176
1100 2176 -3609 -9012 -9532 -3427 -3210 -1289 -1978 -3781 -274 3489 3270 -236 39 3080 -5487 -2378
$$ packed form
1210e893M063L702o187j627N150K305k303p3k705j671p5L249k803M038o254N486
1194a598J310m213J783N278J075l74o770M283L319p97K765j346k334K769Q96O35
1178F681k71O21j1207j795Q485J274l554K155R13j74M298j604p624n11J961o311
1162f663O09P581R9J233n834j062N499O10k780j135K169k548o23K076L402l115
1146d82l874m985L507O89P89O793Q543j317l011m585K221n513L311l297O81N659
1130E129j953l263j575m313L286O081L657J637p844n77m791N058J399m498M849
1115B282j628J717n152m087N056k9L301k759j549k165M675K804j269L216k237
1100B176n785n403n20O105K17J921o89j803L507L763k19l506K75L041q567L109
$$ plain form
1084 -2378 1789 -2370 -221 1372 5661 875 6213 7463 6900 9537 8876 7999 6136 -1589 885 -1071
1068 -1071 2261 -3092 3789 4736 2140 -720 -3613 3124 5813 1437 -251 1197 196 -673 -4635
1053 -4635 514 2068 -2086 -7825 -2627 -1221 4705 5973 2446 -961 404 5656 5109 4270 -2065
1038 -2065 -1910 -5012 -4168 -7988 -6177 -8995 -6110 2297 -1353 -4889 -4961 1011 -1415 -1369 -8247 -12834
1022 -12834 -767 6100 -265 1297 3862 2564 -135 3924 -639 -2630 -6952 -8213 -5315 -6140 -3564
1007 -3564 -3762 -2077 1699 -3080 -250 -827 -1586 2158 -1259 -1694 1253 7148 3997 2166 6755 2560
991 2560 7254 5582 81 -6815 -9435 -2479 2626 3679 4224 -430 -1522 2259 3606 5769 4787 -205
975 -205 -2823 433 -2860 -5021 634 -3362 468 6984 4696 2275 -861 -2309 -2845 -3418 -9004 -9518
$$ packed form
1084b378M167m159K149J593M289m786N338J250n63K637o61q77j863p725K474j956
1068a071L332n353O881R47k596k860k893O737K689m376j688J448j001q69l962
1053d635N149J554m154n739N198J406N926J268l527l407J365N252n47q39o335
1038b065J55l102Q44l820J811k818K885Q407l650l536p2N972k426M6o878m587
1022a2834J2067O867o365J562K565j298k699M059m563j991m322j261K898q25K576
1007c564j98J685L776m779K830n77p59L744l417m35K947N895l151j831M589m195
991B560M694j672n501o896k620O956N105J053N45m654j092L781J347K163r82m992
975b05k618L256l293k161N655l996L830O516k288k421l136j448n36n73n586n14
$$ plain form
959 -9518 -381 3902 -4156 -260 775 2052 4719 4215 -3478 -4234 5242 5052 1863 939 -596 3160
943 3160 4864 -1510 1221 1678 225 -4851 -361 6951 3720 2370 711 4385 5994 3859 2005
928 2005 -5398 -4453 -5936 -3190 3639 1361 -8 1989 8550 5201 6276 10280 2232 -2010 -18
913 -18 1848 2912 453 3868 5440 -339 2138 1909 985 1566 -3140 -3832 2041 5860 4679 5488 3985
$$ packed form
959i518R137M283q058L896J035J277K667n04p693p56R476j90l189r24j535L756
943C160J704o374K731M57j453n076M490P312l231j350j659L674J609k135j854
928B005p403R45j483K746O829k278j369J997O561l349J075M004q048m242J992
913a8J866J064k459L415J572n779K477k29r24N81m706o92N873L819j181Q09j503
$$ [...]
##END NTUPLES=NMR SPECTRUM
##END=
