##TITLE=1H_CA-9260-3
 DMSO
 8 sc, 
 8.4.2024
##JCAMPDX= 6.0         $$ Bruker NMR JCAMP-DX V2.0
##DATA TYPE= NMR SPECTRUM
##DATA CLASS= NTUPLES
##ORIGIN= UXNMR, Bruker Analytische Messtechnik GmbH
##OWNER= root
$$ XWIN-NMR		Version 3.5
$$ Mon Apr  8 14:10:36 2024 Russian Standard Time (UT+4h)  she@DPX200
##.OBSERVE FREQUENCY= 200.1309
##.OBSERVE NUCLEUS= ^1H
##.ACQUISITION MODE= SIMULTANEOUS
##.ACQUISITION SCHEME= undefined
##.AVERAGES= 8
##.DIGITISER RES= 18
##SPECTROMETER/DATA SYSTEM= spect
##.PULSE SEQUENCE= zg30
##.SOLVENT NAME= CDCl3
##.SHIFT REFERENCE= (INTERNAL, CDCl3, 0, 15.683)
##AUDIT TRAIL= $$ (NUMBER, WHEN, WHO, WHERE, WHAT)
$$ ##TITLE= Audit trail, XWIN-NMR		Version 3.5
$$ ##JCAMPDX= 5.01
$$ ##ORIGIN= Bruker BioSpin GmbH
$$ ##OWNER= she
$$ F:/spectra/data/she/nmr/H-F/1/pdata/1/auditp.txt
$$ ##AUDIT TRAIL=  $$ (NUMBER, WHEN, WHO, WHERE, WHAT)
(   1,<2024-04-08 14:08:56.10 +0400>,<she>,<DPX200>,
      <created by zg, POWCHK disabled, PULCHK disabled
       configuration hash MD5:
       00 E9 B6 7A A2 85 ED C7 34 08 36 98 17 FE 4E 26
       data hash MD5: 16K
       AB 2D 26 56 E7 71 45 7A 34 40 BC B0 26 B0 9E 8B>)
(   2,<2024-04-08 14:08:59.10 +0400>,<she>,<DPX200>,
      <Start of raw data processing
       efp BC_mod = 2 LB = 0.24 FT_mod = 6 PKNL = 1 PHC0 = -25297.32 PHC1 = 7.78731 SI = 16K 
       data hash MD5: 16K
       04 DB 57 12 8A 67 20 3B 34 8E 0B D7 5B E3 6A 51>)
(   3,<2024-04-08 14:09:14.64 +0400>,<she>,<DPX200>,
      <pk PHC0 = -81.81883 PHC1 = 0 
       data hash MD5: 16K
       F0 3D 51 EB FC E7 C1 AF AD 87 74 F9 1A 03 81 DD>)
(   4,<2024-04-08 14:09:17.85 +0400>,<she>,<DPX200>,
      <abs ABSG = 5 
       data hash MD5: 16K
       C5 E1 9D 13 78 5F 30 D0 E0 F7 06 58 8B 90 32 FB>)
$$ ##END=
$$ 
$$ hash MD5
$$ 75 CE 5A 36 86 E8 45 35 03 4D F1 FE 9F 51 74 41
##$RELAX= 
##$RELAX= 
##$RELAX= 
##$RELAX= 
##$RELAX= 
##$RELAX= 
$$ Bruker specific parameters
$$ --------------------------
##$DU= <F:/spectra>
##$EXPNO= 1
##$NAME= <H-F>
##$PROCNO= 1
##$TYPE= <nmr>
##$USER= <she>
##$AMP= (0..31)
100 100 100 100 100 100 100 100 100 100 100 100 100 100 100 100 100 100 
100 100 100 100 100 100 100 100 100 100 100 100 100 100 
##$AQSEQ= 0
##$AQ_mod= 1
##$AUNM= <au_zg>
##$AUTOPOS= <>
##$BF1= 200.13
##$BF2= 200.13
##$BF3= 200.13
##$BF4= 200.13
##$BF5= 200.13
##$BF6= 200.13
##$BF7= 200.13
##$BF8= 200.13
##$BYTORDA= 1
##$CFDGTYP= 0
##$CFRGTYP= 5
##$CHEMSTR= <none>
##$CNST= (0..31)
1 1 145 1 1 1 1 1 1 1 1 1 1 1 1 1 1 1 1 1 1 1 1 1 1 1 1 1 1 1 1 1 
##$CPDPRG= <>
##$CPDPRG1= <>
##$CPDPRG2= <>
##$CPDPRG3= <>
##$CPDPRG4= <mlev>
##$CPDPRG5= <mlev>
##$CPDPRG6= <mlev>
##$CPDPRG7= <mlev>
##$CPDPRG8= <mlev>
##$CPDPRGB= <>
##$CPDPRGT= <>
##$D= (0..31)
0 1.2 0 0 0 0 0 0 0 0.06 0 0.03 0 0 0 0 0.0002 0 0 0 0 0 0 0 0 0 0 0 0 
0 0 0 
##$DATE= 1712570935
##$DBL= (0..7)
120 120 120 120 120 120 120 120 
##$DBP= (0..7)
150 150 150 150 150 150 150 150 
##$DBP07= 0
##$DBPNAM0= <>
##$DBPNAM1= <>
##$DBPNAM2= <>
##$DBPNAM3= <>
##$DBPNAM4= <>
##$DBPNAM5= <>
$$ [...]
##$SUBNAM3= <"">
##$SUBNAM4= <"">
##$SUBNAM5= <"">
##$SUBNAM6= <"">
##$SUBNAM7= <"">
##$SUBNAM8= <"">
##$SUBNAM9= <"">
##$SW= 18.0517689322627
##$SWIBOX= (0..15)
0 0 2 0 0 0 0 0 0 0 0 0 0 0 0 0 
##$SW_h= 3612.71676300578
##$TD= 16384
##$TD0= 1
##$TE= 0
##$TE2= 300
##$TE3= 300
##$TEG= 300
##$TL= (0..7)
0 120 120 120 120 120 120 120 
##$TP= (0..7)
150 150 150 150 150 150 150 150 
##$TP07= 0
##$TPNAME0= <>
##$TPNAME1= <>
##$TPNAME2= <>
##$TPNAME3= <>
##$TPNAME4= <>
##$TPNAME5= <>
##$TPNAME6= <>
##$TPNAME7= <>
##$TPOAL= (0..7)
0.5 0.5 0.5 0.5 0.5 0.5 0.5 0.5 
##$TPOFFS= (0..7)
0 0 0 0 0 0 0 0 
##$TUNHIN= 0
##$TUNHOUT= 0
##$TUNXOUT= 0
##$USERA1= <user>
##$USERA2= <user>
##$USERA3= <user>
##$USERA4= <user>
##$USERA5= <user>
##$V9= 5
##$VALIST= <valist>
##$VCLIST= <CCCCCCCCCCCCCCC>
##$VD= 0
##$VDLIST= <DDDDDDDDDDDDDDD>
##$VPLIST= <PPPPPPPPPPPPPPP>
##$VTLIST= <TTTTTTTTTTTTTTT>
##$WBST= 1024
##$WBSW= 4
##$XGAIN= (0..3)
0 0 0 0 
##$XL= 0
##$YL= 0
##$YMAX_a= 218100
##$YMIN_a= -234060
##$ZGOPTNS= <>
##$ZL1= 120
##$ZL2= 120
##$ZL3= 120
##$ZL4= 120
##$ABSF1= 15.68302
##$ABSF2= -2.36887
##$ABSG= 5
##$ABSL= 3
##$ALPHA= 0
##$AQORDER= 0
##$ASSFAC= 0
##$ASSFACI= 0
##$ASSFACX= 0
##$ASSWID= 0
##$AUNMP= <proc_1d>
##$AZFE= 0.1
##$AZFW= 0.1
##$BCFW= 0
##$BC_mod= 2
##$BYTORDP= 0
##$COROFFS= 0
##$CY= -3
##$DATMOD= 1
##$DC= 0
##$DFILT= <>
##$DTYPP= 0
##$F1P= 0
##$F2P= 0
##$FCOR= 1
##$FTSIZE= 16384
##$FT_mod= 6
##$GAMMA= 0
##$GB= 0
##$INTBC= 1
##$INTSCL= 3.70164e-10
##$ISEN= 128
##$LB= 0.24
##$LEV0= 0
##$LPBIN= 0
##$MAXI= 10000
##$MC2= 0
##$MEAN= 0
##$ME_mod= 0
##$MI= 1.114404
##$NCOEF= 0
##$NC_proc= -5
##$NLEV= 6
##$NOISF1= 3.799351
##$NOISF2= 2.8
##$NSP= 0
##$NTH_PI= 0
##$NZP= 0
##$OFFSET= 15.68302
##$PC= 1
##$PHC0= -25379.14
##$PHC1= 7.78731
##$PH_mod= 1
##$PKNL= yes
##$PPARMOD= 0
##$PSCAL= 0
##$PSIGN= 0
##$REVERSE= no
##$SF= 200.129567721928
##$SI= 16384
##$SIGF1= 3
##$SIGF2= 2
##$SINO= 5.538805
##$SIOLD= 16384
##$SREGLST= <1H.CDCl3>
##$SSB= 0
##$STSI= 16384
##$STSR= 0
##$SW_p= 3612.71676300577
##$SYMM= 0
##$S_DEV= 0
##$TDeff= 16384
##$TDoff= 0
##$TI= <>
##$TILT= no
##$TM1= 0
##$TM2= 0
##$TOPLEV= 0
##$USERP1= <user>
##$USERP2= <user>
##$USERP3= <user>
##$USERP4= <user>
##$USERP5= <user>
##$WDW= 1
##$XDIM= 16384
##$YMAX_p= 342806804
##$YMIN_p= -179976
$$ End of Bruker specific parameters
$$ ---------------------------------
##NTUPLES= NMR SPECTRUM
##VAR_NAME=  FREQUENCY,     SPECTRUM/REAL,   SPECTRUM/IMAG
##SYMBOL=    X,             R,               I
##VAR_TYPE=  INDEPENDENT,   DEPENDENT,       DEPENDENT
##VAR_FORM=  AFFN,          ASDF,            ASDF
##VAR_DIM=   16384,         16384,           16384
##UNITS=     HZ,            ARBITRARY UNITS, ARBITRARY UNITS
##FACTOR=    0.220516191357247, 1,           1
##FIRST=     3138.63594073976, 0,            0
##LAST=      -474.08082226601, 0,            0
##MIN=       -474.08082226601, -179976,      0
##MAX=       3138.63594073976, 342806804,    0
$$ Real data points
##PAGE= N=1
##DATA TABLE= (X++(R..R)), XYDATA
$$ [...]
11618 2821 919 328 3375 -170 -1077 3854 8389 4991 998 5407 8065 8166 4774 4083 4316 2743
11602 2743 4294 3654 4191 3545 3376 3015 4415 4452 -208 804 5778 4430 667 2598 3213 2990 1479
11585 1479 4115 7746 7076 3719 4023 4733 3619 1522 2749 5729 5656 3564 7146 7057 4712 4281 3035
11568 3035 4089 4725 1408 517 4068 6244 3772 2628 4495 3755 -2728 -1329 4704 5564 3302 3252
11552 3252 9878 7005 2858 2127 5443 5510 2988 5070 8108 9072 6740 3905 7614 8960 6092 3361
11536 3361 6997 7978 6498 3711 3536 6782 4948 1456 2716 6143 5099 973 3058 6760 6864
11521 6864 3153 -96 5650 9774 7917 5806 10491 9754 5859 5232 10076 9867 6520 6084 8173 7272
11505 7272 4926 4861 9568 12479 9160 9204 9847 9548 6009 5602 7642 7686 7979 5380 5540 8411 9392 7704
11487 7704 12356 11438 8517 6921 8451 12220 11346 12360 12385 11667 9047 7011 10389 11188 13261 12063
11471 12063 13822 15705 12822 11464 14275 17552 19280 17095 15893 18584 16821 15763 22684 27012
11457 27012 25644 23511 21897 24383 24581 23758 24131 28381 30769 30149 29619 35591 35906 30094 30357 37074
11441 37074 42675 43909 49820 57084 57331 54487 49300 49118 50448 51773 54507 51619 47915 36401 29434
11426 29434 27908 24143 21134 18325 19890 19199 13902 8759 9769 11081 8697 5880 8147 10365 8543
11411 8543 4521 2791 3790 5177 3107 1561 5202 4148 1177 411 5044 7721 3031 3681 7555
11396 7555 4130 477 2572 4820 1415 -1487 -1790 1747 3734 2096 2061 -129 3188 1063 1067 652
11380 652 1036 -2082 -3857 -1496 1944 166 -1832 224 5117 1937 -361 44 598 -644 -1370 -245
11364 -245 -537 -1043 -2495 -689 -786 -2910 -5546 -2606 2412 -87 -4241 -2887 1612 2620 407 5004
11348 5004 5140 -1995 -7530 -2566 -1770 -2342 -4673 -4289 -237 -1922 -5658 -5292 -3300 -2157 -3866 -4594
11332 -4594 -1373 -2228 -5599 -6771 -3900 -1382 -5869 -2960 -2154 1338 -2010 -2399 -1643 467 -516 -3318
11316 -3318 -2560 245 393 -4260 -801 2208 -2158 -5867 -3537 657 -3898 -5830 -1981 -248 -3069
11301 -3069 -1671 3807 -1612 -5051 -6072 -3072 -742 -2407 -2428 1766 2572 3870 -994 1303 3689
11286 3689 1647 -1167 663 3306 615 -2502 -1904 1886 4356 918 -1692 51 -1433 -4892 -3373
11271 -3373 -1407 -4073 -6052 -6666 -1632 1611 585 2873 3217 2665 -972 394 5045 3841 -2261
11256 -2261 -234 5071 3354 -92 -966 861 1055 -465 359 3173 3693 472 -775 -226 856 -136
11240 -136 -4386 811 788 -3460 -3730 -3626 258 -1709 -2571 139 311 2436 -3051 1649 4932 666
11224 666 -1167 792 1713 909 -2006 -144 1805 -1739 -2251 -127 1517 818 -3431 -1854 1968 238
11208 238 -2452 -1649 -2229 -673 -1209 -3243 -371 -890 -3641 -3575 1266 4097 85 -1711 2025 -140
11192 -140 -3821 -4698 -1560 825 -1287 -2402 13 -1950 -3761 -5132 -1403 -265 -2530 -3334 -2669 -301
11176 -301 -490 -916 1082 129 -2442 -1771 -1659 250 -1031 -4966 -334 1431 -406 -2822 361 2307
11160 2307 -1244 -4375 -441 2286 -433 -5344 469 3139 -2685 -1322 -2544 156 153 768 376 -57
11144 -57 -335 544 -264 6892 10675 1165 3614 6211 1763 -1529 885 3476 2519 638 -2620 680
11128 680 841 -1561 212 4825 1936 119 1666 3566 2277 -2181 -3920 -718 3245 -2474 -4264
11113 -4264 1258 1894 -1148 -778 2302 3119 -2398 -5249 -931 3599 2463 1621 2269 3240 -1217 -3222
11097 -3222 1030 767 -2029 -1523 2304 3802 -304 -724 1947 -106 -2735 -2645 -1149 -7 -634 -3170
11081 -3170 -262 737 -832 -4013 -1767 1065 440 1234 978 3252 3897 959 -2416 -103 126 -2595
11065 -2595 -1187 2079 114 -486 -822 3170 1217 -4153 -3926 578 2945 -2518 -2715 682 -2361 -2808
11049 -2808 -3031 -1438 -1679 -4852 -4723 -3187 -281 659 -1234 -1071 1606 -4399 -4272 1439 2027 -2091
11033 -2091 -180 3692 3289 1510 1786 3123 4384 2909 565 1296 3137 -3028 -3775 -400 -944 -709
11017 -709 -2178 -4452 -246 847 -2406 -1714 -558 -343 153 1564 2903 900 -1659 -1096 1114 142
11001 142 -2201 -124 3716 2248 -2356 -2119 -255 1006 1108 1701 5260 3974 553 1321 3958 2884
10985 2884 90 -4217 -2835 679 -4652 -2700 292 -771 -4189 -2397 3160 6034 966 -2420 3458
10970 3458 3671 551 1598 2061 3968 -525 -807 2870 894 -4468 -3688 1728 3306 39 -1197 -76
10954 -76 2106 -1432 -3607 2183 2070 706 2030 -475 5655 3579 -1720 902 2062 983 -1917
10939 -1917 2038 1006 927 -228 -1748 836 -538 -3707 -2138 3543 6387 2238 -447 701 152
10924 152 -732 647 3462 2968 -1203 -3924 -622 2094 -3441 -739 728 -535 -4232 787 3769
10909 3769 991 -3669 -1947 1330 887 -1623 -1375 675 -219 -2073 34 357 1129 513 -1097 6633
10893 6633 5132 576 -274 2762 2362 610 -1381 243 2858 -1633 1046 4052 1879 2621 -196
10878 -196 36 2467 391 -964 3279 5215 921 -221 -343 809 1021 -1905 607 749 -2667 -7777
10862 -7777 -2755 1761 -337 -3168 804 476 -605 718 4580 7158 1561 -2030 1636 2436 917
10847 917 -385 -94 1852 190 1209 1221 3254 3809 -516 205 3301 1158 -1904 -164 2586 3159
10831 3159 2745 827 4012 4728 999 -675 1803 -305 -4442 -3209 927 1141 -1816 -982 -178 2431
10815 2431 1390 793 2657 2424 555 570 3876 3393 1400 1431 1607 1963 -3220 -4715 -1469 1711 -1470
10798 -1470 -2008 1646 380 -1780 -1770 488 3756 3429 307 1450 1970 1399 -1703 1261 2170 -2264
10782 -2264 -4055 -1095 1526 2556 -1806 -801 3366 1068 -1608 1801 2416 2740 1946 -206 4870
10767 4870 3474 537 1920 4643 3447 -1368 -382 3127 -56 -3349 -461 2446 945 -3999 -577
10752 -577 1769 1558 -1301 -3079 -1294 349 1751 2421 3792 2810 740 3661 8657 6531 1688 1686
10736 1686 5647 6392 3745 3961 6826 4467 -2153 -1150 4455 3466 579 3565 5786 1809 1628 -1376
10720 -1376 1933 3771 -817 -774 2675 5086 -226 -490 5686 5771 2896 3439 4127 4868 2143 -931 1845
10703 1845 5615 1840 1184 1120 3839 2101 2959 7178 9943 6182 386 2973 1674 1941 -1855 772
10687 772 -3565 1842 8017 2395 5510 2638 2032 4684 9749 7258 1641 3140 7722 10579 6855
10672 6855 7613 11955 12123 10903 10677 13448 15477 16526 20104 24115 23678 16241 13852 12696 10510 7251
10656 7251 7490 12530 9678 6607 6860 9838 10626 6942 8987 10895 11694 8173 8199 9176 11365 7140
10640 7140 3933 8963 11584 7950 3415 4060 6172 3657 3188 7856 9096 5998 4325 8293 8551
10625 8551 3104 180 4650 7443 6491 1869 5252 8523 5354 5098 7604 8293 2884 2560 6974 9670
10609 9670 6547 6814 9758 11459 7910 5642 6377 5625 5717 4184 4174 6482 5736 3466 6306 7346 7062
10592 7062 4432 6303 10849 10964 6104 8433 12924 10928 8436 8397 10112 7448 7000 9704 13165 14226
10576 14226 13028 15304 17982 16008 9975 11949 19242 19642 18416 22518 25331 27736 24212 26251 29941
10561 29941 26851 25529 24025 27631 26012 20851 22146 22978 21249 19646 15314 15427 14581 12328 14894
10546 14894 20860 16999 13624 11887 13158 13894 9700 9334 12113 14558 13577 12922 11971 15694 13860 10973
10530 10973 11792 14309 13103 11494 11561 11520 8373 7169 13975 16829 13747 13236 15147 17857 14326 12511
10514 12511 13992 13630 12822 13706 13383 13773 9888 10365 14222 12704 9322 5560 8688 13192 12855 11742
10498 11742 12696 15899 14180 9983 10969 14932 9796 5133 10742 13309 14332 13119 14300 17561 17473
10483 17473 14329 14551 15729 12458 10236 11570 16781 16513 11875 11733 15709 17838 15732 18930 20704
10468 20704 17364 10096 9018 16663 17678 14180 15053 18525 17996 16024 14519 16876 17786 16592 15877
10453 15877 17213 18487 18118 17554 18141 20050 19286 21207 21851 22366 19492 15218 18428 21925 19953 18345
10437 18345 24981 27281 24288 23606 25103 25939 25770 24939 25644 29723 27341 26879 30381 30862 28406 27375
10421 27375 31357 36865 31514 28987 32417 37388 38004 34608 36049 40774 38701 37783 41167 42448 40211
10406 40211 38459 43293 49566 51375 49334 52087 55748 54913 56979 57653 58823 60137 58043 62956 67517
10391 67517 66996 68175 69997 72778 71167 75360 79426 80604 79101 81140 84618 87840 90492 91765 96431
10376 96431 104317 104599 105042 109480 116235 121707 123032 129120 137155 145595 150315 156512 172405 185393
10362 185393 195880 212894 228616 246966 268138 292837 323616 349570 363751 372186 379912 380418
10350 380418 378295 382933 387249 392886 385725 373966 359198 340135 315872 296376 281831 269031
10338 269031 254136 245450 243406 239627 238118 240592 245363 252738 257733 263725 276523 289951 304803
10325 304803 325546 349799 380137 407247 435099 461649 480863 491228 493042 496141 504453 513639
10313 513639 519274 525541 528654 518871 507691 500934 499716 499679 500453 503841 511112 508184 498538 496430 493681
10298 493681 488111 478034 471741 460503 441433 419081 396417 374612 348151 324732 308572 296198
10286 296198 282320 271849 268613 270167 268206 267938 274846 286735 296209 311012 331309 351648 373780
10273 373780 397505 420337 438216 444767 445954 449032 451080 452219 452518 447095 438291 426068 403768
10260 403768 376726 349348 322207 295745 278700 259272 242793 223921 213319 209788 200455 189028
10248 189028 185147 182920 179122 172175 170158 173464 171791 167041 166090 170840 170683 164631 170130 172220 178506
10233 178506 167726 161017 167306 167925 171916 174664 181973 185286 183390 184619 193267 194350 193573 199286
10219 199286 205152 212720 216391 221828 230604 235287 235180 240270 247559 253310 256497 258758 268293 277484
10205 277484 281980 285448 295528 304378 313349 324845 339582 354905 366358 379619 398313 417755
10193 417755 438791 457189 484871 515821 548640 584884 627867 680380 738227 804070 886028
10182 886028 987643 1098893 1233069 1396787 1609068 1884520 2216731 2612053 3040543 3299574
10172 3299574 3169898 2770924 2338672 1963674 1662914 1416404 1212327 1043895 907423
10163 907423 802077 713779 639279 579075 530752 490123 448463 412124 383462 360825 337643
10152 337643 313840 300142 285961 268260 247998 235569 225080 217936 202299 192321 187798 181192
10140 181192 174388 169959 167108 156875 149117 145663 147039 138005 130176 128542 126760 123417 116604 112129
10126 112129 112418 111197 106903 105282 103104 103856 99818 95531 94462 88027 83170 81471 82076 80091 78691
10111 78691 75909 75386 74189 70105 69892 73582 72853 68693 65358 65402 65350 61973 58056 57855 60908 59850
10095 59850 58082 58177 55613 55211 53500 56427 57413 49436 46204 49971 50964 44098 46029 50743 52510 49621
10079 49621 43325 45121 46973 44068 45149 47444 43942 41535 41483 41528 42478 40248 38155 42273 44696 43771
10063 43771 40505 43744 47095 42616 38590 37762 42454 42839 41417 42118 42714 42651 41667 42600 43066 43194 44207
10046 44207 43564 47589 47419 46112 48359 49252 50089 48573 52702 52182 49010 46129 47936 54387 49636 44942
10030 44942 48708 51869 51898 52626 52443 55082 53074 55001 59540 62722 61275 60276 62695 66805 66302 64478
10014 64478 69127 74740 77204 76278 80730 86456 88031 91304 98416 106172 111584 115340 123717 139307
10000 139307 151195 160036 176146 194874 208683 216937 229916 244517 248828 243126 240779 238684 228268
9987 228268 211737 199600 188095 174121 156531 144665 136582 129369 120663 116205 117785 116853 111638
9974 111638 110454 112786 116687 116254 116733 123939 130914 133977 144442 159426 173696 184638 197392 216698
9960 216698 227173 237486 246460 251729 253525 248646 238049 229794 215279 197536 178413 163235 147393
9947 147393 132608 120636 109523 102421 91725 84391 77560 73850 70395 65563 67841 65271 56801
9934 56801 51486 52409 53359 47845 49904 51165 47445 43987 39890 41486 42871 42304 38612 40772 44670
9919 44670 41981 39046 38924 41722 40027 37687 42815 49058 49786 47502 49805 52503 55716 57679 57203
9904 57203 53767 46481 40653 38250 38419 35398 31632 35469 35684 33212 31718 31152 33756 30324 27446
9889 27446 34696 37254 31002 25024 26625 29893 28214 25250 24430 29291 26047 24904 27619 27950 24704
9874 24704 23739 24682 27039 22443 18344 18991 22802 22701 19096 20641 26168 24003 23696 22992 26291 28922
9858 28922 25725 27993 30198 27425 24840 24691 27068 26395 23084 27542 29075 28631 26848 31902 33218
9843 33218 37726 39293 39298 42318 37852 33923 38640 40059 40787 39679 36871 37768 36746 30984 32833 34895
9827 34895 30967 27907 28642 32245 28310 25278 27093 29419 31534 31005 30621 34640 33849 31569 34626 35033
9811 35033 34855 29518 31294 35095 35840 36930 35718 41497 42222 40137 40705 41859 43764 44188 43826 45999
9795 45999 44925 40327 43463 45859 47133 45277 46017 51017 51180 50771 51031 55669 59304 56373 54334 57322
9779 57322 62561 58913 58899 65800 67917 63542 69856 75651 76609 72920 76881 85584 89336 87688 87764 96745
9763 96745 103027 105762 112707 120796 128892 135664 140032 155712 173336 186002 202390 230004 256196
9750 256196 283759 314590 340719 349162 337796 325683 329417 329897 332679 338338 341197 327283 297761
9737 297761 264130 235962 214123 192703 175916 166194 156945 149304 140676 138370 135812 131744 125644
9724 125644 122866 125462 122599 120626 123979 125487 126485 127367 131276 138161 143018 146275 156629 171537
9710 171537 185948 200495 218874 244680 267980 300063 336182 369323 379076 373934 365467 353128
9698 353128 351248 353152 363690 365451 344096 312093 280121 247738 216117 192152 174125 159138
9686 159138 141906 128049 118876 117017 113841 104320 103381 99612 96388 90535 84172 79946 73450 67638
9672 67638 67139 68341 64156 56784 55612 55639 53702 48620 50279 50247 47895 47025 44557 43971 43512 40082 42388
9655 42388 47023 43669 40973 35920 39470 38638 38242 39277 37119 35298 32955 33617 35951 33567 32874 31707
9639 31707 39175 36827 30392 31300 32069 27364 27601 32567 36280 31677 28453 28106 32225 31043 27816 27271
9623 27271 30502 34242 28608 28636 30628 29599 28687 29860 31380 28279 29142 35000 36494 34201 28075 31961
9607 31961 35164 30641 28117 30749 35846 37114 36857 35630 39496 39208 36221 35176 41825 41613 38714
9592 38714 39008 40339 40376 37928 39413 44812 46078 41981 43649 46200 46402 45715 45809 50291 51412 46309
9576 46309 47810 49255 52484 48522 48106 56740 59058 56305 60415 64315 64660 63771 63080 68651 73283 70888
9560 70888 73914 78707 83370 86906 95215 104909 107570 107630 112327 120627 125726 128707 130174 132286 132397
9545 132397 131595 131984 136884 138457 137108 135822 134159 132717 128610 130985 130785 131749 132615 133596 139962 140430
9529 140430 138167 144558 152049 155870 157600 166160 175302 186190 188553 195019 208564 220296 233932
9516 233932 253723 277905 302329 325855 353676 379560 394571 397450 400687 409121 413297 418752 431282
9503 431282 444214 446219 437068 425265 420255 418340 414155 416751 430692 444521 460608 477245 501822
9490 501822 527053 546478 563242 568176 562044 542043 506774 471234 435937 399053 371278 350778
9478 350778 333232 313482 297500 290718 285222 280224 275195 273909 276907 276078 275893 284786 294845 303367
9464 303367 312511 327784 343549 361936 381550 412823 448733 482682 522617 569744 607908 629333
9452 629333 645518 659075 672505 676315 683820 688768 679896 659812 623096 586988 557277 528986
9440 528986 511179 503267 503060 509213 523187 547909 574735 597061 613513 624675 615850 589021 555806
9427 555806 524803 493152 460386 436890 424370 418480 412527 408404 423302 441022 448799 455115 460825
9414 460825 466354 462280 454055 436535 415190 395833 367541 341148 314965 289550 264771 250687
9402 250687 239304 226634 214958 212887 212097 204824 203814 209097 214399 214502 211669 208388 202708 190651
9388 190651 175963 167183 163724 152648 144850 139586 136851 133663 131449 130817 130359 126004 122451 127500
9374 127500 132215 128041 126298 135058 137729 139076 143909 155481 165921 176640 185130 195271 207739
9361 207739 211955 208129 211524 210849 203691 200883 192337 180720 165390 149986 141355 138214 135598 129972
9347 129972 127467 129803 123441 116462 121691 129304 129426 127750 132385 142905 149743 156960 168004 180763
9333 180763 192017 205349 223694 239929 244576 246190 251398 280780 267473 241476 233152 216529
9321 216529 199715 181922 172451 162013 146410 131796 126522 119158 110939 100456 97944 99810 96400
9308 96400 90845 88760 86937 81940 79731 86837 86251 88231 88635 96331 102835 106941 114673 119430 125123
9293 125123 129011 130099 128198 130267 124819 119347 112627 103694 91835 81955 77550 72471 64423 57294
9279 57294 55900 55605 50078 47399 45243 45522 42851 38919 38292 42329 38227 28982 30569 35652 33192
9264 33192 28718 31873 30297 25468 24048 27795 29729 26528 24649 23232 25153 23639 20675 23093 26468
9249 26468 26299 20773 23545 25095 21001 18708 20406 22139 20737 22255 23717 24441 22460 19681 18463
9234 18463 19797 17394 15028 17801 19719 18599 16073 21479 24024 21342 18228 24424 24954 19729 21413
9219 21413 22870 21761 19993 17619 19899 22734 20861 18941 17398 20020 21726 18079 17597 22438 22135
9204 22135 20364 20117 22899 23520 23661 24907 27360 23113 20894 26515 28834 26030 24078 29957 33762
9189 33762 30694 27167 29549 32302 31048 31011 35385 35444 34316 33487 36413 38183 37260 35757 40473 45735
9173 45735 45521 45659 48250 52883 52237 53056 59742 62343 67737 64363 68660 76003 76965 80669 89357 101075
9157 101075 110070 119398 133760 147753 157922 162092 166595 170912 169376 164241 163439 160174 146726 134853
9143 134853 125901 121388 113505 106287 103633 105230 105478 98226 97913 101521 101361 100080 106372 114226 112942
9128 112942 116277 125271 138371 143586 153562 170151 188816 202539 212619 221593 236321 241427 239208
9115 239208 237546 232778 222713 207518 194307 179272 162644 146101 133716 123924 109437 102399
9103 102399 100471 94820 89258 86180 86658 86928 83914 80091 80212 78425 75683 75683 83185 89951 92528 99158
9087 99158 106712 115216 118199 120479 121046 119362 114033 110353 104889 93679 79975 67328 64947 61315
9073 61315 51088 50157 48168 45876 44292 40516 40220 37951 32940 29937 32827 32885 27487 25074 24523 24248
9057 24248 23135 22357 22727 20379 16908 14290 18842 20436 16012 15381 17464 20047 16162 9619 14682
9042 14682 14230 10591 10234 15582 16082 12029 9491 11675 12463 11772 10006 9013 8727 8819 9224 11306 13245
9025 13245 9021 6823 10636 8266 7095 6486 7215 8882 8593 5517 9513 10361 6418 2285 5007 8588
9009 8588 6494 5419 7241 8670 4672 4362 4697 7110 3257 2802 4036 5524 5577 4625 4166 3414 3120
8992 3120 4105 8047 10409 6698 3164 4230 7189 5827 4395 7236 9289 1543 2 3781 6491
8977 6491 -269 -1526 4323 5606 2605 -572 1028 6565 2227 -585 4606 6312 -63 -923 4275
8962 4275 3399 -381 -3431 -1139 2831 3655 -128 1726 6315 4943 1856 5382 6078 3005 348 5322
8946 5322 4997 998 402 3085 6639 1909 1723 8080 5759 3209 387 1392 2202 -852 2523 5306
8930 5306 5306 611 344 4393 5951 3032 1598 3501 4124 2193 1612 5861 10588 5894 3575 5761
8914 5761 3436 -1390 -2708 2464 5611 4331 -226 1332 3833 2495 -864 6925 6900 2081 -121
8899 -121 1871 5345 45 -2586 -973 1997 1499 597 1883 738 -391 548 2242 3498 565 896
8883 896 2979 2951 -1858 -1384 2499 92 -3857 -3146 1929 5544 5659 -12888 -9209 -5463 -7063 -3418
8867 -3418 -482 -2201 -4685 -4553 -2079 371 -3639 -2175 774 -1666 -1793 -2258 -495 2534 -2219 -2488
8851 -2488 -478 65 -3799 -3901 -810 -1296 -4947 -1191 2009 -677 -2412 -193 -277 640 -3131 -3027 -2535
8834 -2535 -1532 -4843 -6733 -1401 1051 -1760 -971 1041 1582 -858 2783 298 44 755 -1589 -1598 84
8817 84 -3782 -1156 2931 -1522 -3582 -4449 -798 -866 -3621 -857 2311 -1408 -4640 -2714 1743 898
8801 898 -1326 1111 2461 -1050 -4731 -1808 3317 1261 -3853 -4547 -3485 -1286 -500 424 2318 349
8785 349 -2288 -634 2902 547 -5303 -5409 -1142 883 -969 -1256 2385 1761 -1648 -1986 -1040 -1424 -4810
8768 -4810 -2603 752 -1070 -497 -2084 -1419 557 -1588 2498 3617 262 -4534 -7625 -3506 -4353 -6857
8752 -6857 -6221 -2813 -1371 -2938 -3890 -1940 -4693 -6172 -6565 -2596 -1603 -1681 1529 4385 1092 -3465
8736 -3465 -3077 2307 -2372 -7137 -3252 -1970 -1064 -4712 -4245 434 372 -3942 123 5199 282 -1518
8720 -1518 -1206 -1209 -2688 -3378 -4513 -3768 -7574 -11240 -4933 970 -5219 -6468 -2729 1432 -3139 -9578
8704 -9578 -5199 -1165 -3075 -4488 -3114 -1069 -3942 -5039 -124 579 -5606 -9260 -3938 -1207 -1404
8689 -1404 -5164 -2373 1616 -4013 -3962 -2320 -315 -4931 -5858 -131 2711 2485 -1762 -1752 -233 -242 -1791
8672 -1791 2343 2635 -2772 -1970 1901 3978 978 -3223 -714 -2275 -5963 -3371 2367 2828 2531 612
8656 612 5321 6816 2227 -994 -2014 4187 2865 469 4177 7184 3408 -3192 -398 752 -2560
8641 -2560 -4581 -3931 -2151 -4034 -4491 55 767 -1703 170 4351 3290 -1422 -4081 196 2246 -299
8625 -299 506 3863 2297 -1428 623 5870 3852 408 2079 7197 3640 -1199 -278 4527 998 -1266
8609 -1266 -172 6346 -130 233 1666 3855 2692 906 2009 5543 4206 -105 532 4630 4253 6025
8593 6025 6591 10577 7456 10875 12856 19511 15958 19984 17701 26858 24444 39278 50574 102787
8579 102787 89689 -98186 -105444 -67057 -46011 -39624 -26431 -20230 -23006 -26247 -20923 -15996 -14299
8566 -14299 -16519 -14858 -9816 -11524 -11985 -8766 -6268 -12689 -12476 -10431 -5758 -10502 -9556 -10471 -8891 -9928
8550 -9928 -9622 -6422 -5112 -12494 -14394 -13815 -8526 -11362 -13317 -9746 -8120 -10449 -15110 -12325 -5329
8535 -5329 -4499 -7760 -4629 -3531 -5243 -9976 -8961 -6927 -10419 -9977 -9665 -7487 -10801 -8729 -3760 -5783
8519 -5783 -10364 -8775 -6357 -3346 -11546 -11255 -8285 -4806 -8987 -9496 -8329 -4477 -6836 -7248 -5051 -3916
8503 -3916 -9264 -12199 -7939 -6734 -7066 -6859 -5336 -3960 -9467 -11488 -8680 -4842 -5424 -5352 -4226 -7699
8487 -7699 -7434 -8931 -4343 -2193 -2573 -6183 -979 -3212 -8073 -6314 270 -1099 -4858 -3913 -5327 -6272
8471 -6272 -9013 -6064 -4991 -5019 -7793 -8754 -4271 -3501 -4833 -5054 -449 -2944 -8282 -6248 -873 -2652
8455 -2652 -7377 -6293 -5171 -5582 -6433 -7822 -2973 -1806 -4545 -2200 -574 -3517 -218 -2180 -4202
8440 -4202 -7336 -8388 -8061 -6306 -5423 -6732 -1977 -3710 -6623 -7748 -4852 -1672 -3331 -5356 -4345
8425 -4345 137 -2424 -6903 -5164 -1446 -1779 -6898 -5535 -4163 -3153 -2641 -3188 -6341 -6638 -7401 -5861
8409 -5861 -1956 -5963 -8280 -2499 -248 -2855 -6694 -7564 -3504 -8385 -10102 -9093 -6484 -9994 -8137
8394 -8137 -3157 -6822 -8935 -7789 -5120 -2670 -4453 -4381 -8150 -9291 -4773 -2673 -3281 -873 -8511 -9156
8378 -9156 -2773 -3755 -4827 -6141 -3562 -8552 -10391 -10321 -6939 -1357 -4701 -8267 -6859 -8105 -10343 -7925
8362 -7925 -5205 -6526 -6955 -8523 -6282 -3257 -3843 -3485 -298 -4277 -11904 -7185 -5857 -8392 -9999 -7871
8346 -7871 -3933 -6335 -8917 -9979 -3403 -2316 -3925 -5349 -4903 -6478 -11566 -8571 -4318 -5360 -7469
8331 -7469 -6795 -5165 -4595 -4094 -7184 -3033 -6963 -6394 -7874 -3213 -8993 -12012 -4789 -4300 -7771 -12161
8315 -12161 -8969 -3254 -10579 -12199 -6103 -10102 -11077 -11401 -7995 -9597 -14467 -9545 -3978 -3885 -5318 -7249
8299 -7249 -9007 -8836 -5675 -7439 -3993 1990 -1918 -5149 1106 -601 -3615 -5540 -1241 -2935 -4476
8284 -4476 -4460 -1555 2070 -2343 -6182 -3314 -2587 -8058 -4507 571 -686 -6961 -14036 -6108 -4995 -7757
8268 -7757 -7059 -4096 -6277 -12724 -9764 -6517 -7971 -11124 -10641 -546 2750 1661 -1372 -168 4853
8253 4853 2885 -2065 -4996 -4948 -10743 -11375 -6495 -6023 -9186 -6827 -4407 -7968 -12143 -1544 2803 -1182
8237 -1182 -2859 -3620 -4041 -5285 -3007 -7641 -3378 -8958 -7720 -2663 6576 1315 -11561 -8442 -2177
8222 -2177 -3966 -8526 -13815 -14130 -14247 -14964 -5074 -7623 -8449 -9566 -3879 5169 985 -11385 -3235 -12660
8206 -12660 -16669 -18046 -13394 -17253 -29477 -23836 -12372 -13815 -20127 -20777 -11747 20774 23804 -47598
8192 -47598 -55940 27627 23342 -6918 3752 801 -940 -13128 -15948 -5755 -9968 -1990 13243
8179 13243 21098 12966 17666 21380 16172 6662 4713 -2757 428 -9054 -14057 -17687 -23560 -16921 -8338
8164 -8338 1888 -174 9397 5982 5683 4211 -3629 -204 9603 1825 -6357 -10890 -7083 -8385 -10663
8149 -10663 -9377 -2923 -4002 -9301 -7159 -2910 -722 -4859 383 4296 196 -9246 -11237 -8425 -3765
8134 -3765 -3125 -5076 -4404 3261 396 491 -667 843 -30 -5758 -4463 -7526 -10945 -9269 -4644 -2169
8118 -2169 -6864 -5288 -4819 153 -897 -888 1730 -2792 -1964 -1582 4245 -4316 -6884 -3422 2736 -1216
8102 -1216 -7925 -5630 1293 -3962 -6238 -1754 667 1125 -3658 -7955 -5292 -981 -10009 -3200 881
8087 881 -4920 -9053 -1772 -1496 -3311 -3357 -906 1969 -4933 -1279 -994 -875 -3061 -4190 -2117 -539
8071 -539 -2105 -4293 -6016 -3490 -10772 -16825 -7698 -4865 -8535 -6275 -3465 -922 -2896 -5630 -3686
8056 -3686 -2790 -9377 -12367 -8332 -7799 -10901 -6082 378 676 -1348 -5947 -3807 -2603 -6467 -4728 -212
8040 -212 -3920 -5492 -4993 276 -5890 -7120 -6022 -5320 -7147 -10664 -4878 -2759 -9025 -11700 -6998 -5801
8024 -5801 -9161 -8898 -3590 -1703 -782 -3291 -2482 -60 -1214 -9769 -5564 -4014 -2965 -3521 -2384 -2996
8008 -2996 -9969 -6654 -3236 -4310 -4111 -6876 -2391 -1539 -6241 -9015 -2406 773 -2823 -6579 -3364
7993 -3364 368 -2646 -3389 2064 1296 -4714 -4595 -6312 -3202 -7741 -8026 -9714 -5016 -4694 -4529 -2327
7977 -2327 -5518 -12397 -7876 -4438 -4409 -2403 -7692 -5203 75 -7228 -3763 145 -3182 -1425 4726
7962 4726 2088 -1623 -7866 -7442 -3404 1161 -840 -6024 -3544 -3472 -4427 -3423 -3996 -5057 -8741 -3535
7946 -3535 -1484 -4494 -5195 -2845 -5306 -6569 -8195 -5681 -218 -1373 -2813 -740 3171 -1490 -6174
7931 -6174 -5414 -2991 -2433 -4961 -3488 -1035 -3876 -7969 -4451 -1765 -7266 -10018 -8302 -3623 -8676
7916 -8676 -6087 -1966 -5893 -7594 -3720 -1799 -1616 -907 -4864 -6118 -5041 -7644 -8661 -6514 -4227
7901 -4227 -4811 -2632 -3393 -2080 -6203 -11713 -8708 -5533 -6548 -5029 816 618 -6294 -3235 -490 -2721
7885 -2721 -9603 -8823 -2181 1960 -5599 -4006 -2655 -3201 -7087 -4149 -1361 -5320 -7285 -3860 -2551
7870 -2551 -6841 -11541 -8336 -3165 -5898 -9946 -7810 -8535 -9142 -13662 -7824 -7468 -7960 -8714 -4671 -1590
7854 -1590 -3411 -6853 -4888 -4437 -3385 -5524 -1729 -1875 -7983 -8276 -3715 -5911 -9331 -11604 -4233 -6505
7838 -6505 -10895 -10328 -6506 -6866 -10535 -10922 -5120 -6121 -9422 -8813 -4381 -7496 -7872 -7389 -2966 -5667
7822 -5667 -9534 -9675 -9606 -10371 -10178 -8216 -10910 -11835 -14044 -10638 -15081 -15835 -21559 -16520 -23236 -50003
7806 -50003 -179976 -47854 14929 -4238 8074 -4938 7285 -1731 3326 1616 3900 -5647
7794 -5647 -1827 -2421 -289 -4236 -3300 -1670 3289 -980 -2165 -2083 5357 -5380 -6278 -3238 -1967 -6189
7778 -6189 -8543 -5688 -2899 -3133 -1337 -2382 1157 -4593 -5726 -149 -798 -4539 -3724 -2158 -189 -5166
7762 -5166 -3126 -1431 -3557 -6761 -3544 -4281 -6025 -5619 -1643 -1162 -740 -4481 -1182 -1685 -5234 -4843
7746 -4843 -1049 1762 -282 -4259 -3794 -3189 -5137 -8198 -1823 3425 -2824 -7865 -2703 -3482 -5720 -8068
7730 -8068 -3690 -2178 -5595 -7805 -1516 -1817 -3659 -485 2841 1592 -2586 -7666 -5027 -7096 -8176
7715 -8176 -8211 -6293 -2811 -6952 -7841 -1621 -3673 -7305 -4271 -1716 -3062 -3304 -3356 -1329 -3188 -9094
7699 -9094 -7659 -4284 -4673 -8167 -4722 -84 -5068 -7699 -5220 -3651 -7149 -9654 -2000 -2199 -3760
7684 -3760 -8678 -3311 -2152 -4599 -3042 -670 -545 -2700 -6012 -3836 534 -2092 -7376 -1059 2154
7669 2154 -1886 -5088 -3607 -2218 -4336 -3418 -3796 -4395 -3570 -3202 -3371 892 -2906 -5308 -2716 -1408
7653 -1408 -2234 -3316 -573 -1609 1814 2877 3549 5418 1842 -3271 -2778 -4988 -5063 -3756 -2604 -7909
7637 -7909 -9027 -6933 -963 -3915 -4323 -1997 -3938 -5977 -7148 -1997 -3842 -8023 -7809 -1568 -2983
7622 -2983 -4191 -6147 -7061 -5469 -8363 -9367 -3814 -109 -1922 -2121 -1630 -160 -5312 -5109 -2662 -1725
7606 -1725 -5307 -4237 -3841 -3587 -7461 -4959 -417 -3965 -10350 -9326 -6526 -3506 -4348 -4568 -2942 -6352
7590 -6352 -9378 -4404 939 -5827 -6880 -5101 -968 -3030 -7174 -79 1569 -4658 -6189 -3289 -1567
7575 -1567 -5572 -6007 -5456 -2524 -4737 -6904 -4428 -2968 -3908 -6468 -6287 -4581 -10090 -8740 -3806 -4564
7559 -4564 -6173 -6093 -5421 -1019 -8398 -9870 -3446 -3095 -4928 -7301 -4768 -7181 -6542 -1164 1519 -807
7543 -807 -5964 -3038 -705 -1694 -2591 -716 1580 -486 -2058 -2072 -2191 -5734 -6489 -3806 -5689 -7380 -8192
7526 -8192 -6719 -4851 -5778 -5373 -628 4334 372 -8059 -5227 2159 -3279 -5062 -4948 -3500 -15605
7511 -15605 -12600 855 42 -4575 -5605 -4428 -5224 -4786 -6731 -1991 -8124 -9544 -2344 1494 42
7496 42 -3384 -3899 1735 -1883 -6578 -3181 536 -2950 -8676 -8226 -4256 -2994 -6218 -4212 -2371 -4863
7480 -4863 -6857 -5298 -936 -4266 -5189 -2266 -3475 -4287 -4861 -4162 -1718 -6855 -5913 -2485 481 -394
7464 -394 -5027 -4447 -2412 -4799 -3363 202 -1660 -5795 -6497 23 2423 -4501 -5807 -2753 -391 -2180
7448 -2180 -1581 -1380 -2829 -3313 -1243 -496 -3596 -6553 -5178 -2414 -2320 -5703 -4374 -432 -3556 -5380
7432 -5380 -5606 -4799 -4943 -4727 -2439 -4012 -6732 -3396 -1783 -625 -3689 -4901 -1145 -2276 -8566 -5954
7416 -5954 -639 1892 -2694 -4133 -2398 -1504 -3290 -67 136 -1950 -5096 -5883 -795 -111 -2690 -503
7400 -503 897 -1194 -8629 -6337 826 1397 -4633 -6653 -5014 -7137 -10393 -3353 -1757 -7805 -9684
7385 -9684 -7802 -5212 -5229 -6507 -1947 7 -3140 -5044 621 3277 -1786 -3554 -1753 -3810 -8653
7370 -8653 -8826 -5237 -1465 -6649 -5397 -3923 -6094 -5131 -6110 -4056 -2525 -2429 -3909 -1540 -2564 -6312
7354 -6312 -5054 1773 -4059 -7943 -4786 -2757 -4368 -6415 -2544 -1310 -8651 -10839 -3121 -2599 -6247
7339 -6247 -6572 -4034 -3092 -4513 -7252 -4133 -2246 -5796 -5435 37 -1976 -2923 -6824 -1759 -254 -2839
7323 -2839 -3038 -1005 -1338 -4109 -1787 308 -1967 -4690 -5698 -2959 -8718 -9429 -6636 -3741 -4389 -7276
7307 -7276 -3579 -778 -3054 -4271 -5240 -1724 -3449 -7402 -6390 -5218 -7649 -8898 -5488 -2336 -6335
7292 -6335 -8233 -7550 -4553 -7008 -8830 -4545 -4351 -6278 -7676 -4516 -5263 -9636 -9233 -2434 -1417 -9013
7276 -9013 -7659 -1021 -2014 -4954 -5152 -4322 -4096 -3505 -1502 -2547 -2392 -7657 -5095 -848 -1916 -5120
7260 -5120 -5175 -2631 -6103 -5108 -3849 -3972 -8146 -9663 -4583 -2386 -3214 -3830 -1338 115 -7853 -7577 -1659
7243 -1659 1078 -3645 -5361 3609 5437 2421 -466 -591 2773 -3170 -5281 492 -892 -7191 -8072
7228 -8072 -5195 -5728 -9117 -9041 -4473 -5464 -7062 -2415 -1924 -2358 -6329 -2911 -1948 -4244 -9209 -6157 -3948
7211 -3948 -6352 -4073 1211 -922 -4227 -8792 -5990 -819 -7798 -9690 -4653 -5216 -9382 -5995 1651
7196 1651 2154 -1874 -3701 2268 -2718 -8888 -5011 -1545 -674 -4463 -3940 -1245 -1325 -6878 -7649 -1172
7180 -1172 -4288 -4456 -2773 1021 200 -2655 -991 -1311 -4498 -6916 -4729 -3387 -5570 -4057 -3669 -5246
7164 -5246 -5100 -5279 -2653 -675 -5429 -5209 -3890 -6701 -9220 -7700 -1925 -4767 -8404 -8127 558 -2414
7148 -2414 -4021 -2618 -958 -1103 -1728 -3071 -1539 -2055 -7113 -4744 -3182 -7495 -9683 -5246 -2198 -6336
7132 -6336 -9753 -4863 -3243 -9031 -9487 -3464 -1277 -3551 -2868 -3234 -4149 -4380 -3036 -836 -1863 -5615
7116 -5615 -6012 -1759 -442 -1473 -666 1698 2459 -2369 -1494 25 217 -3979 -845 2236 316 316 118
7099 118 -723 -3907 -3535 2066 5183 1080 -4854 2843 4198 -1991 -4106 -1470 2005 -1081 -2106 3151
7083 3151 4400 64 -1249 365 -3403 -3749 -1085 3023 1692 -113 38 3254 3701 -921 469 3615
7067 3615 278 -1673 -13 908 -3096 -2828 -529 82 -12396 -16283 2181 1959 267 -1928 2296
7052 2296 4190 3404 2351 3815 2931 456 1686 5959 2288 -469 461 3206 -629 -2017 -1710 2390
7036 2390 1809 -624 758 4182 5688 1448 1060 1056 -612 -2367 1121 1085 -1419 -3144 -928 -967 -1715
7019 -1715 -5330 -3896 -4154 -6778 -4803 -474 -1277 -7546 -6703 -4142 -135 -1825 -1251 4081 3949 -3310
7003 -3310 -2013 1968 -2482 -3846 -3720 -1538 242 208 1408 2794 -1008 -4955 -2360 -404 1184 -115
6987 -115 2080 2695 -1635 -3210 3069 4333 1587 1515 3631 3598 -376 -157 5449 4352 48 4034 6580
6970 6580 2705 -1940 -536 3784 1970 -1672 170 2684 267 1384 4864 5602 1079 -2593 -848
6955 -848 2806 -470 -1927 1138 4999 1957 -490 3496 291 -1783 357 1151 -2284 -3926 -2545
6940 -2545 238 -2456 -4338 -2736 1638 -1754 -1034 -661 2579 869 1435 5085 5726 1035 565 2894
6924 2894 2587 -1148 -4240 2223 1605 -1744 -334 -2053 612 -300 -2594 1063 -3966 -6956 -2413 -3394
6908 -3394 -5108 -5207 -2782 1580 -979 -4732 -2366 204 102 -220 1113 2300 -2668 -2492 912 2586
6892 2586 84 -889 332 1349 732 966 4750 4698 -235 -2714 1272 2560 -1144 -3107 -2527 341
6876 341 -852 575 1550 -594 -2520 -2029 3379 1012 497 1780 5000 1822 -841 993 5609 3925
6860 3925 -2244 -1242 377 992 -413 2431 4614 3464 -1109 -889 316 285 2794 5068 2223 -4437
6844 -4437 -352 4094 5228 1980 5962 10758 6898 4376 5138 7166 3685 375 4266 6502 -848
6829 -848 -3823 2326 5882 -108 1773 5639 5103 -271 992 7024 4864 -1328 -960 3926 3956 389
6813 389 5139 6057 5783 600 4618 7418 3748 6840 4545 5807 2494 -1473 1454 4463 1016 -350
6797 -350 3322 4235 2859 4174 4818 5441 3899 5938 13031 7014 545 4143 8903 6246 1439 6000
6781 6000 11248 6556 1421 3485 2841 1666 2666 3782 4818 540 -134 5070 3172 -3386 1612
6766 1612 5176 4927 4077 4674 5539 4354 3707 3182 1655 -427 1261 1399 2269 -481 -4196 -298 6839
6749 6839 7172 2734 4202 6284 2104 -2242 -472 4738 4719 3810 5819 5583 1628 551 2645 8281
6733 8281 5496 2202 7318 5910 2029 3553 8513 3125 -506 1379 5075 4942 2450 2925 7083
6718 7083 784 -2982 1876 3661 1598 -2141 4348 6434 6114 4789 9439 7181 1850 3454 10582
6703 10582 7744 451 1928 7168 2796 -336 -671 4091 4710 1512 4195 7708 5430 69 4078
6688 4078 7667 3184 1117 5116 1612 -773 -3460 12 3104 -1322 1917 7323 8935 2982 3908
6673 3908 6217 3111 -4148 -1979 4772 4058 1844 1469 3712 2278 1343 2884 4542 3522 2042 2277
6657 2277 5071 4285 1460 6384 7345 4828 6541 7572 1461 -1727 2190 5892 7468 3677 2043
6642 2043 4999 5912 4129 5306 8235 7060 3299 8642 11293 9186 6217 6898 5047 1108 2991
6627 2991 6864 9251 6584 6544 7705 6376 1026 5290 10606 6265 2715 5091 9845 6950 3327
6612 3327 5192 10521 7669 6609 5178 9838 9457 15817 12186 8427 5637 5378 9746 7267 4819
6597 4819 7576 10445 8103 4421 2722 7173 6958 3760 3347 5510 3532 2027 7899 10847 5131
6582 5131 4906 7210 6552 4048 4034 7842 12577 5980 2336 6215 6098 -642 1939 7634 6130 3976
6566 3976 4884 9869 9693 5295 5924 8322 7616 5870 3886 5272 3533 2310 6635 7886 7256 4732
6550 4732 9624 9007 4645 5411 8876 10242 5542 4878 7993 5297 1255 5410 9532 9216 4035 7536
6534 7536 10555 6238 5512 10211 10530 7447 6607 12010 9559 4898 7254 5641 7715 4628 4407 9555
6518 9555 15673 12346 10798 11415 7453 4192 8355 11462 8794 5277 7117 11116 9926 4323 9598
6503 9598 12296 4761 2859 6960 9182 1195 682 7045 6769 7210 11657 14153 9905 2844 7071 11246
6487 11246 9281 5795 5497 8509 9138 7922 10527 9859 7769 9081 10429 10788 6812 4429 9361 7036
6471 7036 3273 3813 7162 7485 4365 8775 11478 9198 9032 14508 19148 12096 8302 10793 6572 8281
6455 8281 8827 11058 10399 8121 8479 8467 10715 8634 11427 14689 13058 8766 9303 12162 10609 7983
6439 7983 8789 12676 10596 5726 10736 12675 7754 6705 9326 13418 12421 12980 15148 14122 10078 10212
6423 10212 15050 18625 15444 13701 17987 12589 7201 11242 12439 8152 6708 10287 13202 9529 9866
6408 9866 14050 14034 8951 11573 18019 15041 7374 6274 15301 13526 9335 8880 11756 13227 10205 10246
6392 10246 15093 12694 9972 16762 18299 14058 11671 13469 17433 14539 12210 12300 12348 10395 10285 12118
6376 12118 12026 11480 10102 13075 11029 8647 10984 15476 11839 7530 11789 12421 9059 10219 12619 14369
6360 14369 9345 10512 13626 12873 11901 15079 13953 13394 8272 8059 13885 13707 10314 12296 15546 12219
6344 12219 10855 15767 17460 13386 14665 17741 18595 13565 16108 19352 15669 13919 15217 15097 13268
6329 13268 12850 15237 19611 16354 13459 15139 17500 14962 13907 15712 16955 14575 13816 15697 15061
6314 15061 15744 16950 21971 22083 19071 19439 22832 23993 20559 16623 20099 15937 13972 17880 22908
6299 22908 20029 14248 19069 20108 15940 19223 23346 20550 16689 19683 23430 19484 16085 16021 17893
6284 17893 17923 16974 18424 19000 18505 16872 20954 22013 16159 19710 23749 22024 19297 16098 21832 22276
6268 22276 19346 21096 25836 19984 16232 20677 25203 21882 19016 21954 21223 15978 15517 20826 19575
6253 19575 19144 20952 20746 23241 21148 20397 22301 22468 20458 22553 22481 20039 18623 20055 23380 23073
6237 23073 24150 24685 26702 23970 25755 26545 24800 21349 23653 26306 24282 19845 21211 25779 24575
6222 24575 19076 19439 24610 25566 19821 23578 25914 24440 23961 26531 26174 21947 21639 25635 26916 23309
6206 23309 24534 27374 25967 25031 25483 26716 24633 20808 21045 25985 25258 18545 24738 28744 26569 25055
6190 25055 26682 26483 24349 23402 31088 29289 25533 29304 33837 31534 27841 29716 31299 28611 26578
6175 26578 32891 33565 31733 31781 36620 34932 32439 32454 35457 31819 26552 28794 29615 31718 29573 30206
6159 30206 31001 24965 26482 30767 33954 29464 27748 30468 38064 34525 31629 35178 30719 25471 27098
6144 27098 34206 34465 32759 32557 33921 30890 33213 34050 34070 30867 28268 36078 37132 32132 31066 31704
6128 31704 32791 32236 35182 36548 34193 32426 33519 35633 32938 32015 37419 36804 34664 34686 38549 35049
6112 35049 32815 34982 38464 37811 33925 36692 40199 36688 34399 37947 40473 38105 36939 41610 42249
6097 42249 37339 36739 42984 37836 35860 38677 42628 40592 38473 43341 43529 40247 35803 42456 45414
6082 45414 37966 37214 41408 44018 38609 35991 45667 45467 40770 41659 47027 44602 42338 44337 46342
6067 46342 43566 41407 43090 45274 44580 44216 50867 52070 49014 47455 50272 50571 47269 47998 53710 49255
6051 49255 48211 52622 54899 51533 51104 52564 53978 52716 52761 54619 53993 53191 54108 57956 56292 53645
6035 53645 57152 60008 57842 54902 58155 63046 58118 56832 57979 56968 56166 57695 59802 59893 59371 61672
6019 61672 64441 62385 61284 64734 67087 63126 60101 68074 72845 66418 63017 65756 66814 64704 68572
6004 68572 71980 71158 67171 68451 74092 75216 74152 75960 77929 72562 70040 72775 77845 75741 74630
5989 74630 81643 80623 74997 76648 80580 82660 77601 79591 82759 79934 80899 87135 92558 86727 84252
5974 84252 90751 92275 89223 89847 93078 92197 88621 91885 94574 92797 91380 93149 94532 95843 95228
5959 95228 101476 101926 96308 98474 98937 98059 96007 100091 102962 103613 104143 106269 109402 103751 105903 109850
5943 109850 112166 108958 108931 115025 115294 113907 115956 123640 124649 123859 125580 126286 129038 127191 127780 128642
5927 128642 128559 130286 135041 134274 129209 131580 138555 137766 134377 138680 139458 136407 137823 141872 145851 145191
5911 145191 144873 149962 149141 146291 148622 154028 154081 153500 158693 164073 160048 159997 164441 169190 168315 170654
5895 170654 178965 181037 178486 177565 184566 189588 186467 188886 189555 189775 189992 194631 203038 203675 204163 209937
5879 209937 217014 215597 219339 227854 231432 233580 234885 241455 244218 245334 251129 259952 262557 264981
5865 264981 272026 278150 281175 284973 293553 299591 298282 309102 317965 323120 329397 342415 356851 363264
5851 363264 371986 385072 394465 404990 418909 432551 442138 445904 455316 472023 484276 492840 506900
5838 506900 520703 532768 543171 561573 578388 589697 599355 615844 627446 636802 649411 671538
5826 671538 690426 704261 720321 745590 765118 786594 812044 840677 859767 884674 914448 941841
5814 941841 961336 982707 1016256 1042901 1067455 1097461 1130320 1157589 1185362 1217418 1250646 1282065
5802 1282065 1313011 1353958 1394515 1429711 1474515 1525175 1573391 1625720 1693048 1763825 1838122
5791 1838122 1912892 2001348 2099902 2200272 2309818 2440185 2578474 2730303 2910184 3116704
5781 3116704 3346882 3604574 3909976 4259848 4658351 5118104 5654136 6273579 6991854 7837610
5771 7837610 8815219 9877868 10939127 11831661 12261822 12020174 11201284 10091027 8928799
5762 8928799 7839202 6871686 6033799 5314933 4701777 4182626 3745973 3374455 3059887
5753 3059887 2791422 2562440 2363386 2190215 2037717 1904057 1776499 1660575 1566101 1476989
5743 1476989 1386594 1309354 1246656 1183295 1119793 1069127 1021928 978015 940312 906362 871657
5732 871657 837158 805010 781904 754601 724020 700556 680661 658974 635559 616185 602941 584803
5720 584803 563716 550139 540134 525487 511975 502580 489773 473894 459461 452310 440382 426220
5708 426220 417449 412288 401044 390537 385839 379464 365096 358050 355210 348924 327301 320405 325392
5695 325392 316885 307659 302397 301610 295203 292069 292624 291435 280771 272442 268918 264724 256957 252197 252145
5680 252145 247955 241461 243060 243321 238855 231883 231489 232687 227714 223514 223420 220051 212183 211636 211433 209038
5664 209038 203003 204854 202444 200069 198918 201217 202861 196952 196374 199345 194946 190060 191176 190462 183387
5649 183387 180231 182732 184766 180165 180303 181860 180940 175466 171971 173587 172270 169053 170894 173525 167603
5634 167603 167500 171025 170606 170415 173515 175324 171332 167528 170391 170068 163447 156697 162805 164354 160322
5619 160322 160041 161482 159327 154617 156666 159234 159199 151037 152706 156595 151149 150315 158129 158858 152572 153787
5603 153787 157128 151275 145284 149910 153548 150977 148509 151255 153266 155094 156783 161362 161179 156297 157793
5588 157793 158928 155032 153380 159878 158573 152212 153117 156553 157164 152880 154557 157617 154321 152829 155772
5573 155772 157782 157611 158847 159959 159551 158259 157803 163411 164917 158197 157997 160170 158322 158612 160823 161115
5557 161115 158479 160704 167491 167507 162372 164403 171110 168808 164236 167504 170645 168558 169531 173509 173010
5542 173010 168039 168936 177200 176396 165585 169577 175476 171657 173532 178948 181875 176601 177183 182354 178991
5527 178991 175925 178003 178699 176969 177049 183089 181927 179324 179449 182396 184165 180720 181136 185916 184798 184423
5511 184423 189712 196089 191616 190668 196205 191754 188850 188803 195084 192274 192119 197222 196493 192836 193956 200287
5495 200287 200391 196527 197604 201536 201393 202749 207194 209251 204950 205563 207591 205691 205186 208883 215578
5480 215578 209783 206816 215836 217674 217121 217833 226087 223825 219368 219061 222672 223112 219099 224748 228275
5465 228275 223757 222603 231527 234872 230261 234272 240822 237591 232397 237685 245113 242394 242282 245384 244134
5450 244134 240574 244281 249547 248890 247521 254024 254932 251497 252024 256059 259205 257193 259803 265164 263720
5435 263720 260611 268260 271070 266766 268658 276903 276736 272490 274627 278763 274790 273855 284714 284806 281284
5420 281284 281366 285847 291460 288530 290519 291004 292000 295997 301349 305368 301219 303017 307220 310901 310236 315601
5404 315601 324514 322825 323715 330364 334588 335314 336785 348885 348308 346458 354353 363147 363823 362441 368446
5389 368446 370857 368371 374372 381822 383466 383010 391004 397976 394017 396014 407713 413480 410932 416012
5375 416012 422419 424485 425255 433972 440215 439625 445158 456982 461954 462415 470993 478302 476835 472931 480255
5360 480255 485351 482325 482929 491844 493310 492217 496341 504846 505101 505811 517270 522881 520551 529162 542145
5345 542145 545276 548188 554115 559325 561906 569117 579802 585749 587995 595163 609592 618587 622660 631683
5331 631683 639908 639016 644704 659494 665209 669799 682432 693634 699029 705586 718456 730158 734520
5318 734520 741489 756785 769463 775112 791557 801731 811063 825173 842795 852115 856759 870847 889562
5305 889562 896828 905427 924313 940146 946421 961353 980842 991973 1002323 1020341 1038709 1049276
5293 1049276 1064905 1089507 1111906 1126550 1149937 1179325 1200353 1224430 1258771 1293726 1321296
5282 1321296 1358950 1403694 1446974 1490465 1547940 1612871 1677641 1756019 1854138 1959399 2075106
5271 2075106 2209745 2374241 2563358 2782185 3055297 3354411 3655862 3935206 4125785 4176760
5261 4176760 4066357 3838048 3537096 3209589 2905313 2644973 2425126 2244098 2101456 1983274
5251 1983274 1886141 1807357 1750884 1701267 1652257 1616999 1593583 1563764 1539223 1525024 1515155 1496007
5239 1496007 1485166 1481336 1472212 1462520 1461349 1464132 1463550 1464984 1475549 1486457 1489483 1495056 1507566
5226 1507566 1516203 1517492 1528211 1541166 1544460 1550428 1568715 1580504 1585086 1597218 1615429 1623229 1627208
5213 1627208 1648370 1664359 1670097 1682558 1699966 1706884 1720402 1745253 1761340 1770975 1783901 1806327
5201 1806327 1819837 1833662 1852768 1871182 1881099 1897834 1920882 1936663 1946546 1968226 1991597 2005567
5189 2005567 2026538 2056283 2080072 2093947 2117869 2145555 2165760 2183991 2216176 2240020 2257434
5178 2257434 2284935 2313237 2334487 2358249 2389279 2419288 2438443 2465011 2497858 2522338 2542585
5167 2542585 2576444 2607491 2625450 2649662 2687108 2711562 2737390 2769465 2800204 2823110 2852116
5156 2852116 2886410 2909742 2933903 2970182 3001388 3026086 3055852 3096833 3128772 3153755 3188282
5145 3188282 3226982 3252383 3284821 3322707 3355852 3388913 3428690 3473057 3504359 3537216 3578819
5134 3578819 3609544 3639356 3682062 3723372 3757938 3797302 3852299 3902955 3948008 4006126 4072415
5123 4072415 4136711 4205850 4278578 4338769 4383084 4435526 4484905 4521855 4560567 4612664 4662505
5112 4662505 4700680 4744007 4792092 4831678 4876588 4932956 4986327 5034486 5094477 5161376 5219605
5101 5219605 5278646 5351209 5420502 5481488 5548945 5621605 5684941 5750724 5826574 5900164 5969129
5090 5969129 6051913 6141638 6226558 6324335 6434622 6536141 6632375 6740978 6855599 6958851
5080 6958851 7070732 7190805 7303648 7408752 7527021 7642436 7746700 7862088 7993841 8118129
5070 8118129 8250316 8403238 8558522 8708348 8874581 9047339 9214141 9385277 9577957 9775280
5060 9775280 9977560 10198700 10434400 10658632 10889613 11132595 11361873 11585298 11818318 12058187
5050 12058187 12288519 12532213 12799514 13065439 13342568 13667905 14017636 14376612 14766347
5041 14766347 15183160 15612517 16068968 16568460 17086749 17627675 18206858 18794571 19350709
5032 19350709 19902262 20462637 21014546 21558725 22130336 22714621 23308824 23924601 24550859
5023 24550859 25167778 25785660 26403999 27011258 27623390 28271241 28948285 29640919 30368705
5014 30368705 31139488 31926314 32737206 33601416 34504246 35436717 36437761 37484683 38545319
5005 38545319 39651743 40819938 42013105 43244536 44540884 45866936 47167538 48446112
4997 48446112 49704880 50902338 52079239 53294515 54547278 55862193 57257176 58676556
4989 58676556 60155451 61775692 63506726 65293231 67173611 69162800 71268234 73541051
4981 73541051 76010072 78656959 81514513 84624808 87978393 91582240 95480075 99661164
4973 99661164 104168336 109085636 114436507 120229347 126604958 133601985 141219117 149565829
4965 149565829 158751424 168733829 179569906 191253186 203676928 216850806 231173083
4958 231173083 246999405 264531808 283169911 301667350 319473804 335154583 342806804
4951 342806804 339128542 327118250 310980557 293688241 276327235 258990270 241719061
4944 241719061 225078863 209512889 195015411 181360796 168787142 157358590 147014198
4937 147014198 137713266 129350490 121723075 114732468 108284622 102191442 96434349 91113747
4929 91113747 86222092 81738910 77603931 73783215 70245687 66988508 63971390 61178150
4921 61178150 58571426 56135420 53849397 51695568 49675748 47792897 46024478 44349662
4913 44349662 42753163 41254020 39839260 38507792 37248888 36062380 34944893 33874093
4905 33874093 32844180 31859518 30900428 29977251 29089219 28241970 27431325 26662280 25922145
4896 25922145 25199254 24486566 23795159 23131243 22499874 21893553 21311856 20754434 20216991
4887 20216991 19698134 19192631 18701890 18223253 17768934 17326700 16894268 16469998 16053051
4878 16053051 15650485 15261775 14886332 14528521 14183551 13849327 13530605 13223287 12923421
4869 12923421 12632130 12350925 12070521 11797347 11531105 11274548 11034041 10797255 10573927
4860 10573927 10358167 10146574 9938732 9734313 9531674 9333475 9144843 8964556 8792834
4851 8792834 8631210 8474067 8323244 8181161 8045769 7913185 7789542 7664055 7540371 7411569
4841 7411569 7284831 7154511 7028491 6907279 6786417 6664165 6545440 6429352 6317273 6205225
4831 6205225 6096447 5990982 5891244 5791677 5695802 5602236 5509357 5421378 5337721 5254712 5176983
4820 5176983 5102702 5031558 4958062 4888184 4821068 4754778 4684359 4616221 4545957 4476290 4405237
4809 4405237 4333627 4261739 4193296 4125801 4058544 3993079 3933325 3873069 3813531 3753989 3693728
4798 3693728 3635698 3572969 3515801 3458870 3400440 3347045 3291934 3242733 3189614 3136604 3089838
4787 3089838 3043059 2996433 2959088 2927474 2904376 2886519 2875082 2864001 2852239 2838181 2819668
4776 2819668 2796162 2770027 2745370 2725099 2698515 2672218 2639168 2606759 2578435 2546376 2516521
4765 2516521 2487094 2458027 2431356 2404444 2373977 2346019 2319125 2294140 2271935 2251256 2228718
4754 2228718 2210605 2188048 2168038 2149380 2126983 2107887 2088233 2070329 2052095 2035976 2019390
4743 2019390 2001402 1982975 1969762 1956225 1937808 1920049 1904512 1889424 1871504 1855463 1842088
4732 1842088 1828626 1814928 1800415 1784872 1775734 1762559 1749453 1735693 1724562 1711101 1703285 1694218
4720 1694218 1682102 1670872 1660153 1646698 1638887 1627367 1620347 1610927 1602063 1591403 1580675 1568663
4708 1568663 1554054 1544455 1538034 1528010 1518288 1508488 1501362 1486801 1474666 1469031 1462359 1449017 1442284
4695 1442284 1437263 1429884 1425532 1420018 1414132 1408262 1402664 1398733 1394321 1392064 1386041 1381540 1376717 1373876
4681 1373876 1371195 1367416 1363434 1357771 1359676 1356261 1351567 1349309 1347460 1347602 1349706 1347443 1351822 1355722
4667 1355722 1355731 1358988 1363663 1369099 1374700 1384257 1393635 1403626 1416362 1431147 1449504 1472940 1503088 1537102
4653 1537102 1581424 1634242 1692068 1762533 1851948 1954974 2075547 2219244 2394348 2613541
4643 2613541 2878452 3177293 3488741 3769341 3961696 4018424 3919442 3690529 3390359 3066121
4633 3066121 2758862 2490876 2259730 2065212 1905331 1772668 1661325 1564251 1478944 1406942
4623 1406942 1346798 1294798 1248987 1208547 1165410 1128168 1096602 1067527 1039128 1015085 991202
4612 991202 966599 945138 930076 914760 898769 882128 868854 857913 845403 834145 818080 806788
4600 806788 795647 786236 777137 765249 753152 748342 742173 735270 722477 713877 706644 701629 693018
4587 693018 683021 680612 674178 666077 659455 651201 645359 638743 632552 624562 621988 616838 609879 603351
4573 603351 599069 597507 593705 587915 581615 579053 574440 565159 562452 553182 548851 548810 546567 539347 539483
4558 539483 531614 525921 525174 520120 518178 513833 510626 504700 500366 494407 490840 489119 486205 483575 479791
4543 479791 475644 471051 463801 463805 464539 460587 455972 452901 449444 449820 444342 441857 436744 436694 436488 432798
4527 432798 429872 422398 420669 419143 416450 415928 412663 407224 403355 401180 400534 399477 395437 392193 391506
4512 391506 388001 387162 385955 381828 381124 375497 373992 373412 371033 372545 374007 376708 375366 372090 372628
4497 372628 371026 370282 368335 365362 363604 360129 356660 356061 352137 350887 345151 343022 341435 338770 340545
4482 340545 336694 336151 333021 330009 328748 326715 324161 323853 321610 314626 312230 310316 310846 308799 310806
4467 310806 307946 303017 299740 301757 302066 300855 300464 296848 295822 294884 290496 290388 290010 286061 283143 282877
4451 282877 283063 280443 278674 278468 275312 273920 273380 270492 267294 268993 266172 264523 263724 261322 259343
4436 259343 256921 257511 253960 255029 253116 253436 251126 250655 247712 245734 246974 244584 242181 243915 239511
4421 239511 237693 237082 239794 239619 234620 235029 233955 232718 229290 230821 229513 225887 227257 227817 225752
4406 225752 222181 222212 222284 220686 222282 221878 219311 217341 218020 216729 216509 215760 212770 213378 209307 207710 208421
4389 208421 205844 207310 205467 203838 204193 200936 199106 198919 198405 197710 196399 196928 196964 194988 191641 190351
4373 190351 191004 188438 191009 190579 188287 189652 188580 188502 189070 189834 187926 185735 187026 185166 180954 179823
4357 179823 183802 184250 181726 179059 174941 174740 175669 177164 175693 172257 173617 173062 171592 169819 170077 170735
4341 170735 171779 170409 167491 167452 163180 162113 164589 165721 162948 161443 161377 159451 158987 157682 157421 158590
4325 158590 159732 157732 154536 155200 155754 155240 154044 155967 156465 155235 155747 152921 153893 153422 152771 146701
4309 146701 146831 146575 146578 144914 144670 145167 145065 144458 143632 144707 146118 146933 145271 144713 144732 141105 140282 140765
4291 140765 139793 140891 138123 137942 135998 134463 132779 135657 135786 134560 133636 130261 127891 126098 125815 126660
4275 126660 126210 126608 126784 128886 129786 127074 126366 125078 123067 123496 126550 124721 123593 121885 118582 119796
4259 119796 122525 122885 122065 121988 119852 118832 120526 120462 120411 120778 119014 121324 118723 114963 116609 117765 116895
4242 116895 116596 114807 115961 114620 112161 114586 115797 113185 116501 114372 112389 112570 113313 111787 111102
4227 111102 108711 106771 106822 108925 112039 110439 111787 109019 104467 107282 110646 107243 103507 104447 103683
4212 103683 101244 103458 103007 102578 103794 104514 104586 104597 101554 103574 103455 103656 106150 99445 97036 96086 96062
4195 96062 97344 98510 98621 100091 101306 101531 101394 98792 96179 94745 95525 97007 95174 90594 90585 92714
4179 92714 92272 94433 96643 98233 97843 98437 96375 93929 94203 91597 89630 91259 91043 88706 88602 90232
4163 90232 92013 90743 92900 92463 92384 91286 87500 86652 88180 84495 80477 80599 79663 82318 82781 82291 84076
4146 84076 86723 89789 90583 91916 93483 92714 89798 86540 85844 85916 83469 86281 85972 87795 90603 88406
4130 88406 85141 81412 80362 83422 81610 80965 77388 76357 77268 77320 78098 81927 82545 85622 89227 85534
4114 85534 84924 82578 81327 80291 79938 78660 79606 79922 76664 79624 81650 82632 84725 84612 84898 85881 84210
4097 84210 81458 81751 81449 81653 80691 79118 78401 80453 82863 83183 82372 82804 83250 83320 82667 80794 77787 79787
4079 79787 77155 76535 79217 82443 83027 83579 82408 78670 81069 84228 85916 85165 83880 81099 78823 78190
4063 78190 80666 78292 80127 83443 87331 89232 87681 83691 83001 81046 80841 80492 80596 84407 84697 84500
4047 84500 85403 85617 85174 85954 88155 92225 88233 88380 93094 93657 92438 91002 90849 88552 90492 90719 89806
4030 89806 94142 94440 92880 93928 92949 94654 94212 94451 95444 92347 93525 95009 96632 96088 99370 102145
4014 102145 100351 99679 100084 99282 98079 99122 100224 95434 98508 101728 101106 102170 102778 102112 101030 99979
3998 99979 99127 95393 97176 97660 97306 97430 97479 99178 96670 97553 98886 96975 96097 95871 93823 96442 99308
3981 99308 102052 100727 98523 98540 99607 100498 101410 102579 100385 101092 102428 102113 103133 99455 97309 99198
3965 99198 99327 100688 102931 105727 103880 104320 104654 103047 101145 102765 105935 106578 104126 106373 105775 106650
3949 106650 106513 104636 108595 109141 111605 111226 112258 112731 110427 111739 108573 108762 111126 112140 112574 110362
3933 110362 111215 114720 117124 115227 113963 116976 117046 117027 119040 119789 120949 123096 125962 127268 124934 124267
3917 124267 126399 128537 131347 130073 130148 130752 131687 132410 133785 134692 136393 137066 137913 142380 142587 147110 149642
3900 149642 151902 152477 152847 154909 156651 160793 159896 161652 161322 163679 166603 167731 170414 172892 177855
3885 177855 178459 182201 188882 187179 188513 188467 190565 193813 199142 199809 202159 206152 208721 214283 220264
3870 220264 222104 227196 231547 232876 235604 238959 243588 248595 250605 257189 264277 268759 276082 281408
3856 281408 285745 291366 296205 303073 306505 313154 320455 326452 333212 340408 349666 357182 363858 371438
3842 371438 376128 384210 397091 405430 412775 423943 435423 446585 454078 463672 476953 488256 502583
3829 502583 513815 525389 534645 545155 555425 572315 588892 604087 617842 631158 646860 663589
3817 663589 682411 702241 719124 740397 764329 787250 806780 830957 856440 876723 900170 923091
3805 923091 944831 965317 983237 1003821 1020422 1037615 1055935 1078177 1100267 1115096 1132626 1152204
3793 1152204 1176809 1200692 1224386 1250605 1280211 1308336 1342786 1380087 1418443 1458225 1499654
3782 1499654 1542677 1589421 1633553 1676000 1722029 1766217 1810424 1851251 1891408 1932289 1973554
3771 1973554 2015523 2056780 2095934 2135624 2171006 2210396 2247198 2285690 2324255 2365895 2412044
3760 2412044 2465226 2520963 2578625 2646054 2713200 2789187 2868619 2949152 3028464 3109551 3197248
3749 3197248 3280539 3366808 3457406 3556614 3665694 3786252 3919763 4069680 4236544 4419308
3739 4419308 4623346 4837304 5065425 5299945 5530013 5751364 5950551 6118316 6244391 6320936
3729 6320936 6328514 6280614 6178848 6029191 5844086 5632777 5424606 5223529 5028595 4845010
3719 4845010 4666069 4491183 4316149 4148602 3981124 3819893 3664323 3509254 3362507 3213491
3709 3213491 3074407 2940522 2810903 2690186 2577198 2470326 2364284 2263411 2171054 2085129
3699 2085129 2005141 1932781 1860891 1793462 1736356 1679924 1621717 1565351 1515874 1466709 1415304
3688 1415304 1368899 1320891 1274504 1230933 1188331 1146582 1103158 1064209 1031307 1002999 973947
3677 973947 941341 909537 882916 858119 833866 808137 782401 759075 733604 710249 687194 665677
3665 665677 648634 627754 609717 590329 575360 558080 540210 522675 509555 494458 478926 467847
3653 467847 455187 444052 433666 419807 410414 401241 395207 383775 373263 364855 357963 351849 341265
3640 341265 336669 332505 322070 313492 305241 299999 293460 288446 285023 280107 275255 269168 262904 258895
3626 258895 255098 251118 248787 245501 240064 235843 230289 228801 223506 219874 220859 214506 212529 210626 208493
3611 208493 206307 206139 198787 193829 191059 190828 187911 186746 185841 183356 183163 182134 179801 176623 173822
3596 173822 172640 174275 171360 170647 171715 170277 169571 169067 163863 164132 163486 160783 161282 158436 156654 156406
3580 156406 157463 157937 155939 152898 155213 152102 150895 154086 155419 150444 151676 150087 151285 151181 148825
3565 148825 148384 150107 147624 148302 151860 153383 152456 153374 152995 153179 154984 155641 159024 154144 154816 157181
3549 157181 156827 156307 156829 157048 158662 156571 158238 162612 162953 165598 164206 161964 164239 164972 164439 165696
3533 165696 168262 169617 173374 179105 177508 179667 183545 181483 180714 182242 185835 188671 190547 192556 197260
3518 197260 200217 203384 205909 209595 210144 211531 216580 219578 221695 223642 227707 230891 235080 242268 244929
3503 244929 247732 255154 258488 263735 269293 274094 276793 282498 291151 295017 302177 308660 315312 324112
3489 324112 331269 340454 346578 352263 358348 365894 372961 380903 388265 396049 404076 413542 425497 437770
3475 437770 449961 458827 471436 482245 494024 506740 518480 527020 536791 550184 564278 578301
3463 578301 591794 606699 620889 635368 651050 661570 678312 697704 711551 726995 749311 767564
3451 767564 785611 804864 825343 846789 868955 897890 927501 957317 989895 1026508 1062901 1098320
3439 1098320 1136066 1174714 1221399 1274199 1328820 1386718 1444565 1510682 1579057 1653588 1739336
3428 1739336 1831633 1924334 2021849 2122637 2223280 2323985 2414447 2493872 2552865 2592132 2616474
3417 2616474 2632015 2644619 2657503 2667191 2679391 2689369 2700109 2716369 2732742 2747605 2770824 2804493
3405 2804493 2840198 2887190 2941398 3002728 3078936 3167381 3273958 3405975 3568577 3772680 4013546
3394 4013546 4275474 4541760 4728291 4738638 4571325 4306677 4016933 3739217 3486208 3264125
3384 3264125 3071724 2904652 2771770 2655005 2555468 2471232 2400500 2339907 2287499 2247310 2218315
3373 2218315 2195469 2184670 2178060 2174310 2180495 2190237 2206904 2229964 2258846 2283661 2301843 2306296
3361 2306296 2287684 2244717 2177139 2095868 1998586 1896417 1800445 1706236 1617523 1535785 1462896
3350 1462896 1393779 1329284 1272935 1224109 1177841 1132050 1089472 1050579 1012205 976316 943114
3339 943114 911173 883208 858936 831436 809264 787771 761955 736574 715451 697317 679178 660779
3327 660779 642117 621796 603050 589830 572791 555937 539695 522434 504643 493945 483488 470943
3315 470943 462960 451197 440167 430875 418866 409123 398660 387342 375270 367180 359586 349809 340071
3302 340071 332626 325194 316824 305226 298905 291715 284742 274413 269202 262075 256490 250096 243692 235328
3288 235328 226456 223222 220427 216277 209973 204574 198032 193175 188890 186576 182342 175952 173225 169393
3274 169393 167046 161544 154799 154807 149954 148127 144787 144207 140586 135198 133035 129605 126921 124077 117909
3259 117909 118016 120111 114126 115799 111842 107310 108071 105217 106757 103399 99293 98097 99080 97283 94701
3244 94701 90015 90749 88442 87345 87538 86517 84758 81263 80013 78170 75896 78399 78650 77530 76915 76727
3228 76727 72754 72300 69638 67568 64888 66594 66172 64815 65133 66399 66813 66398 66790 64487 64255 63487 59927
3211 59927 57964 58788 55896 53635 53502 55506 55503 53842 55159 56982 53377 55547 54438 52651 52301 50680
3195 50680 50335 52649 50105 49905 50282 48480 47751 47586 47383 47164 49400 49512 49153 50201 48288 47809 45090
3178 45090 42216 43724 44271 43624 47697 45704 46015 42491 41343 42011 43851 43086 45689 44127 42470 42362
3162 42362 41864 42917 41937 43850 41001 41439 41527 42366 42297 44213 39767 38032 39680 43314 43808 42304 44104
3145 44104 43472 43060 41053 37839 40258 43990 43565 41679 42404 41712 42739 42556 43163 43228 43622 46216 43148
3128 43148 40943 39889 40214 36848 36893 38088 37096 37790 38625 39364 37156 41820 42110 41744 40026 39581 42885
3111 42885 42638 42721 48439 51178 51514 49200 45812 43078 43826 42380 37812 40695 39446 37677 34810 32571
3095 32571 32768 31884 28920 32442 34720 31463 29908 30893 33422 32158 28502 29599 31990 31771 33874 34665
3079 34665 36084 32719 30977 29890 28427 31226 29494 29627 26714 23942 27081 26859 26473 25944 25785 25690
3063 25690 27044 26863 22714 22219 23561 21978 23495 22152 21679 20570 16885 20945 22344 20541 19824 19492
3047 19492 20046 20686 20456 17718 15596 20131 19733 16627 16285 16907 16837 17776 16118 17470 17861 19693 19045
3030 19045 17147 16629 15981 17700 18638 15649 11094 8338 11487 15968 15808 12394 11608 14726 15125 15209 15198
3013 15198 18158 17085 17031 12841 12556 13710 12938 15715 16614 15678 15073 15103 12485 11823 12388 14127 11030
2996 11030 10745 14415 11132 8926 10205 10416 10093 9723 7040 4690 9164 9832 12201 9767 9498 9529 9516
2979 9516 11454 14383 12339 9224 8500 6873 8153 8429 10762 14105 9914 8633 9926 6150 8327
2964 8327 10844 11013 7638 8279 8358 6547 6057 5057 7333 9721 9752 10232 7121 9037 7304 6865 9422
2947 9422 8863 7603 7002 6931 5974 5356 6144 6598 8255 7286 7875 8735 8320 7591 9295 9167 9633 6737 3830
2928 3830 5263 5176 7378 5655 5129 6805 7872 8087 4331 5546 7312 9560 7791 5419 5483 6918
2912 6918 6365 5563 8542 7141 4376 5767 4107 6038 4656 3453 4298 5949 6335 4426 4827 4833 8165
2895 8165 3948 3968 4085 5632 9358 9588 7852 7713 5613 7523 6386 4232 3896 5806 5677 2672 3038
2878 3038 1877 795 2077 7229 7517 6814 3581 3498 3932 4441 4626 4258 5624 1169 -104 2319 5964
2861 5964 6034 4501 6428 6364 6135 3783 4169 3026 3154 3429 957 1818 4228 4801 2263 5295 4008
2844 4008 1953 3606 5126 7127 6595 5165 3609 987 2450 2566 3087 2829 2644 344 464 3190
2828 3190 3386 3227 4050 2451 2079 1272 746 670 2289 3258 5748 8142 6043 3842 609 2231 4628
2811 4628 1666 539 -861 962 988 2664 3123 -662 568 -932 495 1421 741 3133 3586 5631
2795 5631 4040 3535 4265 2831 6488 4527 3702 2436 1392 2373 -818 -632 3297 6254 5266 6019 4278
2778 4278 3777 2776 3783 5331 4384 3712 4009 1103 324 2599 3200 3939 4733 2190 3520 2833 6144
2761 6144 4983 2766 4968 7838 7586 3682 5476 3020 3867 3523 5596 3820 8267 7625 7168 2141
2745 2141 -2076 100 4154 2827 2793 3489 2874 3460 3603 3987 2369 3732 1952 935 2196 998 2912
2728 2912 522 1275 4017 4981 633 849 3112 3149 3258 3904 4409 2247 1559 1436 4417 5877 4193
2711 4193 4450 5832 4160 3218 806 1636 3922 1319 2718 2517 5803 4243 902 3955 5817 7636
2695 7636 4158 3407 1827 1561 2756 4620 3565 2187 2043 3888 3588 3001 6609 5218 2899 3528
2679 3528 3566 1186 -882 -958 -2830 -1425 -2144 84 2741 3468 1923 1491 960 -2185 -836 1582 1059
2662 1059 -881 670 1466 3594 6742 2865 636 1816 714 401 1870 4283 5952 3539 -1131
2647 -1131 -901 -1237 -3542 -1776 -1969 271 -103 -2348 -1244 1109 3682 3297 839 805 2050 3542 1914
2630 1914 1128 2346 4384 5035 1187 3017 3153 -927 -55 1430 -2510 -3015 -1291 664 2680 764
2614 764 -646 0 1951 1105 2274 581 -339 537 -290 -117 108 468 -282 -1838 543 2539 464
2597 464 535 220 -4064 -4795 -2007 343 3000 1335 -455 564 2144 191 577 2891 1205 1175 -712
2580 -712 -2014 -1266 -3048 715 3570 207 -2423 830 834 -1908 -1260 -427 -352 -1405 -218 -1633 -2437
2563 -2437 -1970 -3144 -1634 2574 2424 3189 2080 2654 -773 -2707 -1151 341 901 975 -1148 -2569 -920
2546 -920 691 -1238 714 2313 2009 -2049 -1268 1252 498 2186 -1290 -1448 -3444 -1329 1285 2733
2530 2733 -277 -1466 -360 2650 257 676 609 1785 -314 -3306 -907 548 1038 408 -1252 -1786
2514 -1786 -3057 -3050 -2552 16 2893 1547 -470 -2726 -1675 -749 -1360 539 1840 3355 371 -2386
2498 -2386 -1847 2419 -520 -3514 -2442 -3480 -4945 -5679 -6291 -4075 -2805 -1118 -161 -3515 -3111 -2512
2482 -2512 -710 -2567 -2135 -2501 -662 2384 3238 168 -4084 -5723 -3550 -869 260 -345 -1323 -760
2466 -760 -36 -1437 -3546 -886 -1633 -735 -665 -2484 -619 -1596 -1535 85 -1072 -275 -1464 -1822 644 -2820
2448 -2820 -5002 -6348 -4881 -2544 -5916 -3566 -2930 -3047 -729 -1250 -981 -3884 -5805 -3750 -4448 -5478
2432 -5478 -2934 -4591 -6186 -5126 -2889 -2803 -4956 -3534 -3112 -2604 -4243 -5261 -5131 -5209 -1926 510 -748
2415 -748 -4234 -1413 -1528 -1408 -1889 -3805 -1409 1169 141 -3007 -2704 -1322 -1148 735 -772 -2846
2399 -2846 -4217 -2800 1236 -625 -3311 -4405 -3453 -1601 -541 1367 576 1105 -663 -2276 -1419 -362
2383 -362 953 -69 -4780 -4440 -1760 -605 -2788 -3651 -2250 -2962 -2478 -2694 -1393 -1984 -3448 -3091 -2959
2366 -2959 -591 -3260 -4236 -5016 -5790 -3161 243 1059 -109 -1183 -385 1152 1063 3299 3492 743 -660
2349 -660 1459 1165 -3018 -2413 1234 423 -3259 -5599 -6850 -2882 -2645 -1794 851 -1053 -1866 -2486 -264
2332 -264 -3968 -5286 -2811 -2134 -3675 -4095 -1620 -3400 -3709 -2122 -3690 -2708 -1033 -830 -2306 -2905 -3509
2315 -3509 383 -72 -3489 -4532 -5132 -4216 -3255 -5642 -5144 -3007 -1442 -1841 -1843 -3133 -3837 -1088 -2697
2298 -2697 -681 -54 -1730 -829 -2265 -5177 -4648 -6451 -7009 -5193 -6186 -1086 286 -1323 -1391 -2110 -670
2281 -670 1588 2442 1552 -1163 -4743 -5085 -3111 -477 1637 -1103 199 -2248 -3793 -3171 -2692 -4514
2265 -4514 -5420 -2775 -1837 1281 1502 917 -338 -1640 -1351 -2985 -2529 -1956 818 158 -3453 -4672 -3642
2248 -3642 -4498 -1318 385 -935 -1383 -958 -2128 -5178 -6049 -2208 229 -341 1099 -2741 -4716 -1690
2232 -1690 -998 -641 309 -179 -4678 -6790 -4702 -4328 -1698 -3387 -4534 -7171 -3944 -4120 -2450 707
2216 707 2040 2825 -1896 -4537 -1792 -1805 -2570 -3194 -842 -3743 -1077 -1878 -5572 -1886 2103 834 -1905
2199 -1905 -1504 -3850 -2113 -3142 -4029 -2730 -5250 -3897 163 -572 -2452 -2857 -2645 1101 1636 -1172
2183 -1172 -2825 -3901 -2661 -3920 -1154 2284 -275 -2720 -2308 -2136 159 -4261 -5754 -1450 -3545
2168 -3545 -1524 -2500 -823 -99 -765 -2776 -2410 -1203 -2478 -505 -717 -1643 -1350 221 -112 -735 -1373
2151 -1373 -412 -1095 -5065 -4253 -4160 -5099 -4478 -5766 -5373 -3174 -3829 -4726 -1805 -3174 -4501 -4634 -1863 -1720
2133 -1720 -3762 -1036 -759 -3018 -1050 -1753 -4389 -2490 -3040 -4717 -3753 -4546 -3603 -4521 -6947 -8794 -6126
2116 -6126 -3976 -5607 -4446 -4166 -3496 -454 -2697 -5404 -3391 -1875 51 -742 -1677 -4275 -3267 76
2100 76 1002 2554 -2954 -4018 -658 -3446 -4098 -3458 -3884 -5728 -6297 -702 -54 -994 -3240 -4034 -2420
2083 -2420 -3208 -1699 -1043 -1330 -1527 -2576 -4099 -3149 209 -249 -1271 1363 -1329 -3457 116 -1684
2067 -1684 -1267 -6013 -5244 -4915 -6182 -4265 -4772 -2429 -1992 -1477 -2717 -2876 -3792 -6325 -7163 -3438 -6220
2050 -6220 -5299 -5151 -4866 -4690 -3640 -3845 -5899 -6942 -6412 -2359 -1747 -344 -5541 -6056 -6563 -4900 -4618
2033 -4618 -3887 -3001 -2362 -3674 -3208 897 -2410 -4705 -3837 -4561 -4067 -3979 -3118 -2939 -2752 -2144 -1350 -1728 -497
2014 -497 -2515 -4905 -3989 -1970 -1993 -2803 -2804 -5053 -3562 -2094 -2123 -2427 -5206 -5469 -3852 -5789 -4576 -6805
1996 -6805 -5666 -3989 -4652 -4486 -3254 -4145 -4256 -6698 -5119 -1273 -2802 -3845 -4749 -6125 -2484 -3318
1980 -3318 -2654 -2460 -1811 -1161 1425 -2595 -4388 -5478 -5619 -4997 -5643 -4480 -3188 -4600 -3753 75 1225
1963 1225 -857 -2038 -964 -4208 -5065 -3695 -3198 -4593 -5572 -3192 -2305 -2498 -4265 -8312 -8680 -4013
1947 -4013 -4350 -8255 -6106 -5040 -7441 -6336 -3679 -1144 -611 -2434 -3222 -3998 -1639 -4495 -3666 -3516
1931 -3516 -1051 -4017 -8072 -4980 -394 -1030 -4507 -7053 -5445 -3085 -2158 -1560 1247 -2202 -5011 -7769
1915 -7769 -5648 -5506 -6638 -6663 -4749 -3725 -6990 -2954 -2555 -7736 -6235 -2641 -684 1057 -1998 -3122
1899 -3122 -1835 -1035 1709 -1963 -3140 -3041 -2262 -5110 -5395 -3360 -4144 84 -2255 -4456 -4570 -4119 -1999
1882 -1999 -818 -556 458 -1088 -4827 -5721 -3860 -4249 -5147 -2559 -3163 -4023 255 -649 -4460 -4872 -2693
1865 -2693 -4707 -1786 -1242 -387 -1833 -3154 1047 -748 -949 -1004 -667 -1432 -2943 -3660 -7622 -6060 -2739
1848 -2739 -2282 -4641 -4648 -3970 -4128 -6358 -1973 -1724 -3741 -6165 -5650 -6116 -3446 -3632 -7655 -8243 -5392 -4237
1830 -4237 -4463 -3178 -3248 -3546 -4238 -2949 -2923 -3682 -6078 -5585 -4226 -2364 -1586 -547 -681 -394 -355 1244
1812 1244 -2429 -3467 -3387 -2971 -2061 -1622 -6003 -6822 -6372 -5849 -5038 -4689 -1500 -3473 -4922 -6044 -3807
1795 -3807 -4278 -5247 -3883 -776 -1925 -4667 -3465 -1654 1084 759 259 -696 -4068 -1673 -116 -2633
1779 -2633 -3066 -3513 -3599 -1267 169 -1557 -1034 184 -2357 -3174 -1100 -3001 -300 255 -2129 -3413 -1149
1762 -1149 -3778 -4492 -1787 -1938 -1105 -582 -1114 -5405 -3206 -5590 -7514 -5568 -5708 -835 891 -3706
1746 -3706 -3315 -769 1851 -580 -3851 -2560 -5592 -5710 -5180 -5651 -6481 -7236 -5768 -3414 -3217 -873 -1141
1729 -1141 -1642 -2630 -2344 -2400 -2246 -2029 -5906 -10133 -14435 -14584 -13193 -9220 -5324 -4834 -4326 -6012 -3000
1712 -3000 2967 11005 15258 11299 2830 -591 -1622 -4972 -5703 -6117 -8267 -7678 -9439 -8362 -3640 -4994
1696 -4994 -5117 -3005 1133 2468 1386 -417 295 -1412 -2479 -5252 -6304 -4573 -3294 -3082 -464 -496
1680 -496 -457 529 2109 1035 1853 3809 2039 -2233 -3230 -2993 -2409 -3306 -3851 -2872 -3730 -4484 -2771 924
1662 924 1172 1819 -556 -4242 -5247 -4114 -3407 -2248 -2202 -1819 -2609 -2314 1457 3404 3506 2855 3811 730
1644 730 -3513 -3169 -1623 236 -2003 -3628 -373 -3179 -1687 -944 -1330 -491 -409 -2468 -3181 -2341 -5374
1627 -5374 -4553 -4288 -397 1321 290 -2133 1130 610 -5365 -4076 -4366 -1603 -1100 -611 2097 -1356
1611 -1356 -837 -643 -2586 798 2640 -898 -1534 -1217 -2770 -1114 -1356 -2328 -497 383 -447 -2030 -2019
1594 -2019 -1446 -879 -505 -1254 -2228 -3438 -4136 -5204 -5674 -634 223 -3732 -3643 -824 -3633 -4539 -4590 317
1576 317 -2300 -2997 -1789 -3688 -3752 -2310 -2533 -5240 -8569 -6602 -3294 -2565 -4233 -5669 -1786 -102
1560 -102 -1809 -3199 -2619 -4148 -2794 685 1034 739 -1350 -3175 -1634 546 465 -2127 -1499 -1813 -2939
1543 -2939 -181 1831 -2257 -1210 -2105 -2274 -4775 -1314 -3934 -2565 616 719 -527 -1710 -884 409
1527 409 88 -403 -1421 -2661 308 657 957 -2038 508 -940 -3759 -5938 -3667 -2244 -4238 -3471
1511 -3471 -1124 1912 4657 1825 -1165 -1031 -597 -1151 -2389 -2237 -1731 -3130 -2989 -655 -958 -3938 -2611
1494 -2611 1429 231 -347 -1145 241 930 -851 -1382 739 -3187 -2173 -2543 -1971 765 1880 -1308
1478 -1308 -4483 -2850 -2305 -1541 -1192 105 -1298 -3604 -3734 -2615 87 -238 -2712 -941 -3693 -4783
1462 -4783 -1319 -2578 -1860 1695 845 -1413 -4415 -4533 -3206 -789 177 942 -2570 -233 -160 1261 985
1445 985 -289 -1014 -412 -879 609 -296 -1711 28 -2327 -2645 -363 -2035 -3087 -241 591 -2323 -4536
1428 -4536 -5281 -3542 -4087 -2558 -2106 -3085 -2247 -2629 -1436 -1858 -3090 -3004 -761 -2691 -2479 -1007 3505
1411 3505 1745 -1471 -1801 1427 -732 -852 -595 -806 -1948 822 -1773 -2942 -2998 -2442 -2768 -3724 -2988
1394 -2988 -2103 -1382 -2684 -1813 -2470 842 1844 3706 1934 446 1956 27 245 400 -3062 -1165
1378 -1165 580 -127 -1806 -3550 -2295 -3367 -2811 -2219 -2496 -2088 -2395 -2497 -908 -2294 -2286 -458 -2218
1361 -2218 -3309 -2123 -771 794 729 -1208 -2085 -4470 -5221 -1039 -2688 -1809 446 542 1317 -1874 -3265
1344 -3265 -483 -108 -1171 1256 648 -102 -758 -1255 -1745 -3172 -976 1255 1118 3487 1132 -886 -3125
1327 -3125 -2416 -504 2194 -2310 -1953 -460 -589 1183 -714 52 534 -119 -2110 -361 1307 1545 1502
1310 1502 20 188 -1308 -3791 -39 786 89 -260 -1410 -3838 -3597 -495 997 2088 3333 2002
1294 2002 -277 794 -4012 -3109 -2491 -1526 1088 910 1789 1509 2495 3132 1709 -2404 -4063 -1922 -2070
1277 -2070 -1295 -3984 -1818 3302 1908 800 761 -1654 -1635 -3158 -884 -855 -801 435 -1316 -1738 -2889
1260 -2889 -650 -76 582 -723 -1418 -3340 -1925 -941 -2692 -4214 -4584 -1170 2401 -650 -1265 -4681
1244 -4681 -5948 -3642 -1715 -3086 -4474 -5489 -3815 -2235 -3519 289 -506 -1612 -3125 -927 761
1229 761 -2547 -2348 -774 894 -549 878 -441 -112 -1196 -361 -1324 -972 1280 1102 -598 -3039 -2835
1212 -2835 -3772 -8000 -5913 -1615 1723 1556 -2751 -1956 -2549 -1677 -1428 -2918 -3327 1152 1387 1626 479
1195 479 -1260 -1327 -353 280 2132 -111 -843 -746 1469 644 673 1912 2324 -104 -1108 -1464 -1592 1281
1177 1281 1179 2412 -2342 -4835 -6506 -4807 -932 1433 -1430 -2208 -3898 -1855 48 -609 -2094 -2335
1161 -2335 -416 -2597 -3982 -1511 1389 358 1506 -772 -3003 -1130 -455 325 443 505 -1976 -3061
1145 -3061 -1113 -938 -2925 -2057 -1221 481 1405 -946 -1871 -1229 -1994 -3258 -617 163 533 -303 1291
1128 1291 902 -1422 -1485 -202 -2083 162 1188 -1889 -2201 -870 -849 -2749 -2402 -1844 -572 -513 -2326
1111 -2326 -2959 -112 -3340 -3193 -409 -1370 -2239 -63 1998 557 -1214 -1025 -297 -2079 1588 368
1095 368 -319 -281 -1044 -1065 92 -2507 -1141 788 -3902 -2306 -2813 -301 1878 650 -1482 -984 -65
1078 -65 -1204 -292 -1759 -2986 -2977 -722 -1944 -1336 1174 2203 2583 2071 1113 988 1985 214 -494 -312
1060 -312 997 182 1442 2857 4783 1006 -1556 267 -398 -1548 -1324 -618 -1921 384 1311 4917
1044 4917 633 1417 1723 115 -328 -165 -2152 2704 1958 -1220 411 714 -899 408 2550 617
1028 617 -869 -1290 762 -355 -166 -1506 1170 -1273 2772 2469 2948 554 941 534 2560 4114 1017
1011 1017 -841 -17 -351 -172 154 1896 2107 944 2601 1450 2638 3249 2207 -1880 1203 2458
995 2458 1025 -1265 -3649 -1284 -1108 20 314 -1663 -2260 2053 54 -1390 2648 3183 3074 2726 -722
978 -722 -785 -1724 -2715 -1984 -1771 -1341 248 36 -791 -425 131 917 -2405 -2575 637 1770 -2094 -2603 -3547
959 -3547 -1016 150 765 -1831 -1161 -2647 -2905 -4739 -7248 -3487 657 77 143 531 -584 2956 1855
942 1855 -142 -1715 -1797 -1598 -4249 -2385 1227 1703 -2147 -3191 2064 789 -646 297 -1812 -902 849
925 849 -1426 -1232 521 331 -1727 394 1449 2351 2952 -1248 -3200 -986 -3507 -2499 129 234 141
908 141 -102 3663 1978 1223 -812 -2030 866 -698 -1235 -2401 -1337 327 -861 2014 2246 1491 97
891 97 -1322 -1880 -2556 1237 2984 -383 -825 2428 3622 1726 340 1639 689 1087 -483 -349 1117
874 1117 -902 -2931 -3182 -1802 1724 3754 361 164 1495 2595 476 93 2323 4825 1927 1820
858 1820 1681 -2052 -849 1799 3134 4234 4153 6287 2323 -630 -436 1091 465 -626 -364 3946 6795
841 6795 4089 1618 1154 3636 3870 8 -437 970 -897 192 72 368 2489 5029 3126 4043 3363
824 3363 1972 1972 2548 754 -42 -2281 -10 244 1295 -661 858 2548 -301 -5381 -4830 -2188 725
807 725 60 -1325 -3621 -330 -543 121 353 -1086 1549 576 473 -7 2447 2650 2337 190 3511 3824
789 3824 4328 1337 -1164 33 1914 1420 2709 2909 4772 2238 -2931 -4428 -1743 -1678 -1424 -5515 -4231
772 -4231 250 1754 998 -65 2598 2310 3525 2305 43 -1369 719 2173 1063 1016 966 3521 5337
755 5337 2358 -55 1777 2617 1438 1326 5026 4449 2512 4084 2177 -416 -2017 -1870 292 -1831
739 -1831 3366 557 -1373 4425 2528 1237 55 836 699 1588 2978 3746 3185 2259 2703 2250 3269
722 3269 5810 4472 3682 2742 4455 3104 4209 4690 4344 5969 4611 2530 3407 4078 4612 3479 323
705 323 1971 2565 232 -2563 -3443 159 238 1301 1831 2347 4404 4710 657 -106 4247 3260 293 -891
687 -891 1093 -196 -653 2220 4227 3931 2281 4121 3276 1618 4232 3177 1132 -1093 -2676 549
671 549 965 -1657 1314 50 527 2106 1813 1268 -2135 -1343 1984 1016 -1708 -1338 -3839 458 3039
654 3039 4934 4144 5456 3921 959 2201 789 -1233 -604 2406 474 -136 318 3073 6159 6635
638 6635 5663 2572 -227 1694 437 -2933 -1496 2171 1582 2345 568 -186 573 878 1139 3432 3048
621 3048 2681 4098 353 427 1004 -1809 966 3712 3444 4037 1998 2401 3212 2729 170 1995 2946 251
603 251 -2126 1122 2810 2476 21 593 3687 6050 4592 2488 -355 -1461 2790 2312 2647 1629
587 1629 2007 963 2097 656 -724 -612 419 3362 3712 1031 -1586 359 2607 1345 1339 1031 3977
570 3977 2350 353 2297 2864 3789 3556 51 1144 4430 1773 -1429 320 -229 -3400 -1375 553
554 553 2474 3118 2061 4930 4603 4192 3585 157 -751 -1863 2827 5281 1646 40 984 1779 2622
537 2622 3978 4263 3270 943 232 1273 1735 -1390 1445 3808 868 -1065 914 2572 1239 2131
521 2131 1519 4287 6429 345 610 4000 1430 2464 2202 2987 3269 3276 4019 3975 2374 838 2332 1680
503 1680 2421 6079 4211 2139 4363 3999 737 2763 3687 3010 3804 5050 5469 2500 6294 7442 6334
486 6334 5737 5025 2268 302 4587 4134 1284 -536 5862 6687 6362 4745 7782 8054 4654 3959 2886
469 2886 2976 2215 2279 1421 1846 4295 5314 4899 4401 3676 3963 2125 2036 4312 5906 4922 3947 4635 7013
450 7013 5572 4427 1354 4535 6094 1637 2673 3695 3386 3008 2193 2819 1459 268 3304 6377
434 6377 6653 4844 5463 6612 4729 5199 6134 6222 6237 6253 7042 6491 4556 4870 7126 7334 7381 8821 8836 5045
414 5045 4045 3369 3137 4420 5138 1548 3509 3440 5215 4680 2964 5272 7133 4799 4238 8196 10799
397 10799 10110 5635 4524 5928 7917 7453 10118 8074 5518 9156 8546 5917 3656 6712 8397 7278
381 7278 5905 4634 3010 3428 7438 4870 4760 3630 6369 6583 6074 5926 6621 7102 7782 7650 6053
364 6053 7135 6885 6658 5125 3202 7845 4925 4512 7145 5829 6129 4396 2793 4092 1831 3186
348 3186 3723 8006 10372 5829 5778 5690 6494 5296 5677 6561 8350 6080 6043 7322 7200 7578 7378 8603
330 8603 3449 4071 4388 6153 3653 2655 4940 3764 3389 1861 5420 8068 8645 8804 7802 8197 8174
313 8174 6429 5400 5515 8587 8908 7573 6154 10969 8793 7119 6873 1059 2443 5453 6196 7840
297 7840 4799 5675 8096 8069 6787 7835 7188 9502 9581 5014 7017 7682 5940 8017 9244 8054 6541
280 6541 5968 7713 5986 6444 9069 8385 5269 4415 5558 5891 7815 7373 9725 8012 9332 9466 7458
263 7458 7260 4658 8175 7845 6238 7300 8043 9868 8830 5961 8343 6368 7225 6911 6379 6186 6713
246 6713 5151 4945 7251 7255 6890 5655 5354 5909 8049 4973 4999 7839 7219 5459 6907 7036 6941 4464
228 4464 3694 889 2799 4181 5500 5186 4625 6536 6390 5070 6069 6173 7904 4056 4374 5727 6135
211 6135 9653 9056 10183 8038 8191 7782 9458 8277 6628 5680 7942 7134 10042 11193 6710 7175 4089
194 4089 5180 8847 7432 7212 6235 5516 9754 6550 3872 6046 6199 5032 4666 8858 8807 8100 8296
177 8296 8780 10256 9766 6437 3641 4602 5454 5114 4663 7283 5080 4688 6786 5716 6885 9028 8564
160 8564 6996 8021 7673 10966 8266 10971 10838 9179 7774 10455 9033 10102 8521 6600 6752 7004
144 7004 9844 7852 7397 8398 9302 7493 8066 9153 11048 8475 8662 10581 11191 12803 12186 11313 8366
127 8366 7473 10219 9234 7940 5737 5465 5640 7126 7235 8873 8888 7314 6925 7833 9096 7619 7483 7731
109 7731 7934 9555 7995 9176 7385 7147 6828 6670 6316 1849 4447 4705 6150 7866 9790 9063 9931
92 9931 11437 11085 10075 8662 7604 8981 9615 8496 4015 3366 6353 8057 6888 5749 6425 6578 5611
75 5611 7506 8851 9384 7755 6323 6305 8931 9715 6553 7052 7385 7390 7178 8194 10247 10609 8548 9258
57 9258 9143 8253 8445 8535 6705 8651 7314 6752 5907 6419 6317 8075 8972 7479 9142 8771 7602 8609
39 8609 7533 8762 9320 10064 9376 8152 9540 9966 9338 8352 9186 9509 8833 9117 8396 9162 8694 7355 6775
20 6775 8157 8181 6953 6258 7965 9080 10544 10118 9434 8510 7262 6279 7528 9603 9905 8768 9993
3 9993 12125 8956 6980
0 6980
$$ Imaginary data points
##PAGE= N=2
##DATA TABLE= (X++(I..I)), XYDATA
16383 -298654 -293655 -289308 -284713 -278794 -274786 -270833 -266325 -258705 -254114 -249051 -243565 -239076 -235183 -230217
16369 -230217 -225859 -219226 -214290 -209839 -204806 -199945 -193827 -190027 -187193 -180381 -175988 -168620 -164558 -158976
16355 -158976 -152352 -151624 -148706 -142825 -136562 -131870 -128149 -121750 -114164 -110198 -108751 -102743 -95418 -89423
16341 -89423 -87738 -82682 -78651 -74224 -72065 -68823 -62150 -55518 -51212 -48140 -43257 -37349 -33042 -33156 -27515
16326 -27515 -22758 -14617 -10805 -5187 1150 4556 6922 11601 17281 22883 24789 25404 34675 37748 39239
16311 39239 44560 50022 53447 56106 60242 65290 72887 77346 78444 80862 86632 91860 94638 96364
16297 96364 101257 106269 111278 114601 118632 122840 126026 127020 128849 137348 142413 144577 149173 152493 153752
16282 153752 156305 161522 167877 170801 171627 178777 181228 182620 187030 188453 193835 197794 200240 203498
16268 203498 206170 208965 211518 218061 221891 223970 225972 226910 233003 236333 239473 243785 246526 250861
16254 250861 252354 250488 253208 258175 260981 264747 267139 273411 276605 276487 279695 287116 287387 288795 290355
16239 290355 296859 297619 299935 304411 309071 309088 308654 310342 314320 317692 318817 320427 321931 328913 328632
16224 328632 330480 332042 335453 336152 333544 340263 345869 346896 347006 350431 357593 360438 357924 358368 360878
16209 360878 365232 368063 367817 371471 372481 372548 375371 379738 381431 381462 385150 386793 387178 389749 387711 390309
16193 390309 394824 395501 396611 399909 398693 398833 400493 403809 406333 408029 407285 411473 416702 418414 417059
16178 417059 416450 420392 421997 422968 420723 421177 426235 424934 424576 428336 432230 431393 430624 434245 438398 436409
16162 436409 434811 440530 442255 439609 435358 438092 442590 443086 442654 444843 450767 450211 448540 450325 453023
16147 453023 454227 450300 449437 454897 455484 454387 455532 457601 458610 458443 458916 461832 460551 460167 462341
16132 462341 464837 465960 465386 463531 466467 472205 470356 464632 465464 470808 469247 469580 471637 473809 474015
16117 474015 473584 473332 474520 477424 473545 472502 473375 478789 478033 476902 479169 479082 478220 477588 475948 476453
16101 476453 478302 480678 480778 481767 483125 481107 481878 481530 482567 486948 488517 491109 486860 484338 485991
16086 485991 484536 484193 485988 486029 483713 489401 484626 483467 486540 486877 486017 488401 486475 489065 490878
16071 490878 488554 488387 488935 488906 490282 490954 493161 494091 490806 489372 494470 492854 490777 488914 491149 491069
16055 491069 488015 490799 494818 493482 494469 495802 496268 497109 495819 492949 494465 495394 493766 490968 490389
16040 490389 491805 492740 491782 489185 494556 494002 493186 492520 495057 493266 494098 494150 494497 496946 496509 494802 495558
16023 495558 498844 498388 497509 498084 500526 500953 497555 500221 500227 498677 494751 500642 501691 496637 493221 495266
16007 495266 497724 497515 499381 497219 495758 498565 498251 494454 496338 497247 497342 498812 500456 497878 496427
15992 496427 492766 496432 497734 493895 493293 493564 498718 500152 496332 496819 498556 497830 497586 494843 497383
15977 497383 496544 494531 496738 501293 499476 500097 501458 500779 500934 500232 501254 500472 501931 500154 502657 503766
15961 503766 501935 501021 499392 497673 500386 502648 500141 499348 505857 505296 502721 501847 502032 502457 497036 496132
15945 496132 500665 502518 501175 497774 500966 504682 501249 498200 498588 500619 498793 498229 502511 501369 500074
15930 500074 498633 500881 502801 502011 498563 501053 503171 503946 499582 497035 499895 499743 497970 496627 498410
15915 498410 500570 499654 502613 504546 505732 503154 499701 500994 503862 505540 501034 500571 503055 504035 503285
15900 503285 505268 505822 504874 500048 501916 506482 508259 502723 503889 506614 506777 505559 505052 502907 505231
15885 505231 505473 505355 505090 505788 503311 503820 504836 505164 505421 503552 505718 509459 504120 500993 502255 508299
15869 508299 508509 504790 504219 506352 505570 503881 504504 506664 506846 501825 501379 504496 506479 501847 500416 505149
15853 505149 507882 506075 506646 507705 506943 504351 504035 506070 504674 503710 504829 503839 506075 506226 503486 503803
15837 503803 507355 508200 507603 506012 506560 505709 503876 503547 507225 507806 504105 502888 508831 511017 510126 509265
15821 509265 508738 508625 508952 505284 508955 509870 510137 505001 505936 512506 510073 508926 509665 510282 510738 509065
15805 509065 506145 508913 509581 504595 503623 507908 504788 506343 504893 505594 506712 506210 507189 507922 511492 509292
15789 509292 506455 506794 510781 508208 503132 504745 509735 507774 505846 505353 510769 512464 510244 509263 512119
15774 512119 511148 509349 510014 511278 511692 509115 511944 516453 517060 510237 508711 510650 508784 508150 508764 508316
15758 508316 512395 510731 507368 511362 511884 514323 513349 513498 514900 513057 510506 506164 508448 512314 512190
15743 512190 510356 512090 514033 511829 508995 512691 514563 512087 510133 509958 510265 512069 512765 513090 513771
15728 513771 512243 509268 511623 516318 514678 511014 509008 508657 509619 507896 508549 511691 514054 513309 515436
15713 515436 517184 514861 509864 509938 514062 514488 509413 512614 512780 512708 514782 513088 514392 515028 512978 509562
15697 509562 511858 513780 516122 513115 514096 516859 515161 511591 512815 513911 512246 510765 513728 514668 511788
15682 511788 510961 511870 516127 512986 511210 510165 514564 514862 514576 515419 515785 517530 516446 513131 516005 519030
15666 519030 517552 513129 514820 518725 514946 513644 517249 520204 517230 513332 516079 521297 519975 514874
15652 514874 515404 519102 517216 515878 514619 517164 514019 510399 514279 517009 521204 521925 514553 515761 522592
15637 522592 519308 515876 518691 520713 520149 517505 519903 522498 519323 517314 517637 519800 518965 517079 515747
15622 515747 518808 521600 518244 515967 515139 517797 520669 516005 518390 523407 516751 516509 518390 519439 518554
15607 518554 518641 520047 520653 519125 515977 518196 518921 519135 516904 516940 520835 520026 516353 512425 514518 516644
15591 516644 514594 516300 519218 516738 516247 517490 520923 522175 516445 517688 522594 522957 520909 517465 518245
15576 518245 521801 519108 516354 519337 522655 523122 521373 521597 523088 520816 516382 515336 519304 521112 521312
15561 521312 521485 518646 518748 518575 518907 519568 520409 520019 521232 520440 522333 523851 520430 520097 522101 521555 520843
15544 520843 519126 520059 521072 518491 518370 520696 522689 519050 520072 524820 523959 518791 520531 524505 527779
15529 527779 526098 525373 526599 527269 523438 522674 527565 526629 524342 522754 523953 525564 524684 518187 520559
15514 520559 524503 524982 523872 525329 527275 526284 522593 520217 523486 525927 522638 523428 528115 528922 524309
15499 524309 521195 524149 524029 522102 522802 524740 527785 527869 525133 525632 526686 527535 525488 524001 526222 525283
15483 525283 522795 525172 529810 530522 526434 524127 526248 525132 526373 526499 526057 526439 524327 525209 526681
15468 526681 529909 526497 526293 529138 531580 528824 529550 534669 533796 526871 526042 526670 530056 529285 527221 528291
15452 528291 533394 530741 523881 525837 530084 530545 526354 526766 526573 526067 524815 524066 527019 530344 528766
15437 528766 526864 531025 530747 526364 523990 525473 527458 527572 530150 531653 530356 527533 522380 526788 530258
15422 530258 529104 527983 528367 531911 530431 530124 530027 532592 531528 527812 529946 530584 532241 532232 531735 532874
15406 532874 533301 531175 529106 530221 532134 531140 532036 532959 531905 531651 528807 531481 532332 534150 528895 527833
15390 527833 527772 530424 529126 529008 530993 531486 527986 525179 530845 533314 532199 531707 533782 530758 529901 527335
15374 527335 531654 532838 530179 530739 533217 535244 531253 528234 529348 532544 530798 528860 531865 536872
15360 536872 539818 534809 531545 532516 531997 531558 528351 528828 531758 530366 529014 534394 536442 534326 530890
15345 530890 534962 536182 533963 533780 533982 537797 534404 529148 528648 535425 535290 530866 532004 535501 532648
15330 532648 530518 531400 533440 535100 531641 534517 537282 534378 531215 533792 532945 536681 535185 534734 537679
15315 537679 536975 533102 530979 537074 538152 533732 533171 534312 536842 534888 531104 532239 532924 533970 531570
15300 531570 531650 532727 531266 530567 532291 536205 538101 535940 534518 531726 533198 533015 534644 536266 535131
15285 535131 532529 529748 534765 535453 534895 536994 539020 540615 537137 536096 535878 536772 538184 534478 532582
15270 532582 536129 538118 538045 539294 540478 539704 537327 541582 542863 541165 539362 538354 541895 541665 537997
15255 537997 539072 543069 539459 537105 535097 537912 537076 539016 537235 539292 544473 539851 539161 536525 536149
15240 536149 538512 538739 541034 542933 540452 537033 536009 540109 538414 535263 536471 540961 542163 538038
15226 538038 538543 540187 541009 541132 540171 539348 541775 538742 534730 540134 542849 539564 540020 542212 541484 540951
15210 540951 539234 541585 540731 540563 538899 537559 541090 541446 540767 540152 538865 539769 541257 541591 542275 541837
15194 541837 542179 542112 544404 544610 542644 540805 543629 545871 544552 546307 546494 546622 542982 538100 540755 544573
15178 544573 543300 538823 538709 540317 542074 539721 540331 544877 544825 541783 542858 545806 545516 540842 539227
15163 539227 542239 546430 544498 543806 546633 548043 543704 540347 542121 539988 541664 543632 543218 548021 546923
15148 546923 541744 542821 546246 545043 541036 541762 543023 544432 542964 543820 544016 543754 542053 543653 542565
15133 542565 546105 546840 542177 545929 547025 545495 547015 545916 548741 547043 543564 546691 550540 549121
15119 549121 544058 541377 545924 546767 545742 546924 546281 547797 544607 545607 547607 547534 544132 545164 551069
15104 551069 548496 544711 541955 546230 551034 546235 543588 545376 546601 545096 546279 545985 550302 547944
15090 547944 543191 545129 546083 543982 542997 547365 550289 547853 544164 551314 554450 552521 549255 551275 548318
15075 548318 545446 549751 550062 551507 554121 553445 552814 551006 548618 544347 542644 547388 550608 552809 551480
15060 551480 553617 554938 550506 547873 550002 551829 546729 546921 549493 550259 547900 546481 547671 549714 551200
15045 551200 551560 553141 554091 553196 548758 550373 554998 554658 550708 549267 550382 550980 550831 551005 552885 556303
15029 556303 552154 549802 549768 551065 554262 550572 548000 552009 551457 550889 550087 551531 554415 552675 550867
15014 550867 551678 553611 551339 551136 554504 552562 550679 552387 556310 559286 556198 552896 554546 554311 552719
14999 552719 550739 553154 559101 559439 555176 552510 554086 551687 551685 553218 552851 552943 553830 552819 556346 556172
14983 556172 552081 552388 555023 554981 552090 552417 555905 555384 554897 552834 554063 558905 553609 554631 556443 555561
14967 555561 553721 552587 554981 558272 555643 553849 555637 556896 553918 552016 554006 556491 558426 553358
14953 553358 554156 555982 555229 552609 554016 557296 554403 555543 556888 558971 555335 554890 556717 559647 561321
14938 561321 560519 554714 556972 556857 555325 555851 557697 560747 556333 552544 555244 557947 555111 557499 560828
14923 560828 565654 565046 559801 559156 560938 559342 555709 558093 560004 559884 558133 557599 562705 563518 558998
14908 558998 556244 560936 561891 559069 556470 557461 558110 560913 557581 554528 558423 558625 557117 559814 561249
14893 561249 557404 552274 555032 560690 558523 552810 555172 563174 563111 559396 559721 562332 560234 555950 557835
14878 557835 561546 562738 560831 559474 560300 558399 556689 556049 560635 562572 559088 559402 559617 560279 559554 561702
14862 561702 559738 561850 561438 559884 563640 562956 560854 561172 560180 563051 563726 562769 560346 564294 562565 559498
14846 559498 560500 564971 565071 562120 560583 564296 565937 561035 562183 566020 567110 559417 558568 562107 565959
14831 565959 564866 563899 564172 564336 560243 559321 559746 563066 566556 562667 560797 560508 561704 561406 560395 560209
14815 560209 562943 563868 561957 564863 565092 564057 566825 565142 563011 561606 561406 562833 563663 562091 562672
14800 562672 565586 567219 564838 561179 563291 567087 567769 565127 565944 568438 570626 568249 568491 567289 567412
14785 567412 566360 564388 566705 569969 567209 567843 570663 568714 564583 564577 568301 570024 568714 568379 568464 568223
14769 568223 566107 564164 566987 572244 569303 567894 569416 571571 564958 561988 564447 570964 569950 565801
14755 565801 565507 570002 569096 567551 568628 573221 573679 568432 569651 568515 572339 571002 568718 571168 570897
14740 570897 567400 569324 573130 574223 573790 569787 570235 572392 569160 568389 569611 573103 570047 567361 569197
14725 569197 572468 574911 572498 573548 574863 572098 570661 570469 571942 569143 567992 566958 569922 573788
14711 573788 569463 568584 571866 570053 568423 570015 572934 574255 573514 569067 569113 570401 571432 571572 573806
14696 573806 573224 574609 572464 573098 574062 572703 571174 573349 573678 571765 569728 568905 569581 568264 567429 569752
14680 569752 571460 571967 572443 574922 579090 580424 575509 571492 575267 579815 580073 576727 573742 571077 568444
14665 568444 563672 564479 568433 567262 568677 573422 575131 574335 571944 573497 575640 576728 574135 571631 572065
14650 572065 574582 570312 569496 568259 565119 566898 572221 573858 575372 571066 570670 575815 579108 579049 575808
14635 575808 574441 576804 575629 571619 573141 575665 572529 568801 572032 575860 575624 572613 573341 573522 574004
14620 574004 572376 572336 576121 577450 574392 572985 574081 575873 571362 571275 573315 575654 575086 576480 577565
14605 577565 576633 571390 566990 571144 574450 574947 573918 579016 575177 574521 575582 575459 577676 576355 578730
14590 578730 577510 576272 577462 574100 573380 578213 579332 581295 578790 579677 580057 577774 576094 581403 582280
14575 582280 579512 576925 578875 582398 580414 578188 577785 579081 574416 572248 576023 579496 578118 577107
14561 577107 575813 580606 582209 579086 578694 583434 580076 577942 579105 581118 580440 576730 577875 583203 585281
14546 585281 583285 581818 582962 582446 577867 577177 582316 581720 576499 573744 579880 581173 580989 577475 578383
14531 578383 579870 580656 578740 582431 582711 579587 578163 578576 582589 583288 581048 580883 585070 585881 584187 583152
14515 583152 586250 587382 586328 583032 582397 584210 581043 578842 584079 586897 587012 581689 581545 581828 583760
14500 583760 581906 581946 588012 586945 583873 586172 587196 584372 585186 585951 587454 585415 583167 583769 585710
14485 585710 585591 581577 582965 584871 586120 583187 583930 585008 585276 582347 581717 585895 591695 588548 584748
14470 584748 587356 588082 587799 584992 585498 589707 587155 586000 588627 589437 586094 584005 582968 588723 589009
$$ [...]
##END NTUPLES=NMR SPECTRUM
##END=
