##TITLE=1H_CA-9260-2
 DMSO
 8 sc, 
 8.4.2024
##JCAMPDX= 6.0         $$ Bruker NMR JCAMP-DX V2.0
##DATA TYPE= NMR SPECTRUM
##DATA CLASS= NTUPLES
##ORIGIN= UXNMR, Bruker Analytische Messtechnik GmbH
##OWNER= root
$$ XWIN-NMR		Version 3.5
$$ Mon Apr  8 14:15:15 2024 Russian Standard Time (UT+4h)  she@DPX200
##.OBSERVE FREQUENCY= 200.1309
##.OBSERVE NUCLEUS= ^1H
##.ACQUISITION MODE= SIMULTANEOUS
##.ACQUISITION SCHEME= undefined
##.AVERAGES= 8
##.DIGITISER RES= 18
##SPECTROMETER/DATA SYSTEM= spect
##.PULSE SEQUENCE= zg30
##.SOLVENT NAME= CDCl3
##.SHIFT REFERENCE= (INTERNAL, CDCl3, 0, 15.683)
##AUDIT TRAIL= $$ (NUMBER, WHEN, WHO, WHERE, WHAT)
$$ ##TITLE= Audit trail, XWIN-NMR		Version 3.5
$$ ##JCAMPDX= 5.01
$$ ##ORIGIN= Bruker BioSpin GmbH
$$ ##OWNER= she
$$ F:/spectra/data/she/nmr/H-F/1/pdata/1/auditp.txt
$$ ##AUDIT TRAIL=  $$ (NUMBER, WHEN, WHO, WHERE, WHAT)
(   1,<2024-04-08 14:13:39.25 +0400>,<she>,<DPX200>,
      <created by zg, POWCHK disabled, PULCHK disabled
       configuration hash MD5:
       00 E9 B6 7A A2 85 ED C7 34 08 36 98 17 FE 4E 26
       data hash MD5: 16K
       E5 A4 29 E7 92 24 47 CE 0C A5 AC D9 38 20 1D 01>)
(   2,<2024-04-08 14:14:08.90 +0400>,<she>,<DPX200>,
      <Start of raw data processing
       efp BC_mod = 2 LB = 0.24 FT_mod = 6 PKNL = 1 PHC0 = -25379.14 PHC1 = 7.78731 SI = 16K 
       data hash MD5: 16K
       81 E5 93 FA 58 B2 5A 47 14 1A E4 C1 D4 BD DF 2A>)
(   3,<2024-04-08 14:14:29.31 +0400>,<she>,<DPX200>,
      <pk PHC0 = -3.21204 PHC1 = 4.4 
       data hash MD5: 16K
       B5 61 72 C8 65 B9 DC 38 10 01 DB 08 24 E5 F8 96>)
(   4,<2024-04-08 14:14:32.93 +0400>,<she>,<DPX200>,
      <abs ABSG = 5 
       data hash MD5: 16K
       6F B8 70 AF 0B FE 26 09 BA 0F B0 49 8A 02 C3 46>)
$$ ##END=
$$ 
$$ hash MD5
$$ 76 FD E0 4C 33 9F 7B 22 AE 09 49 75 96 12 01 BD
##$RELAX= 
##$RELAX= 
##$RELAX= 
##$RELAX= 
##$RELAX= 
##$RELAX= 
$$ Bruker specific parameters
$$ --------------------------
##$DU= <F:/spectra>
##$EXPNO= 1
##$NAME= <H-F>
##$PROCNO= 1
##$TYPE= <nmr>
##$USER= <she>
##$AMP= (0..31)
100 100 100 100 100 100 100 100 100 100 100 100 100 100 100 100 100 100 
100 100 100 100 100 100 100 100 100 100 100 100 100 100 
##$AQSEQ= 0
##$AQ_mod= 1
##$AUNM= <au_zg>
##$AUTOPOS= <>
##$BF1= 200.13
##$BF2= 200.13
##$BF3= 200.13
##$BF4= 200.13
##$BF5= 200.13
##$BF6= 200.13
##$BF7= 200.13
##$BF8= 200.13
##$BYTORDA= 1
##$CFDGTYP= 0
##$CFRGTYP= 5
##$CHEMSTR= <none>
##$CNST= (0..31)
1 1 145 1 1 1 1 1 1 1 1 1 1 1 1 1 1 1 1 1 1 1 1 1 1 1 1 1 1 1 1 1 
##$CPDPRG= <>
##$CPDPRG1= <>
##$CPDPRG2= <>
##$CPDPRG3= <>
##$CPDPRG4= <mlev>
##$CPDPRG5= <mlev>
##$CPDPRG6= <mlev>
##$CPDPRG7= <mlev>
##$CPDPRG8= <mlev>
##$CPDPRGB= <>
##$CPDPRGT= <>
##$D= (0..31)
0 1.2 0 0 0 0 0 0 0 0.06 0 0.03 0 0 0 0 0.0002 0 0 0 0 0 0 0 0 0 0 0 0 
0 0 0 
##$DATE= 1712571218
##$DBL= (0..7)
120 120 120 120 120 120 120 120 
##$DBP= (0..7)
150 150 150 150 150 150 150 150 
##$DBP07= 0
##$DBPNAM0= <>
##$DBPNAM1= <>
##$DBPNAM2= <>
##$DBPNAM3= <>
##$DBPNAM4= <>
##$DBPNAM5= <>
$$ [...]
##$SUBNAM3= <"">
##$SUBNAM4= <"">
##$SUBNAM5= <"">
##$SUBNAM6= <"">
##$SUBNAM7= <"">
##$SUBNAM8= <"">
##$SUBNAM9= <"">
##$SW= 18.0517689322627
##$SWIBOX= (0..15)
0 0 2 0 0 0 0 0 0 0 0 0 0 0 0 0 
##$SW_h= 3612.71676300578
##$TD= 16384
##$TD0= 1
##$TE= 0
##$TE2= 300
##$TE3= 300
##$TEG= 300
##$TL= (0..7)
0 120 120 120 120 120 120 120 
##$TP= (0..7)
150 150 150 150 150 150 150 150 
##$TP07= 0
##$TPNAME0= <>
##$TPNAME1= <>
##$TPNAME2= <>
##$TPNAME3= <>
##$TPNAME4= <>
##$TPNAME5= <>
##$TPNAME6= <>
##$TPNAME7= <>
##$TPOAL= (0..7)
0.5 0.5 0.5 0.5 0.5 0.5 0.5 0.5 
##$TPOFFS= (0..7)
0 0 0 0 0 0 0 0 
##$TUNHIN= 0
##$TUNHOUT= 0
##$TUNXOUT= 0
##$USERA1= <user>
##$USERA2= <user>
##$USERA3= <user>
##$USERA4= <user>
##$USERA5= <user>
##$V9= 5
##$VALIST= <valist>
##$VCLIST= <CCCCCCCCCCCCCCC>
##$VD= 0
##$VDLIST= <DDDDDDDDDDDDDDD>
##$VPLIST= <PPPPPPPPPPPPPPP>
##$VTLIST= <TTTTTTTTTTTTTTT>
##$WBST= 1024
##$WBSW= 4
##$XGAIN= (0..3)
0 0 0 0 
##$XL= 0
##$YL= 0
##$YMAX_a= 248403
##$YMIN_a= -283578
##$ZGOPTNS= <>
##$ZL1= 120
##$ZL2= 120
##$ZL3= 120
##$ZL4= 120
##$ABSF1= 15.68302
##$ABSF2= -2.36887
##$ABSG= 5
##$ABSL= 3
##$ALPHA= 0
##$AQORDER= 0
##$ASSFAC= 0
##$ASSFACI= 0
##$ASSFACX= 0
##$ASSWID= 0
##$AUNMP= <proc_1d>
##$AZFE= 0.1
##$AZFW= 0.1
##$BCFW= 0
##$BC_mod= 2
##$BYTORDP= 0
##$COROFFS= 0
##$CY= -3
##$DATMOD= 1
##$DC= 0
##$DFILT= <>
##$DTYPP= 0
##$F1P= 0
##$F2P= 0
##$FCOR= 1
##$FTSIZE= 16384
##$FT_mod= 6
##$GAMMA= 0
##$GB= 0
##$INTBC= 1
##$INTSCL= 3.70164e-10
##$ISEN= 128
##$LB= 0.24
##$LEV0= 0
##$LPBIN= 0
##$MAXI= 10000
##$MC2= 0
##$MEAN= 0
##$ME_mod= 0
##$MI= 1.114404
##$NCOEF= 0
##$NC_proc= -5
##$NLEV= 6
##$NOISF1= 3.799351
##$NOISF2= 2.8
##$NSP= 0
##$NTH_PI= 0
##$NZP= 0
##$OFFSET= 15.68302
##$PC= 1
##$PHC0= -25382.35
##$PHC1= 12.18731
##$PH_mod= 1
##$PKNL= yes
##$PPARMOD= 0
##$PSCAL= 0
##$PSIGN= 0
##$REVERSE= no
##$SF= 200.129567721928
##$SI= 16384
##$SIGF1= 3
##$SIGF2= 2
##$SINO= 5.538805
##$SIOLD= 16384
##$SREGLST= <1H.CDCl3>
##$SSB= 0
##$STSI= 16384
##$STSR= 0
##$SW_p= 3612.71676300577
##$SYMM= 0
##$S_DEV= 0
##$TDeff= 16384
##$TDoff= 0
##$TI= <>
##$TILT= no
##$TM1= 0
##$TM2= 0
##$TOPLEV= 0
##$USERP1= <user>
##$USERP2= <user>
##$USERP3= <user>
##$USERP4= <user>
##$USERP5= <user>
##$WDW= 1
##$XDIM= 16384
##$YMAX_p= 383124746
##$YMIN_p= -41840
$$ End of Bruker specific parameters
$$ ---------------------------------
##NTUPLES= NMR SPECTRUM
##VAR_NAME=  FREQUENCY,     SPECTRUM/REAL,   SPECTRUM/IMAG
##SYMBOL=    X,             R,               I
##VAR_TYPE=  INDEPENDENT,   DEPENDENT,       DEPENDENT
##VAR_FORM=  AFFN,          ASDF,            ASDF
##VAR_DIM=   16384,         16384,           16384
##UNITS=     HZ,            ARBITRARY UNITS, ARBITRARY UNITS
##FACTOR=    0.220516191357247, 1,           1
##FIRST=     3138.63594073976, 0,            0
##LAST=      -474.08082226601, 0,            0
##MIN=       -474.08082226601, -41840,       0
##MAX=       3138.63594073976, 383124746,    0
$$ Real data points
##PAGE= N=1
##DATA TABLE= (X++(R..R)), XYDATA
$$ [...]
9021D1483l637r41m042k946j767J051Q8m798J133j24r9k862j388m487q88L23k003
9004A4096k6P77j940k751R93J841Lj406O51l83J589j38J6J37K497k547l15m60
8986A2634l427r15J637L251j973m389k851M36R4j52p4j41j265l006P32J336r1
8969A836m142L880j014j200J3k823M585j49k470j182J829l441O53J274k191J875
8953b667j261Q24L444J619k238l55r19j619K473j849n29l15k24J923k862k537
8937g092L817Q54j928q72k464Q34N384k934J649N82j59K44k172K894l56N95J668
8920E44l037p98m554J745K155Q16R27k890J308J444j124j305J211m174K519K542
8904b671r02K749l305K6n1N44Q51O07j440j927j108o1K392k408p18O66q35L391
$$ plain form
9021 41483 37846 36905 32863 29917 28150 29201 29289 24491 25624 25500 25401 22539 21151 16664 15776 16099 14096
9004 14096 14070 14847 12907 10156 11149 12990 12993 11587 12238 11855 13444 13306 13322 13459 15956 13409 13094 12634
8986 12634 9207 8292 9929 13180 11207 6818 3967 4403 4497 4345 4271 4130 2865 -141 591 1927 1836
8969 1836 -2306 1574 560 -640 -627 -3450 1135 986 -1484 -2666 -837 -4278 -3625 -2351 -4542 -2667
8953 -2667 -3928 -3104 340 1959 -279 -634 -1553 -3172 -699 -2548 -3077 -3392 -3616 -1693 -4555 -7092
8937 -7092 -3275 -2421 -4349 -5221 -7685 -6851 -1467 -4401 -2752 -2170 -2329 -2085 -4257 -1363 -1719 -1124 544
8920 544 -2493 -3291 -7845 -6100 -3945 -3129 -2202 -5092 -3784 -2340 -3464 -4769 -3558 -7732 -5213 -2671
8904 -2671 -3573 -824 -4129 -4103 -4154 -3610 -2759 -2152 -3592 -5519 -6627 -6688 -4296 -6704 -7422 -6756 -7591 -4200
8886d200l50p78j324L0J15L124j098l546K741j433N26j69L767j832m994J350J288
8869f783K784j837j94p2j667j46J313J15j325K137K918l058k301k442J153o39
8853a0044k76r22l321P72M350N69N66p87K100J626J241m45k898P76j066J44J186
8836f429Q42J521l144l213M014j163j412k32K935R04k513J92q99k458N008j937
8820g984j607J826K90K715k081J95J786k947k107q85J386n69j303J939L906L045
8804b395j106k176j050j424K27J420K250j938k097k026J103P38o33j754K003j211
8788a0069R56l61L313j323N10N60kj142j552J03l298K80L641r9K128K281J41q69
8770d802j236j395R1p90k643J502O60Q74K269j42L604L48l057j274K29r68n19
$$ plain form
8886 -4200 -4550 -5328 -6652 -6622 -6507 -3383 -4481 -8027 -5286 -6719 -6193 -6362 -2595 -4427 -9421 -8071 -6783
8869 -6783 -3999 -5836 -6030 -6102 -7769 -7915 -6602 -6487 -7812 -5675 -2757 -5815 -8116 -10558 -9405 -10044
8853 -10044 -10320 -11242 -14563 -13791 -9441 -8872 -8306 -9093 -6993 -5367 -4126 -4571 -7469 -6693 -7759 -7615 -6429
8836 -6429 -5587 -4066 -7210 -10423 -6409 -7572 -8984 -9216 -6281 -5377 -7890 -7698 -8597 -11055 -6047 -7984
8820 -7984 -9591 -7765 -7475 -4760 -6841 -6646 -4860 -7807 -9914 -10799 -9413 -9982 -11285 -9346 -5440 -2395
8804 -2395 -3501 -5677 -6727 -8151 -7924 -6504 -4254 -6192 -8289 -10315 -9212 -8474 -9107 -10861 -8858 -10069
8788 -10069 -9113 -9474 -6161 -7484 -6974 -6414 -6416 -7558 -9110 -9007 -12305 -12025 -8384 -8483 -6355 -4074 -3933 -4802
8770 -4802 -6038 -7433 -7342 -8132 -10775 -9273 -8613 -7739 -5470 -5612 -2008 -1660 -4717 -5991 -5762 -6730 -7249
8753g249J812K401q21m820j652J536L483m642j065q56P74P60K230j896k393R69
8737a1429K312L329j740Q23l18k141j06J44K963r3R73j995k053o16J845j09J870
8720f341j204j694J165L166k015j81K410j888j433k911M003N623l196j574k176
8705h246l28K074k033j193L692m249j420N896l64l788N923q25m732K516K20o0
8689f917k621J619P42r84j94l61J350o28K158J011k143P74l678m80N053J587j375
8672e087k839p74K719k612q01J241J357p52k253N04l839n77L93J646J163N23R23
8655i065r83K85R63J175l03P11k072L145K763k419J763k925j419J386m351K254
8639i092J32l13J929l131K07L181K339l945J115K874k57k447k36j240L372l049
$$ plain form
8753 -7249 -5437 -3036 -3857 -8677 -10329 -8793 -5310 -9952 -11017 -11873 -11099 -10339 -8109 -10005 -12398 -11429
8737 -11429 -9117 -5788 -7528 -6705 -7023 -9164 -9270 -9126 -6163 -6256 -5283 -7278 -9331 -9947 -8102 -8211 -6341
8720 -6341 -7545 -9239 -8074 -4908 -6923 -7104 -4694 -6582 -8015 -10926 -6923 -1300 -4496 -6070 -8246
8705 -8246 -8574 -6500 -8533 -9726 -6034 -10283 -11703 -5807 -6171 -9959 -4036 -4861 -9593 -7077 -6857 -6917
8689 -6917 -9538 -7919 -7177 -8161 -8355 -8716 -7366 -7994 -5836 -4825 -6968 -6194 -9872 -10352 -5299 -3712 -5087
8672 -5087 -7926 -8700 -5981 -8593 -9394 -8153 -6796 -7548 -9801 -9297 -13136 -13713 -13320 -11674 -10511 -9988 -9065
8655 -9065 -10048 -9763 -8800 -7625 -7928 -7217 -9289 -6144 -3381 -5800 -4037 -6962 -8381 -6995 -11346 -9092
8639 -9092 -8960 -9273 -7344 -10475 -10268 -7087 -4748 -8693 -7578 -4704 -4961 -7408 -7644 -8884 -5512 -8561
8623h561j017l663J214M038m43l438K758K23J364K58K045l105k597K157K546k07
8607f428J323p69l541K457J437l49j671j144l23j849N82l97o05M118p54K728K07
8590d978O29m764R50j237k87J480j031p263J59k5498Q0698P417l3213n958o010
8575A094M475q335j440k907R87j90j3l205J846k789K738J43K321k384L090q86
8559e455J973j943n49m961J032J591L952j532K714m309j97j162m77J248J780m521
8543a0816K284K709k50j385K74k060O811K425M9o321l706K939o55j066M87J494
8527f787J929M75j076J165K44o4j167l1o31k743J779j270J199n55k230r78J481
8510i260J795J188k775M96K978j509l98L370K419k05k237j646l739K463L70Q78
$$ plain form
8623 -8561 -9578 -13241 -12027 -7989 -8432 -11870 -9112 -8889 -7525 -7267 -5222 -8327 -10924 -8767 -6221 -6428
8607 -6428 -5105 -5874 -9415 -6958 -5521 -5870 -7541 -8685 -9008 -10857 -10275 -10672 -11277 -7159 -7913 -5185 -4978
8590 -4978 -4349 -9113 -8163 -9400 -9687 -8207 -9238 -16501 -16342 -41840 38858 46275 13062 7104 1094
8575 1094 5569 -2766 -4206 -7113 -6126 -6316 -6329 -9534 -7688 -10477 -7739 -7596 -5275 -7659 -4569 -5455
8559 -5455 -3482 -5425 -5974 -10935 -9903 -8312 -4360 -5892 -3178 -7487 -7684 -8846 -9323 -8075 -6295 -10816
8543 -10816 -8532 -5823 -6073 -7458 -7184 -9244 -2433 -8 41 -6280 -9986 -7047 -7702 -8768 -8281 -6787
8527 -6787 -4858 -4383 -5459 -4294 -4050 -4114 -5281 -5312 -5943 -8686 -6907 -8177 -6978 -7533 -9763 -10741 -9260
8510 -9260 -7465 -6277 -9052 -8556 -5578 -7087 -7485 -4115 -1696 -1901 -4138 -5784 -9523 -7060 -6690 -5812
8494e812K88j365J221L64l890l291N209O87p31J747j364p8L125J189l775j979
8478h455K48n42K45l644k477M292M630j246K180j18q0l761q60L90K699k535l27
8461i361l328J537j71N98J965k700n00k14P002J200P1k16l1K962m985o25m478
8444a1274L12N114K899k29j310J359l0J08k2l533k869P12J320k091K78P26J229
8427g301k474J233k91J143L514l540K22K135j419k877j445J610M899K813r14l323
8411f015R63k78j650M79L68j600j74J622N84o02k172j188P026k79k228k79j29
8394e552J969j201m33q93k026P69m52Q45o52o46j291k402Q21L317K10j459L116
8377e960j349L064k49k076k577j045j899M842k304J806K176N62J466p89O67l265
$$ plain form
8494 -5812 -5524 -6889 -5668 -5304 -9194 -12485 -7276 -6589 -7320 -5573 -6937 -7015 -3890 -2701 -6476 -8455
8478 -8455 -8207 -8749 -8504 -12148 -14625 -10333 -5703 -6949 -4769 -4887 -4967 -8728 -9588 -9198 -6499 -9034 -9361
8461 -9361 -12689 -11152 -11323 -10725 -8760 -11460 -11960 -12174 -5172 -3972 -3901 -4117 -4148 -1186 -6171 -6796 -11274
8444 -11274 -10962 -5848 -2949 -3178 -4488 -3129 -3159 -3051 -3073 -6606 -9475 -8763 -7443 -9534 -9256 -8530 -7301
8427 -7301 -9775 -8542 -8833 -7690 -4176 -7716 -7494 -5359 -6778 -9655 -11100 -9490 -4591 -1778 -2692 -6015
8411 -6015 -5052 -5330 -6980 -6501 -6133 -7733 -7907 -6285 -5701 -6303 -8475 -9663 -2637 -2916 -5144 -5423 -5552
8394 -5552 -3583 -4784 -5217 -6110 -8136 -7367 -7819 -6974 -7626 -8272 -9563 -11965 -11144 -7827 -7617 -9076 -5960
8377 -5960 -7309 -4245 -4494 -6570 -9147 -10192 -12091 -7249 -9553 -7747 -5571 -5009 -3543 -4332 -3665 -6930
8361f930K651P77l572M319k096l830j55k833L891n49J123j355J956L130L811J66
8345E04k878J60k43j087q37j655k414M233J990l107J109m97K839N22J251j913
8329b023J317m342M18j655P36J586j490m309j16J636o27j91L916N51q56K803l140
8312e786J45j390L59n34j65O94k21j326K135j991n09j377j553O487J661O91l276
8295e956R86j526o08L958k71M58J745m624l031P57j693N594L798m010M077k277
8279b623p302Q099J385p061J119L481n185N967K673m749m67k483l389l32K163
8264h704N237l208J151m528L369J677l507r90n24J186K725J453K274J996l215
8249c608k215k507J807P74k350l58J433J502k729J050O773M535p721R91j523J596
$$ plain form
8361 -6930 -4279 -3502 -7074 -2755 -4851 -8681 -8836 -11669 -7778 -8327 -7204 -8559 -6603 -3473 338 504
8345 504 -2374 -2214 -2457 -3544 -4381 -6036 -8450 -4217 -2227 -5334 -4225 -4722 -1883 -1361 -110 -2023
8329 -2023 -706 -5048 -4630 -6285 -5549 -3963 -5453 -9762 -9878 -8242 -8869 -9060 -5144 -4593 -5449 -2646 -5786
8312 -5786 -5641 -7031 -6672 -7206 -7371 -6677 -6898 -8224 -6089 -8080 -8589 -9966 -11519 -5032 -3371 -2680 -5956
8295 -5956 -4970 -6496 -7104 -3146 -3417 -2959 -1214 -5838 -8869 -8112 -9805 -4211 -413 -4423 -346 -2623
8279 -2623 -9925 -1826 -441 -7502 -6383 -2902 -8087 -2120 553 -4196 -4663 -7146 -10535 -10867 -8704
8264 -8704 -3467 -6675 -5524 -10052 -6683 -5006 -8513 -9503 -10027 -8841 -6116 -4663 -2389 -393 -3608
8249 -3608 -5823 -8330 -6523 -5749 -8099 -8457 -7024 -5522 -8251 -7201 -428 4107 -3614 -2623 -4146 -2550
8233b550k7m840j384M03K876L175l375j366l104m23N008k390L404n94R3J323K174
8216a597n905k04k475L309N680L172P52p25o540j1510O074R59n693J1074K467
8201a162j2969r76J7936P451m699l0808J9757l996O6905l947r2702J2467l036
8188b9779K4780J6991N019l721j4953j3386k720J3364P4l568N208m333J802L341
8174a881q747o432M71K725J1704j145o44m410J340k801m469O085J236r96K593
8159e371j455R07m275j017M822M979m542l384N479L467m74l513j930K641J69m00
8143c897L268n961l498r75K059K017K643l909L07J835k413K573O078j944m589
8128f406j123M137J310j464M440n763L30l8J938N304j902p588j958N849p08L330
$$ plain form
8233 -2550 -2577 -7417 -8801 -8398 -5522 -2347 -5722 -7088 -10192 -10615 -5607 -7997 -4593 -5187 -5094 -3771 -1597
8216 -1597 -7502 -7706 -10181 -6872 -1192 1980 2732 2007 -4533 -16043 -9969 -9010 -14703 -3629 -1162
8201 -1162 -14131 -15107 2829 10280 5581 -25227 -5470 -9466 57439 53492 -39210 -26743 -29779
8188 -29779 -4999 11992 17011 13290 -1663 -15049 -17769 -4405 -4331 -7899 -2691 -7024 -5222 -1881
8174 -1881 -10628 -17060 -16589 -13864 -2160 -3305 -3949 -8359 -7019 -9820 -14289 -8204 -6968 -7964 -5371
8159 -5371 -6826 -5919 -10194 -11211 -6389 -1410 -5952 -9336 -3857 -390 -864 -4377 -6307 -3666 -3497 -3897
8143 -3897 -629 -6590 -10088 -11063 -9004 -6987 -4344 -8253 -7946 -6111 -8524 -5951 127 -1817 -6406
8128 -6406 -7529 -3392 -2082 -3546 894 -4869 -4539 -4577 -2639 2665 763 -6825 -8783 -2934 -3642 -312
8112c12k238r5o17m123r06J761K546j213o21M5Q80j884k259O488o546K728J42
8095f224p40K343L83J448m356J816Q47J662R28k606j639m827k854L245M292j740
8079h022J548L929l201o694k226K904o13N904K458J153K631m101o9j843L580j930
8063d592k852k843k545R02J644L176K17K05Q47J104k985L1L227j984O154J866
8047A572o932J608k538j164J967K485j216j827n41J648j633q0N272k601k495L982
8031b493m177j041N633j140J61L961l097j016k713O165l513j987J826J026j932
8016d337L57M91k674j678k598K798K901L401p81k721J558M472k204O39N74m792
8000d594m78K474J14j22o32k510M73P06r17j71Q90L82M59R19k510J399k391n44
$$ plain form
8112 -312 -2550 -2645 -3262 -7385 -8291 -6530 -3984 -5197 -5818 -5773 -4893 -6777 -9036 -2548 -9094 -6366 -6224
8095 -6224 -6964 -4621 -4238 -2790 -7146 -5330 -4483 -2821 -1893 -4499 -6138 -10965 -13819 -10574 -6282 -8022
8079 -8022 -6474 -2545 -5746 -12440 -14666 -11762 -12375 -6471 -4013 -2860 -229 -4330 -4399 -6242 -2662 -4592
8063 -4592 -7444 -10287 -12832 -11930 -10286 -7110 -6893 -6688 -5841 -4737 -7722 -7691 -4464 -6448 -294 1572
8047 1572 -5360 -3752 -6290 -7454 -5487 -3002 -4218 -6045 -6586 -4938 -6571 -6651 -1379 -3980 -6475 -2493
8031 -2493 -6670 -7711 -2078 -3218 -3057 904 -2193 -3209 -5922 243 -3270 -5257 -3431 -2405 -4337
8016 -4337 -3980 -3489 -6163 -7841 -10439 -7641 -4740 -1339 -2120 -4841 -3283 1189 -1015 -376 198 -4594
8000 -4594 -5072 -2598 -2484 -2606 -3238 -5748 -5275 -4569 -5486 -5657 -4767 -4385 -3926 -3007 -5517 -4118 -6509 -7053
7982g053K270M43j057L065j190K305L007k329j314l214o82k121J23L525K062k186
7966d346O62o53L782l883j125m9Q19n95M04J481k777n03O08N37R13M326l059N37
7948b921R82K253k455K94j252m0M88j141j705J288R16j767o93K961K607j830o54
7931b669j522Q73K586K968K37m281J084K32n306N396lJ625J143j094m020j759
7915d510Q19k382m724K547N170M45J752j890K008M06l79j865J962K981l81j496
7899D63P10k148j594k944n40K827K541q06N02n42l539j70M66k57O24K594K409
7882E96J509P36l999l115J313L520m620K90l14J428k0P88j862K479n058K977K51
7865c101r56J795J649K09j840K979j110j639K0j056l426K31N64R04r3p13Q12R3
$$ plain form
7982 -7053 -4783 -4340 -5397 -2332 -3522 -1217 1790 -539 -1853 -5067 -5749 -7870 -7747 -4222 -2160 -4346
7966 -4346 -3684 -4337 -555 -4438 -5563 -5612 -4793 -5388 -4984 -3503 -6280 -6783 -6175 -5638 -4725 -399 -3458 -2921
7948 -2921 -1939 314 -2141 -1847 -3099 -3139 -2651 -3792 -5497 -4209 -3293 -5060 -5753 -2792 -185 -2015 -2669
7931 -2669 -4191 -3318 -732 2236 2473 -1808 -724 -492 -5798 -402 -405 1220 2363 1269 -2751 -4510
7915 -4510 -3691 -6073 -10797 -8250 -3080 -2635 -883 -2773 -765 -359 -738 -2603 -641 2340 1959 463
7899 463 1173 -975 -2569 -5513 -6053 -3226 -685 -1491 -989 -1531 -5070 -5240 -4774 -5031 -4407 -1813 596
7882 596 2105 2841 -1158 -4273 -2960 560 -4060 -3770 -4084 -2656 -2676 -1888 -3750 -1271 -6329 -3352 -3101
7865 -3101 -4057 -2262 -613 -404 -2244 735 -375 -2014 -1994 -3050 -6476 -6245 -5681 -4777 -4870 -5583 -4771 -4678
7847d678L256J52K58k132J74R15o23n942J413N575Q69J231J489l342m852J347
7831d890j227J976l52j495p96K533j883L006j814L198l444J390o23M928l362K971
7815A16M464K885q225M546m478O506o854J2565o251K9477m2205L1887J6508n4990
7801a4049J4256j4850R461m339N449o093K295n58M575m303K799J898J64n210K246
7786f259K81k006K708M925r14l006n274L046K396L322k444k016m144L502q8L249
7770b722l483J380q23K467L97j337O42K562k496K44j859N08j578L378r02M6j057
7753d633K582K822m885K40J440p93j752K790k24k851J797R14L690K500l576r37
7737h76l582l84J561J362J656r54j396M44K131j525m431J597M970k890r03N298
$$ plain form
7847 -4678 -1422 -1270 -1012 -3144 -2970 -2055 -2678 -8620 -7207 -1632 -763 468 1957 -1385 -6237 -4890
7831 -4890 -6117 -4141 -4493 -5988 -6784 -4251 -6134 -3128 -4942 -1744 -5188 -3798 -4421 507 -2855 116
7815 116 4580 7465 -760 3786 -692 5814 -1040 11525 5274 34751 -7454 24433 40941 -14049
7801 -14049 207 -14643 -5182 -9521 -4072 -10165 -7870 -8428 -3853 -8156 -5357 -3459 -3295 -8505 -6259
7786 -6259 -5978 -7984 -5276 -351 -1265 -4271 -9545 -6499 -4103 -781 -3225 -5241 -9385 -5883 -5971 -2722
7770 -2722 -6205 -4825 -5648 -3181 -2784 -4121 -3479 -917 -3413 -3169 -5028 -4520 -6098 -2720 -3622 -3576 -4633
7753 -4633 -2051 771 -4114 -3874 -2434 -3227 -4979 -2189 -2413 -5264 -3467 -2553 1137 3637 61 -876
7737 -876 -4458 -4842 -3281 -1919 -263 -1217 -2613 -2169 -38 -1563 -5994 -4397 573 -2317 -3220 2078
7721B078m229j742Q99K705l364K42K872l953j284K693l622K879L02K72j79q85
7705d316l00Q40K816l690O68L018O80j657j117O63l090J583L556r07k211MJ254
7688b206j498j963L479L140l507l362J191k351M181K393N55m967k633j636J341
7673g843N128L518J262j216j429m35M05K394m568J457O75k704K364J012m271O0
7657d191L095l622Q20L067l468l08K814K548q06l015L86r29k97P76Q33K631j393
7640a059R13P48n14j330l33J72k662J923J163p50j046L014n21P47j209k36J872
7623H92r90M8k401J589M91k327N59J5P43n46l453O48J281J798r79O11j634L833
7605A78Q76n611K128j666K213L390j121L62k708l413J32o40J91J888J657p07K173
$$ plain form
7721 2078 -2151 -3893 -2994 -289 -3653 -3411 -539 -4492 -5776 -3083 -6705 -3826 -3524 -3252 -3431 -4316
7705 -4316 -4616 -3776 -960 -4650 -3982 -964 -284 -1941 -3058 -2395 -5485 -3902 -346 -1253 -3464 -3460 -2206
7688 -2206 -3704 -5667 -2188 952 -2555 -5917 -4726 -7077 -2896 -503 52 -4915 -7548 -9184 -7843
7673 -7843 -2715 803 2065 849 -580 -1015 -610 1784 -2784 -1327 -652 -3356 -992 20 -4251 -4191
7657 -4191 -1096 -4718 -3898 -831 -4299 -4607 -1793 755 -51 -3066 -2680 -3609 -3906 -3130 -2297 334 -1059
7640 -1059 -146 602 88 -1242 -1575 -1403 -4065 -2142 -979 -1729 -2775 239 -282 465 -744 -980 892
7623 892 -98 -50 -2451 -862 -371 -2698 -2139 -2124 -1381 -1927 -5380 -4732 -3451 -1653 -2632 -2021 -3655 178
7605 178 1054 -4557 -2429 -4095 -1882 1508 387 749 -1959 -5372 -5240 -5880 -5689 -3801 -2144 -2851 -678
7588f78J561k730l93M150m385o58J474j180l67J836m27j881j070J79M051Q19R17
7571A218J625j409K367k720R30j482j743l31M55P2J830q75J456M305j816q86l167
7554a71j575J612q93k244O71L440j221L9j900N258K699l117l456N80k373L28K667
7537C44K083k236l505K575P14J309m213L887N214k56k880M75R99N53m209p41k538
7520b425J27l258M079J866k262R70p82p57M284L964j420m610l177K960K392p66
7504A185l554L394J355J406o079j057M458m19K718k435p63K377M73o23n8K936
7488E314j441J378p95j162r49r95K681l653J116Ml33j146K670k264p73M20J19
7471A91K217j2j557r75o1j279L096J727j823j008K078K39m7p55m71j066J650j839
$$ plain form
7588 -678 883 -1847 -2240 1910 -2475 -3133 -1659 -2839 -3206 -1370 -1797 -3678 -4748 -4569 -518 301 1218
7571 1218 2843 1434 3801 1081 2011 529 -1214 -1545 -1090 -1018 812 -63 1393 5698 3882 2996 -171
7554 -171 -1746 -134 -1027 -3271 -2600 840 -381 -342 -2242 3016 5715 2598 -858 -278 -2651 -2323 344
7537 344 2427 191 -3314 -739 -25 1284 -2929 958 6172 5916 3036 3511 4510 5063 854 113 -2425
7520 -2425 -2298 -5556 -1477 389 -1873 -903 -1685 -2442 1842 5806 4386 -224 -3401 -441 1951 1185
7504 1185 -2369 1025 2380 3786 -2293 -3350 1108 689 3407 972 209 2586 3059 2436 2378 5314
7488 5314 3873 5251 4456 3294 2345 1350 4031 378 1494 1498 1165 19 2689 425 -348 72 191
7471 191 2408 2396 839 -136 -197 -1476 1620 3347 1524 516 2594 2833 2786 2031 1560 494 2144 305
7453C05K310L251m90n133l004j356k11J792q19J185k787J642J893L740J735k855
7437A198l104k58K616j627k95N16O36M415K855k404l790J240J89R70J831l207
7421A781l825J523r20J019J510J430l61J890l572j288K690j555J174J98P66l272
7405h12j010J577K764j471m105K87M753l92J312L193k420m361K352N65J59p99
7389A592K994m202m298L609K99J37Q97K488J530m49j639l62P03j24J4Q7j530m056
7371b310K203N429k098j154K42J811P86l353l024L910N788l829j245J456k378
7356B234J095R7N10M43Jj996j587o69K386l85K337j868j829K015q11p6J173j100
7338A970J08j027Q54r08j216J674J175j817J126M294k653l373K51K03J443N2L427
$$ plain form
7453 305 2615 5866 5376 243 -2761 -4117 -4328 -2536 -3355 -2170 -4957 -3315 -1422 2318 4053 1198
7437 1198 -1906 -2164 452 -1175 -1470 -954 -318 4097 6952 4548 758 1998 2187 3157 4988 1781
7421 1781 -2044 -521 -1441 -422 1088 2518 2157 4047 475 -813 1877 322 1496 1694 2460 -812
7405 -812 -1822 -245 2519 1048 -3057 -2770 1983 1591 2903 6096 3676 -685 1667 2232 2391 1592
7389 1592 4586 384 -3914 -305 -6 131 1028 3516 5046 4597 2958 2596 3299 3175 3189 3276 1746 -2310
7371 -2310 -107 5322 3224 2070 2312 4123 4909 1556 -1468 2442 8230 4401 3156 4612 2234
7356 2234 3329 3426 3936 4379 4380 2384 797 128 2514 2129 4466 2598 769 2784 1973 1897 3070 1970
7338 1970 2078 1051 1905 997 -219 1455 2630 813 1939 6233 3580 207 458 661 2104 2156 5583
7321E583M33j432J83p68k147q9J581l484j376J890K366m660L035q6L31p38L11
7304I33l55j707k85J388n17K016K496k061m45L350k405J128N46P93m23o4J467
7287E855K06k161l66M559n68k862j976j07J046k70j775M93j142J641K332M84r44
7270D445J586k422j016m43K187k503l922N81p04J750K304O03l235J334j600J96
7254h59L195K203k680j009J488k365K625P71q71j742o27L197L344O90L26j695
7238E991k326L357K83o69m900j851J063O86Q89P87J895K23j547K81L67J062J606
7221G197j799J258m599L583L105J671j698j809k595p34J612K91k759M70J763j563
7205C394k969K646J533o51K625j695j931L244j122k122p4M237j308j644J963j212
$$ plain form
7321 5583 6016 4584 4767 3999 1852 1763 3344 -140 -1516 374 2740 -1920 1115 1029 1360 622 933
7304 933 578 -1129 -1414 -26 -543 1473 3969 1908 1463 4813 2408 3536 4082 4875 4452 4388 5855
7287 5855 6061 3900 3534 8093 7525 4663 2687 2580 3626 3356 1581 2074 932 2573 4905 5389 4445
7270 4445 6031 3609 2593 2150 4337 1834 -2088 -1507 -2211 -461 1843 2446 -789 545 -1055 -859
7254 -859 2336 4539 1859 850 2338 -27 2598 3369 2498 756 129 3326 6670 7360 7686 5991
7238 5991 3665 7022 7305 6636 1736 -115 948 1634 2523 3310 5205 5428 3881 4162 4529 5591 7197
7221 7197 5398 6656 2057 5640 8745 10416 8718 6909 4314 3580 5192 5483 2724 3194 4957 3394
7205 3394 425 3071 4604 3953 6578 4883 2952 6196 5074 2952 2878 7115 5807 4163 6126 4914
7189D914M59l55n04J159n73K01J935l679J61K710j426j083j570J106M345j524
7173F276O33r52M82k863l102j50K609n67K183K206n091j274N197J775k172Q58
7157F048N64j047M82j993m99L124J410J219K46j407k860j532N720l84k093K103
7141I101j624n39J26N36P64j709j310q66k109M683K68j39L23m86K449q02j703
7124F963K92J863J168m406N42J312k562L13j700p34K045O50J389k388j303K708
7108F152J103J35k069K79j267j709k99j596j45J441J57J557j822J407J115J93
7092D632J188K712m111L523K99o53J821l112J735j383J035K031Q5K165m758j248
7076E961k55j460J823K903m58j498k97K424M21l239J833L538j353n49p80n41J320
$$ plain form
7189 4914 5373 5018 4514 5673 5100 5301 7236 3557 3718 6428 5002 3919 2349 3455 7800 6276
7173 6276 6909 5957 6439 3576 474 324 2933 2366 4549 6755 1664 390 5587 7362 5190 6048
7157 6048 6612 5565 6047 4054 3555 6679 8089 9308 9554 8147 5287 3755 9475 9091 6998 9101
7141 9101 7477 6938 7064 7600 8364 6655 5345 4479 2370 7053 7321 7182 7505 7019 9468 8666 6963
7124 6963 7255 9118 10286 5880 6422 7734 5172 5485 3785 3051 5096 5746 7135 4747 3444 6152
7108 6152 7255 7390 5321 5600 4333 2624 2325 729 584 2025 2182 3739 1917 3324 4439 4632
7092 4632 5820 8532 4421 7944 8243 7590 9411 6299 8034 6651 7686 9717 9802 11967 7209 5961
7076 5961 5706 4246 6069 8972 8514 7016 6719 9143 9564 6325 8158 11696 10343 9794 9014 8473 9793
7059I793N418K578q197K088l144j739l29L789J097l606k234L699K230j974j74
7044I295K973Q48k611K106j882j03N36J106j825j085P97J221K05j626L5K153k353
7027I790j93o41J70J394j954p6R01N43Q3p25Q7J072r72L065k224o54K007J431
7009A3104l498J357N34j629l45k09J630k539k829j142K35j56M138L014j968r36
6993H761J613J692m29j405K3j77j675K847j270L00j51J069J167j820k170K896
6977A1271J052J794j160N57l668l425N98M513O27l595k355N43L263R01j808j343
6961G765J255Q80L20k04j344j026L505j909M56l26L858J070k147j384K152m65
6945A2456l83j720N106r2k771j565j536J758j780j333J146r26L95M909O34k813
$$ plain form
7059 9793 15211 17789 9592 11680 8536 6797 6468 10257 11354 7748 5514 9213 11443 9469 9295
7044 9295 12268 13116 10505 12611 10729 10626 11162 12268 10443 9358 10155 11376 11581 9955 9990 12143 9790
7027 9790 9597 8956 9126 10520 8566 8490 9391 9934 10017 9292 9379 10451 9479 12544 10320 9666 11673 13104
7009 13104 9606 10963 11497 9868 9523 9314 10944 8405 5576 4434 4669 4513 8651 11665 9697 8761
6993 8761 10374 12066 11637 10232 10255 10078 8403 11250 9980 10280 10129 11198 12365 10545 8375 11271
6977 11271 12323 14117 12957 13514 9846 6421 7019 11532 12159 8564 6209 6752 10015 10916 9108 7765
6961 7765 9020 9900 10220 10016 8672 7646 11151 9242 9698 9372 13230 14300 12153 10769 12921 12456
6945 12456 12073 10353 15459 15367 12596 11031 9495 11253 9473 8140 9286 8360 8755 13664 14298 11485
6929A1485j748j290j086L020J141j085l509K181J896n558L462q61M20k140K173
6914H501k9M42L086J021N05o97J023k080J431N46J811k340N13r11L23n33j818
6897A0794J706J183j758L37K89p39J081k72k00L525jj707L003l251l05L35n55
6880A3465J261J432J214k230l501L475J451N0k598j970N33K93M318L11j027l78
6864A6099l919m85j605J959Q56J652p56K960j103M75j044j571L59j737L059r90
6848A4209k760j0N038k798K135N14k113O99J881k40l285K103R38l108O75J990
6832A5868l093J860J505M75L83k229M5n10K51k676K713l837K350L560k718j47
6816A3800K462m50J954J529k509j844K1p43O56P03j187l130J445K219N97k717
$$ plain form
6929 11485 9737 8447 7361 10381 11522 10437 6928 9109 11005 5447 8909 8048 8468 6328 8501
6914 8501 8472 8914 12000 13021 13526 12829 13852 11772 13203 13749 15560 13220 13733 12822 13145 12612 10794
6897 10794 12500 13683 11925 12262 12551 11812 12893 12621 12421 15946 15945 14238 17241 13990 13685 14020 13465
6880 13465 14726 16158 17372 15142 11641 15116 16567 16617 14019 12049 12582 12875 17193 17504 16477 16099
6864 16099 12180 11695 10090 12049 12905 14557 13801 16761 15658 16133 15089 13518 13877 12140 15199 14209
6848 14209 11449 11439 16477 13679 15814 16328 14215 14914 16795 16555 13270 15373 16311 13203 13878 15868
6832 15868 12775 14635 16140 16615 16998 14769 14814 14304 14555 11879 14592 10755 13105 16665 13947 13800
6816 13800 16262 15812 17766 19295 16786 14942 14963 14220 14876 15579 14392 11262 12707 14926 15523 12806
6800A2806K214O10k015J74j92R23K587J034J93O86j602Q25k512k527J159O89K068
6783A7120j123l623m99N873L95j788k84O65J419j037J584J07n00N93j15l79m1
6766A8367J741j668j763M47j77j658L16K441L37q8l7J271k053K324N87L52k024
6749A8715j141k22Q14j602p62L478k787k180q8K901mm77Pj129K759J128k001K142
6731A9551M31n43p96Q91l331l60N638m96o01j399M87k434M78p72J510R02k494
6714A6662k635J49J847J626j78R21K548J755r32j50j620K7J94l9k044k171L50
6697A6310L143J419J809j297N51j149j334K226J60p29j281o51K020j485m79n40
6681A8693O38O06J002P92K210l712j421J979J101J133j161l840J467J64J52o1
$$ plain form
6800 12806 15020 15630 13615 13789 13597 14520 17107 18141 18334 19020 17418 18243 15731 13204 14363 15052 17120
6783 17120 15997 12374 11875 17748 18143 16355 16071 16736 18155 17118 18702 18809 18309 18902 18787 18408 18367
6766 18367 20108 18440 16677 17124 16947 15289 15605 18046 18383 18295 18258 19529 17476 19800 20387 20739 18715
6749 18715 17574 17352 18166 16564 15802 19280 16493 14313 14225 17126 17122 16645 16652 15523 18282 19410 17409 19551
6731 19551 19982 19439 18643 19534 16203 15843 21481 20985 20384 18985 19472 17038 17516 16744 18254 19156 16662
6714 16662 14027 14176 16023 17649 17471 18392 20940 22695 21763 21613 19993 20020 20214 20175 18131 15960 16310
6697 16310 19453 20872 22681 21384 21935 20786 19452 21678 21838 21109 19828 19177 21197 19712 19233 18693
6681 18693 19331 19937 20939 21731 23941 20229 18808 20787 21888 23021 21860 18020 19487 19651 19803 19742
6665A9742j02L684J81j431J223J610m552m78K028m06K923L05J678p96j597M71
6649B4483j75J179N75l168k695K230J189r89k084N118j05K694j843j38l221J251
6633B4301L21r61J064K517j827p53r72K799J578J207J232k764j070L349l880K598
6617B8739j436l111K579M45k47L30K604n60k917J654k554K35j652q73J568P31
6601B5535K626M93J393K66l177k771j526J223R09o93J795Q80l61l64L44K49k703
6584B4118M363L248j911K057k908k739k261J297K467J70R10M98p52Q22J744j027
6568C0096k669O69J572P48j550j931K12J918J146l36L36N88l411O41K441k001
6552B8469L99J260k790K633j27J140k761J581l30k809j124M419Q09Nl362P98r45
$$ plain form
6665 19742 19640 23324 23505 22074 23297 24907 20355 19877 21905 21499 24422 24727 26405 25609 24012 24483
6649 24483 24308 25487 26062 22894 20199 22429 23618 22629 20545 25663 25558 28252 26409 26271 23050 24301
6633 24301 24622 23661 24725 27242 25415 24662 23690 26489 28067 29274 30506 27742 26672 30021 26141 28739
6617 28739 27303 24192 26771 27216 26969 27299 29903 29343 26426 28080 25526 25761 24109 23236 24804 25535
6601 25535 28161 28654 30047 30313 27136 24365 22839 24062 24971 24278 26073 26953 26592 26228 26572 26821 24118
6584 24118 28481 31729 29818 31875 28967 26228 23967 25264 27731 27901 28811 29309 28557 29379 31123 30096
6568 30096 27427 28096 29668 30416 28866 26935 27147 29065 30211 29875 30211 30799 27388 28029 30470 28469
6552 28469 28868 30128 27338 29971 29844 30984 28223 29804 29474 26665 25541 29960 30769 30774 27412 28210 27265
6535B7265j885L37K714K104q14q90q44J69K668K083m057j911L152O45j861J774
6519C0649L35L61P84j422r45K250K904N22l30m903N66K737l1K17n353K578K59
6502C1178K47p29j50o18L20J463L53p35O5L842L64j260m196J301J9k01j22J365
6484C2506P89l332k981L518K499j879J0j18K506J66o66l067m648L738K703N12
6468C2256j569l89J262l72J410j911n81O06K87P36L866k931m78Q34K447r22o35
6451C3916l080K07K082L1N71o97k085l043L053j048o91M53M165K10k175j26O88
6434C2431K15k598j334L350J340m288J976m85n85J014K814M143q40l797J498j734
6418C3120K43J683k6L37l261K354K069j453O21J167j122J050K97m94j247j683
$$ plain form
6535 27265 25380 25717 28431 30535 29721 28831 27987 28156 30824 32907 28850 26939 30091 30736 28875 30649
6519 30649 30984 31345 32129 30707 29762 32012 34916 35438 35108 30205 30771 33508 33477 33694 28341 30919 31178
6502 31178 31425 30696 30546 29928 30248 31711 32064 31329 31394 35236 35600 34340 30144 31445 31464 31263 31141 32506
6484 32506 33295 29963 26982 30500 32999 31120 31130 31012 33518 33684 33018 29951 25303 29041 31744 32256
6468 32256 30687 30298 31560 31188 32598 30687 30106 30712 30999 31735 35601 32670 32192 33026 35473 34551 33916
6451 33916 30836 31043 33125 33156 33727 33030 30945 27902 30955 29907 29216 29669 33834 34044 31869 31743 32431
6434 32431 32646 30048 28714 32064 33404 29116 31092 30607 30022 31036 33850 37993 37153 33356 34854 33120
6418 33120 33363 35046 35020 35357 32096 34450 36519 35066 35687 36854 35732 36782 37079 36585 35338 33655
6402C3655o70R81P16k13J140L514n68l500m4r8j832k032K651n13J947J64R34J475
6384C7707J692p60l342L55J685J281o62j365k11J685p49l223J385J810k49N53
6368C7592l0k175j24K399K35J669o64p03Q92J246M68N73k357R40L81m918L694
6351C9118J467R72k687l425L578K358l780N09J644J288L441q86q57j442r47J990
6335D2341K37k78k547l81J627K396J027j73J336l867l016J310N56l640J03K275
6319C9306K095Q86N22J795J646J081O30J263k191p45K10m591k982J536K696j591
6303D1566o26L37J497m70m89L261M245j306K522K71k279J726j483j773K320k53
6287D9066K183l558k117K80Q51P55K731K152M67k659J285j844L753k535m350J528
$$ plain form
6402 33655 32985 33966 34682 34469 35609 39123 38555 35055 35011 34913 33081 31049 33700 33187 35134 35298 36232 37707
6384 37707 39399 38639 35297 35652 37337 38618 37956 36591 36380 38065 37316 34093 35478 37288 37039 37592
6368 37592 37562 35387 35263 37662 37897 39566 38902 38199 39091 40337 40805 41378 39021 39961 40342 35424 39118
6351 39118 40585 41557 38870 35445 39023 41381 37601 38110 39754 41042 44483 43597 42740 41298 40351 42341
6335 42341 42578 42300 39753 39372 40999 43395 44422 44249 45585 41718 38702 40012 40568 36928 37031 39306
6319 39306 41401 42287 42809 44604 46250 47331 47961 49224 47033 46288 46498 41907 38925 40461 43157 41566
6303 41566 40940 41277 42774 42304 41815 45076 49321 48015 50537 50808 48529 50255 48772 46999 49319 49066
6287 49066 51249 47691 45574 45854 46705 47460 50191 52343 52810 50151 51436 49592 53345 50810 46460 47988
6271D7988L343J767K12J369K12L640m300j115J053r13J338k983J01j294j385L202
6255E2235k006m55L004p19P20k163j088O399R46L81O54j124j257j035P75K23J175
6238E6665o08k298j45j68k681M88K229j180K166R74K356k380j400L741K9j867
6222E5921L2j592K956k911J321J253J218K406J611q53j613L672N30k187q7J431
6206F3108j375N00J875j944k97K063J431l684J930j976K20m15K266k263Q09J45
6190F2393K777K265j126o78j42k04k83k262o70J172j441J981O33J409k806n09
6174F2509K657J828l50j160J009m14l468mQ38L380L42j021L17J911K287R3l04
6157G0450L619J0m93j564o55l180k776M472K086K305k387j40O37K449L109l322
$$ plain form
6271 47988 51331 53098 53310 54679 54891 58531 54231 53116 54169 53256 54594 51611 51712 50418 49033 52235
6255 52235 50229 49774 52778 52059 52779 50616 49528 55927 56873 57254 57908 56784 55527 54492 55267 55490 56665
6238 56665 56057 53759 53614 53446 50765 51253 53482 52302 54468 55442 57798 55418 54018 57759 57788 55921
6222 55921 55953 54361 57317 54406 55727 56980 58198 60604 62215 61362 59749 63421 63951 61764 61677 63108
6206 63108 61733 62233 64108 62164 61867 63930 65361 61677 63607 61631 61851 61436 63702 61439 62248 62393
6190 62393 65170 67435 66309 65631 65489 65285 65002 62740 62070 63242 61801 63782 64415 65824 63018 62509
6174 62509 65166 66994 66644 65484 66493 66079 62611 62607 63445 66825 67167 66146 66463 68374 70661 70754 70450
6157 70450 74069 74079 73586 72022 71367 68187 65411 69883 71969 74274 71887 71747 72384 74833 77942 74620
6141G4620j094K538R83l495O1K593L68j305J101J07L31J705j205l33L261J448
6125H1684l60K523J878M434k576j443K249J698M078P70K853K077K168j220k910
6110I7903n46L10p41n40l582k104j383J993k069j035m9k01j167j127k170Q74O77
6093H5043J160K13m259K231K32j102J70p69L356L383p46k888J021j472J348J279
6077H8200j96k199P71K743m01J804K621n18j119l223R91J51O80J742J285K010
6061I5342J325o62K08j274K154J994k299j761O24J868j438J137m23J993J085K75
6045A00148k060j217J573m26O37j627P50K711j43l93J24K384k086l134R79J437
6029I9657J495J577OK351j671N93Q84q48j52r61L146J916J750K034k130K469R9
$$ plain form
6141 74620 73526 76064 77047 73552 73613 76206 76574 75269 76370 76477 76808 78513 77308 76975 80236 81684
6125 81684 81324 83847 85725 90159 87583 86140 88389 90087 94165 94935 97788 99865 102033 100813 97903
6110 97903 97357 97667 96926 96386 92804 90700 89317 91310 89241 88206 88157 87956 86789 85662 83492 84366 85043
6093 85043 86203 86416 82157 84388 84620 83518 83688 82919 86275 89658 88912 86024 87045 85573 86921 88200
6077 88200 88004 85805 86576 89319 88918 90722 93343 92825 91706 88483 89474 89625 90305 92047 93332 95342
6061 95342 96667 96005 96213 94939 97093 99087 96788 95027 95651 97519 96081 97218 96795 98788 99873 100148
6045 100148 98088 96871 98444 98018 98655 97028 97778 100489 100346 99953 100077 102461 100375 97241 98220 99657
6029 99657 101152 102729 102735 105086 103415 104008 104892 104044 103892 102931 106077 107993 109743 111777 109647 112116 112215
6012A12215J754J147k863k197N140o07O6k366K1K661J033P19J053P26J349J935
5996A21786L05l047m82K270j448l35L404K251O07K75j967K871K585k217k61L70
5980A26967r66K611J605K081p93J774l234p91J956k384K799J213J671J210K11
5965A35930k63Q8R44J992K212k78k43J039K386l061q83l34J407J162k930O897
5949A46065L213k759J511K162m074j613j000k293j34L465P89J809N109K02L569
5934A56021L970J955J060R70P091N104O73J973K382r65K920r03K079J390J424
5919A87144M211k055J959L22J768L268m85K333K151L122j291J87L647k01P46j79
5903B06647L702J682L900M834J988K065K933J521P81Q87L559K061K588J73J175
$$ plain form
6012 112215 113969 115116 112253 110056 115196 114589 114655 112289 112310 114971 116004 116723 117776 118502 119851 121786
5996 121786 122091 119044 118562 120832 119384 119049 122453 124704 125311 125586 123619 126490 129075 126858 126597 126967
5980 126967 126001 128612 130217 132298 131505 133279 130045 129254 131210 128826 131625 132838 134509 135719 135930
5965 135930 135667 135755 136699 138691 140903 140625 140382 141421 143807 140746 139863 139529 140936 142098 139168 146065
5949 146065 149278 146519 148030 150192 146118 144505 143505 141212 141078 144543 145332 147141 152250 152452 156021
5934 156021 159991 161946 163006 163976 171067 176171 176844 178817 181199 180234 183154 182251 184330 185720 187144
5919 187144 191355 189300 191259 191581 193349 196617 196132 198465 200616 203738 202447 202634 206281 206080 206826 206647
5903 206647 210349 212031 215931 220765 222753 224818 227751 229272 230053 230940 234499 236560 239148 239321 240496
5888B40496J582J150K649K119J034N01L41K666oK579M144N141J5K801L667K675
5872B73554M183M698K770L884K106L338K851J627O224Q599P717J0201J0948J1940
5858C54640J1817J4868J8086J0837J5030J7438J3196J4795J4167J1112Q745Q834
5846E13565R766J0214R547R315J0665P765J1025R559J3633J4782J5079R342J0435
5833F54692J2091J3829J4275J7171J5429J6691K0148J5708K0199K0772K1696K0871
5821H63572K3936K7121K8405K7158K5280K4779K6851K6137K6306K8099K8770K9540
5809A185954K7885L2431L7371L4382L0673L2789L2957L7351M1799M2527M8376
5798A584495N0231N4147N9568N8756O3409O9138P2677P4731Q2488Q7936R8072
$$ plain form
5888 240496 242078 243228 245877 247996 249030 249531 249872 252538 252532 255111 259255 264396 264411 267212 270879 273554
5872 273554 277737 282435 285205 289089 291195 294533 297384 299011 305235 313834 321551 331752 342700 354640
5858 354640 366457 381325 399411 410248 425278 442716 455912 470707 484874 495986 504731 513565
5846 513565 523331 533545 543092 552407 563072 570837 581862 591421 605054 619836 634915 644257 654692
5833 654692 666783 680612 694887 712058 727487 744178 764326 780034 800233 821005 842701 863572
5821 863572 887508 914629 943034 970192 995472 1020251 1047102 1073239 1099545 1127644 1156414 1185954
5809 1185954 1213839 1246270 1283641 1318023 1348696 1381485 1414442 1451793 1493592 1536119 1584495
5798 1584495 1634726 1688873 1748441 1807197 1870606 1939744 2012421 2087152 2169640 2257576 2355648
5787B355648J05571J17001J31857J51066J75047J94194K20070K44573K83827L22177
5777D301031L64373M09598M67851N25829N93541O76429P72730Q76940R66935J016358
5767A0971615R66483P48270L26990k18258p39774j092968j216737j180954j063960
5758G500707r28265p95211o72522n63096m65799l88251l27604k77768k37562k09911
5748B634718j76766j61343j44862j32391j18570j06859r9985r0202q3328p7856
5738A442556o9734o3092o2497n9409m7572m7087m2244l7053l3081l0506k8081
5727I22200l2404l0137k9988k4388k6820k1334k1037k0382k1726j8678j7845j7580
5715F39881j6337j4216j7092j3714j2245j4372j4761j1068j0928j3751j4043j2535
$$ plain form
5787 2355648 2461219 2578220 2710077 2861143 3036190 3230384 3450454 3695027 3978854 4301031
5777 4301031 4665404 5075002 5542853 6068682 6662223 7338652 8111382 8988322 9955257 10971615
5767 10971615 11938098 12686368 13013358 12795100 12055326 10962358 9745621 8564667 7500707
5758 7500707 6572442 5777231 5104709 4541613 4075814 3687563 3359959 3082191 2844629 2634718
5748 2634718 2457952 2296609 2151747 2019356 1900786 1793927 1693942 1603740 1520412 1442556
5738 1442556 1372822 1309730 1247233 1187824 1140252 1093165 1050921 1013868 980787 950281 922200
5727 922200 889796 859659 829671 805283 778463 757129 736092 715710 693984 675306 657461 639881
5715 639881 623544 609328 592236 578522 566277 551905 537144 526076 515148 501397 487354 474819
5703D74819q971j1558p294j2177j4835q344R869m156p889r075q337p382q659q519
5689C67492q090n212j0672n040l815j0129n642m002k450l270k943j903k960q933
5675B92431M261N145R89m13L476M528J389k992q7J752j231m043m250m047o684
5660B90224k095n481p247m701l585j84l708l774l047J76Q49l016j776m911j848
5645B45876n94l138l526k843l071k297L72k529j486j992k574q58N026J803r45
5630B27224l081j519J82M910m42m051j11K06r74J585K436k065k654r79K157N29
5614B23353l141k026j46l384j951N20j774J663J121j045M66K169L693L366M846
5599B27730K658J635k380J995K201N03L480q24l28K33k33R1k053K54j97k856l228
$$ plain form
5703 474819 465848 454290 446996 434819 419984 411640 421509 417353 409464 400389 392052 384670 376011 367492
5689 367492 359402 354190 343518 338478 334663 324534 318892 314890 312440 309170 306227 304324 301364 292431
5675 292431 296692 301837 302826 302413 305889 310417 311806 308814 308727 310479 309248 305205 300955 296908 290224
5660 290224 288129 282648 275401 270700 267115 266931 263223 259449 256402 256578 257427 254411 252635 247724 245876
5645 245876 245282 242144 238618 235775 232704 230407 230779 228250 226764 224772 222198 221340 226366 228169 227224
5630 227224 224143 222624 222806 227716 227274 223223 223112 223318 222344 223929 226365 224300 221646 220667 222824 223353
5614 223353 220212 218186 218040 214656 212705 213225 211451 213114 214235 213190 213656 215825 219518 222884 227730
5599 227730 230388 232023 229643 231638 233839 234342 237822 236998 236670 236903 236670 236761 234708 234962 234765 231909 228681
5582B28681j173k224k193l724R00j450N8J802n11J193M11k768N17k672O52L601
5566B21100k74j586j334K560l280j992M15J719O90j883J403J869L353L13R51j983
5550B22041Q04m378J582N71M54j664M610M95j45j96j51Q66p92M531l95J719J45
5533B30097k315j976j446J050L730o74l16Q96K392J638k716P1o72K308J350l720
5517B29697O13J712K121R36J010J316j429m69K577J453J543J556J485j424M643
5502B47340j102L339l56o14M546p62k252K610r49k850L981R05K73j479M38j322
5486B51746K311L990K236j34j450Q99N21p53J862J515K171j346J411n24J052L602
5470B69109M22J276k310n93N92N351j657l96J055P14O51L082L71K013P04k028
$$ plain form
5582 228681 227508 225284 223091 219367 220267 218817 218875 220677 220166 221359 221770 219002 219519 216847 217499 221100
5566 221100 220826 219240 217906 220466 217186 215194 215609 217328 218018 216135 217538 219407 222760 223073 224024 222041
5550 222041 222845 218467 220049 220620 221074 219410 224020 224515 224370 224174 224023 224889 224097 228628 228233 229952 230097
5533 230097 227782 225806 224360 225410 229140 228466 228150 229046 231438 233076 230360 230431 229759 232067 233417 229697
5517 229697 230310 232022 234143 235079 236089 237405 235976 235507 238084 239537 241080 242636 244121 242697 247340
5502 247340 246238 249577 249221 248607 253153 252391 250139 252749 251800 248950 252931 253836 254109 252630 253068 251746
5486 251746 254057 258047 260283 260149 258699 259598 260119 259366 261228 262743 264914 263568 264979 264455 265507 269109
5470 269109 269531 270807 268497 267904 268496 273847 272190 271794 272849 273563 274214 277296 277667 279680 280384 278356
5454B78356k149J271M116M710K661j090o24R62L618J229k902K377J272M163K984
5439C00954j223j52J255O02Q08K304J737K662L36K484m14j182J683L850J480j168
5423C16016K381k299J986J546K794J139O20L984L06K623q81K132L735O76J330
5408C38088J337K367j403Q26K544J785M949k86J030N81K607M15J727J417l78n68
5392C57038M395N718P4K504L139L55N428K432j626J505L639K041J402J374M718
5377C94136K694M244K440J157K397M404L718L130O609m24K615Q338N984N373r11
5362D45904N0J0483Q156M984P058Q990O063K427N090M528J264K31L864K693M452
5347E16237N290O59L576j2J191M442J358L170N309J560J536O83J743M600O504
$$ plain form
5454 278356 276207 277478 281594 286304 288965 287875 287251 288213 291831 293060 290158 292535 293807 297970 300954
5439 300954 299731 299579 300834 301436 302244 304548 306285 308947 309283 311767 311353 310171 311854 315704 317184 316016
5423 316016 318397 316098 318084 319630 322424 323563 324183 328167 328473 331096 330215 332347 336082 336758 338088
5408 338088 339425 341792 340389 341215 343759 345544 350493 350207 351237 351818 354425 354840 356567 357984 357606 357038
5392 357038 361433 367151 367225 369729 372868 373223 378651 381083 379457 380962 384601 386642 388044 389418 394136
5377 394136 396830 401074 403514 404671 407068 411472 415190 418320 424929 424505 427120 435458 441442 446815 445904
5362 445904 445954 456437 464593 469577 476635 485625 491688 494115 499205 503733 504997 505228 509092 511785 516237
5347 516237 521527 522186 525762 525750 526941 531383 532741 535911 541220 542780 544316 544999 546742 551342 557846
5332E57846L936J103J518P131K569K024O142M725K190J639N927M443O175M635
5318F12003K994O289J0430O702K42N905L788Q269N611N245O399J1909J2240M609
5304G02635R230O813R678N497O082M513Q866N786O193N332N477P744O789R017
5290G99652J0852P433R740P001N696J0291Q237J1242R683R499R635J1136Q970
5277I19067J0677R543J2219J0438J0810J1656J2468J1935R726J4307J3626J5038
5265A061510J2257J2652J8366J5482J5885J4707J2838J5416J7274J8034J6886
5254A231307J4040J8122J7048K1431K1549K2449K0687K5441K5700L2247L2406
5243A482427J9967K9126K8415L0549L1686L7539L8010M3690M4944N4003N9284
$$ plain form
5332 557846 561782 562885 564403 571534 574103 576127 582269 586994 589184 590823 596750 601193 607368 612003
5318 612003 614997 621286 631716 638418 638660 644565 648353 656622 662233 667478 673877 685786 698026 702635
5304 702635 711865 718678 728356 733853 739935 744448 753314 759100 765293 770625 776102 783846 790635 799652
5290 799652 810504 817937 827677 834678 840374 850665 858902 870144 879827 889326 898961 910097 919067
5277 919067 929744 939287 951506 961944 972754 984410 996878 1008813 1018539 1032846 1046472 1061510
5265 1061510 1073767 1086419 1104785 1120267 1136152 1150859 1163697 1179113 1196387 1214421 1231307
5254 1231307 1245347 1263469 1280517 1301948 1323497 1345946 1366633 1392074 1417774 1450021 1482427
5243 1482427 1502394 1531520 1559935 1590484 1622170 1659709 1697719 1741409 1786353 1840356 1899640
5232A899640O1407P2436Q3541R0015J01847J17858J31110J49591J67371J89593
5222C064409K19097K52564K82762K94774K89151K34570J35136N888j38604k49285
5212D390462l20515l41168l25735k88558k40953k01698j61321j29714r9263q1751
5202B199786o6232n3861m1357l6567l2771k0541j9904j6152j4020j3930q118p587
5190A868746l675n903o125k906l742l67J702K005L419N632M311M368R868Q825
5176A886158M141J1506J0175J0927Q334R699J0730J4837P962J1167J2583J4573
5164B012792J4556J3705J6392J2283J0718K0109J2587J7359J6552J7058J8911
5153B183022K1397K1777K1713J9185J7748K0524J9782K0694K1270K0784J6687
$$ plain form
5232 1899640 1961047 2033483 2117024 2207039 2308886 2426744 2557854 2707445 2874816 3064409
5222 3064409 3283506 3536070 3818832 4113606 4402757 4637327 4772463 4778351 4639747 4390462
5212 4390462 4069947 3728779 3403044 3114486 2873533 2671835 2510514 2380800 2281537 2199786
5202 2199786 2133554 2079693 2038336 2001769 1968998 1948457 1928553 1912401 1898381 1884451 1876333 1868746
5190 1868746 1865071 1859168 1853043 1850137 1846395 1846028 1847730 1849735 1853154 1858786 1863097 1867465 1877333 1886158
5176 1886158 1890299 1901805 1911980 1922907 1931241 1940940 1951670 1966507 1974469 1985636 1998219 2012792
5164 2012792 2027348 2041053 2057445 2069728 2080446 2100555 2113142 2130501 2147053 2164111 2183022
5153 2183022 2204419 2226196 2247909 2267094 2284842 2305366 2325148 2345842 2367112 2387896 2404583
5142B404583J9686J7945J7243J8392J9965K3234K2019K3340J8945J4769K2361
5131B622482K5859K7305K4352K4096K2936K2219J9842K0673J9160J8258K2353
5120B869535K5529K1843K0295K2706K5924K2636K3726K6020K3872K7013K9493
5109C138592K5067K9102K8015K6889L3589K7970K8343K7879L0035K9309L1784
5098C456574K8957K5964K5383K0369K0467J8566K4078K3966K6914K5399K7155
5087C723792K8846K5510K5781K7232K8479L3888M2483N2435O1097O4927P0146
5076D184616Q1240Q8299R2553R3465R7734R8771R7958R0275Q8710R0164Q6239
5065E190024Q5054Q6200P8878P6880P1239O6637O7201O2708O4087O7709O4191
$$ plain form
5142 2404583 2424269 2442214 2459457 2477849 2497814 2521048 2543067 2566407 2585352 2600121 2622482
5131 2622482 2648341 2675646 2699998 2724094 2747030 2769249 2789091 2809764 2828924 2847182 2869535
5120 2869535 2895064 2916907 2937202 2959908 2985832 3008468 3032194 3058214 3082086 3109099 3138592
5109 3138592 3163659 3192761 3220776 3247665 3281254 3309224 3337567 3365446 3395481 3424790 3456574
5098 3456574 3485531 3511495 3536878 3557247 3577714 3596280 3620358 3644324 3671238 3696637 3723792
5087 3723792 3752638 3778148 3803929 3831161 3859640 3893528 3936011 3988446 4049543 4114470 4184616
5076 4184616 4265856 4354155 4446708 4540173 4637907 4736678 4834636 4924911 5013621 5103785 5190024
5065 5190024 5275078 5361278 5440156 5517036 5588275 5654912 5722113 5784821 5848908 5916617 5980808
5054E980808P1859P6318P5943Q4503R0959Q9372R1869R6909R8693J09132J16961
5043F983326J15848J17433J12154J09413J12990J16073J19296J13503J10317J08759
5033H119112J06026J12951J14056J11250J11042J10571J06973J13244J19340J29376
5023I253941J37333J40050J38942J43710J45950J54478J69923J86502J92833J97432
5013A0861094K09046K24500K36087K51237K56021K64709K82575L07023L37316
5004A3229608L62349L96576M34271M66877M93424N23986N52353N84330O12221
4995A7655995O35801O53825O81071P04372P25786P38958P30787O90324O48844
4986B3865763O06126N53664N29365N23465N26931N40932N70784O08830O26517
$$ plain form
5054 5980808 6052667 6128985 6204928 6289431 6380390 6469762 6561631 6658540 6757233 6866365 6983326
5043 6983326 7099174 7216607 7328761 7438174 7551164 7667237 7786533 7900036 8010353 8119112
5033 8119112 8225138 8338089 8452145 8563395 8674437 8785008 8891981 9005225 9124565 9253941
5023 9253941 9391274 9531324 9670266 9813976 9959926 10114404 10284327 10470829 10663662 10861094
5013 10861094 11070140 11294640 11530727 11781964 12037985 12302694 12585269 12892292 13229608
5004 13229608 13591957 13988533 14422804 14889681 15383105 15907091 16459444 17043774 17655995
4995 17655995 18291796 18945621 19626692 20331064 21056850 21795808 22526595 23216919 23865763
4986 23865763 24471889 25025553 25554918 26078383 26605314 27146246 27717030 28325860 28952377
4977B8952377O24478O41473O78255P12545P47220P75262Q03632Q39030Q86572
4968C5660844R30052R60950R80783J019899J065299J103592J136009J193746J279246
4959D5330420J374769J455500J490344J422383J338824J328551J348112J376881
4951E6465784J415394J415700J435839J482859J534290J581348J649204J755144
4943F8735562J875561J982348K121944K287240K450469K599303K728725K810765
4935H7591917K921427L068698L241403L442799L711567L952658M210571M540124
4927A16681164M983634N541335O196228O886299P554277Q180038Q788477R442592
4919A74254044J0294657J1264907J2075295J2694796J3206926J3767595J4526444
$$ plain form
4977 28952377 29576855 30218328 30896583 31609128 32356348 33131610 33935242 34774272 35660844
4968 35660844 36590896 37551846 38532629 39552528 40617827 41721419 42857428 44051174 45330420
4959 45330420 46705189 48160689 49651033 51073416 52412240 53740791 55088903 56465784
4951 56465784 57881178 59296878 60732717 62215576 63749866 65331214 66980418 68735562
4943 68735562 70611123 72593471 74715415 77002655 79453124 82052427 84781152 87591917
4935 87591917 90513344 93582042 96823445 100266244 103977811 107930469 112141040 116681164
4927 116681164 121664798 127206133 133402361 140288660 147842937 156022975 164811452 174254044
4919 174254044 184548701 195813608 207888903 220583699 233790625 247558220 262084664
4912B62084664J5656769J7056138J8039283J8492846J8229545J6774225J2213467
4905C78546937M577809l183821j0854578j6569537j8979917j9633389j9772230
4898B94131274j9662977j9162130j8184927j6797194j5174647j3686264j2341694
4891A79121441j1145729j0089053r093540q273749p593372p036421o645682o327409
4883A12916486n963844n570698n135453m700031m308041l979647l721191l521803
4875G6015778l323077l103080k869845k676491k499282k339327k193740k080528
4867E4930408j993681j899493j786829j685556j594021j514706j448460j394274
4859D1613388j350454j300717j243698j182831j114783j066092j020682r81209
$$ plain form
4912 262084664 277741433 294797571 312836854 331329700 349559245 366333470 378546937
4905 378546937 383124746 379940925 369086347 352516810 333536893 313903504 294131274
4898 294131274 274468297 255306167 237121240 220324046 205149399 191463135 179121441
4891 179121441 167975712 157886659 148793119 140519370 132925998 125889577 119243895 112916486
4883 112916486 106952642 101381944 96246491 91546460 87238419 83258772 79537581 76015778
4875 76015778 72692701 69589621 66719776 64043285 61544003 59204676 57010936 54930408
4867 54930408 52936727 51037234 49250405 47564849 45970828 44456122 43007662 41613388
4859 41613388 40262934 38962217 37718519 36535688 35420905 34354813 33334131 32352922
4851C2352922r36766q86098q41065q10841p84044p75690p75739p63818p42373
4842B5036488p12826o84086o52961o16417n88841n53403n32230n11209m99103
4833A9685412m91913m77759m70619m66451m57998m52456m39822m30273m15397
4824A5582724m04740l82966l58151l32372l11669k85501k55118k27795k03836
4815A2820576j79698j61866j46117j39974j37393j31413j37602j46931j57325
4806A1482257j73674j87326k03279k12247k13508k17798k21408k21801k18543
4797I612673k15010k03283k01596j94472j88405j78313j83891j72562j60961j63500
4787G750680j62725j62799j59540j56930j53662j54800j49703j44490j37490j30953
$$ plain form
4851 32352922 31416156 30530058 29688993 28878152 28094108 27318418 26542679 25778861 25036488
4842 25036488 24323662 23639576 22986615 22370198 21781357 21227954 20695724 20184515 19685412
4833 19685412 19193499 18715740 18245121 17778670 17320672 16868216 16428394 15998121 15582724
4824 15582724 15177984 14795018 14436867 14104495 13792826 13507325 13252207 13024412 12820576
4815 12820576 12640878 12479012 12332895 12192921 12055528 11924115 11786513 11639582 11482257
4806 11482257 11308583 11121257 10917978 10705731 10492223 10274425 10053017 9831216 9612673
4797 9612673 9397663 9194380 8992784 8798312 8609907 8431594 8247703 8075141 7914180 7750680
4787 7750680 7587955 7425156 7265616 7108686 6955024 6800224 6650521 6506031 6368541 6237588
4777F237588j27072j21728j11136j04594r3699q5132p8599p3945p3237o6775o4993
4766E236678o5299o0622o1105o5405o8061o3954o6157o7187o4522o5240o8760
4755D520366o9605o7625o2601o2692o0107n8488n2314n0224m5646l8558l2899
4744C919607k5805k1619j6446j9726j4152q080r701n638o825r559j0262j4758
4732C757036j2891k3854l2063l6298m6621m6950m8353n5755n6395n6607n5892
4721C285357n0321n1018m4723m5544m5177m2721l7516l7433l7745l5772l2035
4710B825352l1365l5158l4617l0844k7281l3891l0390k6327k6309k6043k5159
4699B497968k8087k3853k5764k8936k7548k5195k7490k7493l1049k7996k5160
$$ plain form
4777 6237588 6110516 5988788 5877652 5773058 5679359 5594227 5515628 5441683 5368446 5301671 5236678
4766 5236678 5171379 5110757 5049652 4984247 4916186 4852232 4786075 4718888 4654366 4589126 4520366
4755 4520366 4450761 4383136 4320535 4257843 4197736 4139248 4086934 4036710 3991064 3952506 3919607
4744 3919607 3893802 3872183 3855737 3836011 3821859 3813779 3804078 3798440 3791615 3782056 3771794 3757036
4732 3757036 3744145 3720291 3688228 3651930 3605309 3558359 3510006 3454251 3397856 3341249 3285357
4721 3285357 3235036 3184018 3139295 3093751 3048574 3005853 2968337 2930904 2893159 2857387 2825352
4710 2825352 2793987 2758829 2724212 2693368 2666087 2632196 2601806 2575479 2549170 2523127 2497968
4699 2497968 2469881 2446028 2420264 2391328 2363780 2338585 2311095 2283602 2252553 2224557 2199397
4688B199397k4587k8089l0020k4096k3046k3764j9236j8533j3862j8021j7051
4677A959092j6980j7386k1903k1582j7329j7185j4349j6880j9277j5200j6190
4666A764831j5279j6637j2811j3727j2951q069j1749j1358p116p176j2020j1909
4654A624029r793n334n759o662o934p810p718n006o686o891n027n940o975p285
4640A530209m331p120p185l265m434k473k179k893m234n524m137n692k653r63
4626A473126k408J136j312o33O19K807J820O829Q214M948J0554J2954J7723J5836
4612A552213K0460K7028L3149L8952M5956M9739N7649P3617P8855R8642J14932
4601B191192J25729J49524J77752K09912K45974K78117L01444K92537K47494J49240
$$ plain form
4688 2199397 2174810 2146721 2116701 2092605 2069559 2045795 2026559 2008026 1994164 1976143 1959092
4677 1959092 1942112 1924726 1902823 1881241 1863912 1846727 1832378 1815498 1796221 1781021 1764831
4666 1764831 1749552 1732915 1720104 1706377 1693426 1685357 1673608 1662250 1655134 1647958 1635938 1624029
4654 1624029 1614236 1608902 1603143 1596481 1589547 1581737 1574019 1569013 1562327 1555436 1550409 1544469 1537494 1530209
4640 1530209 1525878 1518758 1511573 1508308 1503874 1501401 1499222 1496329 1492095 1486571 1482434 1476742 1474089 1473126
4626 1473126 1470718 1471854 1470542 1469909 1470528 1473335 1475155 1481984 1490198 1495146 1505700 1518654 1536377 1552213
4612 1552213 1572673 1599701 1632850 1671802 1717758 1767497 1825146 1898763 1977618 2076260 2191192
4601 2191192 2316921 2466445 2644197 2854109 3100083 3378200 3679644 3972181 4219675 4368915
4591D368915J7982j15774k33418l16030l41769l33134l00503k57820k13912j78813
4581B095724j48333j23368j09200q8056p7436o3853n8222n0838m7948m7278l8020
4570A243172l3453l2165l4604k8796k7586k5468k2695j9667j6642k4198j8988
4559I58910j5570j4820j4495j5564j2181j3118j1833q043j0001j5960j1957j0685
4547H04683j0274j0205q429j0695r968j0102p681m557j0974j0602m465r458o568
4534F90705o433p415q372q633n538m603p044p335l377l630o673o398m396m556
4520F06302q756n252k181o680r353m802n369n189j530o619o278n230l671n685
4506E29707l638m944l569l801j070l324k360l597n903l893p8k515k910j472o832
$$ plain form
4591 4368915 4386897 4271123 4037705 3721675 3379906 3046772 2746269 2488449 2274537 2095724
4581 2095724 1947391 1824023 1714823 1626767 1549331 1485478 1427256 1376418 1328470 1281192 1243172
4570 1243172 1209719 1177554 1142950 1114154 1086568 1061100 1038405 1018738 1002096 977898 958910
4559 958910 943340 928520 914025 898461 886280 873162 861329 853286 843285 827325 815368 804683
4547 804683 794409 784204 775775 765080 755112 745010 737329 732772 721798 711196 706731 697273 690705
4534 690705 684272 676857 668485 659852 654314 649711 642667 635332 631955 628325 621652 615254 610858 606302
4520 606302 597546 592294 590113 583433 574080 569278 563909 558720 557190 550571 544293 539063 535392 529707
4506 529707 526069 521125 517556 513755 512685 509361 507001 503404 497501 493608 493530 491015 488105 486633 479801
4491D79801l142j527j05l106l685q223o216l407m429q66k320m107n411j359l460
4476D28438j595k824o209l656o060n149j760o536l093n832l582m027m716j186
4462C72213j793l30l893o665m854q83k213l07j777J024K115j502K133L053K133
4447C58454k145L945K781m19j887o70p48j994P46m911j154p19m480l238k381J977
4431C43157p48p76j435n93j695m723l650j143J858K21j748k044m15j875n037p24
4415C18630J80l476j807j631j339o19l549l106k522J870j257n403J929l678n092
4400B89130j842k715K087l397k504j9M46q1m095l522k472j216M52j304m42r2l345
4383B65069k060q25K431l671r13k244O11l960l971k178k063k501r66L090l634
$$ plain form
4491 479801 476659 475132 475027 471921 468236 460013 453797 450390 445961 445095 442775 438668 433257 431898 428438
4476 428438 426843 424019 417810 414154 408094 402945 401185 394649 391556 385724 382142 378115 373399 372213
4462 372213 370420 370090 366197 359532 354678 353795 351582 351275 349498 350522 352637 351135 353268 356321 358454
4447 358454 356309 360254 363035 362616 360729 360059 359311 357317 358063 353152 351998 351279 346799 343561 341180 343157
4431 343157 342409 341633 340198 339605 337910 333187 329537 328394 330252 330473 328725 326681 326266 324391 319354 318630
4415 318630 318810 315334 313527 311896 310557 309938 306389 303283 300761 302631 301374 295971 297900 294222 289130
4400 289130 287288 284573 286660 283263 280759 280740 281186 281105 277010 273488 271016 269800 270252 268948 268506 268414 265069
4383 265069 263009 262184 264615 260944 260031 257787 258398 254438 250467 248289 246226 243725 242759 245849 242215
4368B42215k127K12j848r4n91J724j789k977j874l136M3j096j494j96k428r51
4352B23593j326l657O87J010k998L26K360n70j522k375j739p44J337j3n871J198
4336B09696J942k226l826l10N67k467j188k079K570j769r45n32j466l162o71J657
4320A95791q95N76n34k556j387k948k946j338R34k720K429P16m395j407j873J665
4304A79112l54K236k375M51O63l307k3m79j847l248O73O80o59n82q64l539J558
4287A68096Q84j608k781O26j030l505J22L316k184o318j710o79P15j302J563j488
4271A52717r73r88k77m21j677r56J497o90l366j876L692k581k009M635Q78o002
4255A41603J565O99j992J701l579l240n68K447R01k078J327l887j581M38j683
$$ plain form
4368 242215 240088 240300 238452 238358 237767 239491 237702 234725 232851 229715 229758 228662 227168 226972 224544 223593
4352 223593 222267 218610 219297 220307 217309 217635 219995 219425 217903 215528 213789 213045 214382 214369 208498 209696
4336 209696 211638 209412 205586 205276 205843 203376 202188 200109 202679 200910 199965 199433 197967 194805 194134 195791
4320 195791 194896 195472 194938 192382 190995 188047 185101 183763 184697 181977 184406 185122 180727 179320 177447 179112
4304 179112 178758 180994 178619 179070 179733 176426 176403 175924 174077 170829 171502 172182 171523 170941 170077 166538 168096
4287 168096 168980 167372 164591 165217 164187 160682 160804 164120 161936 155618 153908 153229 153944 152642 154205 152717
4271 152717 151744 150756 150479 150058 148381 147425 148922 148232 144866 142990 146682 144101 142092 146727 147605 141603
4255 141603 143168 143867 141875 143576 139997 136757 136189 138636 139537 137459 138786 134899 133318 133756 132073
4240A32073j560K212k035l053k42j413j474l933O09l232J623P76l170n604j593
4225A09984j843m15l244J631K028k747p35l83p44J212J334M70M98M12l404j074
4209A02980L661J167n195j355l75l42J049J237J568j685k260Q34n43K24l73j660
4193I8932J374J848j007j358k06k213j412q93o46k22k71K666L188K114j462l528
4177I6904j466L39o42J153P65K026l314o73K512j910k517j332j953P75K432J05
4161I3204Q58l660J132J487l555j985K756l526k927J460J569k918p96L828K577
4146H9504j497m01R36l618n131J356K823k734P93M733j565k215m44J871P7j590
4130H2898j098K015L97k030m474J233j402j810P51l632m22K213K707J736j090
$$ plain form
4240 132073 130513 132725 130690 127637 127395 125982 124508 120575 121184 117952 119575 120351 117181 111577 109984
4225 109984 108141 107726 104482 106113 108141 105394 104659 104276 103532 104744 106078 106548 107046 107458 104054 102980
4209 102980 106641 107808 102613 101258 100883 100541 101590 102827 104395 102710 100450 101284 100741 100965 100592 98932
4193 98932 100306 102154 101147 99789 99583 97370 95958 95065 94419 94197 93926 96592 99780 101894 100432 96904
4177 96904 95438 95777 95135 96288 97053 99079 95765 95092 97604 95694 93177 91845 89892 90667 93099 93204
4161 93204 94062 90402 91534 93021 89466 87481 90237 86711 83784 85244 86813 83895 83099 86927 89504
4146 89504 88007 87606 88542 84924 79793 81149 83972 81238 82031 86764 85199 82984 82540 84411 84488 82898
4130 82898 81800 83815 84212 82182 77708 78941 77539 75729 76480 72848 72426 74639 77346 79082 77992
4115G7992k745K217J831k981l549l152n51L89L474n33p22j376J344Q66j175j448
4099F9881k96P81k430K723P44j580m081k624R79P77J779p04J998K961j471J61
4083F9598j284K32Q42k787m000j684l125j29j056K389M805n83k707L732K470l318
4067F3395J937j442J4m025l613j096j596J700J981j187j499J131M544J253M50
4052F1947L61O05Q97j553k957J290j412j085J312J371L124k296J211m046l135
4037E5634p2m377j175k17O68J22m335J265M85l63m72o79K731L851o79j9j95K777
4019E4950k204k324k671k277j879J443K46J01m45O4R2J152O36J2K693j712Q44
4002D8721R43k925j679K651j238j086L616j352l6J193J921J019m657R06Q04j773
$$ plain form
4115 77992 75247 77464 79295 76314 72765 69613 69062 69451 72925 72392 71670 70294 71638 72504 71329 69881
4099 69881 69585 70366 67936 70659 71403 69823 65742 63118 64097 64874 66653 65949 67947 70908 69437 69598
4083 69598 68314 68546 69388 66601 62601 60917 57792 57663 56607 58996 63801 63218 60511 64243 66713 63395
4067 63395 65332 63890 63904 59879 56266 55170 53574 55274 57255 56068 54569 55700 60244 61497 61947
4052 61947 62308 62913 63810 62257 59300 60590 59178 58093 59405 60776 63900 61604 62815 58769 55634
4037 55634 55562 51185 50010 49793 50461 50583 46248 47513 47998 47635 47163 46484 49215 53066 52387 52368 52173 54950
4019 54950 52746 50422 47751 45474 43595 45038 45284 45385 44940 45004 45096 46248 46884 46896 49589 47877 48721
4002 48721 49664 46739 45060 47711 46473 45387 49003 47651 47615 48808 50729 51748 47091 47997 48801 47028
3986D7028j340o2l09j862O38J380j142K051Q58N04M28k251p08J869J249l589n425
3969C9317M99J759k454J043J666j448OK138K430j024J675K692j708m312p70j657
3953C9852k366N73p57j077K426j213K278L539j856k24K07o23m77k183j601J633
3937C8131k982j850J59L129J374r54J43P81j116L861k537l331K90j227J075P10
3921C5656O13r75p77j293p36Q40n42j698K301L55q75j762J234q45j620j828N94
3904B8642J25J190l62M4J61j273J985K009N60o22l06j527k266K070O92j312J002
3887C0812k22p36j591L33O064k743j874J552J411J740J706k324k561R99m68J065
3871C3163o49l674k65j061M34j810J975q39l38r85j317K007q23M007l861p12J912
$$ plain form
3986 47028 45688 45626 45317 43455 44093 45473 44331 46382 47240 47744 48172 45921 45213 47082 48331 44742 39317
3969 39317 39816 41575 39121 40164 41830 40382 40388 42526 44956 43932 45607 48299 46591 42279 41509 39852
3953 39852 37486 38059 37302 36225 38651 37438 39716 43255 41399 41175 41382 40759 40282 38099 36498 38131
3937 38131 35149 33299 33458 36587 37961 37007 37150 37931 36815 40676 38139 34808 35098 33871 34946 35656
3921 35656 36269 35294 34517 33224 32488 33328 32786 31088 33389 33744 32869 31107 32341 31496 29876 28048 28642
3904 28642 28767 29957 29595 29639 29800 28527 30512 32521 33081 32459 32153 30626 28360 30430 31122 29810 30812
3887 30812 30590 29854 28263 28596 34660 31917 30043 31595 33006 34746 36452 34128 31567 32566 32098 33163
3871 33163 32514 28840 28575 27514 27948 26138 28113 27274 26936 25951 24634 26641 25818 29825 25964 25252 27164
3854B7164J223K83l539L37J626L39j963L18J711j812K735N91K26j606j929N41
3838B6245M325j608j892j938P58K502j31l770l35K135r82N45l99j223p0k639O18
3821B2141K785r01J297n04p80r73r56p74M236Q58o641O94K613J096q3j649r01
3804B1558P89L566n71k31k34K660n00l200k178J914J184p14o40q67L94l980K748
3787B1698J566k039q46Q54K175k509l570J97j599L431k112J218Q15m36J354J123
3771B1320M35k677J778K484l562J704m72Q64j8L28j496k362O57O78J617r47o02
3754A9729J456k886j566N140K763j970J469J007m174m84j848J546O53J859n06
3739B2188J119j156R89q40k84O00k7j71n12j347J214J473r84l255k517Q25K019
$$ plain form
3854 27164 28387 28670 25131 25468 27094 27433 25470 25788 27499 25687 28422 29013 29239 27633 25704 26245
3838 26245 30570 28962 27070 25132 25890 28392 28261 24491 24156 26291 25309 25854 25455 24232 24162 21523 22141
3821 22141 24926 24025 25322 24818 24038 23065 22109 21335 25571 26429 19788 20482 23095 24191 24108 22459 21558
3804 21558 22347 25913 25342 25111 24877 27537 27037 23837 21659 23573 24757 24043 23403 22536 22930 18950 21698
3787 21698 23264 21225 20379 21233 23408 20899 17329 17526 15927 19358 17246 18464 19279 18843 20197 21320
3771 21320 21755 19078 20856 23340 19778 21482 21010 21874 21856 22184 20688 18326 18983 19661 21278 20331 19729
3754 19729 21185 18299 16733 21873 24636 22666 24135 25142 20968 20484 18636 20182 20835 22694 22188
3739 22188 23307 22151 23140 22300 22016 22616 22589 22418 21906 20559 21773 23246 22262 19007 16490 17315 19334
3722A9334j274j619J725j528q00K269J289M374M79K966j889j523M4j328l345O859
3706B6033M779k939m04j984j295j457L166k512J663q21l112P87j3q82k818L106
3690B1297o86M243P84j387k146l82J743j224L087p10L267j186j844n02p70j450
3674B2134J469M339K788j627l315K16p81k23l98k359K48J124k260o53J227m181
3658A7748J922M933K294O69l198J843N94M48l39l389n31Q19K013j841j435q7N46
3641B3009J815K45l05m87K60j916j08k127p76K974R62K370j165j559j968k041
3625A9183R43J101k359K520N94l40l149o47j790n76M49M192J969k850j514J411
3609A9137K586K93k611k192p66K110K669k404l055K558M28L510J226k323P38Q35
$$ plain form
3722 19334 18060 16441 18166 16638 15838 18107 19396 23770 24249 27215 25326 23803 23847 22519 19174 26033
3706 26033 30812 27873 27469 25485 24190 22733 25899 23387 25050 24229 21117 21904 21891 21009 18191 21297
3690 21297 20611 24854 25638 24251 22105 21723 23466 22242 25329 24619 27886 26700 24856 24354 23584 22134
3674 22134 23603 27942 30730 29103 25788 26004 25223 25000 24602 22243 22491 23615 21355 20702 21929 17748
3658 17748 19670 24603 26897 27566 24368 26211 26805 27253 26914 23525 22994 23813 25826 23985 22550 22463 23009
3641 23009 24824 25069 24764 24277 24537 22621 22513 20386 19610 22584 23546 25916 24751 23192 21224 19183
3625 19183 20126 21227 18868 21388 21982 21642 18493 17846 16056 15480 15929 20121 22090 19240 17726 19137
3609 19137 21723 22016 19405 17213 16447 18557 21226 18822 15767 18325 18753 22263 23489 21166 21904 22739
3593B2739M5n53O44o40j531k39Kj138k91L27k589Nj99k601J721p03K963j406j960
3574A4596N15l60k294M453J378k242m72L979j278j594K578J074N92N248K864J87
3558B9224n99r96j628j810k405J20l221l723J33M735m493n264j677J509J943l159
3542H689K345N307j418j594q10j477l55q6J515L2J203m47J174J067K714r06o65
3525A6288K094n24k775j376m02j345j116J514J363J138k632J402j516l366j123
3510G624J918J798j05k444J729O6r87L88p87P05j63j368L274k333K14J701j909
3493I321n31P19k225n53K038J388N85j531K787k379k98J557M46Q92k669m031k349
3476C167J817R80j681J873O68l024J706j79r12j517J196K237k066o05O30K472
$$ plain form
3593 22739 22784 22231 22875 22235 20704 20465 20467 19329 19038 19365 16776 16781 16582 13981 15702 14999 17962 16556 14596
3574 14596 15111 14751 12457 16910 18288 16046 15574 19553 18275 16681 19259 20333 20925 26173 29037 29224
3558 29224 28625 27629 26001 24191 21786 21906 18685 14962 15095 19830 15337 10073 8396 9905 11848 8689
3542 8689 11034 16341 14923 13329 12519 11042 10687 10601 12116 12148 13351 12904 14078 15145 17859 16953 16288
3525 16288 18382 17858 15083 13707 13305 11960 10844 12358 13721 14859 12227 13629 12113 8747 7624
3510 7624 9542 11340 11235 8791 10520 10586 9599 9987 9200 9905 9742 8374 11648 9315 9529 11230 9321
3493 9321 8790 9509 7284 6731 8769 10157 10742 9211 11998 9619 9321 10878 11324 12216 9547 5516 3167
3476 3167 4984 5964 4283 6156 6824 3800 5506 5327 4415 2898 4094 6331 4265 3660 4290 6762
3460F762L729J457K02j595k430K356l009j017j402J629j420k400k243K379m3l43
3444B612J138J605P09j579L238j732k449l004j579L466R07O9j903J502m23K412
3428D989j140k834L370K789P57l763L621J214k201j681K082k423q15J89O01K018
3412F773k172k846N97O50j55L873m04l081J03K418r05m8k430k113K94J453o79
3395A328K551J098N72J72l82K199r52j684k453j126J428M80o73J159J443q26k079
3378B255N51J203k238j534J880j092K363k094R32J630j408l393M92K405R57L38
3362C247P33J203J143k39k780J094N52P77J567j66j344m624J940K513O55j993
3346D278O51J972K58j799l352L745m31j104O31k66Q24R59k159K301r75k057J007
$$ plain form
3460 6762 10491 11948 12150 10555 8125 10481 7472 6455 5053 6682 5262 2862 619 2998 2955 2612
3444 2612 3750 5355 6064 4485 7723 5991 3542 538 -1041 2425 3332 3401 1498 3000 2577 4989
3428 4989 3849 1015 4385 7174 7931 4168 7789 9003 6802 5121 7203 4780 3965 4154 4755 6773
3412 6773 4601 1755 2352 3002 2847 6720 6316 3235 3338 5756 4851 4803 2373 260 554 2007 1328
3395 1328 3879 4977 5549 5721 5339 7538 6586 4902 2449 1323 2751 3231 2558 3717 5160 4334 2255
3378 2255 2806 4009 1771 237 2117 1025 3388 1294 2226 3856 2448 -945 -453 1952 2909 3247
3362 3247 3980 5183 6326 6087 3307 4401 4953 5730 7297 7131 5787 1163 3103 5616 6271 4278
3346 4278 4929 6901 7159 5360 2008 5753 5322 4218 4849 4583 5407 6366 4207 6508 5533 3476 4483
3329D483M6r64j010M482N35k502q45j378l99K306k809J190n62L245K148k115p92
3312E059j646K92k859J248O09K746J938n898j792L34J671J701j65J234q40R62
3296D594k591n59K219P09j613j132K872l61r17k385l02K838p33J419P27j755O36
3279C666j95j920K463J394j012n063m87L39M06j88o58p89n35J518N440P30n94
3262D515k575l657k925J28L093K077k709k91M98O59j387K319K536o70r47r13r06
3245a155j071P34k411L835o19R80j087O9M1J277O12k935m89k448K629Q94n15L05
3227a354O45l897p31M351L293R76l391j101k111r13L022J69O92J340k914j164
3211c088K926K644j228r25Q80J682m36l238k60N29k686J36J954j744j032L879
$$ plain form
3329 4483 4529 3565 2555 7037 7572 5070 4225 2847 2448 4754 1945 3135 2573 5818 7966 5851 5059
3312 5059 3413 3705 846 2094 2703 5449 7387 1489 -303 31 1702 3403 3238 4472 3632 4594
3296 4594 2003 1444 3663 4372 2759 1627 4499 4138 3221 836 534 3372 2639 4058 4785 3030 3666
3279 3666 3471 1551 4014 5408 4396 -667 -1154 -815 -409 -597 -1255 -2044 -2579 -1061 4379 5109 4515
3262 4515 1940 -1717 -4642 -4514 -1421 656 -2053 -2344 -1846 -1187 -2574 -255 2281 1611 664 -249 -1155
3245 -1155 -2226 -1492 -3903 -68 -687 293 -794 -725 -684 593 1205 -1730 -2219 -4667 -2038 -1144 -1659 -1354
3227 -1354 -709 -4606 -5337 -986 2307 3283 -108 -1209 -3320 -4233 -1211 -1042 -350 990 -1924 -3088
3211 -3088 -162 2482 1254 329 1209 2891 2455 -783 -1043 -514 -3200 -3064 -1110 -2854 -3886 -7
3195gj430L25j964P93k371J253K013l36p55M78J099j89k533J648J324J010j171
3178h13j370j286K848q6l200J251j537J420K338k442p16K055J929j591k797L705
3162b92n58j95j396j678K229k46k131J640K35P64J517r2J222j107k964K181J245
3145C74K033j394j375m369K521p12K172M85j308M346m164L83K088k75k044J243
3129DK466r92j060J374o24j049r64P04J85m176R83K885K86k211L22j826K676j88
3111a205J895L19J97J369k361N71k499k044J088J743q58K10k423M76j79J450J006
3094a245q35p69j667K577J861j322k87n9n00p52j096r0K86n62p34J84O53N26K061
3075a770k239L269R82K51p60l408J226k31J351J329k61j569k806p22P60K408J758
$$ plain form
3195 -7 -1437 -1112 -3076 -2283 -4654 -3401 -1388 -1724 -2479 -2001 -902 -1091 -3624 -1976 -652 358 -813
3178 -813 -2183 -3469 -621 -707 -3907 -2656 -4193 -2773 -435 -2877 -3593 -1538 391 -1200 -3997 -292
3162 -292 -850 -1045 -2441 -4119 -1890 -2136 -4267 -2627 -2392 -1628 -111 -203 1019 -88 -3052 -871 374
3145 374 2407 1013 -362 -4731 -2210 -2922 -750 -265 -1573 2773 -1391 -1008 1080 805 -1239 4
3129 4 2470 1478 418 1792 1168 119 -845 -141 44 -4132 -3149 -264 22 -2189 -1867 -3693 -1017 -1205
3111 -1205 690 1009 1206 2575 214 785 -1714 -3758 -2670 -927 -1785 -1575 -3998 -3522 -3701 -2251 -1245
3094 -1245 -2080 -2849 -4516 -1939 -78 -1400 -1687 -1746 -2246 -2998 -4094 -4184 -3898 -4460 -5194 -5010 -4357 -3831 -1770
3075 -1770 -4009 -740 242 493 -267 -3675 -2449 -2680 -1329 0 -261 -1830 -4636 -5358 -4598 -2190 -432
3058d32j44j9l497n2J598J906k654n86M28J399K073j139j167n98J035k285J989
3041b145N56J49K669l724j847L850J386j715j194J07J419l014j4N98J238l04J614
3024c71J582n53k455m95Q18k55R32R10J733J917k578k661j504K024j771k049L054
3007a722R54j062k409j034L715J242k732J905R9j622j835l90P89n7M10J475m336
2990f610J627Q21J66L340L44m576Q8J699K726j092k931N42N60Q57K231l28J433
2973H97j569m54J039m63m041j041K295j746M134J043m115J651j207l49r19J274
2957c571j450O59J40k579L06M62L915j69j097L340k42o51K378n0j9j901J087j249
2939f91l44m088o6j531k96K133o11J544j039K531J99k436K173j249K979k257Q8
$$ plain form
3058 -432 -576 -595 -4092 -4144 -2546 -640 -3294 -3880 -3452 -2053 20 -1119 -2286 -2884 -1849 -4134 -2145
3041 -2145 -1589 -1440 1229 -2495 -4342 -492 894 -821 -2015 -1908 -489 -3503 -3517 -2919 -1681 -1985 -371
3024 -371 1211 658 -1797 -2292 -1474 -1729 -797 113 1846 3763 1185 -1476 -2980 -956 -2727 -4776 -1722
3007 -1722 -768 -1830 -4239 -5273 -1558 -316 -3048 -1143 -1044 -2666 -4501 -4891 -4102 -4159 -3749 -2274 -6610
2990 -6610 -4983 -4162 -3996 -656 -312 -4888 -4800 -3101 -375 -1467 -4398 -3856 -3296 -2439 -208 -536 897
2973 897 -672 -1126 -87 -550 -4591 -5632 -3337 -5083 -949 94 -4021 -2370 -3577 -3926 -4845 -3571
2957 -3571 -5021 -4362 -4222 -6801 -6495 -6033 -2118 -2287 -3384 -44 -286 -937 1441 1391 1372 -529 558 -691
2939 -691 -1035 -5123 -5189 -6720 -7016 -4883 -5494 -3950 -4989 -2458 -2259 -4695 -2522 -3771 -792 -3049 -2961
2922b961Q8L615O82j657P28k386O88k045L029J427k211j018N23k315j710K413
2906c110J108J999J329n42J80l198J983K590j482j115n46k58n10j283l17R36J873
2889c63J250L57n8o24l421q56R31J632R9k373J001l73J427J769j483k747J501
2872b331k651J897N707r70p032P01M065n41r75K029O2j128J93k031J615Q3L75
2855i32J033j663j55J231J705l77j449J24o07L78o9R87J16N4j960NJ968k050M
2836a657O8L21M09n18o93p40J10L223k09m033K01P85l251j264K083K197p57j176
2818d901L425O29k117j189J376M07l44J013j2j467j300J882O18k253n9j827J752
2801d367J627K11K038J115k652k862J225k367J198q0k323J390j202J605L729l627
$$ plain form
2922 -2961 -2873 742 1424 -233 495 -1891 -1203 -3248 -219 1208 -1003 -2021 -1498 -3813 -5523 -3110
2906 -3110 -2002 -3 1326 784 964 -2234 -251 2339 857 -258 -804 -1062 -1572 -2855 -3172 -2236 -363
2889 -363 887 1244 1186 562 -2859 -3715 -2784 -1152 -1053 -3426 -2425 -2798 -1371 398 -1085 -3832 -2331
2872 -2331 -4982 -3085 2622 1652 -5380 -4679 -614 -1155 -2130 -101 -39 -1167 -974 -3005 -1390 -1307 -932
2855 -932 101 -1562 -1717 -486 1219 842 -607 -483 -1090 -712 -781 206 322 376 -1584 -1579 389 -1661 -1657
2836 -1657 -1589 -1268 -859 -1377 -2070 -2810 -2700 523 314 -3719 -3518 -2733 -5984 -7248 -5165 -2968 -3725 -4901
2818 -4901 -1476 -847 -2964 -4153 -2777 -2370 -2714 -1701 -1713 -3180 -4480 -2598 -1980 -4233 -4292 -6119 -4367
2801 -4367 -2740 -2529 -491 624 -2028 -4890 -3665 -6032 -4834 -4914 -7237 -5847 -7049 -5444 -1715 -5342
2785e342r03K306J445r49m299K489K046K18J953O93j984J562l860M9N49k368O21
2768e774j121J726O5j251l11M746p62l212K920m401L495j277L256J675k579m39
2752c244O39K215j935k558J70J889J613Q65j61m63j465K367K338p1m358k874J040
2735c993M469J033k370j407K154l069o13j7L363j66l850k61J633Q17J527j676
2719b426J376J795Rn868q19N724R39Q80k198k503r3p96j055P13j961J304K87P80
2701c912K409K78n59mq3o0J988m15l240p83L293J904l226N33Q48j542K920m62
2683a13j94r33K728k901l626J428L14o40j624O50k238L113J136L26K75o3r61N81
2665b742r9n17O18J688K55K74L62j181j981l14K367Om89J478J563j19j395n63
$$ plain form
2785 -5342 -6245 -3939 -2494 -3443 -7742 -5253 -3207 -2989 -1036 -343 -2327 -765 -4625 -4576 -4027 -6395 -5774
2768 -5774 -6895 -5169 -5104 -6355 -6666 -1920 -2682 -5894 -2974 -7375 -3880 -5157 -1901 -226 -2805 -3244
2752 -3244 -2605 -390 -2325 -4883 -4713 -2824 -1211 -346 -507 -970 -2435 -68 2270 2199 -2159 -5033 -3993
2735 -3993 476 1509 -861 -2268 -114 -3183 -3796 -3813 -450 -616 -4466 -4727 -3094 -2277 -750 -2426
2719 -2426 -1050 745 754 -5114 -5933 -209 730 1610 -588 -3091 -3184 -3980 -5035 -4322 -6283 -4979 -4692 -3912
2701 -3912 -1503 -1225 -1784 -1788 -1871 -1931 57 -358 -3598 -4381 -1088 816 -2410 -1877 -1029 -2571 349 -113
2683 -113 -307 -1240 1488 -1413 -5039 -3611 -3297 -3937 -5561 -4911 -7149 -4036 -2900 -2574 -2299 -2362 -3323 -2742
2665 -2742 -2841 -3358 -2740 -1052 -797 -523 -161 -1342 -3323 -3637 -1270 -1264 -1753 -275 1288 1169 -226 -789
2647g89K518k880j544K520m20j471K64k210j39l9l32j14l35k00J804O79j280j412
2629e380J247p94j303L814M39P2k477k218O56P22m39p6n1j443K29K720L85q45
2611d742j246j46K599J228j648K14j018j090N39K901J526O08j316m89j256J232
2595b104K078p81l459k094K157J2J916K03J838N32j174j20l319J268L295o92K2
2578d22O48P85k709l33l272j060N137p91K85L55K426n50l606Q04j31l81K647j37
2560c05K06m014R59J408n55M61j554R4k422Q91K795J609j51j503J078J066k765
2543b702K319M60k576m52O55j775J102J639J457k729m80k678K005N76J059M35
2527a685m96J324j340J179K07j418L94J517j131l096L33J665j216p72L935N35
$$ plain form
2647 -789 1729 -1151 -2695 -175 -595 -2066 -1802 -4012 -4151 -4190 -4522 -4636 -4971 -5171 -3367 -2688 -3968 -5380
2629 -5380 -4133 -4927 -6230 -2416 -1977 -1905 -4382 -6600 -5944 -5222 -5661 -5737 -5788 -7231 -7002 -4282 -3897 -4742
2611 -4742 -5988 -6134 -3535 -2307 -3955 -3741 -4759 -5849 -5310 -2409 -883 -275 -1591 -2080 -3336 -2104
2595 -2104 -26 -807 -4266 -6360 -4203 -4191 -2275 -2072 -234 298 -876 -996 -4315 -3047 248 -444 -422
2578 -422 226 1011 -1698 -2031 -5303 -6363 -1226 -2017 -1732 -1377 1049 499 -3107 -2303 -2434 -2815 -168 -305
2560 -305 -99 -4113 -3154 -1746 -2301 -1840 -3394 -3300 -5722 -4831 -2036 -427 -578 -2081 -1003 63 -2702
2543 -2702 -383 77 -2499 -2951 -2296 -4071 -2969 -1330 127 -2602 -3082 -5760 -3755 -3179 -2120 -1685
2527 -1685 -2181 -857 -2197 -1018 -811 -2229 -1835 -318 -1449 -4545 -4212 -2547 -3763 -4535 -600 -65
2511f5l503J845Q88J053k424J790J267k045L000J097k83J929k378k32k981M95
2495e47J5j706j027k19k225L529m36j85R42J032j18j160L84j548j482o82L841
2478a592Q98l744R11j081k38L329j758J615n30r67O88k60l35M570K17m655L66
2461b566J254m74j682J646O58k542O32M05Q96j329j957J413m77N20M223o25o7
2444g2j591j907J267k54j164K061O19P27j163k6K351J279l892k460M287J923J46
2427B131k56j478j758j001O35q82r98J469P30L38k453p88L730R62j241j457K080
2410b37k21j262j452O61J308P27P18j05ml73J210j284K216Q92lp8k776m05l397
2391c865l277L484J775J089j686q04O29J714q88j389O33P41j802l076L507K014
$$ plain form
2511 -65 -3568 -1723 -835 218 -2206 -416 851 -1194 1806 2903 2620 4549 2171 1939 -1042 -547
2495 -547 -532 -2238 -3265 -3484 -5709 -2180 -2616 -2801 -1859 -827 -945 -2105 -1721 -3269 -4751 -5433 -1592
2478 -1592 -694 -4438 -3527 -4608 -4846 -1517 -3275 -1660 -2190 -3157 -2469 -2729 -3064 1506 1723 -2932 -2566
2461 -2566 -1312 -1786 -3468 -1822 -1164 -3706 -3074 -2669 -1773 -3102 -5059 -3646 -4123 -3603 620 -5 -72
2444 -72 -1663 -3570 -2303 -2557 -3721 -1660 -1041 -314 -1477 -1503 848 2127 -1765 -4225 62 1985 2131
2427 2131 1875 397 -1361 -2362 -1727 -2609 -3607 -2138 -1408 -1070 -3523 -4311 -581 381 -860 -2317 -237
2410 -237 -458 -1720 -3172 -2511 -1203 -476 242 137 133 -240 970 -314 1902 2794 2791 2713 -63 -468 -3865
2391 -3865 -7142 -3658 -1883 -794 -2480 -3284 -2655 -941 -1829 -3218 -2585 -1844 -3646 -6722 -3215 -1201
2375a201j242L19K855j831N70L096k216p86j128l422K203k393J425J569j229J673
2359a738J75n18n70J158J930L29l447o16J229L290j403l016K55J761J81k001J73
2342b828K245O02N49k768K34J415J112M39j375l827j405M565nk022J008r86L69
2325b678O31K063J117P62J207k323m163j850K724j057K978R37l043j278L47j170
2309d796j066K995J154j36p09N08j727m14J383L336L09nj580m32k200j991J833
2292c538K279K050j447j671n59J481j882N31j144L123J29r68M01K839J711k8m510
2275a203q52J000k682m38m94K576k47j876K44J465J922j211k686J918P98L146
2259A380j894j801j075r0J950j82j975nR59l805R47L453n40J898M07n06q44m42
$$ plain form
2375 -1201 -2443 -2124 731 -1100 -530 2566 350 -436 -1564 -4986 -2783 -5176 -3751 -2182 -3411 -1738
2359 -1738 -1563 -2081 -2651 -1493 437 766 -2681 -3297 -2068 1222 -181 -3197 -2942 -1181 -1000 -3001 -2828
2342 -2828 -583 19 568 -2200 -1966 -551 561 1000 -375 -4202 -5607 -1042 -1047 -3069 -2061 -3047 -2678
2325 -2678 -2047 16 1133 1895 3102 779 -3384 -5234 -2510 -3567 -589 348 -2695 -3973 -3626 -4796
2309 -4796 -5862 -2867 -1713 -1849 -2558 -2050 -3777 -4191 -2808 528 837 832 -748 -1180 -3380 -5371 -3538
2292 -3538 -1259 791 -656 -2327 -2886 -1405 -3287 -2756 -3900 -777 -648 -1616 -1215 1624 3335 3307 -1203
2275 -1203 -2055 -1055 -3737 -4175 -4669 -2093 -2340 -4216 -3972 -2507 -585 -1796 -4482 -2564 -1766 1380
2259 1380 -514 -2315 -3390 -3480 -1530 -1712 -3687 -3692 -2733 -6538 -5591 -2138 -2678 -780 -373 -879 -1723 -2165
2241b165n35O26K323l703JK081J952l14K38o3l595Q99j089J305L129l418K191
2224a37N34j710J645K27O09J446P90j420k85J556k953J343K622k082J55j799j543
2207a002K08k11M9k619N3K326M0K46K062j515l383M20J531k335K130R78N9J283
2189C20k053Q14r50K155J895j112j698l505Q52K018J582K28q56j00O98n05j886
2172b103J473O12j706j04J34r04J760m53m78J455J426l798L71j82K987r7k178
2155a785K678m52k031Q0M850j636l589J998J005N39j717n63k845K236r28j541
2139c701J810K890O77K35j196l346L146j066k94L78O99n20J05P25l290j68M954
2122B038j513m015K566J340L77j546k002K875P52P99j091K496n32l23O27O88M24
$$ plain form
2241 -2165 -2700 -2074 249 -3454 -3453 -1372 580 266 504 441 -3154 -2255 -3344 -2039 1090 -2328 -137
2224 -137 397 -1313 332 559 1168 2614 3404 1984 1699 3255 302 1645 4267 2185 2340 541 -1002
2207 -1002 -794 -1005 -956 -3575 -3522 -1196 -1156 -910 1152 -363 -3746 -3326 -1795 -4130 -2000 -1022 -963 320
2189 320 -1733 -919 -1869 286 2181 1069 -629 -4134 -3282 -1264 318 546 -310 -410 288 -217 -2103
2172 -2103 -630 -18 -1724 -1828 -1694 -2598 -838 -1291 -1769 -314 1112 -2686 -2315 -2497 490 393 -1785
2155 -1785 893 441 -1590 -1510 3340 1704 -1885 113 1118 1657 -60 -623 -3468 -1232 -2160 -3701
2139 -3701 -1891 999 1676 1911 715 -2631 515 -551 -845 -467 232 -288 -183 542 -2748 -2916 2038
2122 2038 525 -3490 -924 416 793 -753 -2755 120 872 1671 580 3076 2544 2221 2848 3536 3960
2105C960J41o906J51L735K560l324j481K209j24k390J159j134J396N02q64q28
2089a238Q72K03j695R65p46M50J92N23O60J496K8j623l071M17J198j39m2L193
2071A643j72j674k017J637L20m12j513L217j797J689k564k58J074L19n9k747K229
2054a085n45J93L40O4M628j891j042J11J703L04k632j621j437K313Q03o79j013
2037a486k037K199L405J924o3l535j048j845q08L075L1j239P58m70J550J048j714
2020b55J2L864p41j485J527J13p2j09l253k254K37K062M155l699j874K901k719
2003a590L3l87Q37K177o0j054L136p28k930K018J176J453l858k335n97K716q9
1986h2l423J26K260P83j078O01j550m2k90J389L04Q22N09J127O51j373k939j002
$$ plain form
2105 3960 4101 -2805 -2654 1081 3641 317 -1164 1045 921 -1469 -310 -1444 -48 454 -410 -1238
2089 -1238 -366 -163 -1858 -893 -1639 -1189 -997 -474 186 1682 1710 87 -2984 -2567 -1369 -1508 -1550 1643
2071 1643 1471 -203 -2220 -583 -263 -675 -2188 1029 -768 921 -1643 -1901 -827 -508 -567 -3314 -1085
2054 -1085 -1630 -1437 -1097 -1033 3595 1704 662 773 2476 2780 148 -1473 -2910 -597 206 -473 -1486
2037 -1486 -3523 -1324 2081 4005 3942 407 -641 -2486 -3294 -219 -188 -1427 -669 -1139 411 1459 -255
2020 -255 -243 3621 2880 1395 2922 3035 2963 2854 -399 -2653 -2416 -354 3801 102 -1772 1129 -1590
2003 -1590 -1557 -1944 -1107 1070 1010 -44 3092 2364 -566 1452 2628 4081 223 -2112 -2709 7 -82
1986 -82 -3505 -3379 -1119 -336 -1414 -813 -2363 -2405 -2695 -1306 -1002 -180 329 1456 2107 734 -2205 -3207
1968c207K014O63j690k90K100K328l266o14K533J413o40l104k262Q60L119K171
1952B128j453J292j48l292j876K626J900j413m94L3q01J060K454M16k657J631
1936A406l35k990P01j412l486N73J199L146J448j711J064K528l419l111M419O11
1920F31lo19K579l568J3j252k973K827N7j905J061j089j095j72L245J242k272
1903c293K617K766k11m294k726K226J071j393L284O184j418l299P01L88j009k484
1887h90j823j080Q32J250m5M375p27J098j797l66q23k596K199j236o7Q2K347K2
1869G55l505j576M549L175k996n62K576l420l526J120L345r81j072L536q34k564
1853a980m90q49M903o54k50K096k563j35P93o07O34J615J602m283J868M98k763
$$ plain form
1968 -3207 -1193 -530 -2220 -2510 -410 1918 -1348 -1962 571 1984 1344 -1760 -4022 -3162 -43 2128
1952 2128 675 1967 1819 -1473 -3349 -723 1177 -236 -730 -697 -1498 -438 2016 2432 -225 1406
1936 1406 1071 -1919 -1218 -2630 -6116 -5543 -4344 -1198 250 -1461 -397 2131 -1288 -4399 20 631
1920 631 628 9 2588 -980 -967 -2219 -5192 -2365 -2308 -4213 -3152 -4241 -5336 -5508 -2263 -1021 -3293
1903 -3293 -676 2090 1879 -2415 -5141 -2915 -1844 -3237 47 6231 4813 1514 2215 2603 1594 -890
1887 -890 -2713 -3793 -2961 -1711 -1756 2619 1892 2990 1193 827 4 -2592 -393 -1629 -1696 -1614 733 755
1869 755 -2750 -4326 223 3398 402 -160 2416 -1004 -4530 -3410 -65 -1046 -2118 1418 584 -1980
1853 -1980 -2470 -3319 1584 930 680 2776 213 78 871 264 898 2513 4115 -168 1700 2198 -565
1836e65L519l450j475j225K415K584m52k913l51m69l33L502l78L21K056j633K202
1819C355q21l115L084l34j446m8q49q45K541k189k126M349P55K339j581k212J499
1802B356N9o32J500j808q23j532j219L273J447L76k766O17q48J284J334k103o6
1785D49l2L011j228j35j651m731k74n37K488q94P77L160m08l472l28L124J541
1768H60k605K4M61J170K89O58O99o64J617j984k453k38J421k65R05l67L20L321
1750C169k238j357K513l596j450K242n40n9J310k00j175k921J750M967M42L22
1734C179k02l091L49J231r79k009P35J383l253J995K92j568P24O79K746j585k523
1717a897J614M59r34J886R8j260J07K360j988p59O01k602J508O20j416O35J934
$$ plain form
1836 -565 2954 -496 -1971 -3196 -781 1803 1351 -1562 -1913 -2382 -2715 787 409 730 2786 1153 3355
1819 3355 2534 -581 2503 2169 723 675 -174 -1019 1522 -667 -2793 1556 2311 4650 3069 857 2356
1802 2356 2415 1783 3283 1475 652 -880 -2099 1174 2621 2997 231 848 0 1284 2618 515 449
1785 449 417 3428 2200 2065 414 -4317 -4591 -5128 -2640 -3534 -2757 403 -5 -3477 -3805 -681 860
1768 860 -1745 -1721 -1260 -90 199 857 1556 892 2509 525 -1928 -2166 -745 -1010 -105 -472 -152 3169
1750 3169 931 -426 2087 -1509 -2959 -717 -1257 -1316 -6 -206 -1381 -4302 -2552 2415 2857 3179
1734 3179 2977 -114 235 1466 487 -1522 -787 596 -2657 -662 -370 -1938 -1214 -535 2211 626 -1897
1717 -1897 -283 176 -758 1128 1226 -34 73 2433 445 -314 287 -2315 -807 -187 -1603 -968 966
1700I66J099n33p51Q22j075J825K265M36l548j603k703j04K794K234k185O74k846
1683b233J222N42K64p64R07J789n09K950l221m5k979K64J619L308J375j771k009
1666G09Q29j693J066P12l330M571J025j003l785j068K024J431J759m077p43j28
1650a701M919Q85n75m91k206j9O67j615j615L241N17k760k19J247M1J944N6j679
1632F37M323L326k686p84l117k525R52J806m49l467N56q30j865K67K737J928J542
1615B351P31K565K483l373n459K927J813l076K508m743k642J529L291L92j935
1600f38J328J02P08K157j696j595J779j267J886j024k157R6N21J549q90j995L372
1583B236k966k73J135J909p19J330J687j367k400l37j541j144qn64L489k363J717
$$ plain form
1700 966 2065 1532 781 1603 528 2353 4618 5054 1506 -97 -2800 -2904 -110 2124 -61 613 -2233
1683 -2233 -1011 -469 -205 -969 -62 1727 1218 4168 947 902 -2077 -1813 -194 3114 4489 2718 709
1666 709 1538 -155 911 1623 -1707 2864 3889 2886 -899 -1967 57 1488 3247 -830 -1573 -1701
1650 -1701 3218 4103 3528 3037 831 812 1479 -136 -1751 1490 2007 -753 -972 275 316 2260 2316 637
1632 637 4960 8286 5600 4816 1699 -826 126 1932 1483 -1984 -1428 -2258 -4123 -3856 -1119 809 2351
1615 2351 3082 5647 8130 4757 -702 2225 4038 962 3470 -1273 -3915 -2386 905 1297 -638
1600 -638 690 792 1500 3657 1961 366 2145 878 2764 1740 -417 -321 200 1749 859 -1136 2236
1583 2236 -730 -1003 132 2041 1322 2652 4339 2972 572 235 -1306 -2450 -2458 -3022 467 -1896 -179
1566a79J061pp15j828R12J39J74K774l17k061L379j819j309K090O5N5m500J068
1548a018J013j322J975Q30O53k62k45R21n4J293j841k814k000J638l84J525k478
1531b570K062k15P34L617k778r61J225j72Q78J658L53J127j101j225J173K419
1515F224l365m030M62J871j477J46J91j151K900p82J619j106j556j268r75j345
1499c642L757K80l676K492q05p22K30l36r95L228L243J520l596m662p6O33J396
1482a731L791o09R9J714lp08j894Q16j840j24K189k188j348K331j069j369j15
1465b058J742J261n16o66J601J196K681k01l120l667l599K658L328p07J260j076
1449A17q87O02J642M41j824J335k239J018K131p97k406J124L42M49J250K20p68
$$ plain form
1566 -179 882 875 160 -1668 -756 -617 -443 2331 2014 -47 3332 1513 204 2294 2359 2414 -2086 -1018
1548 -1018 -5 -1327 648 1478 2131 1869 1624 2545 2491 3784 1943 -871 -2871 -1233 -1617 -92 -2570
1531 -2570 -508 -723 11 3628 850 -111 1114 942 1820 3478 3831 4958 3857 2632 3805 6224
1515 6224 2859 -1171 -709 1162 -315 -169 22 -1129 1771 989 2608 1502 -54 -1322 -2297 -3642
1499 -3642 115 395 -3281 -789 -1594 -2316 -2086 -2422 -3417 -189 3054 4574 978 -3684 -3760 -3127 -1731
1482 -1731 2060 1451 1550 3264 3261 2553 659 1475 -365 -489 1700 -488 -1836 495 -574 -1943 -2058
1465 -2058 -316 945 429 -237 1364 2560 5241 5040 1920 -1747 -5346 -2688 640 -67 1193 117
1449 117 -770 -168 1474 1915 91 1426 -813 205 2336 1539 -867 257 599 1048 2298 2518 1750
1432A750J823j385N10J55j810l494o02R35J097m42n04J425R31m224K097m0J170
1415f08P79N10O34L05p03K322j061j921j602L95L566J23N69k435n35j055J918
1398A201k115M29R69k033Q70J382q4N90J292j622k836P08L054K364n441l135L717
1381f90K414l34k079k158J476k23K95j266J763k420PO31J594M90J62k39n35M033
1363B921q06k580R98K388j78j710k869J946K78K94K122q37j804L996j551k036
1347E72J033k022R97j018o09M083j731j888L267j168r39L195N39n497K027J683
1331B524q77K722L61m5O33j277k604j423O71k672n36J763N94M468j543k850L241
1314C150K003p77l35j418k760J860q61K530L72k962L4L43j605j059M29J254M20
$$ plain form
1432 1750 3573 2188 2698 2853 1043 -2451 -3053 -2118 -1021 -1463 -1967 -542 389 -3835 -1738 -1778 -608
1415 -608 171 681 1315 1620 917 3239 2178 257 -1345 -950 2616 2739 3308 873 338 -717 1201
1398 1201 -914 -485 484 -1549 -679 703 619 1209 2501 879 -1957 -1249 1805 4169 -1272 -4407 -690
1381 -690 1724 1390 -689 -2847 -1371 -1594 -1299 -2565 -802 -3222 -3215 -2584 -990 -500 -338 -577 -1112 2921
1363 2921 2115 -465 533 2921 2743 1033 -1836 110 388 682 2804 1967 163 4159 2608 572
1347 572 1605 -417 580 -438 -1047 3036 1305 -583 2684 1516 577 3772 4311 -1186 841 2524
1331 2524 1647 4369 4730 4685 5318 4041 1437 14 685 -1987 -2523 -760 -166 4302 2759 -91 3150
1314 3150 5153 4376 4041 2623 -137 1723 862 3392 3764 802 836 1179 -426 -1485 -1056 198 618
1297F18L25j701j099K221K747J634n086j478k7J521P63j052J312J23o92j666k117
1280c654L155K538n57j533j913K132l65K28k475L232J215Q53j655j140K306j044
1264A323q36L54R24j421M66l30K04r84k509L285K307j999Q89k89K77l068M294
1247B887J903l067j915J424k759K6O043k97p96P39k065l605K26J542P48J225j913
1230C46j707J200J200j515K763K525K007l027P1m0J45P76k398k802J959L024l242
1213A285j61l79K220k888l679Q46K996m51M29k149o37R33O67P97L213k412r80
1196c50K691k695L452L128j021n30J152p81Q85N42k478l958J63L017J704J789
1180F710q90m458l300M29J167K531K386K07j183l406j37L503L244l922M18k698
$$ plain form
1297 618 943 -758 -1857 364 3111 4745 -341 -1819 -1846 -325 438 -614 698 821 129 -1537 -3654
1280 -3654 -499 2039 1482 -51 -1964 168 -197 31 -2444 788 2003 2856 1201 61 2367 1323
1264 1323 487 841 1765 344 810 480 684 -300 -2809 476 2783 784 1673 1384 1661 -1407 2887
1247 2887 4790 1723 -192 1232 -1527 -1501 4542 4245 3449 4188 2123 -1482 -1256 286 1034 2259 346
1230 346 -1361 -161 1039 -476 2287 4812 6819 3792 3863 3823 3968 4744 2346 -456 1503 4527 1285
1213 1285 1124 745 2965 77 -3602 -2756 240 -211 218 -1931 -2568 -1635 -968 -171 3042 630 -350
1196 -350 2341 -354 3098 6226 5205 4675 5827 5046 5931 6473 3995 37 200 3217 4921 6710
1180 6710 5820 1362 -1938 -1509 -342 2189 4575 4782 3599 193 56 3559 6803 2881 3299 601
1164F01J543N50j548l19j029j078J842K491j222o06p14L67k382m373K581M103
1148H07J642j413l063J80M44K275k189K73j64K824j342M57j65L47N46J495j987
1131I67j541L84p68J772Q89m50N97k87K775j130r99N60j658k04J907K054l375
1114A493r21l5K245O67l464j976Q58N09k491K349k16j194K172L527L92j902k10
1097A803o76r89J424%j332j363O0M275j13L28o69k210j621J528J5r86J024j130
1079f32R46L867k207k323K92J798L063M93k197p58K02J797n99P95j962L78J017
1062C970n83L88o686K062m62r3M00r19J428K195j472j887J055J80J234m37Q21
1045A194L06j777kk141J031N561J301n750m090L638J040r9r8l01P69J197l440
$$ plain form
1164 601 2144 2694 1146 827 -202 -1280 562 3053 1831 1225 511 878 -1504 -5877 -3296 807
1148 807 2449 1036 -2027 -1847 -1403 872 -1317 -1044 -1208 1616 274 731 566 913 1459 2954 967
1131 967 -574 -190 -958 814 1703 1253 1850 1563 4338 3208 2209 2769 1111 907 2814 4868 1493
1114 1493 572 537 2782 3449 -15 -1991 -1133 -624 -3115 -766 -982 -2176 -4 3523 3915 2013 1803
1097 1803 1127 138 1562 1562 230 -1133 -1073 3202 3089 3417 2748 538 -1083 445 460 -526 498 -632
1079 -632 314 4181 1974 -349 -57 1741 4804 5297 3100 2342 2544 4341 3742 4537 2575 2953 3970
1062 3970 3387 3775 -2911 -849 -1311 -1404 -1004 -1923 -495 1700 228 -1659 -604 -424 810 373 1194
1045 1194 1500 -277 -279 -2420 -1389 4172 5473 -277 -4367 -729 311 212 114 -187 582 1779 -1661
1028a661l40J814K394L57M040n25k371k964j470J986r40j522J658J138m63J880
1012C011j710l971J614K999p88j682j93k347J42N156k426l9j522K384N08k832
996a696J094M380K200j387j662N87j358n33j656O70L285k630Q03J252J036k812
980A573N29J216m435J540j10k249k278Q03L255K289L485k961n8K98J059l513j212
963g69L430j337j282K58j373L551J446n798J049K509K321j265J117Lk845J876
947B891O19M70j901j508P57Q49J077K120O5k289j940Q04m13k20j068J335J849
930C497p27n52M71J092k388p52M314K75R0j815L26J931P78l499j708j102p4n09
912c52l44O27l463K153J018K602p56M201j247k137q8l34j426o4K016j361o57L866
$$ plain form
1028 -1661 -2001 -187 2207 2564 6604 6079 3708 744 -726 1260 320 -1202 456 1594 1131 3011
1012 3011 1301 -2670 -1056 1943 1155 -527 -720 -3067 -2925 2231 -195 -234 -1756 628 1136 -1696
996 -1696 -602 3778 5978 4591 2929 3516 2158 1625 -31 639 3924 1294 2097 3349 4385 1573
980 1573 2102 3318 -1117 423 313 -1936 -4214 -3411 -156 2133 5618 2657 2599 2897 3956 443 -769
963 -769 2661 1324 42 300 -1073 2478 3924 -1874 -825 1684 4005 2740 3857 3860 1015 2891
947 2891 3510 3980 2079 571 1328 2177 3254 5374 5439 3150 1210 2014 1601 1381 313 1648 3497
930 3497 2770 2218 2689 3781 1393 641 4955 5230 5320 3505 3831 5762 6540 3041 1333 231 157 -352
912 -352 -696 -69 -3532 -1379 -361 2241 1485 5686 4439 2302 2214 1880 454 390 2406 1045 388 4254
894D254m5r90l270N87j719r1q21K183r86j879M19j236J409q28Q69J703m2r91j565
875c039M436L012n602K6r20J140J184K504KJ163j121K154Q10k200k138q81j94
858C36K138O42o94m206J424J142j228L422n85j637L78K287j376m0O53r26j383
841C47j540Q12J654j734J614P58K546k333j439K240K582q85r27k20l800J04Q95
824F74k617J538J155l221K457J107r94j911J065P72P54J811r1j015R84n45r30
807I93q04L50L455m144k096J076P96J406q16J921J023o92l38J011j845l40N7l559
789b546J826J600m27K547k52j561M02R84k71j130K093Q75P36J038m851J35k09
772I89j569j994P29n9M49J367l251N38J896J959k036M09J282J81J634N64j207
$$ plain form
894 4254 4209 3219 -51 536 -1183 -1274 -2095 88 -898 -2777 -2358 -3594 -2185 -3013 -2144 -441 -483 -1474 -3039
875 -3039 1397 4409 -1193 -1167 -2087 -947 237 2741 2743 3906 2785 4939 5749 3549 1411 530 336
858 336 2474 3116 2422 -1784 -360 782 -446 2976 2391 754 1132 3419 2043 2003 2656 1730 347
841 347 -1193 -381 1273 -461 1153 1911 4457 2124 685 2925 5507 4622 3695 3475 -325 -221 674
824 674 -1943 -405 750 -2471 -14 1093 99 -1812 -747 25 779 2590 2499 1484 2468 1923 993
807 993 189 539 3994 -150 -2246 -1170 -374 1032 216 2137 3160 2468 2130 3141 1296 956 1013 -2546
789 -2546 -720 880 453 3000 2748 1187 1589 2573 2302 1172 3265 4140 4876 5914 1063 1198 989
772 989 -580 -2574 -1845 -1904 -1455 -88 -3339 -2801 -905 1054 -982 -573 709 890 2524 3088 1881
755A881j121j06m59J964j852K095j030m18J308K135K18k735J572j459O12K780
739E385q25l463r0l2p19m13P96k646n35j581K120L900k018m25J028R86K29j750
721e3J02J601K704j932k935l20K208j01M12Q27J168j000r64J556k059J327O83
704C224r81j951R74M82j815Q8L308L57m513k455J247J151K424j967J69n22l31
687a111J559M36l597j230J001J901j15M44J730k740L14J379J968K459k560k444
671f06r54o61J10K662J787r09j375j538P85n11N043J170P42j665m103j324P29
654f18q68l88n88Q26j08J427K232O55p47j550p00K80L395q89k995K9M117k05k002
635A303q15p25r59J0J180Q7j597J45K08r41K344j369K408J78j831J957n55l126
$$ plain form
755 1881 760 654 195 2159 307 2402 1372 954 2262 4397 4615 1880 3452 1993 2605 5385
739 5385 4560 1097 1007 975 256 -157 639 -2007 -2542 -4123 -2003 1897 -121 -546 482 1468 1697 -53
721 -53 49 1650 4354 2422 -513 -833 1375 1274 1686 2513 3681 2681 1717 3273 1214 2541 3224
704 3224 2243 292 1266 1748 -67 21 3329 3686 -827 -3282 -2035 -884 1540 -427 -258 -780 -1111
687 -1111 448 884 -2713 -3943 -2942 -1041 -1156 -712 1018 -1722 -1408 -29 1939 4398 1838 -606
671 -606 -1560 -2221 -2111 551 2338 1429 54 -1484 -699 -1210 3833 5003 5745 4080 -23 -1347 -618
654 -618 -1486 -1874 -2462 -1636 -1744 -317 1915 2570 1823 273 -427 -147 3248 2359 -636 -607 3510 3305 1303
635 1303 488 -237 -1196 -1186 -6 81 -1516 -1371 -1163 -2104 240 -1129 1279 1457 -374 1583 1028 -2098
617b098l93m50J210j96L16j386P88o65K178M62q13k76k617J987J396j323J022
600h58J65k73J658j399k960J54K319J356R53j679J311l131J837L369J993j644
584C171l135j99k876j43K290o76L97l88Q13j307R12r0J004m914J489J197j413
$$ plain form
617 -2098 -2491 -2941 -1731 -1927 -1611 -2997 -2209 -2874 -696 -234 -1047 -1323 -3940 -1953 -557 -1880 -858
600 -858 -693 -966 692 -707 -3667 -3513 -1194 162 1115 -564 747 -2384 -547 2822 4815 3171
584 3171 36 -163 -3039 -3182 -892 -1568 -1171 -1559 -746 -2053 -1141 -1231 -227 -5141 -3652 -2455 -3868
$$ [...]
##END NTUPLES=NMR SPECTRUM
##END=
