##TITLE=1H_CA-9260-1
 DMSO
 8 sc, 
 5.4.2024
##JCAMPDX= 6.0         $$ Bruker NMR JCAMP-DX V2.0
##DATA TYPE= NMR SPECTRUM
##DATA CLASS= NTUPLES
##ORIGIN= UXNMR, Bruker Analytische Messtechnik GmbH
##OWNER= root
$$ XWIN-NMR		Version 3.5
$$ Fri Apr  5 13:53:42 2024 Russian Standard Time (UT+4h)  she@DPX200
##.OBSERVE FREQUENCY= 200.1309
##.OBSERVE NUCLEUS= ^1H
##.ACQUISITION MODE= SIMULTANEOUS
##.ACQUISITION SCHEME= undefined
##.AVERAGES= 8
##.DIGITISER RES= 18
##SPECTROMETER/DATA SYSTEM= spect
##.PULSE SEQUENCE= zg30
##.SOLVENT NAME= MeOD
##.SHIFT REFERENCE= (INTERNAL, MeOD, 0, 15.6885)
##AUDIT TRAIL= $$ (NUMBER, WHEN, WHO, WHERE, WHAT)
$$ ##TITLE= Audit trail, XWIN-NMR		Version 3.5
$$ ##JCAMPDX= 5.01
$$ ##ORIGIN= Bruker BioSpin GmbH
$$ ##OWNER= she
$$ F:/spectra/data/she/nmr/H-F/1/pdata/1/auditp.txt
$$ ##AUDIT TRAIL=  $$ (NUMBER, WHEN, WHO, WHERE, WHAT)
(   1,<2024-04-05 13:50:57.56 +0400>,<she>,<DPX200>,
      <created by zg, POWCHK disabled, PULCHK disabled
       configuration hash MD5:
       00 E9 B6 7A A2 85 ED C7 34 08 36 98 17 FE 4E 26
       data hash MD5: 16K
       C6 22 EA C8 66 F2 99 28 75 1D C7 B3 59 B3 DB 05>)
(   2,<2024-04-05 13:52:50.17 +0400>,<she>,<DPX200>,
      <Start of raw data processing
       efp BC_mod = 2 LB = 0.24 FT_mod = 6 PKNL = 1 PHC0 = -25302.15 PHC1 = 10.98731 SI = 16K 
       data hash MD5: 16K
       A5 EB 19 0E 52 4F D8 58 18 B2 16 F4 4D C0 FA D7>)
(   3,<2024-04-05 13:53:05.81 +0400>,<she>,<DPX200>,
      <pk PHC0 = -77.54575 PHC1 = -1.4 
       data hash MD5: 16K
       A4 CD AD 79 55 1E 40 85 27 1C A9 A8 62 16 35 31>)
(   4,<2024-04-05 13:53:09.12 +0400>,<she>,<DPX200>,
      <abs ABSG = 5 
       data hash MD5: 16K
       20 F3 ED 41 ED C1 C1 74 65 43 EE A6 30 03 D0 71>)
$$ ##END=
$$ 
$$ hash MD5
$$ 84 40 59 13 59 AA 6F 55 6F 0A C4 20 5E 06 A7 B6
##$RELAX= 
##$RELAX= 
##$RELAX= 
##$RELAX= 
##$RELAX= 
##$RELAX= 
$$ Bruker specific parameters
$$ --------------------------
##$DU= <F:/spectra>
##$EXPNO= 1
##$NAME= <H-F>
##$PROCNO= 1
##$TYPE= <nmr>
##$USER= <she>
##$AMP= (0..31)
100 100 100 100 100 100 100 100 100 100 100 100 100 100 100 100 100 100 
100 100 100 100 100 100 100 100 100 100 100 100 100 100 
##$AQSEQ= 0
##$AQ_mod= 1
##$AUNM= <au_zg>
##$AUTOPOS= <>
##$BF1= 200.13
##$BF2= 200.13
##$BF3= 200.13
##$BF4= 200.13
##$BF5= 200.13
##$BF6= 200.13
##$BF7= 200.13
##$BF8= 200.13
##$BYTORDA= 1
##$CFDGTYP= 0
##$CFRGTYP= 5
##$CHEMSTR= <none>
##$CNST= (0..31)
1 1 145 1 1 1 1 1 1 1 1 1 1 1 1 1 1 1 1 1 1 1 1 1 1 1 1 1 1 1 1 1 
##$CPDPRG= <>
##$CPDPRG1= <>
##$CPDPRG2= <>
##$CPDPRG3= <>
##$CPDPRG4= <mlev>
##$CPDPRG5= <mlev>
##$CPDPRG6= <mlev>
##$CPDPRG7= <mlev>
##$CPDPRG8= <mlev>
##$CPDPRGB= <>
##$CPDPRGT= <>
##$D= (0..31)
0 1.2 0 0 0 0 0 0 0 0.06 0 0.03 0 0 0 0 0.0002 0 0 0 0 0 0 0 0 0 0 0 0 
0 0 0 
##$DATE= 1712310656
##$DBL= (0..7)
120 120 120 120 120 120 120 120 
##$DBP= (0..7)
150 150 150 150 150 150 150 150 
##$DBP07= 0
##$DBPNAM0= <>
##$DBPNAM1= <>
##$DBPNAM2= <>
##$DBPNAM3= <>
##$DBPNAM4= <>
##$DBPNAM5= <>
$$ [...]
##$SUBNAM3= <"">
##$SUBNAM4= <"">
##$SUBNAM5= <"">
##$SUBNAM6= <"">
##$SUBNAM7= <"">
##$SUBNAM8= <"">
##$SUBNAM9= <"">
##$SW= 18.0517689322627
##$SWIBOX= (0..15)
0 0 2 0 0 0 0 0 0 0 0 0 0 0 0 0 
##$SW_h= 3612.71676300578
##$TD= 16384
##$TD0= 1
##$TE= 0
##$TE2= 300
##$TE3= 300
##$TEG= 300
##$TL= (0..7)
0 120 120 120 120 120 120 120 
##$TP= (0..7)
150 150 150 150 150 150 150 150 
##$TP07= 0
##$TPNAME0= <>
##$TPNAME1= <>
##$TPNAME2= <>
##$TPNAME3= <>
##$TPNAME4= <>
##$TPNAME5= <>
##$TPNAME6= <>
##$TPNAME7= <>
##$TPOAL= (0..7)
0.5 0.5 0.5 0.5 0.5 0.5 0.5 0.5 
##$TPOFFS= (0..7)
0 0 0 0 0 0 0 0 
##$TUNHIN= 0
##$TUNHOUT= 0
##$TUNXOUT= 0
##$USERA1= <user>
##$USERA2= <user>
##$USERA3= <user>
##$USERA4= <user>
##$USERA5= <user>
##$V9= 5
##$VALIST= <valist>
##$VCLIST= <CCCCCCCCCCCCCCC>
##$VD= 0
##$VDLIST= <DDDDDDDDDDDDDDD>
##$VPLIST= <PPPPPPPPPPPPPPP>
##$VTLIST= <TTTTTTTTTTTTTTT>
##$WBST= 1024
##$WBSW= 4
##$XGAIN= (0..3)
0 0 0 0 
##$XL= 0
##$YL= 0
##$YMAX_a= 211464
##$YMIN_a= -226330
##$ZGOPTNS= <>
##$ZL1= 120
##$ZL2= 120
##$ZL3= 120
##$ZL4= 120
##$ABSF1= 15.68852
##$ABSF2= -2.363369
##$ABSG= 5
##$ABSL= 3
##$ALPHA= 0
##$AQORDER= 0
##$ASSFAC= 0
##$ASSFACI= 0
##$ASSFACX= 0
##$ASSWID= 0
##$AUNMP= <proc_1d>
##$AZFE= 0.1
##$AZFW= 0.1
##$BCFW= 0
##$BC_mod= 2
##$BYTORDP= 0
##$COROFFS= 0
##$CY= -3
##$DATMOD= 1
##$DC= 0
##$DFILT= <>
##$DTYPP= 0
##$F1P= 0
##$F2P= 0
##$FCOR= 1
##$FTSIZE= 16384
##$FT_mod= 6
##$GAMMA= 0
##$GB= 0
##$INTBC= 1
##$INTSCL= 3.70164e-10
##$ISEN= 128
##$LB= 0.24
##$LEV0= 0
##$LPBIN= 0
##$MAXI= 10000
##$MC2= 0
##$MEAN= 0
##$ME_mod= 0
##$MI= 1.114404
##$NCOEF= 0
##$NC_proc= -6
##$NLEV= 6
##$NOISF1= 3.799351
##$NOISF2= 2.8
##$NSP= 0
##$NTH_PI= 0
##$NZP= 0
##$OFFSET= 15.68852
##$PC= 1
##$PHC0= -25379.7
##$PHC1= 9.587311
##$PH_mod= 1
##$PKNL= yes
##$PPARMOD= 0
##$PSCAL= 0
##$PSIGN= 0
##$REVERSE= no
##$SF= 200.129566621028
##$SI= 16384
##$SIGF1= 3
##$SIGF2= 2
##$SINO= 5.538805
##$SIOLD= 16384
##$SREGLST= <1H.CDCl3>
##$SSB= 0
##$STSI= 16384
##$STSR= 0
##$SW_p= 3612.71676300577
##$SYMM= 0
##$S_DEV= 0
##$TDeff= 16384
##$TDoff= 0
##$TI= <>
##$TILT= no
##$TM1= 0
##$TM2= 0
##$TOPLEV= 0
##$USERP1= <user>
##$USERP2= <user>
##$USERP3= <user>
##$USERP4= <user>
##$USERP5= <user>
##$WDW= 1
##$XDIM= 16384
##$YMAX_p= 533506403
##$YMIN_p= -239778
$$ End of Bruker specific parameters
$$ ---------------------------------
##NTUPLES= NMR SPECTRUM
##VAR_NAME=  FREQUENCY,     SPECTRUM/REAL,   SPECTRUM/IMAG
##SYMBOL=    X,             R,               I
##VAR_TYPE=  INDEPENDENT,   DEPENDENT,       DEPENDENT
##VAR_FORM=  AFFN,          ASDF,            ASDF
##VAR_DIM=   16384,         16384,           16384
##UNITS=     HZ,            ARBITRARY UNITS, ARBITRARY UNITS
##FACTOR=    0.220516191357247, 1,           1
##FIRST=     3139.73679488495, 0,            0
##LAST=      -472.979968120819, 0,           0
##MIN=       -472.979968120819, -239778,     0
##MAX=       3139.73679488495, 533506403,    0
$$ Real data points
##PAGE= N=1
##DATA TABLE= (X++(R..R)), XYDATA
$$ [...]
8589b1919l569K620p502L170o859O518k1328P287r5560j02636K35040L0591k0409
8576E444o944k636J015l235k908J1428n057o129m854K324N307J068j181j534m572
8561a2464j184j60L893m169M208J279m6l253m942K774J94K337m046L110l256J520
8545a4205p752L865M677P16L633o0o784N138p744k372L079j335N699M425l326
8530a2346j536r18M38J666L82K519j2163q80J6342l184L156o097N16K008J242
8515h855k27J989q473k99M35J770p866P723L000M271n307p870m826j009J033R705
8499a4806m074K115K129n705L918J787K06k916K974%K328m156n460M751R43m259
8483b0225L488l197m707M403M527K82J0617Q36r213Q0P91N242m121L484o044k734
$$ y = [-21919, -25488, -22868, -30370, -27200, -34059, -27541, -48869, -41582, -137142, -239778, -4738, 25853, 5444, -1500, -4136, -3121, -6356, -9264, 2164, -2893, -9022, -13876, -11552, -6245, -5177, -6358, -7892, -12464, -13648, -13808, -9915, -14084, -9876, -8597, -8643, -11896, -16838, -14064, -13870, -11533, -15579, -12469, -15725, -14205, -21957, -18092, -13415, -12699, -9066, -9126, -15910, -10772, -18516, -20888, -17809, -19144, -13445, -9020, -12346, -13882, -14800, -14362, -12696, -12314, -9795, -21958, -22838, -6496, -9680, -6524, -12621, -12105, -10097, -8855, -9082, -7093, -15566, -15865, -15430, -13660, -21526, -13803, -10803, -6532, -11839, -19709, -24535, -25544, -24511, -14806, -18880, -16765, -14636, -20341, -16423, -14636, -14430, -17346, -14372, -14372, -12044, -16200, -21660, -16909, -15966, -20225, -16737, -19934, -24641, -20238, -15711, -15429, -4812, -3976, -13189, -13109, -12318, -7076, -11197, -7713, -13757, -16491]
8467a6491Kp703L315N749k834M230N002l400o02m372p343L155k385J979m22k582
8451b4702L882j265P57K307N843J204J269J014J310r775O634M97l424n638O501
8436a3586M640m523K964n6j244O15Q604k631j1206n88P918P64n502O66O482L843
8420b840p004n542N3l985P405n473k111N444p552K666K873m014k181Q733J769
8405a1759J208J5p56o446Q550J555O05j603L077J924j0842k180N341N92m819o024
8389b1562r486P38L759P531l932N442N236K499p021J015M396j136N560j1201m061
8374b2223k02k428O247P049o782M295K005q34P557N400j1232n833m04M588l516
8359a6313p81j269o359Q987P693j166q866n67L279J2260j3468j2460Q680O699
$$ y = [-16491, -16489, -24192, -20877, -15128, -17962, -13732, -8730, -12130, -12732, -17104, -24447, -21292, -23677, -21698, -22120, -24702, -20820, -22085, -21328, -19021, -13178, -11974, -10705, -9691, -8381, -18156, -11522, -11025, -14449, -20087, -13586, -8946, -13469, -10505, -10561, -11805, -11190, -2586, -5217, -16423, -17011, -9093, -8329, -13831, -13165, -6683, -2840, -9844, -15386, -15333, -19318, -11913, -17386, -19497, -14053, -21605, -18939, -16066, -20080, -22261, -13528, -11759, -10551, -10536, -11292, -17738, -9188, -7633, -7028, -8631, -5554, -3630, -14472, -16652, -11311, -10719, -15538, -21562, -31048, -30310, -26551, -19020, -22952, -17510, -12274, -9775, -16796, -15781, -11385, -12521, -6961, -18162, -22223, -22425, -24853, -18606, -11557, -18339, -14044, -12039, -12873, -5316, 84, -11148, -16981, -17385, -12797, -16313, -17094, -18363, -24722, -15735, -8042, -9208, -18074, -18641, -15362, -3102, -16570, -29030, -20350, -13651]
8345a3651l299R43O212o893q471J0283o826q449N729J2464K942n403o140j302
8331b1861J5033r54j622j581k318J817k884L464k313N192K82o921O445L120l168
8316h269j3126n698M386L209J224n416L949Q6m392N33K399J1756l626K052q44
8301a1777n038K556m492N911J0273J392l487l705r26k185k98m133J1953k197K290
8286c863o274j0630K044k988R919P469j526L899n460j1497k78j00J6806L885l531
8271b125n793q286l66J234k572R914k318O045k33j0852j320q98N974p918M631
8256a4883K071j948M110q066K65Q578k866j4691K707R127l7j503m039N62J1332
8241i281P82r070l828J19P824p448L77O937J696l497j5341P02m92j859K583N165
$$ y = [-13651, -16950, -16007, -9795, -16688, -25159, -14876, -21702, -30151, -24422, -11958, -9016, -14419, -20559, -21861, -6828, -7782, -9404, -10985, -13303, -11486, -14370, -10906, -13219, -8027, -7745, -14666, -8221, -5101, -8269, -21395, -27093, -22707, -19498, -18274, -23690, -19741, -19655, -24047, -23514, -21115, -9359, -12985, -10933, -11777, -16815, -14259, -18751, -12840, -2567, -1175, -4662, -8367, -9293, -11478, -11776, -15909, -3956, -6153, -3863, -10137, -20767, -18723, -21711, -11792, -4323, -5849, -1950, -7410, -18907, -19185, -19285, -2479, 1406, -2125, -7918, -16204, -16570, -15336, -17908, -7994, -10312, -4267, -4500, -15352, -16672, -17570, -11596, -19514, -14883, -12812, -14760, -10650, -18716, -18451, -9873, -12739, -27430, -24723, -15596, -15633, -17136, -21175, -20613, -9281, -8499, -17569, -21397, -21278, -13454, -20902, -20525, -13588, -11892, -15389, -30730, -30028, -30520, -32379, -29796, -24631]
8225b4631R158J4511l368j074J0186O774K372J3856n101k7617j1047N810o589
8212a6760R645l660q448j998L428j2699L398J1823q416L0979j1763R78j4983K189
8198a6287M065K0031m714M9940k6413n1716K4893n208M743L322J7324n5452j0256
8185d5728j6252J6517L1642k3134j6417K4303Q617P688J6142j3038L313R886Q954
8172A2493k1548k0166Q889N695n962Q301L105k326j622k092r252N462J4372q863
8158a3514j1087p038J9766j383O71j467j1205J4096P88k579Q744j456l513K509
8144f668r509K427N544p620j1976M789j950j166N223J54j627j157J591r041J1007
8129a9979j57K122J4680P726k660j1308N286j9643j134J5120O43K216M845n006
$$ y = [-24631, -15473, -962, -4330, -5404, 4782, 11556, 13928, 27784, 22683, -4934, -15981, -10171, -16760, -7115, -10775, -19223, -21221, -17793, -30492, -27094, -15271, -23687, 7292, -4471, -3493, -18476, -16287, -12222, 7809, 3095, 53035, 26622, -25094, -201, -5409, -666, 2656, 19980, -35472, -45728, -61980, -45463, -13821, -36955, -53372, -29069, -20452, -12764, 3378, -9660, -6347, 3539, 12493, -9055, -29221, -20332, -14637, -20599, -12298, -9193, -11519, -13141, -15233, -24485, -19023, -4651, -13514, -24601, -31639, -11873, -13256, -12585, -14052, -25257, -11161, -10373, -12952, -4208, -5664, -9177, -6668, -16177, -13750, -8206, -15826, -27802, -23013, -24963, -26129, -20906, -20752, -22379, -23536, -21945, -30986, -19979, -20136, -18014, -3334, 4392, 1732, -9576, -4290, -23933, -25067, -9947, -9304, -7088, -2243, -7249]
8115g249Q338p846m571J1103p41q272J111J0744o791j3561N953m930q281N972
8101a9021M935P549J091l130n164L578J955n498R44j608K829J0323n751L791N35
8086b642j750n197M172o43j775K699r451Q035n376q417K956n327K194K990j971
8071a9503O265N926l325j669J035L322r54m397p71l497J1227L410n930l691L094
8056i458J327j917l166P399P609j5636l145N897L019j1150Q995K645q75N265m461
8041g652r149j594l230K007J0034N272n175m04k289j95j952K575q793J374K674
8026a6497j061j289L763o217K320R62j264K393k136r15k433L771p45Q887m748
8011a5209k974N062K816N841l386o014K745K597k655l436P27j577K579K009N127
$$ y = [-7249, 1089, -6757, -11328, -225, -966, -9238, -8127, 2617, -4174, -17735, -11782, -16712, -24993, -19021, -14086, -6537, -5446, -8576, -13740, -10162, -8207, -13705, -12761, -14369, -11540, -1217, -6968, -3177, -2642, -4392, -9589, -5417, -6060, -7835, -5136, -14587, -6552, -11928, -20345, -17389, -22716, -20522, -17532, -19503, -13238, -7312, -10637, -12306, -11271, -7949, -8903, -13300, -14071, -17568, -6341, -2931, -8861, -12552, -9458, -8131, -10048, -13214, -5815, 1794, -13842, -16987, -11090, -8071, -19221, -10226, -7581, -8456, -3191, -7652, -16801, -18395, -21625, -19618, -9584, -4312, -9487, -9891, -12180, -12375, -14327, -11752, -20545, -19171, -16497, -17558, -18847, -15084, -21301, -18981, -18019, -19283, -16890, -19026, -19941, -22374, -18603, -19348, -10461, -15209, -18183, -13121, -10305, -4464, -7850, -13864, -11119, -8522, -11177, -14613, -13886, -15463, -12884, -10875, -5748]
7996e748o154j599m187M636l3J751j0676M553O424p565j888L846K368O672j72
7981g772q565O3k71l101M553Q346m616L891p263q763J3445k764N1P84m313m88
7965a6783J1415J105n182j095J182l070O95k937M09K560m786L559k888K295L612
7950i909l689j301J131K027L86M48l089j82k404R432l854q35K114l27K62m341
7934a4131l664J557q14J799j532M437J13j60L032l530l345j861P129l442L848
7919a0564J213k863k001K860p820J039K687k507o109N46J2592k417o049P100M114
7904h179l484R66J0336l938p991m300P91j0672P286L271M495N385J947q177l922
7889a6186n42j062Q040M305l124o234M148n58K17k179j0165L611J789j567J616
$$ y = [-5748, -11902, -13501, -17688, -13052, -13085, -11334, -22010, -17457, -11033, -18598, -20486, -16640, -14272, -7600, -7772, -16337, -16274, -16545, -19646, -15093, -6747, -11363, -7472, -14735, -23498, -10053, -12817, -12766, -11982, -16295, -16783, -5368, -4263, -9445, -10540, -9358, -12428, -11733, -14670, -14261, -11701, -16487, -12928, -15816, -13521, -9909, -13598, -14899, -13768, -11741, -11355, -10907, -13996, -14178, -16582, -7150, -11004, -11839, -9725, -10052, -9790, -14131, -17795, -16238, -17052, -15253, -16785, -12348, -12235, -12395, -9363, -12893, -16238, -18099, -10970, -14412, -10564, -9351, -12214, -14215, -11355, -19175, -18136, -15449, -17956, -24065, -23519, -10927, -13344, -19393, -12293, -8179, -11663, -10697, -361, -4299, -12290, -16590, -15799, -26471, -19185, -15914, -11419, -6034, -4087, -12264, -16186, -16728, -17790, -9750, -5445, -8569, -14803, -10655, -11213, -10996, -13175, -23340, -19729, -17940, -19507, -17891]
7874a7891L504q490L232K913J5205m059j179m810m375J228O394p190m91n408K838
7859a8579j610j378O576L470k65L915L522n584n043k629M719J00k523O454k555
7844a1410l484j047N330J0502P3m569m666k488K066m55q81l450O82m246K227K651
7828a3165o920R477M312R483j1008K707n160K710j783L61j580J26q017J1480o762
7813a3739k109n000J1733j3571P655k7041Q970l7045Q8329l2177K2115J9073m9651
7800b2458K3309j0247K0229j7491O680r584J5167q494P25r606N697p827J2922
7787i78L500l847p50L598r194K650N54m690N56Q468o22N804l348R92p063K457
7771a913k197j605q519R185o433L318L19P954j420j572m64L865J413K484j0729
$$ y = [-17891, -14387, -22877, -19645, -16732, -1527, -5586, -6765, -11575, -15950, -14722, -8328, -15518, -16009, -21417, -18579, -20189, -21567, -14991, -11521, -11786, -7871, -4349, -9933, -14976, -17605, -12886, -12786, -15309, -8855, -11410, -14894, -15941, -10611, -109, -36, -4605, -9271, -11759, -9693, -10148, -11029, -14479, -13797, -18043, -15816, -13165, -20085, -10608, -6296, 3187, -7821, -5114, -10274, -7564, -9347, -8986, -10566, -10440, -18457, -6977, -13739, -15848, -20848, -9115, -22686, -15031, -42072, -33102, -70147, 18182, -13995, 8120, 27193, -22458, 851, -9396, 10833, -6658, 22, -9562, 5605, -2889, -2164, -11770, -6073, -13900, -978, 2522, -1325, -2075, 1523, -7671, -5021, -4467, -9157, -8601, -133, -755, 5049, 1701, 2693, -4370, -1913, -4110, -5715, -14234, -5049, -11482, -8164, -7845, 109, -1311, -2883, -3347, 518, 1931, 4415, -6314]
7756f314Q427L45p364l111j385N699j069j980m030n655r83O243K220M333q40r9
7740e563k385J856k907k175n24m392m740J0422J488k974l301l495J997Q090J0416
7725A813p786l587K600j728K605k315j361R47O974J332j344k52L85P32l724k197
7709f906j6r66K639k132J608q10K789o89k750l499J487k24k008N578Q12j738N794
7692a031R592K47j4060l083k773l050Q965O095J449J56m794O183k679n942m562
7677i287n096N132K021J707k798J536O360l470n531p79m200L698k87N12K546P088
7661h48m428n294j291O44L528J691m587m14L910m540K731m68O371J093M691j056
7645A733j689r05r95n341J612M782j715N55p30m008o45j880J768L370K607K310
$$ y = [-6314, 2113, 2458, -4906, -8017, -9402, -3703, -4772, -6752, -10782, -16437, -17420, -11177, -8957, -4624, -5464, -5563, -7948, -6092, -8999, -11174, -11698, -16090, -20830, -10408, -8920, -11894, -15195, -18690, -16693, -8603, 1813, -5973, -9560, -6960, -8688, -6083, -8398, -9759, -8812, -1838, -506, -1850, -2102, -1717, -985, -4709, -6906, -6922, -7888, -5249, -7381, -5773, -6583, -3794, -4483, -7233, -10732, -9245, -9469, -11477, -5899, -5087, -6825, -1031, 8561, 8808, -5252, -8335, -11108, -14158, -5193, 902, 2351, 2507, -2287, 3896, 1217, -4725, -9287, -14383, -9251, -7230, -5523, -8321, -6785, -425, -3895, -9426, -10205, -14405, -10707, -10994, -10482, -7936, -848, -5276, -10570, -11861, -11217, -7689, -5998, -10585, -10999, -7089, -11629, -8898, -9366, -2995, -1902, 2789, 1733, 44, -861, -1856, -7197, -5585, -803, -2518, -1963, -2693, -6701, -7346, -9226, -7458, -4088, -1481, 829]
7629H29j800j736l353o712K927N839J535p123M601K987r44M35p56j480K345O858
7613D452n011Q62J218l474M898L05k246m89j395j0453O25o59J316M24N275q38
7597e190K979L959l627N784l481l256j581p171k652J714o71J2672J017o421K079
7582c846O938o442r75J387J862k75J208r21L366L40j631p17l596j857K303n153
7566h009J153J547P441N068J252J850n789M11r456k755N704K369L974K128p307
7551d19n68J916Q02O105J01n348j175k711J692N485J567N10p190j669k834k577
7535f313Q529j461J639R615o058j808k235J595J460n313l746K385K839N378l96
7520F110o894l571k663K584P845R21l448r41L2009n311k0354n411N137P38L634
$$ y = [829, -971, -2707, -6060, -12772, -9845, -4006, -2471, -9594, -4993, -2006, -2950, -2515, -3271, -4751, -2406, 4452, -559, 303, 1521, -1953, 2945, 3250, 1004, 515, -880, -11333, -10708, -11367, -10051, -9627, -4352, -5190, -2211, 1748, -1879, 3905, 424, -2832, -4413, -11584, -14236, -12522, -13193, -521, 496, -5925, -3846, 3092, -3350, -4325, -2938, -1076, -1351, -143, -1064, 2302, 2642, 1011, 294, -3302, -5159, -2856, -8009, -6856, -5309, 2132, 7200, 8452, 10302, 4513, 4924, -4532, -7287, -1583, 786, 4760, 6888, -419, -987, 929, 1731, 7836, 7937, 2589, 1414, -1297, 395, 5880, 7447, 7957, 767, -902, -3736, -6313, 2216, 755, 2394, 12009, 5951, 4143, 1908, 3503, 4963, -350, -4096, -1711, 1128, 6506, 6110, -784, -4355, -7018, -4434, 3411, 4332, 884, -57, 31952, 26641, 6287, 876, 6013, 6751, 10385]
7505A0385J137k252m87j698J769k1q343K492l53m90J965j607Q50j278O551k539
7489F081o982m55K690l09O582l385J819n118M624n103Q157n252q96m48k099K743
7473B649O174n90j274Q28n741j977l26O726L291p736L677N94o900N890P481M557
7457A7323K354l539k008p649l91P87o187N06P344K435N645p83j433k682p773J13
7441D062J1505r001m995M179K895q46K679L672m850m764K534K072l169j282j695
7426B996M034l867q266m96L411L537L909m470l775P728J366n820O110l940L780
7411F237o615q22L013L433K250N366r482r09L489J367j458m26J106m591m805J697
7395a150O39K629N106j227K362j804n268j224K088K770k987k835O603o3r75k249
$$ y = [10385, 11522, 9270, 8783, 7085, 8854, 8833, 490, 2982, 2629, 2139, 4104, 2497, 3347, 2069, 8620, 6081, -901, -1356, 1334, 1025, 7607, 4222, 6041, 923, 5547, 444, 8601, 3349, 2453, 2005, -94, 2649, 8823, 8233, 6959, 7787, 2046, 69, -257, 6469, 9760, 2024, 5701, 6295, -605, 5285, 12766, 17323, 19677, 16138, 14130, 6481, 6090, 6877, 690, 1196, 8540, 10975, 16620, 15837, 14404, 11722, 3949, 4062, 15567, 6566, 1571, 5750, 8645, 7799, 10478, 14150, 9300, 4536, 7070, 9142, 5973, 4691, 2996, 7030, 3163, -5103, -5599, -2188, 1349, 5258, 788, -2987, 4741, 6107, 287, 6397, 2457, 6237, -378, -1200, 1813, 5246, 7496, 12862, 3380, 2471, 5960, 7327, 5869, 5443, 6549, 1958, -2847, -1150, -511, 2118, 7224, 5997, 8359, 6555, 1287, 63, 2151, 4921, 1934, -901, 5702, 5639, 4664, 2415]
7379B415j657l506J978O886n440M977Q81K700l357l61N89j429L822j304L718l276
7363G636J796O203q213n500l036Q33J0007r828N680P045m621m68M151k193N14
7348A0006K70l345Q50P18j117J538K592K861k346J681N1j546m64K157k295J146
7332A2757M629O7k835o376K625L415o627J985k912o29l836rM356N56P457k732
7316A1891M713j956p66O99K592l094k85k49k053J869j047m142O276K274p298j823
7300G601N465O53j322j507N431L881l724K466j430m284L583j351M022j229l602
7285A4653Q43Q63n232K099l662l533M991k129L071L81J10l366j888N752Q235k020
7269A9168K0m137K199p92j730q747k709J4864Mj271j279n790j532l542N19L20
$$ y = [2415, 758, -2748, -770, 6116, 676, 5653, 6534, 9234, 5877, 5516, 6105, 4676, 8498, 7194, 10912, 7636, 9432, 15635, 7422, 1922, -1114, -281, 9726, -102, 5578, 12623, 8002, 7534, 11685, 9492, 10006, 10276, 6931, 7781, 8499, 7382, 8920, 11512, 14373, 12027, 13708, 13759, 12213, 11749, 13906, 11611, 12757, 17386, 17453, 14618, 8242, 10867, 14282, 7655, 9640, 6728, 6099, 2263, 2254, 6610, 7166, 14623, 11891, 16604, 14648, 13882, 14581, 17173, 14079, 13794, 13545, 11492, 13361, 12314, 8172, 14448, 16722, 9424, 7601, 13066, 13719, 12397, 10890, 16321, 20202, 16478, 18944, 17514, 13230, 16813, 15462, 19484, 18255, 14653, 15496, 16359, 11127, 13226, 9564, 6031, 11022, 8893, 11964, 12345, 12455, 9089, 7201, 12953, 21188, 19168, 19188, 15051, 17250, 16458, 14728, 5981, 3272, 18136, 18140, 16869, 15590, 9800, 8268, 4726, 5245, 5565]
7253E565Q043J052K786p258J764Q614L119o51j2319m11N082K203O2r075l759q37
7237C980o97L547Q337J545k419j875R71P18m751M300m66L631k020R607r25o231
7221A7252o920p99Q333l249j629J1737m32o602k449J867P718j371o613K328n359
7206A3812M299L658M51M9p729M074k577N694j779m430l712n120Q455L517n288
7191A3374O933m029k112m72O396j180l764r23j92o34K351K58L948J388o189k821
7175A2332j43M628L408L616r344k800Q21L743M577O335k396M51L985O37l946n195
7159B0709K516Q68P077J743r979j569N944n197j88Q86k445K427n932L347K712
7144B2919M365j284K514j913j190l36J390p00n242J359j791O474j842n299N78
$$ y = [5565, 13608, 14660, 17446, 10188, 11952, 20566, 23685, 23034, 10715, 10304, 15386, 17589, 17651, 8576, 4817, 3980, 3283, 6830, 15167, 16712, 14293, 12418, 13389, 14107, 9356, 13656, 13190, 16821, 14801, 24408, 23483, 17252, 10332, 9533, 17866, 14617, 12988, 24725, 24293, 17691, 15242, 17109, 24827, 23456, 16843, 19171, 13812, 18111, 21769, 22220, 22269, 14540, 18614, 16037, 21731, 19952, 15522, 11810, 6690, 15145, 18662, 13374, 20307, 16278, 14166, 13694, 20090, 18910, 15146, 14223, 14031, 13397, 15748, 16006, 19954, 21342, 15153, 12332, 12189, 16817, 20225, 23841, 14497, 11697, 12518, 16261, 20838, 27173, 24777, 25228, 29213, 29850, 25904, 20709, 23225, 24093, 31170, 32913, 22934, 21365, 27309, 22112, 21924, 22810, 20365, 22792, 16860, 20207, 22919, 27284, 26000, 28514, 26601, 25411, 25075, 26465, 25765, 20523, 21882, 20091, 26565, 24723, 19424, 20002]
7129B0002K626K715Q08l233L200l860j163L035o385J792K439j72K663J269J548
7114B7284L227p819q981M677M796n12L029m439J735N774M442j227L48n61p380
7099B4393m566M05L471k89K935o12J414L55L73k273K97L068l114l758L830L234
7083B9163l397O713m856r230K370M958O169o287L568L984N74j966L99p91M959
7068C6330j848l485k309j961j262k39n627Q615Q810M0070j6578j9932M166j1851
7054C2899k714j2583Q310L061N517l138L363p332k492l386O286N986K065l102
7040C2740O03l507L065k633K727m719L444l835r82Q441k642P84j069l532p5o364
7024B2446J1943J017J233m893k498J020l432N544J73N717m267L669J87J451l752
$$ y = [20002, 22628, 25343, 26151, 22918, 26118, 22258, 21095, 24130, 17745, 19537, 21976, 21804, 24467, 25736, 27284, 30511, 22692, 13711, 18388, 23184, 22672, 25701, 21262, 22997, 28771, 33213, 31986, 32334, 31773, 24393, 19827, 20232, 23703, 23414, 26349, 25737, 27151, 27506, 27879, 25606, 25903, 28971, 25857, 22099, 25929, 29163, 25766, 32479, 27623, 18393, 20763, 25721, 31890, 25603, 29171, 33155, 33729, 31763, 32162, 31371, 36330, 34482, 30997, 28688, 26727, 25465, 25226, 19599, 28214, 37024, 77094, 60516, 40584, 44750, 32899, 30185, 17602, 25912, 28973, 34490, 31352, 34715, 27383, 24891, 21505, 27791, 33777, 35842, 32740, 33343, 29836, 32901, 30268, 32995, 28276, 31720, 27885, 26903, 35344, 32702, 33486, 32417, 28885, 28810, 22446, 34389, 35406, 36639, 31746, 29248, 30268, 26836, 32380, 32553, 38270, 34003, 37672, 37859, 39310, 35558]
7009C5558M067m244l703J802k781L475L616k042K772k133j983O854k243o444k062
6994C0509P274K326m234J746M594o811j571O93k601N890L469N171m023m5l361
6979C9026Q10k971k483l536L856M538K3r564j384J0109j373K801l719k1P101l146
6963D0067J295O072M953j0839m3N511j407q925l138O183O235m61j092m842M164
6948D3733q04l557M963j484p90K964k338N293J18l318L319p132k060P570J082
6933D7559m406O470L426q132k910L485O12Q223l20n025j481R20J819k072j0209
6918C7959Q478M864J155n965L648J113j355N49J277M059n222p551K888Q276l843
6903E0330j970j831L079j071O74J627n04L405N188o75k01J25M93o771j165J695
$$ y = [35558, 39625, 35381, 31678, 33480, 30699, 34174, 37790, 35748, 38520, 36387, 34404, 41258, 39015, 32571, 30509, 37783, 40109, 35875, 37621, 42215, 35404, 33833, 34526, 31925, 37815, 41284, 46455, 42432, 42387, 39026, 39836, 36865, 34382, 30846, 34702, 39240, 39263, 29699, 28315, 38424, 37051, 39852, 36133, 36112, 43213, 40067, 41362, 47434, 52387, 41548, 41505, 47016, 45609, 36684, 33546, 39729, 45964, 45503, 44411, 39569, 43733, 42929, 39372, 44335, 42851, 42061, 45025, 42687, 47980, 48098, 44780, 48099, 40967, 38907, 46477, 47559, 43153, 49623, 53049, 44917, 42007, 45492, 46104, 54327, 54007, 48982, 47501, 48421, 50240, 48168, 37959, 46437, 51301, 52456, 46491, 50139, 51252, 49897, 50446, 51723, 55782, 50560, 43009, 45897, 54173, 50330, 48360, 46529, 49608, 48537, 49211, 50838, 50334, 53739, 58927, 58252, 58051, 58176, 58669, 51898, 50733, 52428]
6887E2428N62Q92k529J380m710P278m620N65J0348N96l65n184m587M571M293l749
6871E7169J173O184j2829L042l477K737J678k514n08K167J46k414N405K351m463
6856E5847O793j674j231P97l59M020p870L49K152J223j091M965k819L377K200
6841F6679k207j934J427P766K379k288j802m993M125l452K842L953l005R69k300
6826F8159K47N832q18q98m333m0m65L999k674J11N807j25k754N837M455K750l648
6809H1442o429o149J1321O529m910o99j02N749j430q298J988N716k676M351Q6
6794H6489K748k613j84k858M630k223N72K332l529k354O793M388K314o783o3j614
6778H8045q22P696L06n275L326j759k94J5391n646m758O637L175m907J552j336
$$ y = [52428, 52990, 53882, 51353, 52733, 48023, 55301, 50681, 51246, 61594, 62190, 61825, 56641, 52054, 56625, 60918, 57169, 58342, 64526, 51697, 54739, 51262, 53999, 55677, 53163, 52655, 54822, 54968, 52554, 57959, 60310, 55847, 62640, 60966, 59735, 60532, 60173, 64193, 56323, 56672, 58824, 60047, 58956, 63921, 61102, 64479, 66679, 64472, 62538, 63965, 71731, 74110, 71822, 70020, 65027, 69152, 65700, 68542, 72495, 69490, 70459, 68159, 68406, 74238, 73420, 72522, 68189, 68149, 67684, 71683, 69009, 69120, 74927, 74802, 72048, 77885, 82340, 85090, 81442, 75013, 68864, 80185, 86714, 81804, 81105, 81003, 86752, 85322, 77024, 79012, 84728, 82052, 86403, 86489, 89237, 86624, 86440, 83582, 88212, 85989, 86561, 88893, 85364, 83010, 89803, 94191, 96505, 89722, 89659, 88045, 87223, 94919, 95225, 89950, 93276, 91517, 91223, 106614, 100968, 96210, 102847, 106022, 101115, 102667, 101331]
6763A01331O949J392j548q04K23O955L117p273n459M377O342l323l885l8L06K204
6747A10866N350j470N744L874q83l335l946M547k871M160J95j416j132O442L888
6732A30013p99j458L026P148n72M09n065l154K594M66m42o0M749M008l801m431
6716A32631p83o79L124N059L293N71M583O973n17J643l43O431O174n821P029K813
6700A72181j4301L736k173m62K732M8Q406L599K498k970O607m641l048K044M823
6685A79079M955M815M068j993J987n593l406q07M139j50L955L04M902J748J508
6670A99511J395m912K940J998Q94N36J622K112L694j636L992k656p042N053J2458
6655B19959L174J876q069J072Q110o17L639N003j175N879q82J086P117K098N71
$$ y = [101331, 108280, 109672, 108124, 107320, 107543, 114498, 117615, 110342, 104883, 109260, 115602, 112279, 108394, 108356, 108662, 110866, 116216, 114746, 120490, 124364, 123481, 120146, 116200, 120747, 117876, 122036, 122231, 120815, 119683, 126125, 130013, 129214, 127756, 130782, 137930, 137358, 137767, 132702, 129548, 132142, 132608, 132166, 132106, 136855, 140863, 137062, 132631, 131848, 131169, 134293, 139352, 142645, 143216, 147799, 154772, 154255, 155898, 155555, 161986, 168160, 162339, 169368, 172181, 157880, 161616, 159443, 158981, 161713, 161761, 170167, 173766, 176264, 173294, 179901, 175260, 172212, 174256, 179079, 184034, 188849, 192917, 190924, 192911, 187318, 183912, 183105, 187244, 187094, 191049, 191353, 196255, 198003, 199511, 200906, 195994, 198934, 200932, 201826, 202362, 203984, 206096, 209790, 208154, 212146, 209490, 202448, 207501, 219959, 223133, 225009, 216940, 218012, 226122, 225505, 229144, 234147, 232972, 238851, 237969, 239055, 246172, 248270, 248841]
6640B48841k786N591K977O036j524n197L454K896m557P203M283O832K91K32L216
6625B77788M398Q893J457L912j673N026N18O73N660K308K925M034L677J985l068
6610C18513K308K530r39Q575J0629q893L383N090M148N982l7L012K053L576N65
6595C60495J030J1640k387n374K548J2637M305J288P726K101j411M483J6033K628
6581D17742j257L525j904J669K63K410Q008O86k309j896M540k986k579J271O953
6566D34136L508o776J1042P796n810P583k054M297P789M354M709J1131L624O723
6552D92052K434M6O965R449Q009J0403J0954M153J2553R177Q248L610P545J0645
6538E96243R471N090k829P765J0393J3028K044N286N729J2952N750J0340R723
$$ y = [248841, 246055, 251646, 254623, 260659, 259135, 253938, 257392, 260288, 255731, 262934, 267217, 274049, 274340, 274572, 277788, 282186, 291079, 292536, 296448, 294775, 299801, 300319, 300992, 306652, 308960, 311885, 315919, 319596, 321581, 318513, 320821, 323351, 322412, 330987, 341616, 332723, 336106, 341196, 345344, 351326, 351289, 354301, 356354, 359930, 360495, 361525, 373165, 370778, 365404, 367952, 380589, 384894, 386182, 393908, 396009, 394598, 399081, 415114, 417742, 416485, 420010, 418106, 419775, 420038, 422448, 430456, 431142, 428833, 426937, 431477, 428491, 425912, 427183, 434136, 437644, 430868, 441910, 449706, 443896, 451479, 449425, 453722, 461511, 465865, 470574, 481705, 485329, 492052, 494486, 494532, 501497, 510946, 518955, 529358, 540312, 544465, 557018, 566195, 574443, 578053, 585598, 596243, 605714, 610804, 607975, 615740, 626133, 639161, 641205, 646491, 652220, 665172, 670922, 681262, 690985]
6525F90985J2002J0399J4410J3147Q492J6660J4810J6201P789J0150J7484J0996
6513H43525J3139K1202J0550J3603J3178J9316J9975J4928J7480K4112K8311K3925
6501A063244J6247K8773K7674K7595K7184K3483K2924L3632K3299K3894L9426
6490A357375L8042L6271L7549M6060M5251N0820M6621N4346N8778O1434N8620
6479A891167N1888O3251N0860M7909M7491N4004N4503N3602N4235N0501O6995
6468B486406O2121O1165O4831P2042P8341Q0787P9990P6216P7199Q0749R4370
6457C314217Q9748R3870J06728J08813J11214J16205J19394J22200J33301J48489
6447D464179J46025J53133J51560J57445J60332J61987J68815J78371J80034J90161
$$ y = [690985, 702987, 713386, 727796, 740943, 749435, 766095, 780905, 797106, 804895, 815045, 832529, 843525, 856664, 877866, 888416, 902019, 915197, 934513, 954488, 969416, 986896, 1011008, 1039319, 1063244, 1079491, 1108264, 1135938, 1163533, 1190717, 1214200, 1237124, 1270756, 1294055, 1317949, 1357375, 1395417, 1431688, 1469237, 1515297, 1560548, 1611368, 1657989, 1712335, 1771113, 1832547, 1891167, 1943055, 2006306, 2057166, 2105075, 2152566, 2206570, 2261073, 2314675, 2368910, 2419411, 2486406, 2548527, 2609692, 2674523, 2746565, 2824906, 2905693, 2985683, 3061899, 3139098, 3219847, 3314217, 3403965, 3497835, 3604563, 3713376, 3824590, 3940795, 4060189, 4182389, 4315690, 4464179, 4610204, 4763337, 4914897, 5072342, 5232674, 5394661, 5563476, 5741847, 5921881, 6112042]
6437F112042K00758K07696K26391K44595K60120K60235K74912K96366L16526L50670
6427H750311L72137M00933M37144M85651N17978N73551O37366P13424Q02028Q99337
6417A4589860J016550J157464J299172J462285J627639J788841J928313K044238
6409B6914362K147596K204830K175166K020309J698025J157877M71439l19966
6401C8469638j075962j731547k186404k419632k490337k429093k269369k073715
6393B1793579j857457j644636j464109j314308j170285j051249r48089q53262
6385A1490184p69907o99213o26339n62706n16669m69888m17759l87483l49682
6376F690538l19137k89628k79745k62680k40914k20774k07045j94363j82004j83245
$$ y = [6112042, 6312800, 6520496, 6746887, 6991482, 7251602, 7511837, 7786749, 8083115, 8399641, 8750311, 9122448, 9523381, 9960525, 10446176, 10964154, 11537705, 12175071, 12888495, 13690523, 14589860, 15606410, 16763874, 18063046, 19525331, 21152970, 22941811, 24870124, 26914362, 29061958, 31266788, 33441954, 35462263, 37160288, 38318165, 38789604, 38469638, 37393676, 35662129, 33475725, 31056093, 28565756, 26136663, 23867294, 21793579, 19936122, 18291486, 16827377, 15513069, 14342784, 13291535, 12343446, 11490184, 10720277, 10021064, 9394725, 8832019, 8315350, 7845462, 7427703, 7040220, 6690538, 6371401, 6081773, 5802028, 5539348, 5298434, 5077660, 4870615, 4676252, 4494248, 4311003]
6366D311003j65955j59486j47542j42132j26987j15798j18066j15051j12345j04352
6356C003289r7122r3485q6862q6078q3101q0086p3651p3280p0414o4726o6556
6345B127928n7617n5852o5849n3737m8563m4437m6588m5526m0850m1745l7956
6334A589208l8834l4779k8921l7964l1002k6762k9114k7837l6119k9330k6976
6323A241570k9565l3792k9811k8790k5650k5701k1612k2978k4733j7570j9260
6312I62108j8969j8524j8201j5798j6389q830k0961j7433j1337k1676q953j5835
6300G69202k2182j6519o149j4408q346n867j5319r619o006j0267r351r543n976
6287F29650m640j3407q126j2432p260l739j3284j1348p812j2107j0539m319p377
$$ y = [4311003, 4145048, 3985562, 3838020, 3695888, 3568901, 3453103, 3335037, 3219986, 3107641, 3003289, 2906167, 2812682, 2725820, 2639742, 2556641, 2476555, 2402904, 2329624, 2259210, 2194484, 2127928, 2070311, 2014459, 1948610, 1894873, 1846310, 1801873, 1755285, 1709759, 1668909, 1627164, 1589208, 1550374, 1515595, 1486674, 1448710, 1417708, 1390946, 1361832, 1333995, 1297876, 1268546, 1241570, 1212005, 1178213, 1148402, 1119612, 1093962, 1068261, 1046649, 1023671, 998938, 981368, 962108, 943139, 924615, 906414, 890616, 874227, 865397, 844436, 827003, 815666, 793990, 785037, 769202, 747020, 730501, 724352, 709944, 701598, 695731, 680412, 670793, 664787, 654520, 645169, 635626, 629650, 625010, 611603, 603477, 591045, 583785, 580046, 566762, 555414, 547602, 535495, 524956, 520637, 513260]
6274E13260m848k068o852j6780o697j931l885p895q335k975o893l082l728M265
6260D41556m181q080L280j576k669k060r285j1133L179n69j106p520j507k548
6246C95781l408r920l917k703q476p491q650m99q659n861q149p812n114k972r592
6231C02558m314m27n557K760J086O37l397m206K063l252m358o573m773l817Q25
6216B69255r306k917L60m51k164J676q870l061K603p45O01r20M10R68O09l617
6200B44431m51J722k596J226J200J215n361j4418M869M092m352k285R148m099
6186B34341J059j151l00K579k215o723M66o954j795J0372Q78j188p64p964o399
6171B14242K111N126K064m716p27L800n682o351M461Q565k145l515k968q606R388
$$ y = [513260, 508412, 506344, 499492, 482712, 476015, 474084, 470199, 462304, 453969, 450994, 444101, 441019, 437291, 441556, 437375, 429295, 432575, 430999, 428330, 426270, 416985, 405852, 409031, 408462, 407356, 399836, 398329, 395781, 392373, 382453, 378536, 375833, 367357, 359866, 351216, 350717, 342058, 336197, 328048, 320236, 315122, 312150, 302558, 298244, 297817, 292260, 295020, 296106, 296743, 293346, 289140, 291203, 287951, 283593, 277020, 272247, 268430, 269255, 259949, 257032, 257392, 256941, 254777, 256453, 247583, 244522, 247125, 246380, 246981, 246061, 246471, 247439, 248048, 244431, 243980, 245702, 243106, 244332, 245532, 246747, 241386, 226968, 231837, 235929, 231577, 229292, 238440, 234341, 235400, 234249, 233949, 236528, 234313, 227590, 228056, 221102, 219307, 229679, 230557, 229369, 228605, 220641, 214242, 216353, 221479, 223543, 218827, 218100, 221900, 216218, 209867, 214328, 222893, 220748, 217233, 214265, 205659, 215047]
6156B15047K87Q00n808M940J161j5890J299K57O732j012j772J811q00k006L60
6141B05406K474l976m47M144r03r065K635Q505j1654q318O893M815j502N33k318
6126A97222n210P325m872q18Q30j962Q34O716k35K832N592r943L627M39r62l95
6110B01020m933M056Q58Q91M496L152j324j235m913N217L619J78K048K034P373
6095B22537K78k928J637K929L127j228J123M021k027l388j275k381M666N00l106
6080B24485o328l167N370k586L051k256l27J081p618J389J846l97J66k401J070
6065B13378K95j463j702O867J157j067N98l836L001l109j267p15j558N184L074
6050B18837O485N592O801N720m626J443J334j252j033J571j122P228O216K772
$$ y = [215047, 215334, 216134, 210326, 215266, 216427, 200537, 201836, 202093, 208825, 207813, 206041, 207852, 207052, 205046, 205406, 207880, 203904, 203457, 207601, 206698, 197633, 200268, 208773, 197119, 188801, 195694, 200509, 199007, 199540, 197222, 192012, 199337, 194465, 193647, 194477, 192515, 193349, 200065, 199830, 202662, 208254, 198311, 201938, 202377, 201415, 201020, 196087, 200143, 201001, 201892, 206388, 209540, 208216, 206981, 202068, 207285, 210904, 211082, 213130, 215164, 222537, 222815, 219887, 221524, 224453, 227580, 226352, 227475, 231496, 229469, 226081, 224806, 222425, 227091, 227591, 224485, 218157, 214990, 220360, 217774, 220825, 218569, 218242, 219323, 211705, 213094, 214940, 214543, 214709, 212308, 213378, 213673, 212210, 210508, 217375, 218532, 217465, 218063, 214227, 217228, 214119, 212852, 212137, 210579, 215763, 218837, 225322, 230914, 237715, 243435, 238809, 240252, 241586, 240334, 239301, 240872, 239750, 246978, 253194, 255966]
6036B55966o051M96J565m390M437n799l636k251L204K104P78k850j195o603Q245
6021B44020L779r75K539j976M5o210K533L912p36K860K29M141J04K277L333L760
6005B63635K572m98J387r861l670j025n701j706J072M657M009m196o872j28M408
5990B48083O90l629j70J073J169n005O943P291l977J795k227L134n34p324N093
5975B52405k14L094r61L229J958k596l5l937j051q46q81L429j681L443O778k344
5959B59790k096O637n77p279N349P94M863m165K134k332j633J0476l655m694O05
5944B64217K914M532P290K74M84J784K43l150J761L088k172k034P26M128k857
5929B81228K240j88j751j722K541L119N916N860L02j35K166k21%k322K634L18
$$ y = [255966, 249915, 250411, 251976, 247586, 252023, 246224, 242588, 240337, 243541, 245645, 246423, 243573, 242378, 235775, 244020, 247799, 246824, 249363, 247387, 247432, 241222, 243755, 247667, 246931, 249791, 250020, 254161, 254265, 256542, 259875, 263635, 266207, 265709, 267096, 257235, 253565, 252540, 246839, 245133, 246205, 250862, 254871, 250675, 243803, 243675, 248083, 248773, 245144, 244974, 246047, 247216, 242211, 249154, 256445, 252468, 254263, 252036, 255170, 254636, 247312, 252405, 252191, 255285, 254324, 257553, 259511, 256915, 256880, 252943, 251892, 251046, 250165, 253594, 251913, 255356, 262134, 259790, 257694, 264331, 263754, 256475, 261824, 262618, 267481, 263316, 265450, 263118, 261485, 271961, 268306, 263612, 264217, 267131, 271663, 278953, 279227, 279711, 281495, 281738, 278588, 280349, 283437, 281265, 279231, 279957, 284085, 281228, 283468, 283280, 281529, 279807, 282348, 285467, 291383, 297243, 297545, 297410, 299576, 299355, 299355, 297033, 299667, 299985]
5913B99985K078K657K103r73N537p63l594Q028O769L936l958l789M921J004M34
5898C24375o79l022M877M735Q92O21k27K418j854J0500k799n365J061J11P447
5883C43091m624K786O433jj623M823L446N377J460K510K591L344J613J154L114
5868C75494L357K471L050J88R963L9j378O983k835L119L373k129l708O010Q300
5853D12297K56R1L354Q270j291r86M762J516Q244J0815M681K36M007Q589Q981
5838D73822l77M802N075R819J982L512N718K897J3045R892P186l364J413P875
5824E43297J2061J1335Q310N150R566O685R830L906N776R473J3810N184J5408
5811F59791J1535N616J0322J1942J5510J3867J5051J6578J7751K3769J6673J0405
$$ y = [299985, 302063, 304720, 306823, 305850, 311387, 310624, 307030, 315058, 321827, 325763, 321805, 318016, 322937, 323941, 324375, 323696, 320674, 325551, 330286, 331178, 331799, 331572, 333990, 332136, 342636, 339837, 334472, 335533, 335644, 343091, 338467, 341253, 347686, 347685, 346062, 350885, 354331, 359708, 361168, 363678, 366269, 369613, 371226, 372380, 375494, 378851, 381322, 384372, 384560, 394523, 394562, 393184, 400167, 397332, 400451, 403824, 401695, 397987, 403997, 412297, 412553, 412644, 415998, 424268, 422977, 421991, 426753, 428269, 436513, 447328, 452009, 452245, 456252, 464841, 473822, 473445, 478247, 483322, 493141, 495123, 498635, 504353, 507250, 520295, 530187, 537373, 534009, 535422, 543297, 555358, 566693, 575003, 580153, 589719, 596404, 606234, 610140, 615916, 625389, 639199, 644383, 659791, 671326, 676942, 687264, 699206, 714716, 728583, 743634, 760212, 777963, 801732, 818405, 828810]
5799H28810J3768J2197K1098J8204J9110J2517K0309J5990K4158K2800K2162K0015
5787A051138J9908K5130K6273K6153K1268K8387M1284K7415L1606L5896L7621
5776A372079M2265M6971M7364N0890N5530N3124O9661P3980Q5951Q5423R9567
5765B082805J08034J18672J22319J32399J40089J49666J58590J60491J55925J38421
5755C467411R8841M5223m335l7707o9688r1430q7066p1210n1433m2132k0059l492
5743C132923J9607L0616M6036N9436Q4551J14376J34870J58665J79871K14246
5733D175197K55635K78355L04636L26398L50377L77988L96318L95207L50611K83390
5723G494112J60592Q311j52129k84272l61397m03290l98388l66171l22189k72419
$$ y = [828810, 842578, 854775, 875873, 894077, 913187, 925704, 946013, 962003, 986161, 1008961, 1031123, 1051138, 1071046, 1096176, 1122449, 1148602, 1169870, 1198257, 1239541, 1266956, 1298562, 1334458, 1372079, 1414344, 1461315, 1508679, 1559569, 1615099, 1668223, 1737884, 1811864, 1897815, 1983238, 2082805, 2190839, 2309511, 2431830, 2564229, 2704318, 2853984, 3012574, 3173065, 3328990, 3467411, 3566252, 3611475, 3607140, 3569433, 3499745, 3408315, 3321249, 3250039, 3198606, 3156474, 3136415, 3132923, 3152530, 3183146, 3229182, 3288618, 3373169, 3487545, 3622415, 3781080, 3960951, 4175197, 4430832, 4709187, 5013823, 5340221, 5690598, 6068586, 6464904, 6860111, 7210722, 7494112, 7654704, 7663015, 7510886, 7226614, 6865217, 6461927, 6063539, 5697368, 5375179, 5102760]
5713E102760k30147j87637j45620j12192p2999m0346j9585K1054M7230Q6104J18557
5702D567179J58710J94929K41198K63957K73469L16646L36576L60426L42048K96307
5692G351445K06864P4285q5715k55957l75218m36650m67161m54125m23407l76130
5682D758231l31991k80212k43931k08317j78795j54203j30492j01466q8126o4462
5672B976236m4074k8408p66R738K2951M0997N8107P3303Q3420Q1198P4688N4487
5660C401877K1283k7018p8529j27874j60867j81419j85246j80222j67605j46466
5650B167914j31322j18654j01173q7418q2851p6869o5100o1273n2939n1643m8794
5639A289878m6464m1966l5000k9737l2842l1089k3702k1952k1854j9624k1305
$$ y = [5102760, 4872613, 4684976, 4539356, 4427164, 4354165, 4313819, 4294234, 4315288, 4362518, 4448622, 4567179, 4725889, 4920818, 5162016, 5425973, 5699442, 6016088, 6352664, 6713090, 7055138, 7351445, 7558309, 7632594, 7546879, 7290922, 6915704, 6479054, 6011893, 5557768, 5134361, 4758231, 4426240, 4146028, 3902097, 3693780, 3514985, 3360782, 3230290, 3128824, 3040698, 2976236, 2932162, 2903754, 2902988, 2912726, 2935677, 2976674, 3034781, 3108084, 3191504, 3272702, 3347390, 3401877, 3423160, 3396142, 3317613, 3189739, 3028872, 2847453, 2662207, 2481985, 2314380, 2167914, 2036592, 1917938, 1816765, 1729347, 1646496, 1569627, 1504527, 1443254, 1390315, 1338672, 1289878, 1243414, 1201448, 1166448, 1136711, 1103869, 1072780, 1049078, 1027126, 1005272, 985648, 964343]
5628I64343j8095k0648k1769j3364q068j7043j2250j1353k1249j0712p985r681
5616G92126r647j2597j1748r320j1970p293l121j1301o354q904p757q214j2241
5603F71659k790q289L762Qr861m341J801j5120j0972K452o748k762o021N16p341
5588F05953k712l253L327m820j4262n353Nr4l364o300J371m135k520J966j2389
5573E53420j50L5q706l117Q350J538m471J817k907j840M11K286n62m20N27n212
5557E40999m542K751J568pk29J307n195m20L602r72N67k712k62N898J957m660
5541E39650J835Q087N748m235K449k261k016j092k449o563k892L527K780k562
5527E40006O512k740j360o125k413Q664P441n087L134L000J974k859q926N384
$$ y = [964343, 946248, 925600, 903831, 890467, 882399, 865356, 853106, 841753, 820504, 809792, 801807, 792126, 782479, 769882, 758134, 748814, 736844, 729551, 726430, 715129, 708775, 699871, 692114, 683900, 671659, 668869, 660580, 664342, 664350, 654489, 650148, 651949, 636829, 625857, 628309, 621561, 618799, 612778, 613294, 605953, 603241, 599988, 603315, 598495, 584233, 578880, 578885, 578791, 575427, 569127, 570498, 566363, 563843, 565809, 553420, 553270, 553305, 544599, 541482, 549832, 551370, 546899, 548716, 545809, 543969, 544380, 546666, 546104, 545684, 546211, 540999, 536457, 539208, 540776, 540769, 540540, 541847, 536652, 536232, 539834, 538862, 539429, 536717, 536455, 542353, 544310, 539650, 541485, 549572, 555320, 551085, 553534, 551273, 549257, 548165, 545716, 539153, 536261, 539788, 542568, 540006, 546518, 543778, 542418, 536293, 533880, 542544, 549985, 544898, 548032, 551032, 553006, 550147, 541221, 546605]
5513E46605O52J040m157L815k605J837N968L029M025K582k234p563K643J863j75
5498E57325K401N846L10m778L114K457L750K951M561R042n061l139L134l818M188
5483E82283M730Q60M137k025M119m2M399J68M433P075P24o6n591Q756j299N601
5467F18262k322N537o35M554O923n694M462J212K10m652l540P579J3111n44L263
5452F47726P78N169L359J402K801j064R931O90l593P188N514J690O81Q380o73
5437F89979M79L335K161O706J103L683k888o74O658q17j757O963N370M218l421
5422G21098M040J725P151M747L272O57Q231N123q18P185N711N409L480O468Q544
5407G92023j392J814N885N920j154l167O931M254L067Q01N69j865q16j011M682
$$ y = [546605, 547257, 548297, 544140, 547955, 545350, 547187, 553155, 556184, 560209, 562791, 560557, 552994, 555637, 557500, 557325, 559726, 565572, 565882, 561104, 564218, 566675, 570425, 573376, 577937, 586979, 581918, 578779, 581913, 578095, 582283, 587013, 587873, 592010, 589985, 594104, 594062, 598461, 598629, 603062, 610137, 610861, 610795, 605204, 613960, 612661, 618262, 615940, 621477, 620842, 625396, 632319, 626625, 631087, 632299, 632509, 627857, 624317, 631896, 645007, 644463, 647726, 648504, 653673, 657032, 658434, 661235, 660171, 670102, 670792, 667199, 674387, 679901, 681591, 682272, 690652, 689979, 690458, 693793, 695954, 702660, 703763, 707446, 704558, 703884, 710542, 709725, 707968, 714931, 720301, 724519, 721098, 725138, 726863, 734014, 738761, 742033, 742690, 750921, 756044, 755226, 762411, 768122, 773531, 777011, 783479, 792023, 790631, 792445, 798330, 804250, 803096, 799929, 806860, 811114, 814181, 814982, 815551, 813686, 812870, 811859, 816541]
5392H16541R298M850L053P231O28J668j812J939Q452N534K607J1186N493M222
5378H80890K909Q33J0545O867J960N488J963o382K626M468l65K931J455n14R433
5363I25107O781J577O822J600M443N875j920Q046N765P323J639R263J2971O708
5349A002000P564R017J5876Q759N257R958J0394l20L606J2716J1488Q545M763
5336A109623L279R912L451N810J792J0862L672R782J675O753N847L905R268M887
5322A190518J3396J514J1253N276J2479P765Q13Q548R905J1357R211K810J2333
5309A297178J1627J0516Q931J3438J4509Q316O858R303J1561L520J2131J0139
5297A418027J7245J0044K886Q065J1975J5264J1279J2159J3641N544J1700J5017
$$ y = [816541, 825839, 830689, 833742, 840973, 841601, 843269, 841457, 843396, 851848, 857382, 859989, 871175, 876668, 880890, 883799, 884632, 895177, 902044, 904004, 909492, 911455, 905073, 907699, 912167, 911802, 914733, 916188, 915674, 925107, 931888, 933465, 940287, 941887, 946330, 952205, 950285, 958331, 964096, 971419, 973058, 982321, 995292, 1002000, 1009564, 1018581, 1034457, 1043216, 1048473, 1058431, 1068825, 1068505, 1072111, 1084827, 1096315, 1104860, 1109623, 1112902, 1122814, 1126265, 1132075, 1133867, 1144729, 1148401, 1158183, 1159858, 1166611, 1172458, 1176363, 1185631, 1190518, 1203914, 1205428, 1216681, 1221957, 1234436, 1242201, 1243014, 1251562, 1261467, 1272824, 1282035, 1284845, 1297178, 1308805, 1319321, 1328252, 1341690, 1356199, 1364515, 1371373, 1380676, 1392237, 1395757, 1407888, 1418027, 1435272, 1445316, 1448202, 1456267, 1468242, 1483506, 1494785, 1506944, 1520585, 1526129, 1537829, 1552846]
5285A552846J6175J6968K1086J1294J5477J2696J0962J5829J7092J5342J6549
5274A722316J7131O734J3200J6415J7477J6585J5645J4259J9284K2170K1115J4066
5262A916397K7619J8082J3977K3492K2169K4445K2218K0388K6763K9717K3391
5251B168658K2913L0430K9304K7776K6101L1316K1066K7112K6584L1865L6988
5240B480113L9789L1724L4317M1048L9537M4242M0185M0699M1107M5527N0439
5229B928727N5762M9392O4558O2919O4715Q4108Q0738Q0381R3632J05523J16924
5218C787379J33039J51086J79976J97950K04234K21398K40268K55965K72118K79911
5208E923324K77682K48018K04424J43196O3422k6888j12455j94736k52071k72205
$$ y = [1552846, 1569021, 1585989, 1607075, 1618369, 1633846, 1646542, 1657504, 1673333, 1690425, 1705767, 1722316, 1739447, 1746181, 1759381, 1775796, 1793273, 1809858, 1825503, 1839762, 1859046, 1881216, 1902331, 1916397, 1944016, 1962098, 1976075, 1999567, 2021736, 2046181, 2068399, 2088787, 2115550, 2145267, 2168658, 2191571, 2222001, 2251305, 2279081, 2305182, 2336498, 2357564, 2384676, 2411260, 2443125, 2480113, 2519902, 2551626, 2585943, 2626991, 2666528, 2710770, 2750955, 2791654, 2832761, 2878288, 2928727, 2984489, 3033881, 3098439, 3161358, 3226073, 3310181, 3390919, 3471300, 3564932, 3670455, 3787379, 3920418, 4071504, 4251480, 4449430, 4653664, 4875062, 5115330, 5371295, 5643413, 5923324, 6201006, 6449024, 6653448, 6796644, 6860066, 6833178, 6720723, 6525987, 6273916, 6001711]
5198F001711k79916k61469k48762k22696j90469j67358j46761j17286r8391r4026
5188D174577p1963o2236n2078m4745l9724k8223k3859k3205j2850n636o475m876
5176C798707J802L235P012K870P34K112J0189M454K525J8121K1076J3848N883
5163C892568J6551J6088J2418K1705K5856K4704K6400K7113L1755K8794K6488
5152D150440K6290L6661L4113K8940K2166K9008L4931L8986L0836K6351L7437
5141D496159M7410L2262L1339L2878L8071L0076L3076L8462L8738M1296M1626
5130D901393M5393M8324M2502M2109M7804M8401M2456M1820M8651M6436M7042
5119E402331M7721N3689N2193M6231N8971N3137N4911N7403N8148O0753O0495
$$ y = [6001711, 5721795, 5460326, 5211564, 4988868, 4798399, 4631041, 4484280, 4366994, 4268603, 4174577, 4102614, 4040378, 3988300, 3943555, 3903831, 3875608, 3851749, 3828544, 3815694, 3810058, 3803583, 3798707, 3800509, 3803744, 3810756, 3813626, 3814360, 3816472, 3826661, 3831115, 3833640, 3851761, 3872837, 3886685, 3892568, 3909119, 3925207, 3937625, 3959330, 3985186, 4009890, 4036290, 4063403, 4095158, 4123952, 4150440, 4176730, 4213391, 4247504, 4276444, 4298610, 4327618, 4362549, 4401535, 4432371, 4458722, 4496159, 4543569, 4575831, 4607170, 4640048, 4678119, 4708195, 4741271, 4779733, 4818471, 4859767, 4901393, 4946786, 4995110, 5037612, 5079721, 5127525, 5175926, 5218382, 5260202, 5308853, 5355289, 5402331, 5450052, 5503741, 5555934, 5602165, 5661136, 5714273, 5769184, 5826587, 5884735, 5945488, 6005983]
5108F005983O2872N0964N7079N4284N6331N7805O0554N1398O3991N3589N5191
5097F630041O5394O2237O5584O4566O2983O4462O1193O3774N9779N4566O5504
5086G320083O9064O4201O9910O9007O4001P0361O5603Q1336P7211P7720Q0818
5075H109315P4403P1622P7235O9299O5343P6083O7161N9915O3654O9782O0896
5064H864708N8741N2858O0958N2815N0911N6085N5561O0049P2481P2444Q7032
5053I544643R0195Q9373J09161J12423J15972J17810J10259J25749J20703J24369
5043A0660657J31044J45841J41794J45985J55379J58605J57685J63555J63991
5034A2024536J61354J67182J53489J65846J71662J85097J85947J98939J95241
$$ y = [6005983, 6068855, 6119819, 6176898, 6231182, 6287513, 6345318, 6405872, 6457270, 6521261, 6574850, 6630041, 6695435, 6757672, 6823256, 6887822, 6950805, 7015267, 7076460, 7140234, 7200013, 7254579, 7320083, 7389147, 7453348, 7523258, 7592265, 7656266, 7726627, 7792230, 7873566, 7950777, 8028497, 8109315, 8183718, 8255340, 8332575, 8401874, 8467217, 8543300, 8610461, 8670376, 8734030, 8803812, 8864708, 8923449, 8976307, 9037265, 9090080, 9140991, 9197076, 9252637, 9312686, 9385167, 9457611, 9544643, 9634838, 9724211, 9833372, 9945795, 10061767, 10179577, 10289836, 10415585, 10536288, 10660657, 10791701, 10937542, 11079336, 11225321, 11380700, 11539305, 11696990, 11860545, 12024536, 12185890, 12353072, 12506561, 12672407, 12844069, 13029166, 13215113, 13414052, 13609293]
5025A3609293K02576K12166K23632K22528K26728K22276K18731K35144K26840
5016A5599914K38749K54348K65912K73751K88240K90272L03135L08775L05666
5007A8128762L18612L28706L39524L54480L68035L82111L88360M01514M07356
4998B1417460M17401M39773M52897M68571M93301N13953N44633N74584N88737
4989B5911310O17337O29304O45476O67273P02581P32092P57693P90694Q38577
4980C2292337Q81415R29369R75850J025876J079886J128284J162195J213691J246554
4971D1935457J229987J181049J113305J075093J065486J067230J114268J154323
4963E0936198J167793J185128J213612J252524J298334J358031J433861J493785
$$ y = [13609293, 13811869, 14024035, 14247667, 14470195, 14696923, 14919199, 15137930, 15373074, 15599914, 15838663, 16093011, 16358923, 16632674, 16920914, 17211186, 17514321, 17823096, 18128762, 18447374, 18776080, 19115604, 19470084, 19838119, 20220230, 20608590, 21010104, 21417460, 21834861, 22274634, 22727531, 23196102, 23689403, 24203356, 24747989, 25322573, 25911310, 26528647, 27157951, 27803427, 28470700, 29173281, 29905373, 30663066, 31453760, 32292337, 33173752, 34103121, 35078971, 36104847, 37184733, 38313017, 39475212, 40688903, 41935457, 43165444, 44346493, 45459798, 46534891, 47600377, 48667607, 49781875, 50936198, 52103991, 53289119, 54502731, 55755255, 57053589, 58411620, 59845481, 61339266]
4955F1339266J525030J554833J593759J634860J707618J784543J863010J968684
4947G4971603K079265K159401K197941K277510K373376K477233K616552K772130
4939I3925011K871404K924143K975058K968502K906404K851364K878492L007375
4931A17307753L165998L327449L525904L759516M019579M282141M556043M785838
4923A48730221M956831N097141N311102N670094O107569O594182P084498P560714
4915A97112352Q002477Q480175R124130R949058J0877439J1880288J3030507J4293246
4907B82749672J5550659J6823626J8160012J9318581J9879742J9919796J9999670
4900D12401758K0345817K0531888K0119608J8991098J6895300J3410890Q430906
$$ y = [61339266, 62864296, 64419129, 66012888, 67647748, 69355366, 71139909, 73002919, 74971603, 77050868, 79210269, 81408210, 83685720, 86059096, 88536329, 91152881, 93925011, 96796415, 99720558, 102695616, 105664118, 108570522, 111421886, 114300378, 117307753, 120473751, 123801200, 127327104, 131086620, 135106199, 139388340, 143944383, 148730221, 153687052, 158784193, 164095295, 169765389, 175872958, 182467140, 189551638, 197112352, 205114829, 213595004, 222719134, 232668192, 243545631, 255425919, 268456426, 282749672, 298300331, 315123957, 333283969, 352602550, 372482292, 392402088, 412401758, 432747575, 453279463, 473399071, 492390169, 509285469, 522696359, 531127265]
4893E31127265K379138l970775r960530j4994061j8608475k0889683k2288007
4886D42794872k2912961k2753979k1923853k0690771j9348307j8079031j6938491
4879C00147479j5941188j5018458j4097235j3202605j2341399j1545050j0792285
4872B07209259j0063188r358261q678245q051658p503097p025671o590184o210100
4864A43728855n847323n509052n189182m884276m596947m349383m114293l886970
4856A05351429l687574l469609l263471l094790k971823k867401k789109k679533
4848H0528119k556725k434895k330811k233645k150288k077944k024754j956244
4840F2762813j869509j784738j707347j633821j559981j505288j445896j382003
$$ y = [531127265, 533506403, 529535628, 519575098, 504581037, 485972562, 465082879, 442794872, 419881911, 397127932, 375204079, 354513308, 335165001, 317085970, 300147479, 284206291, 269187833, 255090598, 241887993, 229546594, 218001544, 207209259, 197146071, 187787810, 179109565, 171057907, 163554810, 156529139, 149938955, 143728855, 137881532, 132372480, 127183298, 122299022, 117702075, 113352692, 109238399, 105351429, 101663855, 98194246, 94930775, 91835985, 88864162, 85996761, 83207652, 80528119, 77971394, 75536499, 73205688, 70972043, 68821755, 66743811, 64719057, 62762813, 60893304, 59108566, 57401219, 55767398, 54207417, 52702129, 51256233, 49874230]
4832D9874230j319318j265439j195012j141702j092379j039929j000183r74834
4824D0845434r50294r31599r12525q89235q60237q41177q08858p83888p64419
4815C3103202p44176p24842o95583o84614o71594o58016o36829o15747n95411
4806B7076390n84146n56903n33556n31212n15857n10229m95209m80134m75781
4797B2393363m61587m48069m27076m15581m11316l84025l56484l57627l41325
4788A8790273l32353l23909l07597k99160l06239l01894k87955k86979k79228
4779A6064959k69012k71964k63460k55895k55984k50550k44133k40738k36144
4770A3777079k24727k20439k22870k13452k03753j96645j96612j89411j82766
$$ y = [49874230, 48554912, 47289473, 46094461, 44952759, 43860380, 42820451, 41820268, 40845434, 39895140, 38963541, 38051016, 37161781, 36301544, 35460367, 34651509, 33867621, 33103202, 32359026, 31634184, 30938601, 30253987, 29582393, 28924377, 28287548, 27671801, 27076390, 26492244, 25935341, 25401785, 24870573, 24354716, 23844487, 23349278, 22869144, 22393363, 21931776, 21483707, 21056631, 20641050, 20229734, 19845709, 19489225, 19131598, 18790273, 18457920, 18134011, 17826414, 17527254, 17221015, 16919121, 16631166, 16344187, 16064959, 15795947, 15523983, 15260523, 15004628, 14748644, 14498094, 14253961, 14013223, 13777079, 13552352, 13331913, 13109043, 12895591, 12691838, 12495193, 12298581, 12109170, 11926404]
4761A1926404j82877j78573j64344j59687j55065j50271j46720j48486j46299
4752A0494082j34805j32111j28672j36325j26149j15534j23159j10397j07783
4743I379147j07811j12785j11101j06039j14436j12181j12966j15434j21687j12817
4733H251890j15240j24656j21720j22531j25586j25948j31413j32775j26893j21972
4723G003156j24065j16342j10821j07406j02636r5905q9073q1991q5496p9455
4713F009966p4899p4700o6187o3249p1959n7985o4992p1585o8659p1292o6583
4702E257876n8868n6997n2854n0681n0035n2055m8401l8885m7752m4756m3552
4691D713040m4941m5405m7055m2074m2484m5516m1311l7516m3632m8962l7078
$$ y = [11926404, 11743527, 11564954, 11400610, 11240923, 11085858, 10935587, 10788867, 10640381, 10494082, 10359277, 10227166, 10098494, 9962169, 9836020, 9720486, 9597327, 9486930, 9379147, 9271336, 9158551, 9047450, 8941411, 8826975, 8714794, 8601828, 8486394, 8364707, 8251890, 8136650, 8011994, 7890274, 7767743, 7642157, 7516209, 7384796, 7252021, 7125128, 7003156, 6879091, 6762749, 6651928, 6544522, 6441886, 6345981, 6256908, 6174917, 6089421, 6009966, 5935067, 5860367, 5794180, 5730931, 5658972, 5600987, 5535995, 5464410, 5395751, 5324459, 5257876, 5199008, 5142011, 5089157, 5038476, 4988441, 4936386, 4887985, 4849100, 4801348, 4756592, 4713040, 4668099, 4622694, 4575639, 4533565, 4491081, 4445565, 4404254, 4366738, 4323106, 4274144, 4237066]
4680D237066l1856m2310m0926k7309l6453l8953l2537l0304l3219l5158l2284
4669C855757k9930l3059l1572k6646l7146l2686k6555k3051k0739l4141k7201
4658C533031j2697k6317k9222k0461l1221k9399j7415k7678l1820k1359j9876
4647C265566k0789k3394k2678j9643k0963j5198j5037k6270k6936k0960j2070
4636C041628j9034j1101j7226j1983j7612j9413j0150j3773p039j0020j0313p375
4624B886589p726m658o114q775r005q902o941m995m021K30M85l815n28N028N508
4609B832360j89J6019J3099K3522J6868J8659K3888K4235L4399L3596L8572N1349
4597C126377N5013O3301Q5678R6502J06333J18731J47161J64588J84327K07783
$$ y = [4237066, 4205210, 4162900, 4121974, 4094665, 4058212, 4019259, 3986722, 3956418, 3923199, 3888041, 3855757, 3825827, 3792768, 3761196, 3734550, 3697404, 3664718, 3638163, 3615112, 3594373, 3560232, 3533031, 3520334, 3494017, 3464795, 3444334, 3413113, 3383714, 3366299, 3338621, 3306801, 3285442, 3265566, 3244777, 3221383, 3198705, 3179062, 3158099, 3142901, 3127864, 3101594, 3074658, 3053698, 3041628, 3022594, 3011493, 2994267, 2982284, 2964672, 2945259, 2935109, 2921336, 2914297, 2904277, 2893964, 2886589, 2878863, 2874205, 2868091, 2859316, 2850311, 2841409, 2834468, 2829473, 2825452, 2825682, 2826167, 2822352, 2821824, 2826852, 2832360, 2832171, 2848190, 2861289, 2884811, 2901679, 2920338, 2944226, 2968461, 3002860, 3036456, 3075028, 3126377, 3181390, 3244691, 3330369, 3426871, 3533204, 3651935, 3799096, 3963684, 4148011, 4355794]
4587D355794K25015K39654K60149K61248K51467K28183J87573J08745J6876p1321
4577F063383j57415k27881k80553l01215l02591k82068k64980k41513k14778j92106
4567C598283j73043j57279j36155j22438j17585j03047r5705q4633p2070p2324
4557B464004o5220n9833n1409m8811m6006m6310m5557l8932m1970l6158l4608
4546A949190k8473l2689k8747k6551k9933k7172k1263k3791k4984k5933k1833
4535A657821j8084j5930j7068k0247j8102k4514j8091j0008k0009j7794j3433
4524A464541j5759j5615r105q419j7220r500j3135k0335j3556q314j0056n251
4512A318276p382q008j0856j2241j5778q553n162j1863j6830q481l460j2595j1278
$$ y = [4355794, 4580809, 4820463, 5080612, 5341860, 5593327, 5821510, 6009083, 6117828, 6134704, 6063383, 5905968, 5678087, 5397534, 5096319, 4793728, 4511660, 4246680, 4005167, 3790389, 3598283, 3425240, 3267961, 3131806, 3009368, 2891783, 2788736, 2693031, 2608398, 2536328, 2464004, 2398784, 2338951, 2287542, 2238731, 2192725, 2146415, 2100858, 2061926, 2019956, 1983798, 1949190, 1920717, 1888028, 1859281, 1832730, 1802797, 1775625, 1754362, 1730571, 1705587, 1679654, 1657821, 1639737, 1623807, 1606739, 1586492, 1568390, 1543876, 1525785, 1515777, 1495768, 1477974, 1464541, 1448782, 1433167, 1424062, 1415643, 1398423, 1388923, 1375788, 1355453, 1341897, 1333583, 1323527, 1318276, 1310894, 1302886, 1292030, 1279789, 1264011, 1255458, 1250296, 1238433, 1221603, 1213122, 1209662, 1197067, 1185789]
4499A185789r995o305j0991j9225n615p992r924m677p275q469l893m644j3809
4486A072975r157m773j2620r433l880l175j0893q551o536o424j4210q197m41l0
4472I74655j2391m483r081j1044K504k819p026p858l375O79O332o081k997j142
4458I15873L34m980m713m570m843n323n96m252l393n110o028l782j0339j0257
4444H48021j2570l678k363m235k136q112m780m818l871k123k058o534m906o068
4430G79769rn10K286k210j1911q213Q76k572l612l429j580j966m484l848k607
4415G35980L55j868n762m400r758k493m039l770n557m754r333l439k873n071K76
4400F73494j0564l644j1389r467q574l742k974K587L177n327q801r339L10m907
$$ y = [1185789, 1175794, 1169489, 1158498, 1139273, 1133658, 1125666, 1115742, 1111065, 1103790, 1095321, 1091428, 1086784, 1072975, 1063818, 1059045, 1046425, 1036992, 1033112, 1029937, 1019044, 1010493, 1003957, 997533, 983323, 975126, 974685, 974655, 962264, 957781, 948700, 937656, 940160, 937341, 930315, 922457, 919082, 919761, 926093, 920012, 917015, 915873, 916207, 911227, 906514, 901944, 897101, 891778, 891182, 886930, 883537, 878427, 872399, 868617, 858278, 848021, 835451, 831773, 829410, 825175, 823039, 814927, 810147, 805329, 801458, 799335, 797277, 790743, 785837, 779769, 779760, 779250, 781536, 779326, 767415, 759202, 760078, 757506, 753894, 750465, 748885, 746919, 742435, 738587, 735980, 736335, 734467, 728705, 724305, 714547, 712054, 708015, 704245, 698688, 693934, 684601, 681162, 678289, 673218, 673494, 662930, 659286, 647897, 638430, 629856, 626114, 623140, 625727, 628904, 623577, 614776, 605437, 605747, 600840]
4386F00840n513p726l564l24n164n944q329J975O15k088n607p554m970j6k788
4371E43843j209p603L18k356m023r632L30k752l67j967j196l091m382k670j098
4356E02145r989l323N800p359j113l235l127o61k970L993m310j1035o91k218j722
4341D60185K910J290N484j4197j1509O663o423o013J653l683n113j659m222M607
4327D29973n585p421k453K025J191L037o202q63l381o63l553L150k674p654l524
4312C95403J304k462k203l133L63J109j2751l492j405R95M582J486J177j721k370
4297C76882l142q168n25n475K111r3l40j496l233j979j911K578l194l228J539
4282C50326j991q420K125j249k110l09l647l155o70J042j253n047m263J788J728
$$ y = [600840, 595327, 587601, 584037, 583713, 578549, 572605, 564276, 566251, 566866, 564778, 559171, 551617, 546647, 546631, 543843, 542634, 535031, 535349, 532993, 528970, 519338, 519668, 516916, 516549, 514582, 513386, 510295, 505913, 503243, 502145, 492156, 488833, 494633, 487274, 486161, 482926, 479799, 479138, 476168, 480161, 475851, 464816, 464125, 461907, 460185, 463095, 464385, 469869, 455672, 444163, 450826, 444403, 438390, 440043, 436360, 431247, 429588, 425366, 429973, 424388, 416967, 414514, 416539, 417730, 420767, 414565, 413702, 410321, 409658, 406105, 409255, 406581, 398927, 395403, 396707, 394245, 392042, 388909, 389272, 390381, 377630, 374138, 372733, 373728, 378310, 379796, 380973, 379252, 376882, 373740, 365572, 365047, 359572, 361683, 361590, 361250, 359754, 356521, 354542, 352631, 355209, 352015, 348787, 350326, 348335, 339915, 342040, 340791, 338681, 338372, 334725, 331570, 330900, 331942, 330689, 325642, 321379, 323167, 324895]
4267C24895k072m108n035Q30O15K128J236p546P72n49l880l7K638k893m776k865
4251B99353o496L257k506L620o630m862L890L47L01k708k341M39J081L070M906
4236B94721J890p311l774l274j833K107l810l882M21k866N788k178o317j067k077
4221B66538N342j901K26O36n400n079L731j581n208k624M402k069l028q39K074
4206B55220l426J342j970p941q07M597n566m316m954j630J986J208k164O547k618
4191B35508l755j167m410m685l813m315J768K68J572j010p19m13Q479m291m095
4176B14922J065o419O011q64l587n550K275m160l463m416Q58R61k884P405N295
4161B07449J427m322o172m093m428R67M269k6m460k722K252n2k00K447m199K566
$$ y = [324895, 322823, 318715, 313680, 314510, 315125, 317253, 318489, 310943, 311715, 311166, 307286, 307249, 309887, 306994, 302218, 299353, 292857, 296114, 293608, 297228, 290598, 285736, 289626, 289973, 290274, 287566, 285225, 285664, 286745, 289815, 294721, 296611, 289300, 285526, 282252, 280419, 282526, 278716, 274834, 275255, 272389, 278177, 275999, 269682, 268615, 266538, 271880, 269979, 270205, 270841, 265441, 260362, 264093, 262512, 257304, 254680, 259082, 257013, 253985, 253146, 255220, 251794, 253136, 251166, 243225, 242418, 247015, 241449, 237133, 232179, 230549, 232535, 233743, 231579, 238126, 235508, 231753, 230586, 226176, 221491, 217678, 213363, 215131, 215399, 216971, 215961, 215242, 214829, 223308, 219017, 214922, 215987, 209568, 215579, 214715, 211128, 205578, 207853, 203693, 200230, 195814, 196672, 197633, 194749, 202154, 207449, 208876, 204554, 198382, 194289, 189861, 190828, 195097, 195071, 190611, 187889, 190141, 190089, 189889, 192336, 188137, 190703]
4145A90703n78R81k775k671j590k329l151M143M389n183p902l290P676J662k448
4130A77637M501j899M21l056k465l061o009j549P831O338m028R312r968j1254
4116A62751L448j789M641m618j871L004J667l338m108o789K176K400k744J0401
4102A65231J044j765P53n204k219o948M265O287l000k93n398j054k612k535n529
4087A41023M51R475K81n679l018R44p118K271m661m97M021J022M745M577k850
4072A44987k927K072l45J83j85m722j250N75l705Q347L784l741k518j3386k090
4057A25079L157j638j933O990L879k152o020J965p51J292j761k294j395l785L903
4042A24536N49M868k587K668J647j812n59j025j689l661k424N491m847k249j791
$$ y = [190703, 190125, 191106, 188331, 185660, 184070, 181741, 178590, 182733, 187122, 181939, 174037, 170747, 178423, 180085, 177637, 182138, 180239, 180660, 177604, 175139, 172078, 166069, 164520, 172351, 178689, 174661, 183973, 174005, 162751, 166199, 164410, 169051, 164433, 162562, 165566, 167233, 163895, 159787, 152998, 155174, 157574, 154830, 165231, 166275, 164510, 165263, 160059, 157840, 150892, 155157, 161444, 158444, 158151, 152753, 151699, 149087, 146552, 141023, 141474, 150949, 151230, 145551, 142533, 143477, 136359, 138630, 133969, 133472, 137493, 138515, 143260, 147837, 144987, 142060, 144132, 143787, 143970, 143785, 139063, 137813, 138388, 134683, 143030, 146814, 143073, 140555, 127169, 125079, 128236, 126598, 124665, 131655, 135534, 133382, 127362, 129327, 128576, 129868, 128107, 125813, 124418, 120633, 124536, 125085, 129953, 127366, 130034, 131681, 129869, 129310, 128285, 126596, 122935, 120511, 126002, 121155, 118906, 117115]
4027A17115L28M4k701M254k796k471O875r594M077K066P03m036J137j74l098L887
4011A15616l999k548Q454k248r19k524m238K946L022J254K227m101l638O905l418
3996A12791m416L142J083o99K587k627l099m026J944M49L660J31n955K599L993
3981A11557k214m539o079J796K727K816j537o432K841k106K729j928k998L500
3967A00133J694l180K173l521k652j009l491N044N591Q33J185k034l310n48k347
3952I4561j660k417L495n81K40j408M272n40q34J367n404R24L396o709l710N183
3936I0175N550m136J493k922R77j34l690J188K686M98o52K91J581K056K188j596
3920I5553n333K081j232j586O07N179m056r556N994K736J33L054n05l594k143
$$ y = [117115, 117443, 117487, 114786, 119040, 116244, 113773, 120648, 111054, 115131, 117197, 117900, 113864, 115001, 114827, 111729, 115616, 111617, 109069, 117523, 115275, 114356, 111832, 107594, 110540, 113562, 114816, 117043, 112942, 109304, 116209, 112791, 108375, 111517, 112600, 111901, 114488, 111861, 108762, 104736, 106680, 107129, 110789, 110920, 104965, 107564, 111557, 109343, 104804, 98725, 100521, 103248, 106064, 104527, 98095, 100936, 98830, 101559, 99631, 96633, 100133, 101827, 98647, 100820, 97299, 94647, 93638, 90147, 95191, 100782, 101615, 102800, 100766, 97456, 96908, 94561, 92901, 90484, 93979, 93398, 93638, 92230, 96502, 95962, 95128, 96495, 91091, 92015, 95411, 88702, 84992, 90175, 95725, 91589, 93082, 90160, 91137, 91003, 87313, 88501, 91187, 91685, 91033, 91324, 92905, 94961, 97149, 95553, 90220, 92301, 91069, 89483, 90090, 95269, 91213, 81657, 87651, 90387, 90520, 93574, 93069, 89475, 87332]
3905H7332l099j305k787J199P813j475J44j423o4J23n71j824N547j97O156k023
3889I3546p244L852L69K10n012J1270M342m829J835j823j202N269o271j234k511
3874I0567N058k104K369L77L301l302Q61L070J402j632k568k767J448Q082J199
3859A05361L593L104R436K314n6o075L458N330M264k991J984L571J367Q823k508
3844A40975M139k958j2087j609N92l048p490j280k129K452K10L217O978k229N46
3829A26279N38K588J2793P460K215k047J780j122N067P233M939k107M768M452
3815A74836M094J774p952o444N81q491m641L455m853m964m126m360k299p28M71
3800A36353J832R77n963j821M054j980r17O604M384r06R05j15M546K144l75P006
$$ y = [87332, 84233, 82928, 80141, 81340, 89153, 87678, 87822, 86399, 86335, 86458, 85887, 84063, 89610, 89413, 95569, 93546, 86302, 90154, 90523, 90733, 85721, 96991, 101333, 96504, 98339, 96516, 95314, 100583, 94312, 93078, 90567, 95625, 93521, 95890, 96267, 99568, 96266, 97127, 100197, 101599, 99967, 97399, 94632, 96080, 104162, 105361, 108954, 112058, 121494, 123808, 123752, 117677, 121135, 126465, 130729, 127738, 129722, 133293, 134660, 143483, 140975, 145114, 142156, 130069, 128460, 129052, 126004, 118514, 117234, 115105, 117557, 117767, 120984, 127962, 125733, 126279, 126817, 129405, 142198, 149658, 151873, 149826, 151606, 150484, 155551, 162784, 167723, 165616, 170384, 174836, 178930, 180704, 172752, 166308, 166889, 158398, 153757, 157212, 152359, 147395, 143269, 138909, 136610, 135882, 136353, 138185, 139162, 133199, 131378, 135432, 133452, 132535, 139139, 143523, 142617, 143522, 143407, 147953, 150097, 149722, 156728]
3784A56728l320K160j318j84L76m454q533l244O2m301L577j667K187J363p514
3769A31918j701L186l136N7j019K687J070Q46M750k692J185J877k03n69N688r43
3753A43001r12M141M309m12M10N584K918m730j152J278R16M826rJ1437j486j149
3737A68970m564K471K722m808O886J084k316n118L011J849M231P955l230M361
3723A83504J435J601k952k507L749P577J188l72O139M883K637k463o931o98N558
3708B02348P635J938L40k158m67L905K508M71N386J256K803J998k521N922k47
3693B31117J049k310K561P954O470J848n10Q522L23J986R34L677P092P415o93
3678B77435K337O657Q085M593l997O111M701Q31J748P770M131Q734K532P33J1645
$$ y = [156728, 153408, 155568, 154250, 154066, 154442, 149988, 141455, 138211, 138273, 133972, 137549, 135882, 138069, 139432, 131918, 130217, 133403, 130267, 130324, 129305, 131992, 133062, 133908, 138658, 135966, 137151, 139028, 138825, 138256, 143944, 143001, 142089, 146230, 150539, 150127, 150537, 156121, 159039, 154309, 153157, 154435, 155351, 160177, 160168, 171605, 170119, 168970, 164406, 166877, 169599, 164791, 171677, 172761, 170445, 165327, 168338, 170187, 174418, 182373, 179143, 183504, 184939, 186540, 183588, 181081, 184830, 192407, 193595, 193223, 199362, 204245, 206882, 204419, 197488, 196790, 202348, 209983, 211921, 212261, 210103, 209636, 213541, 216049, 216520, 221906, 223162, 225965, 227963, 225442, 231364, 231117, 232166, 229856, 232417, 240371, 246841, 248689, 248179, 256701, 257024, 259010, 259944, 263621, 270713, 278128, 277435, 279772, 286429, 294514, 299107, 295110, 301221, 305922, 306753, 308501, 316271, 320402, 329136, 331668, 332401, 344046]
3663C44046L013O319J0520M631M990P619N637O480J0979L629Q943J2887R641J1122
3649D50456R307J2687J3033M979P668J6110O513J2483J4951J0355J8069J5629
3637E92240J6451J0281J0225J3602J4819J8079J7178J5207J6226J9255J7593K4139
3625G85295K1316K0167J7149K7689K7224K8006K6335K0317L0487L0020L4525M1364
3613A109894K8393L9163L6553L5648M1846L9364L4526M1541M1553L8240M3540
3602A530261M1217M4458M6393M8560M9142N9790O3652O3926O0641O9004O8890
3591B145934Q1711Q5996R1909R6853J06559J05917J24994J35993J49562J68727
3581C294155J93183K18526K36863K63567K96327L27630L59969L76851M03008M33797
$$ y = [344046, 347059, 353378, 363898, 368529, 373519, 381138, 386775, 393255, 404234, 407863, 416806, 429693, 439334, 450456, 459763, 472450, 485483, 490462, 498130, 514240, 520753, 533236, 548187, 558542, 576611, 592240, 608691, 618972, 629197, 642799, 657618, 675697, 692875, 708082, 724308, 743563, 761156, 785295, 806611, 826778, 843927, 871616, 898840, 926846, 953181, 973498, 1003985, 1034005, 1068530, 1109894, 1138287, 1177450, 1214003, 1249651, 1291497, 1330861, 1365387, 1406928, 1448481, 1486721, 1530261, 1571478, 1615936, 1662329, 1710889, 1760031, 1819821, 1883473, 1947399, 2008040, 2077044, 2145934, 2227645, 2313641, 2405550, 2502403, 2608962, 2714879, 2839873, 2975866, 3125428, 3294155, 3487338, 3705864, 3942727, 4206294, 4502621, 4830251, 5190220, 5567071, 5970079, 6403876]
3571F403876M59514M71017M46326L80760K72193J13086o0752k11868l14887l57226
3561G602039l63337l36817k82598k35989j84770j30184p5989l6678n93M5685R3701
3550F094470J38622J95202K48952L06337L77613M47839N08353N61635O18985O64733
3540A0162741P32819P65736P66519P09517N54625K89607l6324l67843o36625q05151
3530A2135621q70105q63552q10440p26979o25558n33091m62878l89652l26222
3521F527144k79572k22202j78615j40968r1028m3289n21M7691R0272J30869J69539
3510F009320K02976K44209K64805K84229K90759K54005J62203K7032j29477k79099
3500G330962m00040m70482m97034m72852m39396m13343l59556l13824k79280k48176
$$ y = [6403876, 6863390, 7334407, 7780733, 8161493, 8433686, 8546772, 8486020, 8274152, 7959265, 7602039, 7238702, 6901885, 6619287, 6383298, 6198528, 6068344, 5992355, 5955677, 5955084, 6000769, 6094470, 6233092, 6428294, 6677246, 6983583, 7361196, 7809035, 8317388, 8879023, 9498008, 10162741, 10895560, 11661296, 12427815, 13137332, 13691957, 13981564, 13945240, 13577397, 12940772, 12135621, 11265516, 10401964, 9591524, 8864545, 8238987, 7705896, 7243018, 6853366, 6527144, 6247572, 6025370, 5846755, 5705787, 5614759, 5571470, 5570949, 5618640, 5708912, 5839781, 6009320, 6212296, 6456505, 6721310, 7005539, 7296298, 7550303, 7712506, 7739538, 7610061, 7330962, 6930922, 6460440, 5963406, 5490554, 5051158, 4637815, 4278259, 3964435, 3685155, 3436979]
3490C436979k14453k02709j81434j54264j45188j38370j24952j11865j00892r0711
3480A972141q6402q2353p6290p0274o7009n9994n3204n2611n0647n1155l9702
3469A282500m4022m3459l4048l0146l2565l4212k6233k5014k6244k6049l0459
3458I30049k2564k8122j9433j5748l2045k8598k2020j3399j7731k1444k2702k3348
3446F62895j1289j1714j5243j1152r544j3897j3425j4850q491j0744j3063r028
3434E20455j4864o226j5375j6798k805p818j6302j0653p232m127n670m085p610
3421D00890l594p469j1271j310j3055j09L31j1293n640q833p743j3552p949r271
3407C00132o282r803K9j843j6396j1346l555M099m393l208o12Q202J250O91k21
$$ y = [3436979, 3222526, 3019817, 2838383, 2684119, 2538931, 2400561, 2275609, 2163744, 2062852, 1972141, 1885739, 1803386, 1727096, 1656822, 1589813, 1529819, 1476615, 1424004, 1373357, 1322202, 1282500, 1238478, 1195019, 1160971, 1130825, 1098260, 1064048, 1037815, 1012801, 986557, 960508, 930049, 907485, 879363, 859930, 844182, 812137, 783539, 761519, 748120, 730389, 708945, 686243, 662895, 651606, 639892, 624649, 613497, 603953, 590056, 576631, 561781, 553290, 542546, 529483, 520455, 505591, 499365, 483990, 467192, 464387, 456569, 440267, 429614, 422382, 418255, 412585, 408500, 400890, 397296, 389827, 378556, 377246, 364191, 364082, 364413, 353120, 347480, 338647, 330904, 317352, 309403, 300132, 293850, 284047, 284076, 282233, 265837, 254491, 250936, 255035, 250642, 247434, 246822, 255024, 256274, 256965, 256744]
3392B56744r14o161m438n343k859m934m339m949o148q035k917j356K609m821L52
3377B02491O297l385K273m811n857j1488p789q510o117m502p983q630J489m497
3363A38981M73J68J553m501P440L696J618q958m453N550K98m098J02j67l397M79
3347A34784l040p930l279J181m178m724l242j810N156k847j149n630P325Q497
3333A19114m383m924J277j117J37K6l820o964j057m867m329J383K623N371j043
3318I7427Q65L786l549m246J19k393O326Q04j205k339K162m401m708k71P209R54
3302I6540l944p994j073K671K641o15K286K213M381m86k049q39O267K020P80p10
3286A02089J936R56N448k511Mk199j996o4o871J651p294k910M680m223K842l041
$$ y = [256744, 255830, 249669, 245231, 239888, 237029, 232095, 227756, 222807, 216659, 208624, 205707, 204351, 206960, 202139, 202491, 208788, 205403, 207676, 202865, 197008, 185520, 177731, 169221, 163104, 158602, 150619, 141989, 143478, 138981, 139454, 139622, 141175, 136674, 144114, 147810, 149428, 140470, 136017, 141567, 141865, 137767, 137869, 137702, 134305, 134784, 131744, 123814, 120535, 121716, 117538, 112814, 109572, 107762, 112918, 110071, 108922, 103292, 110617, 119114, 114731, 109807, 111084, 109967, 110104, 110130, 106310, 99346, 98289, 93422, 89093, 90476, 93099, 98470, 97427, 98292, 102078, 98529, 94283, 94402, 92009, 98335, 99139, 97934, 95595, 97757, 93356, 88648, 88377, 95586, 96540, 92596, 84602, 83529, 86200, 88841, 88226, 90512, 92725, 97106, 96620, 94571, 93732, 99999, 102019, 102799, 102089, 104025, 104981, 110429, 107918, 107922, 105723, 103727, 103663, 96792, 98443, 91149, 88239, 92919, 88696, 91538, 88497]
3270H8497o36M535L85l521J501M234R1m792j164L133m133M041M971L502P846k52
3254A08238K684O803N540J320l60k266m235L321q295j0813k761l827l372m596
3240H7381p711j062l7j806j807m842J51k655J586J690j782l215j050N864M407
3225G5112j235m715m475P904N091m012K368o211o214L663k18n796o983L61J246
3210E5886L859k873o906Q89m91K666p541l929p436M67N64J209L637k020m061j588
3194C2332o32k949m070P131Q85K124o08j161R134M313q007j178l810P76L810m428
3178C3662j478l2L812M203n943l358l973l455l76J707M461n001l189P659J917
3163C0616j865n934P61k546L635J77j1105j213J860J083J436J292m837j458k450
$$ y = [88497, 87861, 92396, 92781, 89260, 90761, 94995, 95086, 90294, 89130, 92263, 88130, 92171, 97142, 100644, 108490, 108238, 110922, 117725, 123265, 124585, 124225, 121959, 117724, 121045, 112750, 101937, 99176, 95349, 91977, 87381, 79670, 78608, 78571, 76765, 74958, 70116, 70267, 67612, 69198, 70888, 69106, 65891, 64841, 70705, 75112, 73877, 69162, 64687, 72591, 77682, 73670, 76038, 69827, 63613, 67276, 67058, 61262, 54279, 54640, 55886, 59745, 56872, 49966, 50855, 50364, 53030, 45489, 41560, 34124, 34591, 35155, 36364, 40001, 37981, 33920, 32332, 31700, 28751, 24681, 31812, 32697, 34821, 34213, 33052, 42186, 46499, 38492, 37314, 33504, 34280, 38090, 33662, 32184, 32152, 35964, 40167, 34224, 30866, 26893, 23438, 23062, 24769, 29230, 24229, 21040, 28699, 30616, 28751, 22817, 23578, 21032, 24667, 24844, 13739, 12526, 14386, 15469, 16905, 18197, 13360, 11902, 9452]
3148I452p89L768M742q789L048N638J691l084j075J049p96J553n755M161K610
3133A7424j686K486l014l798J166n13O73n10m606O491K673j636n888k299J855
3118H818P455n205l561j021J001m795N831j024J26j957j068P340L338J700j398
3103A5580N115p975J430J428L443n717M5j478j851N42o574O01O165m425j811J132
3087E650P17K287K273j339M677M00m852K074N58N10l26K058r62o98o371j036L820
3070I440o46N62Q20R2P91j689k782L786k138k468N396l987L427K062n840J133
3054G959k564o6k300N142M43l38j842j853K141j614K092k28K884p67m723r27L849
3037G288j735o05P554l037p196k57m216L47J00O74O56K174M504K784j705K28k158
$$ y = [9452, 8663, 12431, 17173, 8384, 11432, 17070, 18761, 15677, 14602, 15651, 14855, 16408, 10653, 14814, 17424, 15738, 18224, 15210, 11412, 12578, 12065, 12738, 12228, 7622, 14113, 16786, 15150, 9262, 6963, 8818, 16273, 11068, 7507, 6486, 7487, 2692, 8523, 7499, 7625, 5668, 4600, 11940, 15278, 16978, 15580, 20695, 12720, 14150, 15578, 19021, 13304, 13349, 11871, 10020, 10562, 3988, 4589, 10754, 6329, 4518, 5650, 6367, 8654, 10927, 9588, 14265, 14665, 9813, 11887, 12445, 12955, 12629, 14687, 13725, 13027, 6656, 5620, 9440, 8794, 9356, 10176, 10268, 11059, 9370, 6588, 10374, 8236, 5768, 11164, 7177, 10604, 12666, 6826, 7959, 5395, 5329, 3029, 8171, 8614, 8276, 6434, 4581, 6722, 5108, 7200, 6972, 9856, 9089, 4366, 3439, 7288, 5553, 4948, 12502, 9465, 2269, 2012, -2204, -1857, -1757, -1083, -427, 1747, 6251, 9035, 7330, 7558, 5400]
3020E400J830J014K573m053q160J0463n77k72L646l237j912n499P57M412n444
3005I41n349P175K779j018o027p9L384q32P66K557m59Q68j997k136N481m534l631
2988b111K441K71L553K223j171l150J184j707R167j0092j449J675o791M055J346
2973e56J419j441N022m670L272k772o429K009P306L352m14m087l907m06o954O772
2957b484L913P12n662j353P651j107J359p966p25j987L203K286J422p20M785J307
2941D634j115J543n55k450j475k930J07l820L825Q35q34P61j473l252M516K380
2925F97p89N208j937q092k395J543O901K121m386K415m50n84m358r20j539J472
2909e093M02J610N124k105k73P7m966R098n255m313M45M490k801j879K392l57
$$ y = [5400, 7230, 8244, 10817, 6764, -1396, 9067, 8490, 8218, 11864, 8627, 6715, 1216, 1973, 6385, 941, -4408, 2767, 5546, 4528, -1499, -1578, 1806, 974, 1740, 4297, 3838, 4706, 2709, 573, 6054, 1520, -2111, 330, 601, 4154, 6377, 5206, 2056, 3240, 1533, 10700, 608, -841, 834, -5957, -1902, -556, 863, -578, 4444, -226, 3046, 274, -6155, -4146, 3160, 6512, 6098, 2011, -1896, -2302, -9256, -2484, 1429, 2141, -3521, -4874, 2777, 1670, 3029, -4937, -5662, -7649, -4446, -2160, -738, -1458, 3327, 4634, 3519, 5062, 4507, 2057, 582, -2348, -2241, -6061, -2236, -1401, -2235, -1474, -2947, -6199, -1683, 697, -92, 5116, 3179, -4913, -7308, -5765, 1136, 3257, -1129, 1286, 836, 252, -4106, -5026, -6565, -5093, -4691, -3081, 2043, -62, -335, -258, -5224, 3874, -1381, -5694, -5249, -759, -3560, -5439, -3047, -3404]
2893c404L812L204L614j69r178o409P558O876n073o800L157K204L248o188L002
2878e46n113M752N774l454m19m144J654K036j6k072j224k666M762j037j060J008
2862a765L102o032J726l606r12M497L59R1k999k069K219N960q44n528K859l554
2846f496k394L830N32K37k376L486k401Q04m392N872J0061k365o003J065j232
2831a772p62j572R56R2j763k103q42O443Q02Q45q93L192j754k933j869O64K716
2814e53r365O773j544j922O166j427k693L3R36j865K273P76L9n612P765L199m643
2797a664k012M602O22J931l337m617k418o468K302L871j373L889k352m246j757
2782a3027K935J103J93l524K767J518L38M390j995O260n012j949K074j451J372
$$ y = [-3404, 408, 3612, 7226, 7057, -2121, -8530, -972, 5904, 831, -5969, -2812, -608, 2640, -3548, -546, -5659, -907, 4867, 1413, 994, -3150, -1496, 540, 524, -1548, -2772, -5438, -676, -1713, -2773, -1765, 1337, -4695, -2969, -6575, -7487, -2990, -2631, -2540, -5539, -7608, -5389, 571, -273, -5801, -2942, -6496, -8890, -5060, -4528, -4291, -6667, -3181, -5582, -4778, -9170, -3298, 6763, 4398, -1605, -540, -1772, -2534, -4106, -3150, -3058, -4821, -6924, -7766, -1323, -521, 324, -569, 2623, 869, -2064, -3933, -3269, -553, -9918, -3145, -4689, -6611, -445, -1872, -4565, -4532, -3596, -5461, -3188, -2412, -2373, -7985, -220, 2979, -1664, -3676, 926, 1548, 3479, 142, -4475, -6893, -13361, -11059, -7188, -8561, -4672, -7024, -11270, -13027, -10092, -8989, -8796, -12320, -9553, -8035, -7697, -3307, -5302, 958, -4054, -6003, -3929, -5380, -4008]
2767d008j103l624O528L436n283K427k623k572j763l92N997k716j606j141L321
2752e122j170M029M888n454L234M4l285J636n326l915k554R80k906M484J722L666
2736e049L493J033J131k563j799J409k291m413p07M56P620K11n047j579Q239l334
2720c190L623J822J62p208l678J122M642j613k623N510k543n419j945L962j217
2705h593k162J330n769M318Q030j077J588Q6P39j123m194p51N363N02L929m711
2689b495p24k367J178j203k211J574N473O56k312R56l885m271J165k314K216M630
2673c934M144Q97j665M65J48J628l931n033Q76k124k838K875K418K163L662k407
2657b656j775K082J005J84J939l110r34l382k601k778k940N478k220L690l16O028
$$ y = [-4008, -5111, -8735, -2207, 1229, -4054, -1627, -4250, -6822, -8585, -8977, -2980, -5696, -7302, -8443, -5122, -6292, -2263, 2625, -2829, 405, 449, -2836, -1200, -6526, -10441, -12995, -12015, -14921, -10437, -8715, -5049, -1556, -523, 608, -1955, -3754, -2345, -4636, -9049, -9756, -9300, -1680, -1469, -6516, -8095, 144, -3190, 433, 2255, 2417, -4791, -8469, -7347, -2705, -4318, -6941, -1431, -3974, -9393, -11338, -7376, -8593, -10755, -9425, -15194, -10876, -2846, -3923, -2335, -2249, -1510, -2633, -6827, -7578, -2215, -1713, 2216, -2495, -3219, -5586, -4408, -5611, -7822, -6248, -775, -119, -2431, -1475, -5360, -9631, -8466, -10780, -8564, -3934, 210, 1107, -558, -93, 55, 1683, -2248, -7281, -6405, -8529, -11367, -8492, -6074, -3911, -249, -2656, -4431, -2349, -1344, -1160, 779, -2331, -3265, -6647, -9248, -12026, -14966, -9488, -11708, -8018, -8334, -2306]
2641b306J387l825q994J581L169M213o21M451O956j2361n19L728j768J94L725
2626i90J802j860j328k481l447J589j782K648L543k493k974l0L020n857J116j175
2610a0699L397Q380k259o297k021M323k509j46k686j315L622L97L668p81k915
2595g841k904k75N400K253N18J234r225l785K948L105N281J563m042m43L054p705
2579a0864N175Q32L565n063k733J148m965M255N285j184j5m692J596O053L937
2564B330M395l962k397j059M990l526r094l258K818L123L955l856K929l03O85
2549b230o200n705J023K363R92J795j130k941M174j893q5M197j434j525Q978n961
2533e582j422k007m446L107j147K87j409k501P49k037Q96N377n937J798Q631K694
$$ y = [-2306, -919, -4744, -13738, -12157, -8988, -4775, -5396, -945, 6011, -6350, -6869, -3141, -4909, -4715, -990, 812, -1048, -2376, -4857, -8304, -6715, -8497, -5849, -2306, -4799, -7773, -7803, -4783, -10640, -9524, -10699, -7302, 1078, -1181, -7478, -9499, -5176, -7685, -7831, -10517, -11832, -8210, -7813, -4145, -4926, -7841, -10745, -11020, -5620, -3367, -2849, -1615, -10840, -14625, -11677, -8572, -3291, -1728, -5770, -6213, -3159, -10864, -5689, -4857, -1292, -6355, -9088, -7940, -12905, -8650, -3365, -4549, -4564, -9256, -7660, -1607, 2330, 6725, 2763, 366, -693, 4297, 771, -8323, -11581, -8763, -5640, -1685, -5541, -2612, -2915, -2230, -8430, -14135, -13112, -10749, -9757, -7962, -9092, -12033, -7859, -9752, -9837, -5640, -7074, -8599, 379, -5582, -7004, -9011, -13457, -10350, -11497, -11210, -12619, -15120, -14371, -16408, -15512, -10135, -16072, -14274, -5643, -2949]
2517b949m774k191l44R81k175Q233l60q539M386J114l162N77j830j65J423j675
2501a1450J0830j809m121K700l865J975j347K16j242l061L019J917o420M252M262
2486d144k43m351n535M108K592L958L690j560n694j961M886j782m191N422k346
2471g151n077N698P089n335o513K171j398K24M928L4j956p32n57L89M444N2J630
2454b060m175J442k069J7L832l989k855M749l295K615L032L68J13j182l991l852
2438a1300m86L532J644J62j328L480k404m797l25L834m194k377K312K055K165
2423h027N303n560k106P025k17k894k462q96J736L492o921K692N4k406K484p82
2407i485o62L750l42K387k445j885M300j139M933K06q697J822L535J13l798q337
$$ y = [-2949, -7723, -9914, -10258, -9277, -11452, -3219, -3579, -12118, -7732, -6618, -9780, -9203, -11033, -11198, -9775, -11450, -620, -2429, -6550, -3850, -7715, -5740, -7087, -6871, -8113, -11174, -8155, -6238, -12658, -8406, -4144, -4387, -8738, -14273, -10165, -7573, -3615, 75, -1485, -7179, -9140, -4254, -6036, -10227, -4805, -7151, -12228, -6530, 559, -4776, -11289, -9118, -10516, -10292, -5364, -5330, -7286, -8018, -8575, -8186, -3742, -3690, -2060, -6235, -4793, -6862, -6845, -3013, -7002, -9857, -5108, -8403, -5788, -2756, -2388, -2275, -3457, -7448, -11300, -11786, -8254, -6610, -6448, -7776, -4296, -6700, -11497, -11822, -7988, -12182, -14559, -12247, -10192, -8027, -2724, -8284, -10390, -3365, -3582, -6476, -8938, -9834, -8098, -4606, -11527, -8835, -8781, -11187, -8703, -9485, -10147, -6397, -6739, -4352, -6797, -8682, -4382, -5521, -588, -382, -9079, -7257, -3722, -3609, -7407, -15744]
2391a5744K492J058P75J429j958P644n060K945L141l859O71M501m072m308k946
2376a3291N244L083l603k059P834L063o846m85M631k446K8K776m632J090J55l649
2360i107N00k83k217N280L065K828m266m276M755J714R85m935o3P08N95o688l924
2343a5329P113p19R25K553L090N170q3j223k529k68o373L458K201n884Q98k161
2327i161k976p48J283J0353k605J492j331k903K715m914L98M58o389K515J771
2312a0042N776N115l632r15K068J999K82l151j838J29K64k528J883O530o673j887
2296f620J468p78M155L080l909Nk10K07n545n781L504J264k761J003k221N222
2280g917K363k268K438p54m983P254l338j604j345P39K358M877j462k684j373
$$ y = [-15744, -13252, -12194, -11419, -9990, -11948, -4304, -9364, -6419, -3278, -7137, -6466, -1965, -6037, -10345, -13291, -8047, -4964, -8567, -10626, -2792, 271, -6575, -7060, -2429, -4875, -4847, -2071, -6703, -5613, -5458, -9107, -8607, -8890, -11107, -5827, -2762, 66, -4200, -8476, -3721, -2007, -1022, -5957, -6020, -5312, -4717, -11405, -15329, -8216, -8935, -8010, -5457, -2367, 2803, 2720, 1497, -1032, -1300, -7673, -4215, -2014, -7898, -7000, -9161, -12137, -12885, -11602, -1249, -3854, -2362, -3693, -6596, -3881, -8795, -8397, -7939, -14328, -11813, -10042, -4266, 849, -2783, -3698, -1630, 369, 651, -2500, -4338, -4209, -3945, -6473, -4590, 1940, -4733, -6620, -5152, -5930, -1775, 1305, -2604, -2599, -2809, -2602, -8147, -13928, -10424, -9160, -11921, -10918, -13139, -7917, -5554, -7822, -5384, -6138, -11121, -3867, -7205, -8809, -10154, -9415, -7057, -2180, -3642, -6326, -7699]
2265g699j922P060L001n324l435O822J006o48L547l180Nl721j550j954l520J869
2249i643L358j750k784l725J0242L302n375o653N853k10K65K5K712O509k651n199
2233e724J849L518L815j85P22j844o587K732O87J435l169L77j627n88j633J228
2217d994N929P62l463J198K664k56n340O90N659j948o172l329l510N928K275j0528
2201a4435J436P816j532J329J152L443n717O6L268M201M09q50k270l067O500M45
2185B194o850k545p92j913L234p31m937O548N638N463r807k551o270M829J841
2170f649K488J994k820q19N82j144j216K29M779R6P74P56m32k848l198K460k497
2153g465M005R91K652J664q21k700n864N17L9L95r57p872M75k42P461J270K440
$$ y = [-7699, -9621, -2561, 440, -4884, -8319, -1497, -491, -1139, 2408, -772, -767, -4488, -6038, -7992, -11512, -9643, -6285, -8035, -10819, -14544, -4302, -1000, -6375, -13028, -7175, -7385, -7120, -7095, -4383, 2126, -525, -5724, -3875, -357, 3458, 3273, 3995, 2151, -4436, -1704, -1017, 418, -2751, -2374, -4001, -4589, -6222, -4994, 935, 1697, -1766, -568, 2096, 1840, -3500, -2810, 2849, 901, -5271, -8600, -12110, -6182, -3907, -14435, -12999, -5183, -6715, -5386, -4234, -791, -6508, -6442, -3174, 1027, 1436, 586, -1684, -4751, 1749, 2194, -4656, -7201, -7993, -9906, -6672, -7403, -12340, -5792, -154, 5309, -4498, -7049, -13319, -8490, -6649, -4161, -2167, -4987, -5806, -5224, -6368, -7584, -7355, -2576, -2480, -1706, -950, -1382, -4230, -7428, -4968, -7465, -3460, -2469, 183, 1847, 1026, -1674, -7538, -7021, -6982, -6587, -7544, -15416, -14941, -15183, -7722, -6452, -4012]
2136d012K520j519L411M72R99j454j225n81J80N57q00M69J743m688n054O717m44
2119b709j889j707j028l773K850Q057o55l121q31M967K794J782o911j954j06l084
2103g318N357q52q230j935Q543J296K270j928k28M094l156k135J104k627J328
2088d417R08L807K231l501l320K195k146n48l010L004K937J747j355K187n69N517
2072E667l552r93O68Q81l445j956J161P39l438o623l558M652P671m281M520k769
2056d656l971M893R095m991l70k549J873l986L210L264p832K752j952n942P71
2041a0391K417q665K778O941K9j397P71P844m886J48l800l134M168o70p2P613
2025c06k86k310k354J802m265J480n01K765k612j165L247l581M996k464K378j995
$$ y = [-4012, -1492, -3011, 400, 872, 1871, 417, -808, -1389, -1209, -652, -1452, -983, 760, -3928, -8982, -2265, -2709, -4598, -6305, -7333, -11106, -8256, -199, -854, -3975, -4806, 161, 2955, 4737, -2174, -4128, -4234, -7318, -1961, -2813, -11043, -12978, -4435, -3139, -869, -2797, -3025, 1069, -2087, -4222, -3118, -5745, -4417, -3509, 298, 2529, -972, -4292, -2097, -4243, -4791, -7801, -4797, -1860, -113, -1468, 719, 150, 5667, 2115, 1122, 1790, 2671, -774, -2730, -1569, -830, -4268, -10891, -14449, -9797, -2126, -6407, -1887, -4656, -8627, -3734, 5361, 370, 0, -2549, -676, -4662, -1452, 1812, -6020, -3268, -5220, -11162, -10391, -7974, -16639, -13861, -6920, -6891, -8288, -7517, 327, -4559, -4411, -8211, -11345, -7177, -7847, -7919, -306, -592, -2902, -5256, -3454, -7719, -6239, -6740, -3975, -6587, -7752, -4505, -8086, -3090, -5554, -3176, -5171]
2009e171l862O066J001n824K753O436K514n78j728j714M694K21n11l914j43n180
1993d940J512j937L697Q044k063k374k352Q86N153o049k808J969j0627J438K572
1978g879J807j337k453k630J631L079j944j313P948J399j872K186j000J087J740
1963D49m919n254Q351K238K284o243n944J858m92N97L966m076R65M886m018M305
1947a047K374K456m075K359k91K624K876J840l302j940p020l252O055K3k694N172
1931B158q09Q76m221m871k316l759Q193O626m274pM129k354Q93k735L799J011
1915B339m583K588n109O544m93o350M625K073J257q93j517k529j51l78M843l505
1899a239l620N615L641k988q82k364N23j896M210K503k173k162o265j105N602
$$ y = [-5171, -9033, -2967, -1966, -7790, -5037, 1399, 3913, 3335, 1607, -107, 4587, 4808, 4297, 383, 240, -4940, -3428, -5365, -1668, 6376, 4313, 1939, -413, 473, 5626, -423, -3231, -1262, -11889, -10451, -7879, -6072, -7409, -9862, -12492, -10861, -7782, -9726, -11039, -3091, -1692, -3564, -1378, -2378, -1291, 449, -4470, -9724, -1373, 865, 3149, -3094, -9038, -7180, -7672, -7075, -3109, -7185, -6220, -1334, -5352, -1047, 1327, 3783, -292, 2067, 1776, 4400, 7276, 9116, 5814, 3874, -3146, -6398, -343, -320, -3014, 2158, 1349, 2225, -1996, -6867, -9183, -12942, -4749, 1877, -2397, -2404, 1725, -629, 264, -2471, 1328, 2339, -2244, 344, -4765, 1779, 1286, -5064, -439, 1634, 2891, 1998, 481, -2048, -2199, -2577, 2266, -1239, -4859, 756, 4397, 1409, 527, -1837, -1314, -3210, 1000, 3503, 1330, -832, -7097, -8202, -2600]
1884b600J607j633R796n24p645j383j625P54j621L745R89n03j626k269M89L197
1868h52o760P71j693K566J825L502L976p965J053j744P35N686j988K985J541M22
1852D060n869J083k590l685K010J681j048Q58M275l192j373K048M417k66m87j400
1836E22J373K674l03l081n269Q56j206N96L245J903j496p73k819j011K313p628
1820a0104L297K076J828J432L122l706j784M069k782K699K710n265m19L653J701
1805B527l141j040p370M323O551K921m696m242m660M933J112Q80J033p813N533
1790c149M186m723P61J0149l610o14j194k999M094m70j913j318j795j191n500
1775i286N886N410K602o569k002L007m611K701L377m60j801q148j748J0178n860
$$ y = [-2600, -993, -2626, 7170, 6646, -999, -2382, -4007, -3253, -4874, -1129, -140, -643, -2269, -4538, -4049, -852, -7612, -6841, -8534, -5968, -4143, -641, 3335, -4630, -3577, -5321, -4586, 1100, -888, 2097, 3638, 4060, -1809, -726, -3316, -7001, -4991, -3310, -4358, -3500, 775, -2417, -3790, -1742, 2675, 2409, 1922, 522, 1895, 4569, 4266, 1185, -4084, -3228, -4434, -3838, -593, 1310, -186, -959, -3778, -4789, -2476, -10104, -6807, -4731, -2903, -1471, 1651, -2055, -3839, 230, -2552, 147, 2857, -2408, -2827, 826, 2527, -614, -1654, -9024, -4701, 1850, 4771, 75, -4167, -8827, -3894, -2782, -1902, -869, -8682, -3149, 1037, -3686, -2925, 7224, 3614, 3000, 1806, -1193, 2901, 2431, 518, -800, -2595, -3786, -9286, -3400, 2010, 4612, -1957, -3959, -952, -5563, -2862, 515, 55, -1746, -9894, -11642, -1464, -7324]
1760g324l022J377Q29L793N457J92o60l650j150L806J451j220Q89L472k446K877
1744D671J112l146q290m968J815R43L63o210p17N743K551Q267l80q42O18J920
1728C450R53k9k990J799n00l007K101n337j18o02J109L583L94l121j472J648L651
1711A512J550o284K190J81l270L888o08L748K02l182n202L446M36k149L58N277
1695B093k763k146O3j745J348J789L226m009J195K095j401O60o184L781R91j315
1679b322n179J203N017P83M24p014J472O409J943k535J491m845N913j494l557
1664b291j170N546q76l303L33k724M148M0o894M761o10Q68l327j076k895P96K599
1647f075L411j56m193K218K203j194M412J080N88l1N32J927N85l481k106M753
$$ y = [-7324, -10346, -8969, -8140, -4347, 1110, 1302, 642, -3008, -4158, -352, 1099, -121, 768, 4240, 1794, 4671, 5783, 2637, -5653, -10621, -8806, -7863, -7500, -13710, -14427, -8684, -6133, 2134, 1754, 912, 1530, 3450, 4403, 4374, 1384, 3183, 2683, -324, 1777, -3560, -3678, -4280, -3171, 412, 806, -2315, -3787, -2139, 1512, 3062, -3222, -1032, -851, -4121, -233, -841, 2907, 3109, -73, -5275, -1829, -1393, -3542, -3184, 2093, -670, -2816, -2753, -4498, -3150, -1361, 1865, -2144, -949, 1146, -255, 405, -5779, -1998, -1007, -2322, -7501, -6298, -1281, -498, -74, -7088, -5616, 793, 2736, 201, 1692, -3153, 2760, 1266, -2291, -3461, 2085, 1209, -2094, -1761, -4485, -337, -297, -7191, -2430, -3040, -2172, -5499, -6575, -9470, -8674, -6075, -2664, -2820, -7013, -4795, -2592, -3786, 626, 1706, 2294, 2263, 2795, 4722, 5307, 1826, -280, 4473]
1631D473k893m619m269l538j792L575O536Q49r79N539P29l175L705K849j290k860
1615B840n8m12K68M003m552j808j2430o588L388M606Q64K622j329K274O121l93
1599e84l574M220L349O070j59m288M145M072O608m173j0266m173j985L543m059
1584a254n478J471J19m87m046k444J0507M381K317L395l336r89L891J97m717L50
1568C877K391N261K719r49n37p369m506R64K163p983j745L017k823L763P962K44
1552F449P15m606j749K828K752M312k025j388k70j770k122L341l36j184L526Q85
1536I358n742Q78m674j927L377M472L014j0p804O200J667m075p998l684O227J503
1520G82L880m253o492k61M393m129N024L915O093J03M73m030k890L159n8L512
$$ y = [4473, 1580, -3039, -7308, -10846, -12638, -9063, -2527, -1678, -2657, 2882, 3611, 436, 4141, 6990, 5700, 2840, 2782, 2370, 2638, 6641, 2089, 281, -12149, -18737, -15349, -10743, -9879, -7257, -8586, -6312, -191, -584, -4158, 62, 3411, 9481, 9322, 5034, 9179, 13251, 19859, 15686, 5420, 1247, -738, 2805, -1254, -6732, -5261, -5142, -5629, -9675, -12119, -1612, 2769, 5086, 8481, 5145, 4156, 8047, 8244, 3527, 3877, 6268, 11529, 14248, 13299, 12762, 5393, 887, 1851, 4014, -3969, -5714, -2697, -5520, -1757, 6205, 6449, 7164, 2558, 809, 3637, 6389, 10701, 8676, 7288, 7018, 5248, 3126, 6467, 6131, 4947, 8473, 9358, 3616, 4494, -180, -2107, 1270, 5742, 8756, 8746, 942, 7142, 8809, 4734, -3264, -6948, -721, 782, 4662, 409, -6083, -6344, -1951, -6080, -1056, 2859, 8952, 9055, 9528, 5498, 2608, 5767, 5709, 9221]
1504I221J94J678p623m955k17K390J173K888j650m655J801m332L56L271L282j420
1488A402j633P476m80q612l514M204j383k907L402J946N336N104n780j991j008
1473A562k808J659Q04l66K885K333J121L617n98l81n449m671J815Q95j318J385
1457B485j540J139K968n672O5L209K485K293n489k563K384j858K986n32K714J350
1441F424p88K64p487K062P871j611j890o709J972K618J163l666L482l409N899
1426F195j18m650j726M009K792j331l080J328M642j677o52Q30o64o55J084k132
1410D195m507n016R32j086K523K725M743m443R96M0k532J654n3O453J950j0567
1394a993L733j293j448j710J282L891R267N185r089p401J209K023j29k812K38
$$ y = [9221, 9415, 11093, 3470, -1485, -1702, 688, 1861, 4749, 3099, -1556, 245, -4087, -3731, -460, 2822, 1402, -231, 7245, 6765, -1847, -5361, -1157, -2540, -5447, -2045, -99, 5237, 10341, 4561, 2570, 1562, -1246, 413, 1217, 851, 3736, 6069, 7190, 10807, 10209, 9828, 4379, -292, 1523, 2418, 1100, 2485, 945, 2084, 5052, -620, -555, 2654, 5139, 7432, 1943, -620, 1764, -94, 2892, 2360, 5074, 6424, 5636, 5900, -1587, 475, 8346, 6735, 4845, -1864, 108, 2726, 3889, 223, 3705, 296, 6195, 6077, 1427, -299, 3710, 6502, 5171, 2091, 3419, 8061, 6384, 5732, 6562, 5898, 5243, 6327, 4195, -312, -5328, -4396, -5482, -2959, -234, 4509, 66, 1062, 1102, -1430, 224, 171, 6624, 8574, -1993, 1740, 447, -1001, -2711, -1429, 2462, 11729, 16914, 7825, 424, 1633, 3656, 3527, 715, 953]
1379I53j597J817L473k59j667m107N413J087j246p72l71m79J167k16l48M322k665
1362D505k569m568Q406M858j344p846l462L394L69J617j57L52j58J953N035m557
1346E828j413M843l371j869m117J810j881K34N440o184L596l299J190m02N514
1331E919J905K048k369k397J823k821p22j056L505k87K375m174M348j649M471
1316A0919j205m964K743L83j858K180l231n506K417K916j523K066j915j812J822
1301C432J489J639L573J313k957k409K763J483k93k637k180M299l933J292M283
1286A1157l734k926K744L196o041l542M275k48N358m702k883J986j925M733K540
1271I988j296l058R0M604l319q109J203q62k92J899k499n851N278N101O521k541
$$ y = [953, -644, 1173, 4646, 4387, 2720, -1387, 4026, 5113, 3867, 3095, 2724, 2245, 3412, 3196, 2848, 7170, 4505, 1936, -2632, 5774, 10632, 9288, 1442, -2020, 1374, 1743, 3360, 3203, 3555, 3397, 5350, 10385, 5828, 4415, 9258, 5887, 4018, -99, 1711, -170, 64, 5504, -680, 2916, -383, 807, 405, 5919, 7824, 9872, 7503, 5106, 6929, 4108, 3386, 2330, 5835, 5548, 7923, 3749, 8097, 6448, 10919, 9714, 4750, 7493, 7876, 6018, 8198, 4967, -539, 1878, 4794, 3271, 5337, 3422, 1610, 3432, 4921, 6560, 10133, 11446, 8489, 6080, 8843, 10326, 10033, 7396, 5216, 9515, 5582, 6874, 11157, 7423, 4497, 7241, 10437, 4396, 854, 5129, 4881, 10239, 5537, 2654, 4640, 2715, 7448, 9988, 8692, 5634, 5724, 10328, 7009, -1100, 103, -759, -1051, 848, -1651, -7502, -2224, 2877, 9398, 6857]
1255F857K561m876m484J471L477M159l916l81k39K567r3O94o19k659R61K122l62
1238G240M69m863J648O323n943q57L186O042p149K347p32m42k431q61j490j528
1222I59L047j695l701M031M89k943N445p459K087M584N407M234p502P71j364n495
1206H95O90k118M503m56K083j781q54J400m999O647J945p103k259O33J0490r467
1190B49M209k109j597j250K278L981M95l978O45m87L098o35n349M393k128K649
1174D464J916K205j444k929J794k528Q888p11p172L0m522o531m47L230l973M693
1158c037k083J465k578O628L804N18k619o158k06N242K027K434m025r83K018L617
1142F064K402m305N59L087m036m142M364o211j580J750N361O464J247m617m790
$$ y = [6857, 9418, 4542, 58, 1529, 5006, 9165, 5249, 4868, 4629, 7196, 7103, 7797, 7178, 4519, 5480, 7602, 7240, 7709, 2846, 4494, 10817, 4874, 4017, 7203, 13245, 6096, 8443, 7711, 7269, 4838, 3977, 2487, 959, 4006, 2311, -1390, 2641, 3130, 187, 5632, -1827, 260, 4844, 10251, 14485, 6983, 7754, 6390, 895, 1585, -533, 3970, 3514, 5597, 3816, 2962, 4362, -637, 6010, 7955, 852, -1407, -774, 9716, 249, 4458, 2349, 752, -498, 1780, 5761, 6256, 2278, 2923, 2436, 5534, 4899, -450, 3943, 1815, 4464, 6380, 8585, 7141, 4212, 6006, 3478, 12366, 11655, 4483, 4513, -9, -6540, -6987, -3757, -7730, -3037, -5120, -3655, -6233, 395, 4199, 4717, 2098, -4060, -4266, 976, 3003, 5437, 1412, 429, 2447, 6064, 8466, 4161, 4720, 7807, 3771, -371, 3993, -2218, -3798, -2048, 3313, 9777, 11024, 6407, 1617]
1127A617K511J491j517j50j278q54k722R9R72N62N796l864n046L129N16q9l182
1110b009o12J545j127L863J716k93l16j594J418r15J242k848O035q93p887l187
1094e862NJ671K67j611M381j283J424P207j567k184j580l344L962k559n23j865
1078c461k710L707P63L691n918K905Q081O322j1886J211O361L24K6o298M798l575
1062D341j485J426J080K377O09J174k774J588p675q97K105O261N734j837n230
1047F797k981k682L230j955l871j269J881J78M143n56L588N445l165k299j999
1032D485L214Q02o001M520n69m361L659k714j327j34j393m412j75q13O21O124
1016A526M733k605j675o45K74L10o119J563K222M868R79r36p08k902k977L315
$$ y = [1617, 4128, 5619, 4102, 3952, 2674, 1820, -902, -803, 169, 731, 6527, 2663, -2383, 746, 1262, 1173, -2009, -2621, -1076, -2203, 1660, 3376, 3083, 2767, 1173, 2591, 1676, 2918, 70, 6105, 5212, -2675, -5862, -5857, -4186, -3919, -5530, -1149, -2432, -1008, 6199, 4632, 2448, 868, -2476, 1486, -1073, -1596, -3461, -6171, -2464, -1701, 1990, -3928, -1023, 7058, 13380, 1494, 2705, 9066, 9390, 9416, 3118, 7916, 4341, 2856, 4282, 5362, 7739, 8348, 9522, 6748, 8336, 661, -236, 1869, 8130, 13864, 12027, 6797, 3816, 1134, 4364, 2409, -1462, -2731, -850, -672, 3471, 2915, 6503, 11948, 8783, 6484, 4485, 7699, 8501, 2500, 7020, 6451, 2090, 5749, 3035, 1708, 1574, 181, -4231, -4406, -5219, -4598, 1526, 6259, 3654, 1979, 1334, 1608, 1918, -4201, -2638, -416, 4452, 5431, 4495, 3787, 885, -2092, 1223]
1000A223R06n654K479l129K099N141J250J763J132k866l077r97K060K603j259
985C674j77j36N980K893p654M530k072j010N02p39n242K360n733l406J3988L900
$$ y = [1223, 2129, -3525, -1046, -4175, -2076, 3065, 4315, 6078, 7210, 4344, 1267, 270, 2330, 4933, 3674, 3497, 3361, 9341, 12234, 4580, 9110, 7038, 6028, 6530, 5791, 549, 2909, -2824, -6230, 7758, 11658]
$$ [...]
##END NTUPLES=NMR SPECTRUM
##END=
