##TITLE=1H_CA-9259-1
 DMSO
 8 sc, 
 5.4.2024
##JCAMPDX= 6.0         $$ Bruker NMR JCAMP-DX V2.0
##DATA TYPE= NMR SPECTRUM
##DATA CLASS= NTUPLES
##ORIGIN= UXNMR, Bruker Analytische Messtechnik GmbH
##OWNER= root
$$ XWIN-NMR		Version 3.5
$$ Fri Apr  5 13:57:46 2024 Russian Standard Time (UT+4h)  she@DPX200
##.OBSERVE FREQUENCY= 200.1309
##.OBSERVE NUCLEUS= ^1H
##.ACQUISITION MODE= SIMULTANEOUS
##.ACQUISITION SCHEME= undefined
##.AVERAGES= 8
##.DIGITISER RES= 18
##SPECTROMETER/DATA SYSTEM= spect
##.PULSE SEQUENCE= zg30
##.SOLVENT NAME= MeOD
##.SHIFT REFERENCE= (INTERNAL, MeOD, 0, 15.6885)
##AUDIT TRAIL= $$ (NUMBER, WHEN, WHO, WHERE, WHAT)
$$ ##TITLE= Audit trail, XWIN-NMR		Version 3.5
$$ ##JCAMPDX= 5.01
$$ ##ORIGIN= Bruker BioSpin GmbH
$$ ##OWNER= she
$$ F:/spectra/data/she/nmr/H-F/1/pdata/1/auditp.txt
$$ ##AUDIT TRAIL=  $$ (NUMBER, WHEN, WHO, WHERE, WHAT)
(   1,<2024-04-05 13:56:26.65 +0400>,<she>,<DPX200>,
      <created by zg, POWCHK disabled, PULCHK disabled
       configuration hash MD5:
       00 E9 B6 7A A2 85 ED C7 34 08 36 98 17 FE 4E 26
       data hash MD5: 16K
       0C D8 15 3A 6E 70 A2 48 88 63 F4 D3 CA 32 8C C1>)
(   2,<2024-04-05 13:56:29.26 +0400>,<she>,<DPX200>,
      <Start of raw data processing
       efp BC_mod = 2 LB = 0.24 FT_mod = 6 PKNL = 1 PHC0 = -25379.7 PHC1 = 9.587311 SI = 16K 
       data hash MD5: 16K
       24 81 FE 9C 6C 40 91 C4 6A F0 1E EA 35 20 8A 92>)
(   3,<2024-04-05 13:56:54.09 +0400>,<she>,<DPX200>,
      <pk PHC0 = -1.066219 PHC1 = 1.8 
       data hash MD5: 16K
       7C B5 20 55 21 A2 35 00 9C 8F 55 8E 99 58 B0 69>)
(   4,<2024-04-05 13:56:57.84 +0400>,<she>,<DPX200>,
      <abs ABSG = 5 
       data hash MD5: 16K
       3D 67 89 4B E9 85 21 A0 A2 C3 65 0F B3 AF 4E 39>)
$$ ##END=
$$ 
$$ hash MD5
$$ 27 A6 F7 2D 5E C0 BD 58 1B DB E8 47 AC C5 9A 2C
##$RELAX= 
##$RELAX= 
##$RELAX= 
##$RELAX= 
##$RELAX= 
##$RELAX= 
$$ Bruker specific parameters
$$ --------------------------
##$DU= <F:/spectra>
##$EXPNO= 1
##$NAME= <H-F>
##$PROCNO= 1
##$TYPE= <nmr>
##$USER= <she>
##$AMP= (0..31)
100 100 100 100 100 100 100 100 100 100 100 100 100 100 100 100 100 100 
100 100 100 100 100 100 100 100 100 100 100 100 100 100 
##$AQSEQ= 0
##$AQ_mod= 1
##$AUNM= <au_zg>
##$AUTOPOS= <>
##$BF1= 200.13
##$BF2= 200.13
##$BF3= 200.13
##$BF4= 200.13
##$BF5= 200.13
##$BF6= 200.13
##$BF7= 200.13
##$BF8= 200.13
##$BYTORDA= 1
##$CFDGTYP= 0
##$CFRGTYP= 5
##$CHEMSTR= <none>
##$CNST= (0..31)
1 1 145 1 1 1 1 1 1 1 1 1 1 1 1 1 1 1 1 1 1 1 1 1 1 1 1 1 1 1 1 1 
##$CPDPRG= <>
##$CPDPRG1= <>
##$CPDPRG2= <>
##$CPDPRG3= <>
##$CPDPRG4= <mlev>
##$CPDPRG5= <mlev>
##$CPDPRG6= <mlev>
##$CPDPRG7= <mlev>
##$CPDPRG8= <mlev>
##$CPDPRGB= <>
##$CPDPRGT= <>
##$D= (0..31)
0 1.2 0 0 0 0 0 0 0 0.06 0 0.03 0 0 0 0 0.0002 0 0 0 0 0 0 0 0 0 0 0 0 
0 0 0 
##$DATE= 1712310986
##$DBL= (0..7)
120 120 120 120 120 120 120 120 
##$DBP= (0..7)
150 150 150 150 150 150 150 150 
##$DBP07= 0
##$DBPNAM0= <>
##$DBPNAM1= <>
##$DBPNAM2= <>
##$DBPNAM3= <>
##$DBPNAM4= <>
##$DBPNAM5= <>
$$ [...]
##$SUBNAM3= <"">
##$SUBNAM4= <"">
##$SUBNAM5= <"">
##$SUBNAM6= <"">
##$SUBNAM7= <"">
##$SUBNAM8= <"">
##$SUBNAM9= <"">
##$SW= 18.0517689322627
##$SWIBOX= (0..15)
0 0 2 0 0 0 0 0 0 0 0 0 0 0 0 0 
##$SW_h= 3612.71676300578
##$TD= 16384
##$TD0= 1
##$TE= 0
##$TE2= 300
##$TE3= 300
##$TEG= 300
##$TL= (0..7)
0 120 120 120 120 120 120 120 
##$TP= (0..7)
150 150 150 150 150 150 150 150 
##$TP07= 0
##$TPNAME0= <>
##$TPNAME1= <>
##$TPNAME2= <>
##$TPNAME3= <>
##$TPNAME4= <>
##$TPNAME5= <>
##$TPNAME6= <>
##$TPNAME7= <>
##$TPOAL= (0..7)
0.5 0.5 0.5 0.5 0.5 0.5 0.5 0.5 
##$TPOFFS= (0..7)
0 0 0 0 0 0 0 0 
##$TUNHIN= 0
##$TUNHOUT= 0
##$TUNXOUT= 0
##$USERA1= <user>
##$USERA2= <user>
##$USERA3= <user>
##$USERA4= <user>
##$USERA5= <user>
##$V9= 5
##$VALIST= <valist>
##$VCLIST= <CCCCCCCCCCCCCCC>
##$VD= 0
##$VDLIST= <DDDDDDDDDDDDDDD>
##$VPLIST= <PPPPPPPPPPPPPPP>
##$VTLIST= <TTTTTTTTTTTTTTT>
##$WBST= 1024
##$WBSW= 4
##$XGAIN= (0..3)
0 0 0 0 
##$XL= 0
##$YL= 0
##$YMAX_a= 230587
##$YMIN_a= -256304
##$ZGOPTNS= <>
##$ZL1= 120
##$ZL2= 120
##$ZL3= 120
##$ZL4= 120
##$ABSF1= 15.68852
##$ABSF2= -2.363369
##$ABSG= 5
##$ABSL= 3
##$ALPHA= 0
##$AQORDER= 0
##$ASSFAC= 0
##$ASSFACI= 0
##$ASSFACX= 0
##$ASSWID= 0
##$AUNMP= <proc_1d>
##$AZFE= 0.1
##$AZFW= 0.1
##$BCFW= 0
##$BC_mod= 2
##$BYTORDP= 0
##$COROFFS= 0
##$CY= -3
##$DATMOD= 1
##$DC= 0
##$DFILT= <>
##$DTYPP= 0
##$F1P= 0
##$F2P= 0
##$FCOR= 1
##$FTSIZE= 16384
##$FT_mod= 6
##$GAMMA= 0
##$GB= 0
##$INTBC= 1
##$INTSCL= 3.70164e-10
##$ISEN= 128
##$LB= 0.24
##$LEV0= 0
##$LPBIN= 0
##$MAXI= 10000
##$MC2= 0
##$MEAN= 0
##$ME_mod= 0
##$MI= 1.114404
##$NCOEF= 0
##$NC_proc= -5
##$NLEV= 6
##$NOISF1= 3.799351
##$NOISF2= 2.8
##$NSP= 0
##$NTH_PI= 0
##$NZP= 0
##$OFFSET= 15.68852
##$PC= 1
##$PHC0= -25380.77
##$PHC1= 11.38731
##$PH_mod= 1
##$PKNL= yes
##$PPARMOD= 0
##$PSCAL= 0
##$PSIGN= 0
##$REVERSE= no
##$SF= 200.129566621028
##$SI= 16384
##$SIGF1= 3
##$SIGF2= 2
##$SINO= 5.538805
##$SIOLD= 16384
##$SREGLST= <1H.CDCl3>
##$SSB= 0
##$STSI= 16384
##$STSR= 0
##$SW_p= 3612.71676300577
##$SYMM= 0
##$S_DEV= 0
##$TDeff= 16384
##$TDoff= 0
##$TI= <>
##$TILT= no
##$TM1= 0
##$TM2= 0
##$TOPLEV= 0
##$USERP1= <user>
##$USERP2= <user>
##$USERP3= <user>
##$USERP4= <user>
##$USERP5= <user>
##$WDW= 1
##$XDIM= 16384
##$YMAX_p= 355393843
##$YMIN_p= -67702
$$ End of Bruker specific parameters
$$ ---------------------------------
##NTUPLES= NMR SPECTRUM
##VAR_NAME=  FREQUENCY,     SPECTRUM/REAL,   SPECTRUM/IMAG
##SYMBOL=    X,             R,               I
##VAR_TYPE=  INDEPENDENT,   DEPENDENT,       DEPENDENT
##VAR_FORM=  AFFN,          ASDF,            ASDF
##VAR_DIM=   16384,         16384,           16384
##UNITS=     HZ,            ARBITRARY UNITS, ARBITRARY UNITS
##FACTOR=    0.220516191357247, 1,           1
##FIRST=     3139.73679488495, 0,            0
##LAST=      -472.979968120819, 0,           0
##MIN=       -472.979968120819, -67702,      0
##MAX=       3139.73679488495, 355393843,    0
$$ Real data points
##PAGE= N=1
##DATA TABLE= (X++(R..R)), XYDATA
$$ [...]
$$ plain form
8609 -4794 -11222 -18168 -23033 -16391 -5429 -3672 -11168 -20088 -23770 -13682 -7750 -5473 -13515 -23655
8595 -23655 -24727 -18753 -14424 -10284 -17771 -20717 -22927 -14875 -12110 -16734 -26096 -26575 -29677 -20368 -46129
8580 -46129 -67702 -15416 -16556 -4187 813 7376 370 -6564 -11575 -4005 -544 2177 -6270 -15951
8566 -15951 -19908 -12699 -1342 914 -8551 -15509 -17538 -12061 350 2423 -10397 -15732 -16467 -8520
8552 -8520 -393 -3131 -11009 -17524 -12668 -8146 -4059 -3495 -11734 -18404 -17601 -8569 -4257 -4537 -10723 -19008
8536 -19008 -17326 -7129 -1287 -6593 -14781 -21234 -18160 -7270 404 -5255 -13565 -22433 -16970 -7262
8522 -7262 -5979 -10609 -18907 -19936 -13454 -4038 -2586 -5733 -13296 -16883 -10324 -6571 -5585 -11638 -16518
8507 -16518 -17337 -8235 -3950 -2527 -11803 -19896 -12959 -6944 -2804 -5626 -17952 -22032 -19075 -8969
$$ packed form
8609d794o428o946m865O642J0962J757p496q920l682J0088N932K277q042j0140
8595b3655j072N974M329M140p487k946k210Q052K765m624r362m79l102R309k5761
8580d6129k1573N2286j140J2369N000O563p006o934n011P570L461K721q447r681
8566a5951l957P209J1357K256r465o958k029N477J2411K073j2820n335p35P947
8552h520Q127k738p878o515M856M522M087N64q239o670Q03R032M312k80o186q285
8536a9008J682J0197N842n306q188o453L074J0890P674n659q310q868N463R708
8522g262J283m630q298j029O482R416J452l147p563l587O559L753R86o053m880
8507a6518q19R102M285J423r276q093O937O015M140k822j2326m080K957J0106
$$ plain form
8493 -8969 -3289 -4487 -13367 -18535 -14179 -5506 -722 -9254 -18717 -19361 -13019 -1731 -820 -7153 -17322
8478 -17322 -17354 -9690 -2827 -905 -4229 -13434 -17535 -14316 -7139 -3251 -10311 -17592 -16711 -8368 970
8463 970 -1902 -6999 -17836 -19028 -12139 1639 -2932 -10235 -16066 -16703 -6051 -2521 -7556 -14712 -19777
8448 -19777 -18662 -10929 -5677 -7886 -15484 -21194 -15486 -5228 -3585 -8815 -18622 -22580 -15037 -4195
8434 -4195 -2240 -7006 -16161 -18741 -12456 -4922 -6858 -13105 -17729 -18013 -7415 -617 -4211 -9641 -15724
8419 -15724 -12647 -10626 -7807 -5151 -11630 -20443 -14369 -3460 3997 -6032 -17050 -20256 -18632 -11693
8405 -11693 -2468 -5158 -14570 -17996 -12586 -6425 -2287 -8334 -14002 -13162 -7928 -269 -1354 -12374 -17615
8390 -17615 -17954 -7525 1335 522 -8921 -16500 -13398 -3627 2255 -2645 -14975 -21288 -17580 -6429
$$ packed form
8493h969N680j198q880n168M356Q673M784q532r463o44O342J1288R11o333j0169
8478a7322l2P664O863J922l324r205m101L219P177L888p060p281Q81Q343R338
8463I70k872n097j0837j192O889J3778m571p303n831o37J0652L530n035p156n065
8448a9777J115P733N252k209p598n710N708J0258J643n230r807l958P543J0842
8434d195J955m766r155k580O285P534j936o247m624k84J0598O798l594n430o083
8419a5724L077K021K819K656o479q813O074J0909P457j0029j1018l206J624O939
8405a1693R225k690r412l426N410O161M138o047n668Q40N234P659j085j1020n241
8390a7615l39J0429Q860q13r443p579L102R771N882m900j2330o313L708J1151
$$ plain form
8376 -6429 -244 -5889 -16564 -22060 -15122 -7313 -1083 -3482 -15198 -20986 -12377 181 1536 -9573
8362 -9573 -14370 -17730 -13909 -5746 -3524 -14607 -18502 -20207 -13035 -903 -227 -11957 -20967 -18765
8348 -18765 -11185 -3167 -4061 -14794 -22189 -22810 -14159 -4855 -5246 -13847 -23343 -21000 -13022 -6470 -13218
8333 -13218 -19197 -22594 -17214 -7648 -3701 -9719 -18602 -23266 -16553 -8548 -8714 -13979 -19120 -19972 -12951
8318 -12951 -2819 -4062 -16626 -23407 -17480 -8290 -4309 -3763 -12324 -19597 -19926 -12980 -6603 -10347 -17862
8303 -17862 -21051 -14827 -7843 -3387 -4179 -12799 -19419 -19529 -11018 -2647 -4502 -10237 -11910 -9187 -4884
8288 -4884 -2607 -9784 -15039 -18408 -12957 -4884 -4221 -8164 -12463 -12860 -9316 -4877 499 -6069 -19644
8273 -19644 -20362 -6442 6012 4544 -8150 -19887 -15268 -4366 -1213 -102 -14053 -16893 -13472
$$ packed form
8376f429O185n645j0675n496O938P809O230k399j1716n788Q609J2558J355j1109
8362i573m797l360L821Q163K222j1083l895j705P172J2132O76j1730r010K202
8348a8765P580Q018q94j0733p395o21Q651R304l91q601r496K343P978O552o748
8333a3218n979l397N380R566L947o018q883m664O713Q005j66n265n141q52P021
8318a2951J0132j243j2564o781N927R190L981N46q561p273l29O946O377l744p515
8303a7862l189O224O984M456p92q620o620j10Q511Q371j855n735j673K723M303
8288d884K277p177n255l369N451Q073O63l943m299l97L544M439N376o568j3575
8273a9644p18J3920J2454j468j2694j1737M619J0902L153J111j3951k840L421
$$ plain form
8260 -13472 -1253 2858 -4302 -16313 -24956 -14035 -2358 1349 -5050 -16788 -17378 -15360 -2139
8247 -2139 6201 -4936 -13568 -10445 -3029 3807 -1216 -11184 -16558 -16553 -5957 -2238 -1646 -6586 -14353
8232 -14353 -12647 418 10381 6687 -4266 -18618 -20469 -4175 1879 -824 -7807 -13443 -8076 2243
8218 2243 2872 3509 -21837 -27280 -17446 -12190 -9823 -11725 -22298 -25076 -13408 -203 13520 4274
8204 4274 -2704 7149 11616 25288 16882 4775 -6170 -4299 -7587 7378 1208 47491 84251
8191 84251 -19610 -18101 19620 13825 3796 -3414 -8513 8289 4994 -416 -14713 -25417 -15725
8178 -15725 -6108 -2898 -20438 -20938 -21128 -18419 -7587 -1093 -12969 -19381 -19464 -7868 -2980 -2906 -4315
8163 -4315 -19738 -14961 -11228 -2027 -2403 -15157 -16649 -15449 -7256 -1633 -12383 -21238 -19803 -15390
$$ packed form
8260a3472J2219M111p160j2011q643J0921J1677L707o399j1738n90K018J3221
8247b139Q340j1137q632L123P416O836n023r968n374NJ0596L719N92m940p767
8232a4353J706J3065R963l694j0953j4352j851J6294O054k703o983n636N367J0319
8218B243O29O37k5346n443R834N256K367j902j0573k778J1668J3205J3723r246
8204D274o978R853M467J3672q406j2107j0945J871l288J4965o170M6283L6760
8191H4251j03861J509L7721n795j0029p210n099J6802l295n410j4297j0704R692
8178a5725R617L210j7540n00j90K709J0832O494j1876o412q3J1596M888P4j409
8163d315j5423M777L733R201l76j2754j492J200Q193N623j0750q855J435M413
$$ plain form
8149 -15390 -4839 -9117 -13792 -18793 -23541 -11255 795 -304 -4179 -9720 -15445 -3819 -2502 -7577
8135 -7577 -13756 -21969 -21548 -13992 -4420 -10699 -18444 -21945 -21814 -10740 -926 -4703 -10675 -12222 -13797
8120 -13797 -9500 -1584 -5106 -15255 -13897 -5799 474 5229 -2265 -14069 -17387 -12000 -4677 -858
8106 -858 -7465 -15003 -19150 -10880 -3501 -4014 -10383 -17718 -22377 -13147 -3539 -7999 -15903 -21392 -13710
8091 -13710 -4763 7211 109 -14827 -19628 -13855 -2087 3210 -3111 -14483 -16716 -16550 -3734 3779
8077 3779 -4356 -16804 -13258 -8455 2368 2872 -8940 -18828 -18861 -8413 -3380 -6532 -12262 -17588 -14676
8062 -14676 -4075 -723 -2045 -12542 -19382 -19187 -8970 -4479 -6241 -12357 -19828 -17546 -8823 -5789
8048 -5789 -5833 -9052 -9603 -6198 465 -2165 -11111 -20258 -21347 -13222 -1122 -599 -11977 -19207 -17310
$$ packed form
8149a5390J0551m278m675n001m748J2286J2050j099l875n541n725J1626J317n075
8135g577o179q213M21P556R572o279p745l501J31J1074R814l777n972j547j575
8120a3797M297P916l522j0149J358Q098O273M755p494j1804l318N387P323L819
8106h58o607p538m147Q270P379n13o369p335m659R230R608m460p904n489P682
8091a3710Q947J1974p102j4936m801N773J1768N297o321j1372k233J66J2816P513
8077C779q135j2448L546M803J0823N04j1812r888l3J0448N033l152n730n326K912
8062a4676J0601L352j322j0497o840J95J0217M491j762o116p471K282Q723L034
8048e789m4l219n51L405O663k630q946r147j089Q125J2100N23j1378p230J897
$$ plain form
8033 -17310 -7349 -350 -5272 -13927 -17758 -16321 -7347 2523 -1499 -9293 -17024 -13355 -4043 -1420 -5080
8018 -5080 -18084 -17125 -6527 -2822 -3203 -8734 -17323 -17717 -11191 -1490 -3631 -10558 -20269 -21629 -13573
8003 -13573 -2381 -2185 -11185 -15948 -7661 1615 2504 -2062 -10255 -15524 -11911 -1128 3344 -3009 -12565
7988 -12565 -17228 -10880 2311 2223 -7341 -14943 -17192 -11258 -859 1837 -5658 -14967 -16075 -9069 1712
7973 1712 1834 -9950 -14932 -13908 -10701 -4120 -2245 -8906 -12658 -11002 -6985 600 -5469 -16766 -18979
7958 -18979 -11954 -3632 -2153 -6601 -14316 -18936 -11806 -3373 3132 -4649 -14551 -18876 -9828 1889
7944 1889 230 -7141 -13013 -12272 -6057 2044 -1067 -9961 -17172 -15705 -8189 -1198 -3818 -13529 -24794
7929 -24794 -16496 -3094 -106 -3927 -15763 -15578 -5876 3480 7778 -713 -14704 -16995 -10238 -968
$$ packed form
8033a7310R961O999m922q655l831J437Q974R870m022p794p731L669R312K623l660
8018e080j3004R59J0598L705l81n531q589l94O526R701k141o927r711j360Q056
8003a3573J1192J96r000m763Q287R276Q89m566q193n269L613J0783M472o353r556
7988a2565m663O348J3191q8r564p602k249N934J0399K696p495r309j108P006J0781
7973A712J22j1784m982J024L207O581J875o661l752J656M017P585o069j1297k213
7958a8979P025Q322J479m448p715m620P130Q433O505p781r902m325R048J1717
7944A889j659p371n872P41O215Q101l111q894p211J467P516O991k620r711j1265
7929b4794Q298J3402K988l821j1836J85R702R356M298q491j3991k291O757R270
$$ plain form
7915 -968 -1127 -12179 -17374 -11447 -2157 3594 2359 -8667 -11687 -9382 -1087 2934 -698 -9979 -14646
7900 -14646 -10440 -1093 1677 -2998 -9938 -14931 -8302 2375 8340 968 -10052 -12418 -3955 4193
7886 4193 3133 -8049 -14749 -14341 -6701 -587 -3466 -11459 -13835 -11519 -707 3656 -2444 -15795
7872 -15795 -17575 -10319 -5036 -2114 -4144 -9161 -13397 -7662 183 755 -8882 -17922 -16106 -3087 6748
7857 6748 5360 -7883 -14800 -14755 -4552 3594 2439 -6026 -16964 -12040 -3298 1458 -2347 -10907 -12606
7842 -12606 -8658 3567 3070 -4059 -11320 -12671 -8972 -3954 372 -5535 -13917 -11272 -3266 600 -1481
7827 -1481 -5484 -12235 -8428 -884 6791 6066 -3884 -11707 -6473 1699 4910 2761 -5302 -8145 556
7812 556 8836 16717 8665 6357 3578 21649 42188 70491 19493 -65888 -51088 -30846 -12218
$$ packed form
7915i68j59j1052n195N927R290N751j235j1026l020K305Q295M021l632r281m667
7900a4646M206R347K770m675o940m993O629J0677N965p372j1020k366Q463Q148
7886D193j060j1182o700M08P640O114k879p993k376K316J0812M363o100j3351
7872a5795j780P256N283K922k030n017m236N735P845N72r637r040J816J3019R835
7857F748j388j3243o917M5J0203Q146j155q465j0938M924Q742M756l805q560j699
7842a2606L948J2225m97p129p261j351L699N018M326n907q382K645Q006L866k081
7827a481m003o751L807P544P675p25r950p823N234Q172L211k149q063k843Q701
7812E56Q280P881q052k308k779J8071K0539K8303n0998q5381J4800K0242J8628
$$ plain form
7799 -12218 -15817 -18894 -27130 -25027 -10140 -1330 -8856 -17060 -23504 -19912 -11293 -6288 -9906 -17907
7785 -17907 -21725 -15945 -4608 -584 -7169 -15039 -16685 -8680 -1228 -3782 -8926 -16533 -20653 -10179
7771 -10179 -4271 -5077 -16538 -21533 -18592 -8597 -3322 -6969 -15764 -19125 -13988 -927 2302 -4895
7757 -4895 -12841 -15636 -6354 2267 2117 -11682 -20725 -18471 -6042 1550 2614 -9014 -15802 -15544 -8025
7742 -8025 132 -1867 -10563 -18189 -14942 -2252 3706 -1667 -10974 -16512 -11234 1017 2475 -1538
7728 -1538 -15174 -15535 -7680 -3282 -2248 -8436 -16159 -16750 -5929 1394 -1908 -10566 -11446 -10697 -4952
7713 -4952 1387 -4110 -12119 -13672 -8992 2238 5312 -3656 -11141 -16526 -8659 1200 2941 -5372 -13874
7698 -13874 -15579 -8498 -2061 -2184 -10334 -15944 -16186 -7478 -3190 -6168 -15125 -19183 -12281 -3377 1092
$$ packed form
7799a2218l599l077q236K103J4887Q810p526q204o444L592Q619N005l618q001
7785a7907l818N780J1337M024o585p870j646Q005P452k554n144p607m120J0474
7771a0179N908q06j1461m995K941R995N275l647q795l361N137J3061L229p197
7757d895p946k795R282Q621j50j3799r043K254J2429P592J064j1628o788K58P519
7742h025Q157j999q696p626L247J2690N958n373r307n538N278J2251J458m013
7728a538j3636l61P855M398J034o188p723n91J0821P323l302q658q80P49N745
7713d952O339n497q009j553M680J1230L074q968p485n385P867R859J741q313q502
7698a3874j705P081O437j23q150n610k42Q708M288k978q957m058O902Q904M469
$$ plain form
7683 1092 -4543 -14180 -20546 -14194 359 6673 -377 -10117 -13752 -7813 2552 3569 -6946 -18446
7669 -18446 -19390 -7998 3677 1685 -8181 -15624 -11790 -4243 3552 -996 -12844 -16535 -11706 3709
7655 3709 4281 -6857 -13775 -14270 -7525 5109 8890 -2481 -13027 -9973 -3309 4640 4629 -4150 -14527
7640 -14527 -11277 -2005 3446 -960 -7417 -14237 -9628 513 5067 -1719 -10097 -14227 -9081 -678
7626 -678 2359 -5343 -17085 -18615 -9751 1923 3143 -5035 -12169 -7699 487 6197 -1539 -12286
7612 -12286 -15040 -11300 -800 4900 -2165 -10277 -11256 -4076 1457 4444 -3734 -10579 -12199 -8192 3010
7597 3010 3521 -8117 -19141 -14130 1020 7695 2066 -6002 -14213 -12282 -2476 3633 -801 -8460
7583 -8460 -13899 -11479 -3439 5263 -1238 -11067 -12581 -6116 2829 5467 -3430 -12667 -11164 -4285 5233
$$ packed form
7683A092n635r637o366O352J4553O314p050r740l635N939J0365J017j0515j1500
7669a8446r44J1392J1675j992r866p443L834P547P795m548j1848l691M829J5415
7655C709N72j1138o918m95O745J2634L781j1371j0546L054O664P949j1q779j0377
7640a4527L250R272N451m406o457o820M609J0141M554o786q378m130N146Q403
7626f78L037p702j1742j530Q864J1674J220q178p134M470Q186N710p736j0747
7612a2286k754L740J0500N700p065q112r79P180N533K987q178o845j620M007J1202
7597C010N11j1638j1024N011J5150O675n629q068q211J931R806O109m434p659
7583h460n439K420Q040Q702o501r829j514O465Q945K638q897r237J503O879R518
$$ plain form
7568 5233 5535 -9045 -15701 -10973 -1568 6057 -1177 -9241 -14347 -10166 -45 3777 -1068 -11482
7554 -11482 -14226 -3846 4879 4494 -2551 -10511 -13755 -4615 2131 4232 -4238 -12287 -11985 -2128 4692
7539 4692 5404 -1027 -8722 -8926 1239 4601 -3129 -12136 -12018 -3693 9929 7073 698 -5183 -7129
7524 -7129 -496 6284 4083 -7585 -14030 -10078 666 10178 2631 108 -8638 997 -11944 -46371
7510 -46371 -21309 -21680 -20878 -14359 -3458 -345 -3553 -13052 -14609 -5569 4264 3549 -8482 -16805 -15071
7495 -15071 -7071 4156 491 -14175 -17620 -10105 1941 5811 -1284 -13634 -14812 -11500 363
7482 363 7055 -4921 -18662 -17513 -8030 2248 1890 -8031 -15880 -13651 -1482 4311 2414 -5825
7468 -5825 -12196 -9734 769 4505 -837 -10764 -12608 -4340 7291 8142 -3027 -10109 -13028 -3660
$$ packed form
7568E233L02j4580o656M728R405P625p234q064n106M181J0121L822m845j0414
7554a1482k744J0380Q725l85p045p960l244R140O746K101q470q049L02R857O820
7539D692P12o431p695k04J0165L362p730r007J18Q325J3622k856o375n881j946
7524g129O633O780k201j1668o445L952J0744R512p547k523q746R635j2941l4427
7510d6371K5062l71Q02O519J0901L113l208r499j557R040R833p15j2031q323J734
7495a5071Q000J1227l665j4666l445P515J2046L870p095j2350j178L312J1863
7482C63O692j1976j3741J149R483J0278l58r921p849K229J2169N793j897q239
7468e825o371K462J0503L736n342r927j844Q268J1631Q51j1169p082k919R368
$$ plain form
7454 -3660 4793 2041 -4906 -9641 -9875 -2062 5698 3320 -4642 -11275 -5126 7022 9718 1719 -10914
7439 -10914 -13998 -4419 5433 9212 -1470 -13548 -7188 -141 5199 6654 -1159 -11362 -7542 -631
7425 -631 5853 4186 -9141 -14478 -9758 2480 8629 1185 -6835 -11045 -6290 1724 5767 -3227 -10775
7410 -10775 -11042 -2759 5457 5529 -3785 -9730 -8645 966 6066 1718 -9243 -14253 -5317 6264 8040
7395 8040 -1420 -9133 -10214 -1786 9054 9278 -159 -7507 -5096 3739 8061 6522 -4325 -11537 -6992
7380 -6992 4954 15079 4204 -9837 -11438 -5723 3847 8024 1501 -10733 -15904 -8339 4066
7367 4066 4078 -4646 -14299 -12499 -1271 4599 3984 -7533 -15561 -9131 -794 4040 -1562 -9569 -7696
7352 -7696 420 5780 6854 -1118 -12241 -13251 280 8183 3008 -6809 -13922 -10835 26 9154
$$ packed form
7454c660Q453k752o947m735k34P813P760k378p962o633O149J2148K696p999j2633
7439a0914l084R579R852L779j0682j2078O360P047N340J455p813j0203L820O911
7425f31O484j667j3327n337M720J2238O149p444q020m210M755Q014M043q994p548
7410a0775k67Q283Q216P2r314n945J085R611N100m348j0961n010Q936J1581J776
7395H040r460p713j081Q428J0840K24r437p348K411Q835M322j539j0847p212M545
7380f992J1946J0125j0875j4041j601N715R570M177o523j2234n171P565J2405
7367D066J2q724r653J800J1228N870o15j1517q028O430Q337M834n602q007J873
7352g696Q116N360J074p972j1123j010J3531P903n175r817p113L087J0861R128
$$ plain form
7338 9154 6719 -4498 -9438 -4955 6286 10087 378 -11915 -9864 302 9486 7630 -1909 -11147
7324 -11147 -9387 -2476 5432 2631 -6076 -11794 -10300 -2467 8092 3396 -6753 -7180 -3595 5940
7310 5940 12280 4952 -7697 -12111 -3293 4343 5577 -2798 -10432 -11405 478 9780 6545 -5499
7296 -5499 -10779 -5291 2528 10948 3207 -7390 -10682 -517 7387 10391 3319 -8111 -7893 977
7282 977 9731 9039 -2369 -11916 -11703 2148 10736 6851 -8827 -13320 -6998 3804 9939 2714 -9486
7267 -9486 -11545 -4047 10781 13040 959 -10934 -9761 431 7757 6770 -3067 -13822 -8118 6592
7253 6592 12525 2853 -11277 -11661 -3414 7648 10785 -1208 -11209 -7899 3824 12790 8890 1146
7239 1146 -6967 -7941 3845 10527 7048 -4300 -5988 -2244 5174 10864 3142 -9304 -11542 -1339
$$ packed form
7338I154k435j1217m940M483J1241L801r709j2293K051J0166R184j856r539r238
7324a1147J760O911P908k801q707n718J494P833J0559m696j0149m27L585R535
7310E940O340p328j2649m414Q818P636J234q375p634r73J1883R302l235j2044
7296e499n280N488P819Q420p741j0597l292J0165P904L004p072j1430K18Q870
7282I77Q754o92j1408r547K13J3851Q588l885j5678m493O322J0802O135p225j2200
7267i486k059P498J4828K259j2081j1893J173J0192P326r87r837j0755N704J4710
7253F592N933r672j4130l84Q247J1062L137j1993j0001L310J1723Q966l900p744
7239A146q113r74J1786O682l479j1348j688L744P418N690p722j2446k238J0203
$$ plain form
7225 -1339 9999 10550 1296 -7424 -7205 4066 10254 9055 -2399 -6804 -6688 5479 11803 2679 -6947
7210 -6947 -8225 1144 9477 10416 4289 -3554 -6674 2980 10657 7281 -878 -9217 -4843 4066 10195
7195 10195 3949 -7614 -14556 -6609 7327 9113 4540 -7998 -10705 -3335 6010 10260 -1815 -13301
7181 -13301 -12161 -15 9920 7862 -738 -6365 -6339 6220 11259 5071 -4448 -11012 -1834 9969
7167 9969 12709 2014 -8501 -8719 1733 10560 10722 -783 -9465 -5892 8940 14340 3326 -7645
7153 -7645 -10771 -6296 5275 6231 -1247 -10654 -10376 339 12098 12240 807 -11962 -8057 5337
7139 5337 13082 6931 -4705 -10886 -6683 6867 12601 7890 -3711 -8245 1325 11313 9909 4020
7125 4020 -5040 -6982 634 12467 8784 -295 -7701 -3691 7242 12879 6019 -3306 -7521 619
$$ packed form
7225a339J1338N51r254q720K19J1271O188j199j1454m405J16J2167O324r124r626
7210f947j278R369Q333R39o127p843l120R654P677l376q159q339M374Q909O129
7195A0195o246j1563o942P947J3936J786m573j2538k707P370R345M250j2075j1486
7181a3301J140J2146R935k058q600n627K6J2559N039o188r519o564R178J1803
7167I969K740j0695j0515k18J0452Q827J62j1505q682L573J4832N400j1014j0971
7153g645l126M475J1571R56p478r407K78J0715J1759J42j1433j2769L905J3394
7139E337P745o151j1636o181M203J3550N734m711j1601m534R570R988j404n889
7125D020r060j942P616J1833l683r079p406M010J0933N637o860r325m215Q140
$$ plain form
7111 619 11646 10277 118 -9189 -7940 1552 11279 9782 -1049 -7347 -3651 9202 17652 14595
7097 14595 -1084 -4229 775 11559 14390 4636 -5994 -6588 800 14477 13735 3678 -5811 -5244
7083 -5244 7401 16441 11577 599 -4393 -1615 11756 20897 11302 -3440 -6240 49 10272 10779
7069 10779 1229 -5400 -4027 3952 13697 8936 -2468 -10913 -3872 5485 7922 -247 -1633 -3860
7055 -3860 4682 17363 19878 7149 -7221 -5831 4190 12464 11105 -354 -6038 832 13907
7042 13907 19273 11003 -2397 -6892 3074 17226 15230 6247 -4104 -5887 3728 14477 11247 3553
7028 3553 -2229 -315 9046 16804 11048 -66 -2879 3430 13915 18106 7427 -6074 -5222 9442
7014 9442 14675 12410 315 -10714 -3481 9036 16359 10040 -1491 -8293 326 15291 18329 8083
$$ packed form
7111F19J1027j369j0159r307J249R492R727j497j0831o298L696J2853Q450l057
7097A4595j5679l145N004J0784K831r754j0630n94P388J3677p42j0057r489N67
7083e244J2645R040m864j0978m992K778J3371R141r595j4742k800O289J0223N07
7069A0779r550o629J373P979R745m761j1404q445P041R357K437q169j386k227
7055c860Q542J2681K515j2729j4370J390J0021Q274j359j1459n684O870J3075
7042A3907N366q270j3400m495R966J4152j996q983j0351j783R615J0749l230p694
7028C553n782J914R361P758n756j1114k813O309J0485M191j0679j3501Q52J4664
7014I442N233k265j2095j1029P233J2517P323o319j1531o802Q619J4965L038j0246
$$ plain form
7000 8083 -2711 -6566 2637 13063 16201 3673 -6778 -2727 7950 15047 11147 -888 -2333
6987 -2333 2455 11874 16335 10971 -224 -1592 9088 18926 16642 8233 -1085 1797 12566 17450
6973 17450 11948 1763 -4924 3378 17579 16695 8814 -282 807 11352 17367 17767 10243 -2464
6959 -2464 -49 13619 21721 19060 7470 -5209 12 17090 22469 13018 -771 -1261 8912 23323
6945 23323 21584 5882 -3896 3046 13799 17801 11090 982 -7672 1113 15961 17981 10421 832
6931 832 -699 10601 22986 20970 5470 -3437 2451 14078 19191 13216 79 -7760 4540 18358
6917 18358 21315 7972 -3263 -1694 5971 16550 17332 7544 -3846 -3748 8850 19327 15776 3287
6903 3287 -1492 3917 17770 22512 15305 1243 -456 8911 17322 19128 6965 -1861 1751 12172
$$ packed form
7000H083j0794l855R203J0426L138j2528j0451M051J0677P097l900j2035j445
6987b333M788R419M461n364j1195j368J0680R838k284q409r318K882J0769M884
6973A7450n502j0185o687Q302J4201q84p881r096J089J0545O015M00p524j2707
6959b464K415J3668Q102k661j1590j2679N221J7078N379r451j3789m90J0173J4411
6945B3323j739j5702r778O942J0753M002o711j0108q654Q785J4848K020p560r589
6931H32j531J1300J2385k016j5500q907N888J1627N113n975j3137p839J2300J3818
6917A8358K957j3343j1235J569P665J0579P82r788j1390R8J2598J0477l551j2489
6903C287m779N409J3853M742p207j4062j699R367Q411J806j2163q826L612J0421
$$ plain form
6889 12172 19823 15372 1738 -5069 4890 17313 21660 11730 710 -3407 6244 17179 20478 8842
6875 8842 -2360 886 11679 21699 19625 5323 -4117 1872 17977 21453 11304 520 -324
6862 -324 7584 19079 16914 7262 -658 -139 13459 20468 12504 -1465 -3269 6438 17272 21280
6848 21280 14530 70 192 10039 18695 20553 7976 -343 4486 17283 21326 14255 251 -4624
6834 -4624 3948 16647 18304 4821 -3828 -3083 9069 20292 19023 5632 -2638 839 13127 23094
6820 23094 17768 4830 3051 8543 21502 23347 12824 4093 5547 14780 25564 20500 6425
6807 6425 -1565 5929 18485 23907 15014 3222 964 11443 21710 23228 10655 723 4242 14725
6793 14725 21886 17609 6045 1101 7799 19882 23884 12939 -398 -31 11268 22769 22538 11627
$$ packed form
6889A2172P651m451j3634o807R959J2423M347r930j1020m117R651J0935L299j1636
6875H842j1202L246J0793J0020k074j4302r440N989J6105L476j0149j0784q44
6862c24P908J1495k165r652p920N19J3598P009p964j3969j804R707J0834M008
6848B1280o750j4460J22R847Q656J858j2577q319M829J2797M043p071j4004m875
6834d624Q572J2699J657j3483q649P45J2152J1223j269j3391q270L477J2288R967
6820B3094n326j2938j779N492J2959J845j0523q731J454R233J0784n064j4075
6807F425p990P494J2556N422q893j1792k258J0479J0267J518j2573r932L519J0483
6793A4725P161m277j1564m944O698J2083M002j0945j3337L67J1299J1501k31j0911
$$ plain form
6779 11627 2410 3034 16726 24422 18622 4800 2232 6070 18222 23093 14648 4388 427 11706
6765 11706 25735 25270 15810 5961 8153 19964 27136 19562 8893 4261 9321 22939 27948 12836
6751 12836 360 895 13482 22921 21705 9148 272 3057 12897 22561 17425 6158 3248 13398
6737 13398 26141 29682 18203 6304 5598 13711 23424 23018 11258 2685 7312 23230 28843 17790
6723 17790 2645 5643 15914 22895 23125 14012 7064 7903 18399 24932 19120 7018 2610 8033
6709 8033 22044 26748 18228 9968 9763 17570 27409 26947 14919 3018 6332 19028 27881 21277
6695 21277 10303 5604 12265 25364 28182 18118 8027 8093 16176 24600 24021 12712 5294 10279
6681 10279 21848 27752 20685 7410 4258 14739 25259 27827 17651 8655 10211 19393 27807
$$ packed form
6779A1627r217O24J3692P696n800j3822k568L838J2152M871q445j0260l961J1279
6765A1706J4029m65r460r849K192J1811P172p574j0669m632N060J3618N009j5112
6751A2836j2476N35J2587R439j216j2557q876K785R840R664n136j1267k910J0150
6737A3398J2743L541j1479j1899p06Q113R713m06j1760q573M627J5918N613j1053
6723A7790j5145K998J0271O981K30r113o948Q39J0496O533n812j2102m408N423
6709H033J4011M704q520q260k05P807R839m62j2028j1901L314J2696Q853o604
6695B1277j0974m699O661J3099K818j0064j0091O6Q083Q424n79j1309p418M985
6681A0279J1569N904p067j3275l152J0481J0520K568j0176q996J556R182Q414
$$ plain form
6668 27807 26006 11086 4153 13915 27375 32367 21716 5343 3316 16187 28076 25386 10353
6655 10353 2274 9026 21622 32085 24012 11699 5359 15394 27714 28817 19966 5587 5406
6642 5406 15387 26555 25977 11885 4038 13269 23589 33172 27079 11541 10853 17765 32161 30682
6628 30682 18623 8083 13566 25722 29119 21682 9576 7289 19653 32058 33509 23134 10963
6615 10963 11823 20665 30372 30493 19337 10662 12847 24996 28911 21524 7251 7261 19854 31767
6601 31767 31190 17222 8551 10966 24948 32469 26517 15141 8996 14680 27514 32114 20561 10928
6587 10928 14951 23498 30632 29602 16820 8145 13639 26090 37557 29897 13221 10943 20556 32119
6573 32119 35380 21528 13517 12448 26267 35440 28704 16276 7997 13409 29391 35514 25690 13253
$$ packed form
6668B7807j801j4920o933R762J3460M992j0651j6373k027J2871J1889k690j5033
6655A0353q079O752J2596J0463q073j2313o340J0035J2320J103q851j4379j81
6642E406R981J1168n78j4092p847R231J0320R583o093j5538o88O912J4396j479
6628C0682j2059j0540N483J2156L397p437j2106k287J2364J2405J451j0375j2171
6615A0963Q60Q842R707J21j1156q675K185J2149L915p387j4273J0J2593J1913
6601C1767n77j3968q671K415J3982P521n952j1376o145N684J2834M600j1553r633
6587A0928M023Q547P134j030j2782q675N494J2451J1467p660j6676k278R613J1563
6573C2119L261j3852q011j069J3819R173o736j2428q279N412J5982O123r824j2437
$$ plain form
6559 13253 12909 22939 35437 32872 20964 12148 15898 27816 36011 26890 13567 11951 20577 32869
6545 32869 34044 23164 11738 15117 27950 34024 30400 18151 10809 20443 33054 36089 25108
6532 25108 9375 8711 25430 37457 33030 17913 11367 16113 26242 35818 27315 17293 17224 26154
6518 26154 35255 34713 23418 13431 15431 28189 36460 29968 17613 12889 20108 33275 38215 27039
6504 27039 14315 13975 27097 39891 37943 23454 14559 22976 39375 41075 30953 16768 15152
6491 15152 28017 41633 38509 25380 12645 17281 32712 41420 31516 17290 15629 28017 38402
6478 38402 40952 26726 14643 20137 32223 40758 34334 17848 16414 23642 34743 41543 31297
6465 31297 20691 18382 29938 42807 39110 25736 13581 21101 36324 42128 31510 20497 18763
$$ packed form
6559A3253l44J0030J2498k565j1908q816L750J1918Q195r121j3323j616Q626J2292
6545C2869J175j0880j1426L379J2833O074l624j2249p342R634J2611L035j0981
6532B5108j5733o64J6719J2027m427j5117o546M746J0129R576q503j0022o9Q930
6518B6154R101n42j1295r987K000J2758Q271o492j2355m724P219J3167M940j1176
6504B7039j2724l40J3122J2794j948j4489q895Q417J6399J700j0122j4185j616
6491A5152J2865J3616l124j3129j2735M636J5431Q708r904j4226j661J2388J0385
6478C8402K550j4226j2083N494J2086Q535o424j6486j434P228J1101O800j0246
6465C1297j0606k309J1556J2869l697j3374j2155P520J5223N804j0618j1013j734
$$ plain form
6452 18763 28022 40893 44145 35018 22495 24611 35822 46317 40503 27893 17707 26742 43617
6439 43617 45488 33756 19898 19796 34296 47624 45461 28398 18922 28403 42163 43283 33304
6426 33304 21165 18934 31637 46501 45283 31874 21530 26883 40844 49908 40097 24931 21924
6413 21924 33567 45959 47940 32905 23183 23065 36506 50211 44585 28538 22359 30819 42015
6400 42015 46501 37984 23802 24581 40842 50564 47238 34368 24296 30609 45789 49506 40064 25790
6386 25790 26369 39193 49756 46063 32363 25073 31089 44983 51621 43539 29556 25314 37133
6373 37133 51289 48724 34034 23528 28468 43420 51682 44779 30100 24503 35484 50726 51205
6360 51205 38912 25059 28307 42136 50747 42845 28212 27417 38610 52064 56572 43779 28549
$$ packed form
6452A8763R259J2871L252r127j2523K116J1211J0495n814j2610j0186R035J6875
6439D3617J871j1732j3858j02J4500J3328k163j7063r476R481J3760J120r979
6426C3304j2139k231J2703J4864j218j3409j0344N353J3961R064r811j5166l007
6413B1924J1643J2392J981j5035r722j18J3441J3705n626j6047o179Q460J1196
6400D2015M486q517j4182P79J6261R722l326j2870j0072O313J5180L717r442j4274
6386B5790N79J2824J0563l693j3700p290O016J3894O638q082j3983m242J1819
6373C7133J4156k565j4690j0506M940J4952Q262o903j4679n597J0981J5242M79
6360E1205j2293j3853L248J3829Q611p902j4633p95J1193J3454M508j2793j5230
$$ plain form
6347 28549 26846 42490 52290 51783 36106 25989 32688 50221 55080 45383 34741 28538 42321
6334 42321 54678 53935 36598 25931 31414 46767 54137 48542 32740 28546 41925 56659 55357
6321 55357 45547 31456 31636 49053 59665 50215 33109 28239 39219 55200 59082 45672 31858
6308 31858 36893 49365 59689 50860 34492 28467 39976 54233 57280 43978 31950 31433 47718
6295 47718 58025 50860 37842 28346 38000 57061 61530 46915 33938 34351 46560 57428 55719
6282 55719 39393 32619 39883 52104 56223 47558 33022 34177 50693 64705 61552 47738 37281
6269 37281 42624 57704 64183 56337 38818 36910 51556 64055 59861 46448 38014 44379 59131
6256 59131 66037 56400 40560 35089 46584 58271 58406 46879 34706 37807 54568 65737 57027
$$ packed form
6347B8549j703J5644R800n07j5677j0117O699J7533M859r697j0642o203J3783
6334D2321J2357p43j7337j0667N483J5353P370n595j5802m194J3379J4734j302
6321E5357r810j4091J80J7417J0612r450j7106m870J0980J5981L882j3410j3814
6308C1858N035J2472J0324q829j6368o025J1509J4257L047j3302j2028n17J6285
6295D7718J0307p165j3018r496R654J9061M469j4615j2977M13J2209J0868j709
6282E5719j6326o774P264J2221M119q665j4536J155J6516J4012l153j3814j0457
6269C7281N343J5080O479p846j7519j908J4646J2499m194j3413q434O365J4752
6256E9131O906r637j5840n471J1495J1687J35j1527j2173L101J6761J1169q710
$$ plain form
6243 57027 42865 39045 49099 62036 60984 50489 40160 40616 55463 64312 60440 43369 40749
6230 40749 52803 65385 67352 52559 37910 39922 56774 66973 59692 46955 40639 49129 60905
6217 60905 62780 55521 42069 43983 58401 69514 61545 45923 37067 47591 65463 69571 54529
6204 54529 43431 43901 55887 69890 67434 49844 41707 51407 66070 68581 56753 44035 45164
6191 45164 59289 69934 63222 46748 39843 50373 66870 68762 56608 44059 46544 62228 71101
6178 71101 64667 51428 44233 52939 66798 73244 61429 49942 49237 60598 72731 70976 55947
6165 55947 47238 51901 69008 75793 63810 51592 52595 62960 73559 72013 58054 49846 58321
6152 58321 72385 74697 62111 47393 46300 60175 76358 71862 58067 48570 57272 72056 76812
$$ packed form
6243E7027j4162l820J0054J2937j052j0495j0329M56J4847Q849l872j7071k620
6230D0749J2054J2582J967j4793j4649K012J6852J0199p281j2737o316Q490J1776
6217F0905J875p259j3452J914J4418J1113p969j5622q856J0524J7872M108j5042
6204E4529j1098M70J1986J4003k456j7590q137R700J4663K511j1828j2718J129
6191D5164J4125J0645o712j6474o905J0530J6497J892j2154j2549K485J5684Q873
6178G1101o434j3239p195Q706J3859O446j1815j1487p05J1361J2133j755j5029
6165E5947q709M663J7107O785j1983j2218J003J0365J0599j546j3959q208Q475
6152E8321J4064K312j2586j4718j093J3875J6183m496j3795r497Q702J4784M756
$$ plain form
6139 76812 69061 52570 53092 69257 79772 76775 63433 54595 62846 74137 84414 71400 56488
6126 56488 55054 66021 79579 74137 59817 49524 56967 72495 77130 67807 56633 54963 72011
6113 72011 82870 78648 59440 49607 59723 78172 86660 73321 55803 55137 68928 84750 83900
6100 83900 70246 59306 66353 80306 83934 73230 60862 61134 72983 88066 89259 72833 59106
6087 59106 65943 81758 88898 75185 59164 62657 80334 92624 88780 69105 57542 66140 87869
6074 87869 89306 75448 64500 66719 82050 95232 88713 73596 67113 72398 87462 93872 81525
6061 81525 66225 67738 83463 93974 88725 70800 61300 72674 87359 93539 80221 67325 71849
6048 71849 88714 95222 86602 72827 67502 78568 93743 99648 90514 74223 73053 89949 100239
$$ packed form
6139G6812p751j6491N22J6165J0515k997j3342q838Q251J1291J0277j3014j4912
6126E6488j434J0967J3558n442j4320j0293P443J5528M635r323j1174j670J7048
6113G2011J0859m222j9208r833J0116J8449Q488j3339j7518o66J3791J5822q50
6100H3900j3654j0940P047J3953L628j0704j2368K72J1849J5083J193j6426j3727
6087E9106O837J5815P140j3713j6021L493J7677J2290l844j9675j1563Q598K1729
6074H7869J437j3858j0948K219J5331J3182o519j5117o483N285J5064O410j2347
6061H1525j5300J513J5725J0511n249j7925r500J1374J4685O180j3318j2896M524
6048G1849J6865O508q620j3775n325J1066J5175N905r134j6291j170J6896J0290
$$ plain form
6035 100239 93323 74776 70566 84225 98515 100541 87702 73584 75695 97892 104345 97104 81570
6022 81570 71633 84896 102046 103164 87651 72324 75126 96198 108871 101174 81600 73541 86044
6009 86044 102079 103775 89005 79043 85448 102699 108197 100571 85877 80584 95481 109210 108623
5996 108623 89012 78641 88836 110715 116401 102799 87346 83927 100660 115190 110254 99929
5984 99929 86893 93895 113651 120302 107110 93394 92274 107486 120142 112166 97578 91732 104719
5971 104719 120799 122717 108728 91880 94052 111216 124101 118727 101084 95389 106264 122947
5959 122947 125915 112483 99076 100008 115293 129290 122071 105469 99162 114947 130571 128811 114316
5946 114316 102134 109310 126327 133527 123996 108748 107769 123087 138816 133265 119398 105659 115270
$$ packed form
6035A00239o916j8547m210J3659J4290K026j2839j4118K111K2197O453p241j5534
6022H1570r937J3263J7150J118j5513j5327K802K1072J2673p697j9574q059J2503
6009H6044J6035J696j4770r962O405J7251N498p626j4694n293J4897J3729n87
5996A08623j9611j0371J0195K1879N686j3602j5453l419J6733J4530m936j0325
5984I9929j3036P002J9756O651j3192j3716j120J5212J2656p976j4588n846J2987
5971A04719J6080J918j3989j6848K172J7164J2885n374j7643n695J0875J6683
5959A22947K968j3432j3407R32J5285J3997p219j6602o307J5785J5624j760j4495
5946A14316j2182P176J7017P200r531j5248r79J5318J5729n551j3867j3739R611
$$ plain form
5933 115270 131716 138532 128004 114857 113128 127442 145293 141733 124217 114382 123855 141338 145529
5920 145529 133435 119046 122701 141437 152845 145012 129819 126613 137323 156011 159620 145272
5908 145272 131678 135061 152020 159209 151114 136259 132436 145484 161510 162172 145921 135195 141094
5895 141094 159712 164635 155393 140478 140464 159056 177817 173187 151424 141085 155672 174501 179690
5882 179690 168314 154816 158332 178145 193176 188333 170409 163220 176095 194165 193652 181246 171506
5869 171506 177599 193976 204363 195748 177608 177036 193594 213691 212861 196486 189625 197421 213003
5856 213003 223819 214239 199092 200561 216871 233725 233048 221745 213287 224637 247254 252181 239657
5843 239657 224306 230409 248438 263231 261501 246135 244548 261724 281856 285899 273596 260757
$$ packed form
5933A15270J6446O816j0528j3147j729J4314J7851l560j7516r835R473J7483M191
5920A45529j2094j4389L655J8736J1408p833j5193l206J0710J8688L609j4348
5908A45272j3594L383J6959P189q095j4855l823J3048J6026O62j6251j0726N899
5895A41094J8618M923r242j4915j4J8592J8761m630k1763j0339J4587J8829N189
5882A79690j1376j3498L516J9813J5031m843j7924p189J2875J8070n13j2406r740
5869A71506O093J6377J0387q615j8140n72J6558K0097q30j6375o861P796J5582
5856B13003J0816r580j5147J469J6310J6854o77j1303q458J1350K2617M927j2524
5843B39657j5351O103J8029J4793j730j5366j587J7176K0132M043j2303j2839
$$ plain form
5831 260757 270194 293586 308480 302813 291030 291103 314519 336260 338024 328209 326241 344576 368220
5818 368220 378865 375910 364457 373658 402008 420039 420208 408516 408403 429836 456270 468389 462819
5805 462819 454151 471531 499720 514179 508934 499996 510939 540773 567358 571020 562350 564912 591971
5792 591971 622291 640582 643944 641412 656344 688098 715863 725827 725863 741206 774206 807938 825134
5779 825134 828400 833015 860217 903257 933689 942437 945555 969397 1013053 1058445 1081422 1096994
5767 1096994 1126274 1179392 1240997 1291257 1322649 1363599 1420152 1499104 1573038 1633366 1690617
5756 1690617 1768382 1874150 1992423 2105756 2224079 2363494 2544153 2762422 3001927 3256177
5746 3256177 3543167 3891807 4302527 4772855 5296256 5881726 6532191 7216294 7840338 8255687
$$ packed form
5831B60757R437K3392J4894n667j1783P3K3416K1741J764r815j968J8335K3644
5818C68220J0645k955j1453R201K8350J8031J69j1692j13K1433K6434J2119n570
5805D62819q668J7380K8189J4459n245q938J0943K9834K6585L662q670K562K7059
5792E91971L0320J8291L362k532J4932L1754K7765R964L6J5343L3000L3732J7196
5779H25134L266M615K7202M3040L0432Q748L118K3842M3656M5392K2977J5572
5767A096994K9280N3118O1605N0260L1392M0950N6553P8952P3934O0328N7251
5756A690617P7765J05768J18273J13333J18323J39415J80659K18269K39505K54250
5746C256177K86990L48640M10720M70328N23401N85470O50465O84103O24044M15349
$$ plain form
5736 8255687 8326501 8022480 7441361 6729445 5991364 5291911 4660338 4127256 3694723 3325035
5726 3325035 2990630 2692275 2442306 2245555 2082449 1929390 1777891 1641158 1536162 1454454
5716 1454454 1381110 1295233 1206443 1138501 1093844 1056104 999913 937069 882728 854329 836241
5705 836241 812459 771087 724974 699043 693162 686570 655097 616579 593837 593858 594825 575682 543260
5692 543260 519103 514794 520522 516591 492564 466515 454139 460294 463356 446262 419066 402326 408171
5679 408171 420362 411883 388770 367264 367855 383088 384863 367417 341661 333346 345702 353957 343267
5666 343267 319163 307808 313753 331181 327974 309485 290203 289644 304491 310162 296116 274493 271193
5653 271193 284830 293876 286175 264433 249380 262976 279104 278980 256143 239802 245116 265757 272671
$$ packed form
5736H255687P0814l04021n81119p11916p38081o99453o31573n33082m32533l69688
5726C325035l34405k98355k49969j96751j63106j53059j51499j36733j04996q1708
5716A454454p3344q5877q8790o7942m4657l7740n6191o2844n4341k8399j8088
5705H36241k3782m1372m6113k5931n881o592l1473l8518k2742K1R67j9143l2422
5692E43260k4157m309N728l931k4027k6049j2376O155L062j7094k7196j6740N845
5679D08171J2191q479k3113k1506N91J5233J775j7446k5756q315J2356Q255j0690
5666C43267k4104j1355N945J7428l207j8489j9282n59J4847N671j4046k1623l300
5653B71193J3637R046p701k1742j5053J3596J6128j24k2837j6341N314K0641O914
$$ plain form
5640 272671 254658 234692 231190 246970 261411 252612 234162 224976 233615 252539 256030 237076 219996
5627 219996 226480 245682 253681 242066 221036 217880 233857 251566 246630 224138 210816 222555
5615 222555 241563 242403 223449 208693 213291 232539 243755 230611 209714 207766 224328 240326
5603 240326 235771 216063 210244 219977 236446 238375 223199 207118 214306 233229 242430 229154 209984
5590 209984 212905 233639 245067 234524 216489 211446 222499 242662 242137 222192 208411 219690
5578 219690 242716 245116 229142 213038 216470 235168 244993 233996 212970 209721 226298 240918
5566 240918 238754 219259 207469 216875 238372 244522 226461 207567 213110 236818 246152 235010 217464
5553 217464 214029 231002 248680 243200 222795 215069 227728 247959 248328 229739 215944 225071 247171
$$ packed form
5640B72671j8013j9966l502J5780J4441q799j8450r186Q639J8924L491j8954j7080
5627B19996O484J9202P999j1615k1030l156J5977J7709m936k2492j3322J1739
5615B22555J9008Q40j8954j4756M598J9248J1216j3144k0897j948J6562J5998
5603B40326m555j9708n819R733J6469J929j5176j6081P188J8923R201j3276j9170
5590B09984K921K0734J1428j0543j8035n043J1053K0163n25j9945j3781J1279
5578B19690K3026K400j5974j6104L432J8698R825j0997k1026l249J6577J4620
5566B40918k164j9495j1790R406K1497O150j8061j8894N543K3708R334j1142j7546
5553B17464l435J6973J7678n480k0405p726J2659K0231L69j8589j3795R127K2100
$$ plain form
5540 247171 256408 241842 222747 222055 243012 258257 251099 227171 221520 239597 258202 257964 238044
5527 238044 226106 237283 257426 261451 248339 230999 233306 254502 264044 253250 231283 231946 252356
5514 252356 267292 260823 242127 236762 252067 272744 274081 255335 238437 250291 273250 280567
5502 280567 262553 243497 244701 265351 279446 273317 255479 248761 266468 285080 282679 263589
5490 263589 251962 264647 287217 290528 270073 254686 260043 284026 297152 280875 263583 262828
5478 262828 284770 300284 292165 273110 270655 286019 304831 302453 282834 271975 288138 311857
5466 311857 312482 292103 279739 289527 310858 320333 305773 284394 288880 310178 323257 313723 291624
5453 291624 289819 309209 328277 322614 302407 294002 309593 332444 333517 315961 304082 314384
$$ packed form
5540B47171R237j4566j9095o92K0957J5245p158k3928n651J8077J8605k38j9920
5527B38044j1938J1177K0143M025j3112j7340K307K1196R542j0794k1967O63K0410
5514B52356J4936o469j8696n365J5305K0677J337j8746j6898J1854K2959P317
5502B80567j8014j9056J204K0650J4095o129j7838o718J7707J8612k401j9090
5490B63589j1627J2685K2570L311k0455j5387N357K3983J3126j6277j7292p55
5478B62828K1942J5514q119j9055k455J5364J8812k378j9619j0859J6163K3719
5466C11857O25k0379j2364R788K1331R475j4560k1379M486K1298J3079r534k2099
5453B91624j805J9390J9068n663k0207q405J5591K2851J073j7556j1879J0302
$$ plain form
5441 314384 338589 344596 325148 308039 313776 338033 351159 339573 317874 314291 336881 353160
5429 353160 351275 332352 323441 339105 360858 362471 345031 331431 344603 367611 373516 358241
5417 358241 340375 342479 366618 380252 371784 351829 353791 378500 394274 384604 366286 363913 384755
5404 384755 404638 400487 381612 371236 382916 403651 407924 390841 380611 392583 416215 425326
5392 425326 407457 390886 393372 421716 434016 419187 400668 400620 424245 443653 438165 417831 410732
5379 410732 430053 457563 456667 434020 425847 439835 464579 470864 453466 444657 458460 483895 490529
5366 490529 471589 456777 470388 494785 507571 494882 475170 479547 506824 521560 510897 495843
5354 495843 499129 521440 543642 533849 513823 510625 531750 557024 557339 541560 532714 552867 583481
$$ packed form
5441C14384K4205O007j9448j7109N737K4257J3126j1586k1699l583K2590J6279
5429C53160j885j8923q911J5664K1753J613j7440j3600J3172K3008N905j5275
5417C58241j7866K104K4139J3634q468j9955J962K4709J5774r670j8318k373K0842
5404C84755J9883m151j8875j0376J1680K0735M273j7083j0230J1972K3632R111
5392D25326j7869j6571K486K8344J2300j4829j8519m8K3625J9408n488k0334p099
5379D10732J9321K7510q96k2647q173J3988K4744O285j7398q809J3803K5435O634
5366D90529j8940j4812J3611K4397J2786j2689j9712M377K7277J4736j0663j5054
5354D95843L286K2311K2202r793k0026l198K1125K5274L15j5779q846K0153L0614
$$ plain form
5341 583481 592236 575959 564773 581528 608467 616229 599968 583427 590087 616755 629891 618050
5329 618050 601461 606986 631200 648933 641951 623766 623049 648109 674155 672697 654255 654995 676831
5316 676831 697540 704303 690900 682960 705504 735196 743392 724445 713528 730071 759036 774041
5304 774041 759697 745883 760281 789952 807705 803878 789480 797988 830013 848570 845910 831016
5292 831016 838527 870402 891711 887993 874841 883268 912381 938172 943286 928389 931541 960457 990923
5279 990923 996876 988369 990293 1018460 1053114 1063534 1057608 1055031 1078639 1116768 1135140 1130984 1127825
5266 1127825 1153702 1193084 1214114 1210149 1207875 1233376 1278641 1311410 1317728 1319817 1349673 1401748
5254 1401748 1438390 1450267 1459775 1495274 1554377 1604920 1627184 1646507 1694773 1772432 1852552 1906370
$$ packed form
5341E83481Q755j6277j1186J6755K6939P762j6261j6541O660K6668J3136j1841
5329F18050j6589N525K4214J7733o982j8185p17K5060K6046j458j8442P40K1836
5316F76831K0709O763j3403p940K2544K9692Q196j8947j0917J6543K8965J5005
5304G74041j4344j3814J4398K9671J7753l827j4398Q508L2025J8557k660j4894
5292H31016P511L1875K1309l718j3152Q427K9113K5791N114j4897L152K8916L0466
5279I90923N953q507J924K8167L4654J0420n926k577K3608L8129J8372m156l159
5266A127825K5877L9382K1030l965k274K5501M5265L2769O318K089K9856N2075
5254A401748L6642J1877R508L5499N9103N0543K2264J9323M8266P7659Q0120N3818
$$ plain form
5242 1906370 1952787 2043536 2170851 2313153 2440434 2572302 2748792 2982407 3256404 3547549
5232 3547549 3849065 4160250 4446557 4627779 4629363 4449098 4150371 3812362 3478580 3159439
5222 3159439 2872948 2645113 2490334 2378369 2264714 2150070 2064676 2017377 1989018 1948661
5212 1948661 1894334 1849325 1838318 1844480 1832349 1798719 1771256 1773221 1790743 1795273 1769992 1750317
5200 1750317 1763243 1789276 1801981 1787196 1771898 1782606 1810977 1823325 1814293 1801263 1811015 1846215
5188 1846215 1862835 1849237 1838234 1855025 1891562 1911792 1906085 1900061 1916695 1957446 1979876 1976284
5176 1976284 1967155 1984436 2020794 2045910 2042821 2033963 2051723 2091013 2112021 2105060 2094344 2114791
5164 2114791 2155191 2182442 2179793 2174284 2194670 2234557 2260000 2255721 2248292 2269615 2312765 2340675
$$ packed form
5242A906370M6417R0749J27315J42302J27281J31868J76490K33615K73997K91145
5232C547549L01516L11185K86307J81222J584j80265k98727l38009l33782l19141
5222C159439k86491k27835j54779j11965j13655j14644q5394m7299k8359m0357
5212A948661n4327m5009j1007O162j2131l3630k7463J965J7522M530k5281j9675
5200A750317J2926K6033J2705j4785j5298J0708K8371J2348r032j3030R752L5200
5188A846215J6620j3598j1003J6791L6537K0230n707o024J6634M0751K2430l592
5176A976284r129J7281L6358K5116l089q858J7760L9290K1008o961j0716K0447
5164B114791M0400K7251k649n509K0386L9887K5443m279p429K1323M3150K7910
$$ plain form
5152 2340675 2339638 2333265 2356287 2400059 2430139 2430672 2423253 2448669 2495115 2525499 2526780 2523794 2550511
5139 2550511 2596979 2632970 2636116 2640809 2671297 2717637 2754538 2761411 2763371 2798873 2857157 2895644
5127 2895644 2904982 2910096 2946050 3005303 3043837 3048838 3056237 3096280 3156954 3196030 3202792 3213226
5115 3213226 3254966 3315751 3353205 3366382 3384838 3434888 3500946 3544622 3557689 3577404 3631806
5104 3631806 3705355 3746800 3762143 3791347 3858534 3932103 3977651 3999542 4036741 4109810 4183147
5093 4183147 4224952 4243146 4279038 4342247 4408326 4442491 4455186 4491723 4560008 4623059 4651867
5082 4651867 4669650 4713197 4792739 4868406 4914691 4951069 5023113 5127463 5221389 5277191 5329742
5071 5329742 5416923 5531786 5629980 5694387 5764195 5871500 5992685 6093464 6164026 6242959 6360153
$$ packed form
5152B340675j037o373K3022M3772L0080N33p419K5416M6446L0384J281k986K6717
5139B550511M6468L5991L146M693L0488M6340L6901O873J960L5502N8284L8487
5127B895644R338N114L5954N9253L8534N001P399M0043O0674L9076O762J0434
5115C213226M1740O0785L7454J3177J8456N0050O6058M3676J3067J9715N4402
5104C631806P3549M1445J5343K9204O7187P3569M5548K1891L7199P3069P3337
5093D183147M1805J8194L5892O3209O6079L4165J2695L6537O8285O3051K8808
5082D651867J7783M3547P9542P5667M6285L6378P2044J04350R3926N5802N2551
5071E329742Q7181J14863R8194O4407O9808J07305J21185J00779P0562P8933J17194
$$ plain form
5060 6360153 6487029 6588906 6665659 6750541 6873591 7003665 7099082 7165695 7259678 7392732
5050 7392732 7526111 7625489 7705727 7820450 7972906 8116552 8227119 8331113 8467005 8637657
5040 8637657 8787082 8894051 9004598 9160866 9349133 9509618 9645221 9798205 10000973 10218999
5030 10218999 10401870 10559674 10745842 10983067 11225256 11433703 11636348 11878304 12160296
5021 12160296 12432225 12676482 12928060 13228361 13562475 13876337 14158087 14461760 14815274
5012 14815274 15191886 15552075 15912019 16333241 16831784 17350594 17836639 18323474 18852583
5003 18852583 19417832 19970784 20488979 21014305 21592625 22196532 22767583 23304343 23866151
4994 23866151 24484514 25112882 25682001 26231145 26824490 27474835 28137716 28774632 29417222
$$ packed form
5060F360153J26876J01877P6753Q4882J23050J30074R5417O6613R3983J33054
5050G392732J33379R9378Q0238J14723J52456J43646J10567J03994J35892J70652
5040H637657J49425J06969J10547J56268J88267J60485J35603J52984K02768K18026
5030A0218999J82871J57804J86168K37225K42189K08447K02645K41956K81992
5021A2160296K71929K44257K51578L00301L34114L13862K81750L03673L53514
5012A4815274L76612L60189L59944M21222M98543N18810M86045M86835N29109
5003A8852583N65249N52952N18195N25326N78320O03907N71051N36760N61808
4994B3866151O18363O28368N69119N49144N93345O50345O62881O36916O42590
$$ plain form
4985 29417222 30111966 30832405 31541493 32236842 32976999 33783957 34622589 35445524 36283157
4976 36283157 37188422 38168533 39168576 40153646 41184197 42321639 43539326 44777995 46044926
4967 46044926 47383911 48744449 50047218 51287000 52540803 53834249 55114885 56325147
4959 56325147 57554316 58921239 60448399 62056588 63732636 65552193 67591915 69797267
4951 69797267 72098011 74511290 77152079 80019493 83007369 86017611 89181957 92628294
4943 92628294 96306801 100141035 104209129 108610449 113365195 118450565 123977820 130147766
4935 130147766 137115550 144839139 153304051 162675316 173104032 184384507 196221843 208534225
4927 208534225 221628700 235808441 251288568 268242532 286445184 304721701 321782821
$$ packed form
4985B9417222O94744P20439P09088O95349P40157Q06958Q38632Q22935Q37633
4976C6283157R05265R80111J000043R85070J030551J137442J217687J238669J266931
4967D6044926J338985J360538J302769J239782J253803J293446J280636J210262
4959E6325147J229169J366923J527160J608189J676048J819557K039722K205352
4951F9797267K300744K413279K640789K867414K987876L010242L164346L446337
4943I2628294L678507L834234M068094M401320M754746N085370N527255O169946
4935A30147766O967784P723589Q464912R371265J0428716J1280475J1837336J2312382
4927B08534225J3094475J4179741J5480127J6953964J8202652J8276517J7061120
$$ plain form
4920 321782821 336986710 349596780 355393843 350364816 336704375 318379047 299326932
4913 299326932 281088365 263331552 245960325 229501023 214485463 200978484 188585947
4906 188585947 176792204 165655683 155291337 145730531 137028095 129135511 121969184 115488227
4898 115488227 109578477 104061538 98744692 93649907 88895014 84498802 80421099 76603795
4890 76603795 73026501 69704573 66636630 63805768 61161645 58683675 56360264 54181954
4882 54181954 52137503 50226816 48437273 46752121 45145326 43614498 42143122 40747463
4874 40747463 39427340 38178646 36987276 35853326 34773486 33747685 32764389 31819527
4866 31819527 30898566 29996954 29124131 28295885 27504010 26745235 26012324 25303767 24608638
$$ packed form
4920C21782821J5203889J2610070N797063n029027j3660441j8325328j9052115
4913B99326932j8238567j7756813j7371227j6459302j5015560j3506979j2392537
4906A88585947j1793743j1136521j0364346r560806q702436p892584p166327o480957
4898A15488227n909750n516939n316846n094785m754893m396212m077703l817304
4890G6603795l577294l321928l067943k830862k644123k477970k323411k178310
4882E4181954k044451j910687j789543j685152j606795j530828j471376j395659
4874D0747463j320123j248694j191370j133950j079840j025801r83296r44862
4866C1819527r20961r01612q72823q28246p91875p58775p32911p08557o95129
$$ plain form
4857 24608638 23934282 23279020 22648838 22041607 21468569 20924931 20403170 19899778 19411353
4848 19411353 18929884 18461771 18003921 17562663 17130507 16715293 16305350 15904595 15505859
4839 15505859 15116958 14749963 14399407 14059075 13731584 13406296 13091972 12792391 12505214
4830 12505214 12228403 11960189 11696686 11443173 11202552 10966317 10732322 10504171 10281286
4821 10281286 10069149 9862016 9657584 9462575 9274855 9091427 8912578 8735614 8561410
4812 8561410 8395818 8235813 8081757 7930805 7788767 7653783 7527372 7405622 7278997 7156793
4802 7156793 7031922 6911616 6790267 6672891 6558307 6446362 6334782 6228291 6122410 6021247
4792 6021247 5919039 5820827 5724104 5630529 5538792 5446668 5355207 5264663 5181931 5098095 5017791
$$ packed form
4857B4608638o74356o55262o30182o07231n73038n43638n21761n03392m88425
4848A9411353m81469m68113m57850m41258m32156m15214m09943m00755l98736
4839A5505859l88901l66995l50556l40332l27491l25288l14324k99581k87177
4830A2505214k76811k68214k63503k53513k40621k36235k33995k28151k22885
4821A0281286k12137k07133k04432j95009j87720j83428j78849j76964j74204
4812H561410j65592j60005j54056j50952j42038j34984j26411j21750j26625j22204
4802G156793j24871j20306j21349j17376j14584j11945j11580j06491j05881j01163
4792F021247j02208r8212r6723r3575r1737r2124r1461r0544q2732q3836q0304
$$ plain form
4781 5017791 4941152 4865219 4797093 4733887 4676964 4624515 4571430 4523905 4476058 4427388 4372972
4770 4372972 4322988 4273521 4221564 4167820 4117550 4067929 4017739 3967506 3920375 3872645 3826284
4759 3826284 3782637 3738575 3691582 3637898 3584078 3532479 3478622 3423072 3368692 3312351 3258133
4748 3258133 3211213 3166843 3123178 3078620 3037218 2999867 2972072 2943004 2920052 2894772 2868909
4737 2868909 2846637 2822517 2795651 2767558 2743668 2719081 2695901 2667511 2636448 2611537 2580867
4726 2580867 2557581 2531632 2504651 2478419 2456065 2433813 2410677 2385368 2360433 2335633 2311142
4715 2311142 2290537 2268824 2246100 2225232 2204597 2184103 2168132 2149892 2129974 2114173 2092850
4704 2092850 2075193 2054846 2034518 2014457 1994758 1977535 1959316 1940246 1918794 1899880 1883033
$$ packed form
4781E017791p6639p5933o8126o3206n6923n2449n3085m7525m7847m8670n4416
4770D372972m9984m9467n1957n3744n0270m9621n0190n0233m7131m7730m6361
4759C826284m3647m4062m6993n3684n3820n1599n3857n5550n4380n6341n4218
4748C258133m6920m4370m3665m4558m1402l7351k7795k9068k2952k5280k5863
4737B868909k2272k4120k6866k8093k3890k4587k3180k8390l1063k4911l0670
4726B580867k3286k5949k6981k6232k2354k2252k3136k5309k4935k4800k4491
4715B311142k0605k1713k2724k0868k0635k0494j5971j8240j9918j5801k1323
4704B092850j7657k0347k0328k0061j9699j7223j8219j9070k1452j8914j6847
$$ plain form
4693 1883033 1868530 1853580 1831835 1813225 1799112 1784603 1766354 1751437 1736863 1723148 1709156
4682 1709156 1693895 1679999 1666877 1657676 1643638 1629651 1619142 1610036 1598473 1590527 1579944 1567400
4670 1567400 1554093 1544648 1534616 1523363 1513342 1503200 1494949 1485327 1474715 1464475 1456867 1449675
4658 1449675 1441892 1431682 1424773 1420590 1415062 1411511 1404670 1402025 1396157 1395059 1394308 1389370 1385712 1377747
4644 1377747 1372544 1368595 1365567 1360359 1354739 1352982 1354494 1360897 1364842 1369533 1374442 1375701 1381042 1391499
4630 1391499 1403353 1413294 1421348 1430593 1444196 1458373 1476953 1498444 1524657 1558877 1600527 1651397
4618 1651397 1710847 1781997 1867461 1971619 2090149 2229264 2397392 2605562 2855216 3146931
4608 3146931 3469576 3795124 4071008 4233801 4236609 4082691 3797340 3445073 3094066 2775088
$$ packed form
4693A883033j4503j4950k1745j8610j4113j4509j8249j4917j4574j3715j3992
4682A709156j5261j3896j3122r201j4038j3987j0509r106j1563p946j0583j2544
4670A567400j3307r445j0032j1253j0021j0142q251r622j0612j0240p608p192
4658A449675p783j0210o909m183n528l551o841k645n868j098p51m938l658p965
4644A377747n203l949l028n208n620j757J512O403L945M691M909J259N341J0457
4630A391499J1854R941Q054R245J3603J4177J8580K1491K6213L4220M1650N0870
4618A651397N9450P1150Q5464J04158J18530J39115J68128K08170K49654K91715
4608C146931L22645L25548K75884J62793K808j53918k85351l52267l51007l18978
$$ plain form
4598 2775088 2504427 2277160 2091859 1934983 1802189 1692459 1596758 1514950 1444089 1379054
4588 1379054 1319628 1273584 1228504 1189409 1153769 1122219 1092942 1061308 1032426 1001036 980751
4577 980751 960896 943932 925588 908039 892739 876061 860544 848416 836428 822938 808344 795896
4565 795896 785923 772120 762966 754061 746935 738735 733437 722630 714382 704461 694181 686466 679980 673574
4551 673574 664867 654292 646679 640015 633873 628971 621267 615698 611514 601557 594701 594637 588648 582612 577971
4536 577971 570281 564257 559846 556948 552419 545680 541443 534051 526809 523167 520634 518451 517465 512369 506768
4521 506768 499564 494221 492629 489166 482783 479991 475606 469624 463652 460845 457400 454257 450243 448468
4507 448468 447304 443891 440795 437139 435461 432587 431121 426679 425250 422145 414857 409618 409821 406051 400460
$$ packed form
4598B775088k70661k27267j85301j56876j32794j09730r5701q1808p0861o5035
4588A379054n9426m6044m5080l9095l5640l1550k9277l1634k8882l1390k0285
4577I80751j9855j6964j8344j7549j5300j6678j5517j2128j1988j3490j4594j2448
4565G95896r973j3803r154q905p126q200n298j0807q248r921j0280p715o486o406
4551F73574q707j0575p613o664o142m902p704n569m184r957o856o4n989o036m641
4536E77971p690o024m411k898m529o739m237p392p242l642k533k183r86n096n601
4521E06768p204n343j592l463o383k792m385n982n972k807l445l143m014j775
4507D48468j164l413l096l656j678k874j466m442j429l105p288n239K03l770n591
$$ plain form
4492 400460 400103 397501 393117 390774 387299 386047 386243 379576 375427 373775 372540 368134 363180 361748 359955
4477 359955 359517 355894 351968 350907 350845 350624 347676 345237 341235 342972 340860 336602 335616 330566 330047 328157
4461 328157 326891 326734 322926 320361 318912 319188 318079 313802 309969 307432 305801 305852 302394 300603 299309
4446 299309 296583 294663 295525 291054 289987 283999 282134 281403 280422 278767 276720 274759 273882 274800 270124 268215
4430 268215 267203 264684 263677 261628 260804 258033 258975 256926 253991 253388 254526 251090 247814 247132 244859
4415 244859 246706 246204 245002 241361 238665 240328 240016 236569 232933 228638 228915 228006 230127 229179 224833 221704
4399 221704 219303 220309 218041 215282 215849 213189 214731 214891 209842 208336 210590 213059 211677 207891 207103
4384 207103 205422 206861 204838 198180 196987 196567 195184 195465 196737 196223 193052 194442 193136 191302 189698
$$ packed form
4492D00460l57k602m384k343l475j252J96o667m149j652j235m406m954j432j793
4477C59955m38l623l926j061o2k21k948k439m002J737k112m258r86n050n19j890
4461C28157j266j57l808k565j449K76j109m277l833k537j631N1l458j791j294
4446B99309k726j920Q62m471j067n988j865p31r81j655k047j961q77R18m676j909
4430B68215j012k519j007k049q24k771R42k049k935o03J138l436l276o82k273
4415B44859J847n02j202l641k696J663l12l447l636m295K77r09K121r48m346l129
4399B21704k401J006k268k759N67k660J542J60n049j506K254K469j382l786p88
4384B07103j681J439k023o658j193m20j383K81J272n14l171J390j306j834j604
$$ plain form
4369 189698 187567 187767 188743 186022 184073 183163 182032 182851 181445 178764 178541 176058 175835 175106 174123 171165
4353 171165 172808 173799 175370 175095 170687 167006 168222 167322 167450 165968 161407 162216 162248 160323 159367 158845 161485
4336 161485 162995 158376 157927 155664 154364 154639 152138 154038 151934 151447 149572 149289 146919 146247 147782 146245
4320 146245 147253 146908 142586 142583 145094 143858 142399 141311 140700 139907 137413 134424 135099 133307 132820 133741 132697
4303 132697 134076 133915 129496 127777 130069 127577 125776 124088 124676 124681 124442 127513 126256 126236 121568 121072 121301
4286 121301 120376 119688 119628 117050 116790 118835 120350 120069 120221 121431 121314 117795 112867 109948 110759 110544 111426
4269 111426 111694 114717 113280 112691 112322 113635 110140 107463 103633 104746 105688 101974 101773 101455 103028 101946
4253 101946 102283 99660 99306 100543 98022 98140 97747 97827 94457 93278 93795 93301 94436 94260 95889 91981 92052
$$ packed form
4369A89698k131K00R76k721j949r10j131Q19j406k681k23k483k23p29r83k958
4353A71165J643R91J571k75m408l681J216r00J28j482m561Q09L2j925r56n22K640
4336A61485J510m619m49k263j300K75k501J900k104m87j875k83k370o72J535j537
4320A46245J008l45m322lK511j236j459j088o11p93k494k989O75j792m87R21j044
4303A32697J379j61m419j719K292k492j801j688N88Nk39L071j257k0m668m96K29
4286A21301r25o88o0k578k60K045J515k81J52J210j17l519m928k919Q11k15Q82
4269A11426K68L023j437n89l69J313l495k677l830J113R42l714k01l18J573j082
4253A01946L37k623l54J237k521J18l93Q0l370j179N17m94J135j76J629l908P1
$$ plain form
4236 92052 92374 87984 89732 91184 92901 89352 85159 89357 89029 91282 93527 93710 92452 86803 86958 88411
4220 88411 88929 88171 88710 89193 86992 86912 85933 86655 86438 83667 83758 84148 86537 84503 83164 82859 78347 80113
4202 80113 81344 80903 80193 80062 78612 77837 78458 76842 78104 80788 80868 75088 73427 72081 72417 73761 75641
4185 75641 75346 74190 76319 79570 78549 74523 75883 78800 77539 71739 69508 67949 71031 68839 68537
4170 68537 67255 66696 70045 70594 69295 71495 72147 69125 69081 70221 70557 67868 66303 64553 65112 67084
4154 67084 65992 62282 63619 68785 69341 66242 64858 61035 59423 61956 59727 59240 59185 59607 61585 60958
4138 60958 58150 62799 64913 62136 53401 54672 52585 53174 54200 55548 56431 55110 57167 58786 57568
4123 57568 55498 57723 56998 53559 52325 55105 56604 54954 54048 51257 48272 46275 51079 53620 51787
$$ packed form
4236I2052L22m390J748J452J717l549m193M198l28K253K245J83j258n649J55J453
4220H8411N18p58N39M83k201q0r79P22k17k771R1L90K389k034j339l05m512J766
4202H0113J231m41p10j31j450p75O21j616J262K684Q0n780j661j346L36J344J880
4185G5641k95j156K129L251j021m026J360K917j261n800k231j559L082k192l02
4170F8537j282n59L349N49j299K200O52l022m4J140L36k689j565j750N59J972
4154F7084j092l710J337N166N56l099j384l823j612K533k229m87n5M22J978o27
4138F0958k808M649K114k777q735J271k087N89J026J348Q83j321K057J619j218
4123E7568k070K225p25l439j234K780J499j650r06k791k985j997M804K541j833
$$ plain form
4108 51787 50866 55224 56410 57443 55990 50248 54252 52326 50471 49294 52778 54446 54808 52782 52497
4093 52497 52996 53426 47806 43512 47613 49083 46170 44762 43380 40862 42863 42378 44390 49415 49417 49065
4077 49065 46509 45297 44198 40977 40522 43194 45612 46645 44427 43815 44194 46957 48581 44895 43169
4062 43169 43964 41813 40047 40511 40388 39507 39085 38163 37967 38365 39666 40461 40058 38490 37311 39639 41336
4045 41336 41005 40254 37611 37672 35188 35121 36007 35101 34155 36267 38262 36547 35585 34844 31064 34550 34708 35181
4027 35181 31941 30562 33228 31185 32213 30836 35015 35262 33927 32049 31913 32515 31929 31716 32148 30131
4011 30131 29606 31955 34377 38372 35509 34938 33191 33392 33860 33336 33136 30555 29525 29817 31659 31765 30420
3994 30420 30742 33076 32039 32804 33132 32522 30259 28245 26303 25559 25599 28165 29827 30592 28765 26308 28320
$$ packed form
4108E1787r21M358J186J033j453n742M004j926j855j177L484J668L62k026k85
4093E2497M99M30n620m294M101J470k913j408j382k518K001m85K012N025Kl52
4077D9065k556j212j099l221m55K672K418J033k218o12L79K763J624l686j726
4062D3169P95k151j766M64j23q81m22r22j96L98J301P95m03j568j179K328J697
4045D1336l31p51k643O1k484o7Q86r06r46K112J995j715r62p41l780L486J58M73
4027C5181l240j379K666k043J028j377M179K47j335j878j36O02n86k13M32k017
4011C0131n25K349K422L995k863n71j747K01M68n24k00k581j030K92J842J06j345
3994C0420L22K334j037P65L28o10k263k014j942p44M0K566J662P65j827k457K012
$$ plain form
3977 28320 29370 28596 27064 30054 31983 25187 21751 24827 30218 29784 28472 28512 25036 25211 23805 24683
3961 24683 24106 23979 25841 21992 22373 24959 28205 27873 26192 28165 27145 27095 28569 25950 25892 26008 21286
3944 21286 20111 27078 26205 24016 21801 20304 23611 23460 25654 25527 24931 25505 25600 25353 27818 26455 24599
3927 24599 24836 23016 23900 21472 20658 21543 20578 19508 22271 20631 20173 23796 23869 23700 22410 20045 20740
3910 20740 21419 20739 19444 22477 22875 23449 25001 21861 19796 18161 17625 15524 17462 19257 19898 18836
3894 18836 20591 18004 17464 17572 15880 17279 17043 15797 16081 17438 18973 20199 18568 16329 16414 15339
3878 15339 15320 15849 13428 13953 14157 14472 13250 14675 15112 13865 13458 16803 17329 14387 13281 14098 15322
3861 15322 17869 19736 16917 16449 16788 17031 10572 11254 13545 13831 16937 14436 14364 13070 12515 14216 12721
$$ packed form
3977B8320J050p74j532K990J929o796l436L076N391m34j312M0l476J75j406Q78
3961B4683n77j27J862l849L81K586L246l32j681J973j020n0J474k619n8J16m722
3944B1286j175O967q73k189k215j497L307j51K194j27n96N74R5k47K465j363j856
3927B4599K37j820Q84k428q14Q85r65j070K763j640m58L623P3j69j290k365O95
3910B0740O79o80j295L033L98N74J552l140k065j635n36k101J938J795O41j062
3894A8836J755k587n40J08j692J399k36j246K84J357J535J226j631k239Q5j075
3878A5339j9N29k421N25K04L15j222J425M37j247m07L345N26k942j106Q17J224
3861A5322K547J867k819m68L39K43o459O82K291K86L106k501p2j294n55J701j495
$$ plain form
3844 12721 12035 13944 13016 12547 13955 13458 14157 17239 16379 18079 16897 18505 16074 15041 14516 16755
3828 16755 14589 12291 11750 12714 14370 10814 12383 10519 12473 11460 13172 14792 14622 11365 10214
3813 10214 11978 13837 11937 16483 16295 14317 12184 13986 16615 14663 14143 13484 13085 13677 12894 12983 9972
3796 9972 10160 11466 10527 11541 11172 12960 10383 8180 9711 11030 9999 9792 12533 14389 13282 11677
3780 11677 6840 7116 7450 8881 14135 12965 12486 14478 12269 9105 6466 9739 12637 13146 11446 9421
3764 9421 8236 9306 8888 11130 13132 14203 12927 11064 17290 16278 13404 10401 10529 12517 12450 9367
3748 9367 7758 9934 10548 10165 8248 7711 9586 11119 9064 9062 9566 10539 9369 13340 14174 13606 13834 11231
3730 11231 11678 14000 13862 14270 14128 9952 8440 9883 10399 9179 11004 11324 11676 11742 10853 10566 9548
$$ packed form
3844A2721o86J909r28m69J408m97O99L082q60J700j182J608k431j033n25K239
3828A6755k166k298n41R64J656l556J569j864J954j013J712J620j70l257j151
3813A0214J764J859j900M546j88j978k133J802K629j952n20o59l99N92p83Q9l011
3796I972J88J306r39J014l69J788k577k203J531J319j031k07K741J856j107j605
3780A1677m837K76L34J431N254j170m79J992k209l164k639L273K898N09j700k025
3764I421j185J070m18K242K002J071j276j863O226j012k874l003J28J988o7l083
3748I367j609K176O14l83j917n37J875J533k055kN04R73j170L971Q34n68K28k603
3730A1231M47K322j38M08j42m176j512J443N16j220J825L20L52O6q89k87j018
$$ plain form
3713 9548 6974 5655 6453 6854 6148 4259 7087 8592 5497 6245 3758 3503 4927 8338 8098 8550 6786
3696 6786 10204 8946 9282 9860 8374 8364 9084 13086 12321 12938 10166 10467 10969 10702 8699 8169 9722 7966
3678 7966 5715 6210 3941 5093 6280 7462 4913 8895 10250 8705 10452 8450 9477 9669 9706 9201
3662 9201 5682 4962 7969 9603 10974 13788 14856 14314 12823 14441 12043 9012 9360 8327 8194 6095
3646 6095 6090 9960 9683 6586 9050 8471 5913 6677 6135 7158 6741 6652 5756 4753 6647 4099 3552 4715
3628 4715 5864 6358 5525 9424 7886 7873 9204 6708 3438 5030 6692 5451 3842 3664 1906 4354
3612 4354 8877 7829 5185 5129 8066 7870 8716 11123 9519 7704 6660 7324 8649 7174 9007 8724
3596 8724 7758 5864 4177 5059 6943 5654 5934 7851 8149 6884 8302 7520 6762 4733 1059 2001 5022
$$ packed form
3713I548k574j319P98M01p06j889K828J505l095P48k487k55J424L411k40M52j764
3696F786L418j258L36N78j486j0P20M002p65O17k772L01N02k67k003n30J553j756
3678G966k251M95k269J152J187J182k549L982J355j545J747k002J027J92L7n05
3662I201l519p20L007J634J371K814J068n42j491J618k398l031L48j033j33k099
3646F095nL870k77l097K464n79k558P64n42J023m17q9q96j003J894k548n47J163
3628D715J149M94q33L899j538j3J331k496l270J592J662j241j609j78j758K448
3612D354M523j048k644n6K937j96Q46K407j604j815j044O64J325j475J833k83
3596H724r66j894j687Q82J884j289K80J917K98j265J418p82p58k029l674R42L021
$$ plain form
3579 5022 3843 5151 5116 4024 5169 8550 9279 11558 16279 15166 17410 18998 17420 16727 14471 13433
3563 13433 10648 8769 8212 6720 5695 6114 6503 7182 2930 -800 4632 4267 1974 5210 5643 3479
3547 3479 3708 3357 7174 5984 5911 8369 7801 7260 7197 6711 7298 8795 6716 5626 4659 5597 3984 4505
3529 4505 5243 5340 1666 1493 4609 3667 1616 -52 -631 -993 -501 -1982 -1446 -3024 789 3444 2344
3512 2344 1496 680 -813 -1786 -965 -1571 -4007 -597 722 -562 -2071 -2791 -1887 -888 280 -1632 968
3495 968 2873 -1016 -3247 -1709 -2994 -3827 -3477 828 3949 2137 -4319 -5835 -3600 -1828 -945 -4210
3479 -4210 -3108 -48 708 -19 -2180 -1736 -2453 -2151 -1831 -1751 -2013 -1730 -699 2097 -1569 -1634 239 -1346
3461 -1346 -326 -1407 -2092 -2066 -657 -3544 -4286 -4038 -2258 -1085 49 1443 -1762 -1753 -3428 -5377 -3921
$$ packed form
3579E022j179J308l5j092J145L381P29K279M721j113K244J588j578o93k256j038
3563A3433k785j879n57j492j025M19L89O79m252l730N432l65k293L236M33k164
3547C479K29l51L817j190p3K458n68n41o3m86N87J497k079j090r67R38j613N21
3529D505P38R7l674j73L116r42k051j668n79l62M92j481N36j578L813K655j100
3512B344q48q16j493r73Q21o06k436L410J319j284j509p20R04R99J168j912K600
3495I68J905l889k231J538j285q33L50M305L121j812o456j516K235J772Q83l265
3479d210J102L060P56p27k161M44p17L02L20Q0k62K83J031K796l666o5J873j585
3461a346J020j081o85K6J409k887p42K48J780J173J134J394l205Rj675j949J456
$$ plain form
3444 -3921 -5132 -3612 -3817 -2748 -3618 -3473 -3345 -3319 -1189 -390 -758 -468 -681 -97 -1246 -4838 -5309 -5258
3426 -5258 -2273 -764 -2249 -2709 -3731 -3909 -2314 -3316 -7382 -4591 -3371 -4981 -5732 -3968 -1483 -2968
3410 -2968 -2840 -849 -3300 -3450 -2249 -425 -709 -1399 -2242 -587 -2338 -5866 -3141 -2143 -1871 -2236 -5666
3393 -5666 -4750 -2655 -4722 -8007 -6646 -5622 -7174 -3483 -1049 -3071 -4546 -4539 -5359 -5699 -5566 -4612 -6644
3376 -6644 -3036 -932 -1649 -1922 -880 -1989 -3981 -5344 -7116 -5453 -3028 -4033 -4080 -804 -4816 -7273
3360 -7273 -6051 -6594 -5005 -4527 -4605 -2622 -1155 -3078 -5523 -7257 -5172 -3880 -5306 -8133 -2761 -306
3344 -306 -4090 -3899 -4935 -5516 -3811 -4489 -2880 -2693 -230 -854 -3889 -4202 -2313 -1958 -2983 -1516 -2294
3327 -2294 -3533 -3213 -2607 -1515 -59 -595 -164 -2793 -1162 116 -2469 -3353 -4602 -5214 -2335 -1371 -774
$$ packed form
3444c921j211J520k05J069q70J45J28K6K130P99l68K90k13N84j149l592m71N1
3426e258K985J509j485m60j022j78J595j002m066K791J220j610p51J764K485j485
3410b968J28J991k451j50J201J824k84o90q43J655j751l528K725R98K72l65l430
3393e666R16K095k067l285J361J024j552L691K434k022j475Pq20l40J33R54k032
3376f644L608K104p17k73J042j109j992j363j772J663K425j005m7L276m012k457
3360g273J222n43J589M78p8J983J467j923k445j734K085J292j426k827N372K455
3344c06l784J91j036n81J705o78J609J87K463o24l035l13J889L55j025J467p78
3327b294j239L20O06J092J456n36M31k629J631J278k585q84j249o12K879R64N97
$$ plain form
3310 -774 -2032 -3882 -2093 -3003 -2374 -619 -813 -852 106 643 340 -593 -4053 -3909 -1294 -3624 -3548 -6201
3292 -6201 -3779 -1158 -3421 -5159 -5805 -2911 -4072 -2529 -628 -522 -1564 -4176 -1891 -2825 -3219 -5682
3276 -5682 -4753 -7229 -5248 -3542 -2617 -521 -5927 -6277 -5739 -3211 -2786 -3470 -7907 -5112 -2732 -3376 -5679
3259 -5679 -4356 -3767 -2395 -2695 -765 -77 -2580 -4377 -4341 -3805 -4987 -3275 -4744 -4842 -4404 -4809 -6132
3242 -6132 -6986 -4079 -3626 -4245 -3665 -4447 -1702 -2765 -3171 -3367 -3792 -3576 -5924 -3995 -3361 -3489 -4150 -4939
3224 -4939 -3302 -2423 -516 -3440 -2688 -2819 -4593 -5210 -6052 -4861 -5903 -7187 -4097 -3813 -6832 -3556
3208 -3556 -3409 -4027 -4782 -3880 -2929 -4370 -3898 -3584 -3843 -4142 -5911 -3730 -4933 -5013 -3768 -5567 -8402 -9345
3190 -9345 -7125 -7206 -6455 -4678 -3160 -5477 -8192 -6827 -4785 -6920 -7659 -5901 -7464 -6564 -5140 -6356
$$ packed form
3310g74j258j850J789r10O29J755j94l9R58N37l03r33l460J44K615k330P6k653
3292f201K422K621k263j738o46K894j161J543J901J06j042k612K285r34l94k463
3276e682R29k476J981J706R25K096n406l50N38K528M25o84m437K795K380o44k303
3259e679J323N89J372l00J930O88k503j797L6N36j182J712j469r8M38m05j323
3242f132q54K907M53o19N80p82K745j063m06j96m25K16k348J929O34j28o61p89
3224d939J637Q79J907k924P52j31j774o17q42J191j042j284L090K84l019L276
3208c556J47o18p55R02R51j441M72L14k59k99j769K181j203q0J245j799k835r43
3190i345K220q1P51J777J518k317k715J365K042k135p39J758j563R00J424j216
$$ plain form
3174 -6356 -4912 -4621 -4495 -4898 -4879 -5289 -7009 -5186 -8244 -6076 -4972 -3735 -4007 -3720 -5271 -7662 -8232
3157 -8232 -4829 -4826 -8278 -8298 -7237 -4829 -6120 -3672 -3427 -5342 -4145 -6387 -6343 -4364 -5088 -6678 -5478
3140 -5478 -3816 -5449 -5932 -6332 -5021 -4052 -3775 -6620 -4046 -4092 -2878 -5614 -4744 -6793 -6919 -4444 -5971
3123 -5971 -6004 -6088 -8485 -6149 -7267 -4275 -3775 -3780 -6654 -8744 -4898 -7786 -7641 -8629 -6410 -7243 -8108 -6312
3105 -6312 -6985 -5165 -5864 -9414 -8784 -9112 -6261 -5808 -6312 -5334 -6671 -5882 -852 -2273 -7164 -8521 -6653
3088 -6653 -7631 -9476 -7761 -8125 -4093 -3626 -7779 -7905 -4444 -2727 -2089 -5851 -5765 -5122 -4928 -3933 -5806
3071 -5806 -3820 -5549 -8617 -6319 -4800 -5649 -6396 -7098 -3232 -4656 -4080 -3681 -4745 -5553 -6488 -10538 -12138
3054 -12138 -10196 -5081 -1860 -2372 -7413 -9256 -2776 -2720 -5112 -7261 -10446 -9440 -6531 -8779 -7704
$$ packed form
3174f356J444K91J26m03J9m10j720J823l058K168J104J237k72K87j551k391n70
3157h232L403Ll452k0J061K408j291K448K45j915J197k242M4J979p24j590J200
3140e478J662j633m83m00J311R69K77k845K574m6J214k736Q70k049j26K475j527
3123e971l3q4k397K336j118K992N00nk874k090L846k888J45r88K219q33q65J796
3105f312o73J820o99l550O30l28K851M53n04R78j337P89N030j421m891j357J868
3088f653r78j845J715l64M032M67m153j26L461J717O38l762Q6O43J94R95j873
3071e806J986j729l068K298J519q49p47p02L866j424N76L99j064q08r35m050j600
3054a2138J942N115L221n12n041j843O480N6k392k149l185J006K909k248J075
$$ plain form
3039 -7704 -6667 -5671 -5519 -6014 -3054 -3510 -4369 -7339 -7430 -6796 -9979 -8567 -5245 -5606 -3665 -2622 -4305
3022 -4305 -4958 -3677 -3279 -4457 -6310 -5955 -6122 -4992 -4391 -5043 -5463 -9186 -8071 -5176 -2165 -2379 -4166
3005 -4166 -5329 -4453 -3277 -4527 -5033 -6880 -4763 -3747 -8963 -5611 -4891 -6077 -5695 -6818 -4487 -5801
2989 -5801 -2897 -3202 -7172 -4926 -4741 -6405 -7625 -7563 -3226 -4189 -6399 -5085 -5501 -4872 -7973 -9166 -9389
2972 -9389 -10394 -8569 -5915 -7971 -8929 -7220 -11024 -8757 -6225 -6011 -3226 -2964 -3557 -5174 -5493 -3643
2956 -3643 -6172 -8167 -4846 -1783 -4667 -5742 -7836 -6770 -3532 -2857 -4198 -7619 -5142 -5700 -7256
2941 -7256 -6246 -6099 -8757 -7017 -7068 -7360 -4932 -5809 -6747 -5600 -7901 -10893 -7615 -6570 -6906 -6454 -6238
2924 -6238 -6560 -7584 -8482 -7595 -6361 -5146 -7383 -4583 -2888 -6988 -5701 -5190 -7179 -6320 -3584 -4790
$$ packed form
3039g704J037R96J52m95K960m56q59k970r1O34l183J412L322l61J941J043j683
3022d305o53J281L98j178j853L55j67J130O01o52m20l723J115K895L011k14j787
3005d166j163Q76J176j250n06j847K117J016n216L352P20j186L82j123K331j314
2989e801K904l05l970K246J85j664j220O2M337r63k210J314m16O29l101j193k23
2972i389j005J825K654k056r58J709l804K267K532K14K785K62n93j617l19J850
2956c643k529j995L321L063k884j075k094J066L238O75j341l421K477n58j556
2941g256J010J47k658J740n1k92K428q77r38J147k301k992L278J045l36M52K16
2924f238l22j024q98Q87J234J215k237K800J695m100J287N11j989Q59K736j206
$$ plain form
2908 -4790 -6018 -6995 -4619 -6530 -5996 -6843 -6462 -8976 -9699 -6266 -6821 -6040 -4851 -6722 -8987 -7683 -5891
2891 -5891 -5524 -10385 -6459 -5373 -5316 -7839 -10539 -8856 -9986 -9598 -8892 -9533 -9436 -7512 -9938 -12485 -10844
2874 -10844 -8441 -9700 -10613 -10292 -10724 -6502 -7111 -9990 -8954 -6004 -6592 -7004 -5538 -5444 -6946 -9832 -8711
2857 -8711 -4983 -6513 -8522 -9332 -9742 -5520 -4959 -4082 -5930 -5688 -4623 -4766 -7354 -6951 -3533 -3561 -3637 -6604
2839 -6604 -4311 -5089 -4542 -6472 -2895 -4756 -5976 -2888 -5866 -5894 -6443 -4699 -7970 -5766 -3435 -3404 -2988
2822 -2988 -4313 -5441 -5485 -3437 -6237 -9673 -7057 -4814 -2933 -2489 -4697 -5758 -5821 -6360 -7862 -8056 -6935
2805 -6935 -8034 -8271 -8112 -6766 -4542 -2537 -3597 -5564 -5089 -3988 -1973 -4286 -4757 -2853 -1424 -3090
2789 -3090 -7644 -4569 -4238 -2152 -3351 -2953 -720 1087 -219 -2107 -1225 -4189 -7992 -3689 -1005 -3157
$$ packed form
2908d790j228r77K376j911N34q47L81k514p23L433n55P81J189j871k265J304J792
2891e891L67m861L926J086N7k523k700J683j130L88P06o41R7J924k426k547J641
2874a0844K403j259r13L21m32M222o09k879J036K950n88m12J466R4j502k886J121
2857h711L728j530k009q10m10M222N61Q77j848K42J065j43k588M03L418k8p6k967
2839f604K293p78N47j930L577j861j220L088k978k8n49J744l271K204K331L1M16
2822b988j325j128m4K048k800l436K616K243J881M44k208j061o3n39j502j94J121
2805f935j099k37J59J346K224K005j060j967M75J101K015k313m71J904J429j666
2789c090m554L075L31K086j199L98K233J807j306j888Q82k964l803M303K684k152
$$ plain form
2773 -3157 -5326 -6248 -5098 -5366 -4029 -3214 -3762 -5212 -6297 -7196 -7407 -6530 -3085 -6961 -6997 -5212 -6657
2756 -6657 -5362 -5377 -5445 -4826 -6663 -5562 -5092 -5961 -4872 -5778 -6467 -6706 -9476 -9649 -7139 -3847 -4436 -2535
2738 -2535 -1123 -4040 -5267 -4013 -6433 -9676 -10325 -8232 -2367 -1317 -3628 -6928 -7015 -3240 -2142 -811
2722 -811 -5047 -6235 -5058 -6055 -6138 -6813 -5131 -2119 -4210 -5281 -6385 -2919 -1007 -4718 -5003 -3399
2706 -3399 -2906 -2878 -3267 -4143 -4792 -6073 -5256 -4188 -7484 -3528 -2087 -5116 -4000 -3988 -3210 -7249 -3805
2689 -3805 -2491 -2422 -4396 -5841 -3228 -2252 -2276 -2683 -2223 -6091 -7117 -4286 -3233 -2775 -4066 -4764 -5486
2672 -5486 -8261 -9204 -2593 -2666 -2317 -3508 -4559 -4067 -4177 -4601 -2108 -252 -3182 -2784 -2646 -2720 -2217 -1927
2654 -1927 -4570 -4226 -1091 469 -947 184 -1275 -5558 -5581 -3190 -2000 -2059 -3430 -3636 -3741 -3245 -2253
$$ packed form
2773c157k169r22J150k68J337Q15n48j450j085q99k11Q77L445l876l6J785j445
2756f657J295j5o8O19j837J101M70q69J089r06o89k39k770j73K510L292n89J901
2738b535J412k917j227J254k420l243o49K093N865J050k311l300q7L775J098J331
2722h11m236j188J177r97q3o75J682L012k091j071j104L466J912l711k85J604
2706c399M93K8l89q76o49j281Q17J068l296L956J441l029J116J2P78m039L444
2689c805J314O9j974j445K613R76k4m07M60l868j026K831J053M58j291o98p22
2672e486k775r43O611p3L49j191j051M92j10m24K493J856k930L98J38p4N03K90
2654a927k643L44L135J560j416J131j459m283k3K391J190n9j371k06j05M96R92
$$ plain form
2637 -2253 -1698 -1773 -937 -2657 -4413 -4318 -2579 -861 -1828 -4232 -5403 -4266 -4604 -3010 -2816 -2431 -3362 -2181
2619 -2181 -2835 -4078 -5094 -6282 -4972 -4806 -2893 -3392 -5114 -7699 -5511 -5354 -6684 -5484 -4794 -411
2603 -411 -5226 -4510 -6187 -6077 -7318 -8024 -7743 -6306 -2886 -4112 -1185 -2212 -4337 -6743 -4452 -3731
2587 -3731 -3548 -6155 -5042 -5969 -4645 -5344 -7384 -4891 -4525 -4706 -1322 -2197 -3505 -2747 -2382 -2045 -1710
2570 -1710 -3316 -4808 -7818 -6057 -4160 -6993 -6717 -7668 -7379 -7645 -7226 -3671 -3533 -6736 -2103 -2256 -2031
2553 -2031 -1425 -2831 -3793 -3692 -5370 -4399 -4215 -3011 -1975 -3861 -2605 -4190 -3489 -2692 -4548 -5407 -5585
2536 -5585 -4726 -4440 -3642 -2784 -2447 -4685 -2891 -1285 -3251 -3679 -1797 -2261 -2745 -6982 -8275 -9233 -7745
2519 -7745 -2816 404 -1933 -4021 -987 -3264 -3710 -3522 -3171 -3708 -5897 -5263 -6733 -6856 -5842 -4379
$$ packed form
2637b253N55p5Q36j720j756R5J739J718r67k404j171J137l38J594J94L85r31J181
2619b181o54j243j016j188J310J66J913m99j722k585K188J57j330J200O90M383
2603d11m815P16j677J10j241p06K81J437L420j226K927j027k125k406K291P21
2587c731J83k607J113r27J324o99k040K493L66j81L384q75j308P58L65L37L35
2570a710j606j492l010J761J897k833K76r51K89k66M19L555J38l203M633j53K25
2553b031O06j406r62J01j678R71J84J204J036j886J256j585P01P97j856q59j78
2536e585Q59K86P98Q58L37k238J794J606j966m28J882m64m84m237j293r58J488
2519g745M929L220k337k088L034k277m46J88L51n37k189O34j470j23J014J463
$$ plain form
2503 -4379 -3134 -4127 -5794 -5134 -4297 -3771 -4089 -3048 -7800 -10332 -6679 -3979 -2776 -2371 -1305 -4280
2487 -4280 -3116 -5152 -3980 -3490 -2352 -1227 -3273 -4564 -6179 -8525 -5140 -3686 -474 -3703 -2325
2472 -2325 -1540 -1558 712 53 -2607 -1184 -19 -3336 -2673 -429 -1963 -3006 -5068 -6055 -5452 -2511 -4275
2455 -4275 -4828 -3586 -2711 -3807 -3767 -3064 -5820 -5197 -5991 -6083 -5202 -3364 -4439 -6095 -2026 365 -826
2438 -826 -853 -5172 -8149 -4510 -4878 -6401 -5938 -5122 -4949 -3309 -4437 -7189 -6499 -4317 -2921 -4006 -3683
2421 -3683 -6991 -8019 -7276 -7048 -8584 -8631 -10550 -7372 -3966 -1457 -2592 -6417 -5133 -4282 -5397 -6427
2405 -6427 -6884 -5132 -5950 -9051 -6993 -5561 -6174 -6436 -6023 -1320 -2026 -3870 -1364 -1399 -2522 -3403 -3826
2388 -3826 -3314 -5296 -4084 -1441 543 -2318 -2662 -3650 -1583 -3446 -4106 -6058 -6109 -6136 -5069 -3393 -978
$$ packed form
2503d379J245r93j667O60Q37N26l18J041m752k532L653K700J203M05J066k975
2487d280J164k036J172M90J138J125k046j291j615k346L385J454L212l229J378
2472b325P85j8K270o59k660J423J165l317O63K244j534j043k062r87O03K941j764
2455d275n53J242Q75j096M0P03k756O23p94r2Q81J838j075j656M069K391j191
2438h26k7m319k977L639l68j523M63Q16J73J640j128k752O90K182J396j085L23
2421c683l308j028P43K28j536m7j919L178L406K509j135l825J284Q51j115j030
2405f427m57J752q18l101K058J432o13k62M13M703p06j844K506l5j123q81m23
2388c826N12j982J212K643J984k861l44r88K067j863o60j952n1k7J067J676K415
$$ plain form
2371 -978 3536 3958 1300 -3434 -6435 -4074 -4081 428 1165 280 -2862 -3774 -2593 84 -416 -2732 -3801
2354 -3801 -3518 -1523 -648 -2406 -4157 -5847 -4110 -377 -997 -3044 -2463 -2222 -4818 -6530 -7006 -4813
2338 -4813 -3082 -2267 -3658 -4761 -4543 -1798 -3433 -809 -263 -153 -220 -2112 -2139 245 -1327 -1805 -5783
2321 -5783 -2079 -1634 657 -786 -4962 -6648 -5076 -2137 -703 -2031 -560 -1642 -314 -1423 -6041
2306 -6041 -5739 -3413 -3699 77 -2391 -3965 -3599 -4712 -3739 -417 -1494 -5150 -5094 -1846 -1836 -4598 -4422
2289 -4422 -2478 -864 -723 -2712 -4682 -4614 -5012 -3152 -2810 -767 -807 -1853 -776 -227 437 -1865 -270
2272 -270 -2845 -1800 -398 -3832 -5753 -4061 -3754 -4295 -2447 -4431 -4171 -1642 -46 -2548 -1727 -6270
2256 -6270 -4425 -3008 -2063 -484 -1083 -280 -1931 -2433 732 -1818 -1154 -983 -1766 -2036 -3181 1183 118
$$ packed form
2371i78M514M22k658m734l001K361pM509P37q85l142r12J181K677n00k316j069
2354c801K83J995Q75j758j751j690J737L733o20k047N81K41k596j712m76K193
2338d813J731Q15j391j103K18K745j635K624N46J10o7j892k7K384j572m78l978
2321e783L704M45K291j443m176j686J572K939J434j328J471j082J328j109m618
2306f041L02K326k86L776k468j574L66j113R73L322j077l656N6L248J0k762J76
2289d422J944J614J41j989j970O8l98J860L42K043m0j046J077N49O64k302J595
2272b70k575J045J402l434j921J692L07n41J848j984K60K529J596k502Q21m543
2256f270J845J417R45J579n99Q03j651n02L165k550O64J71p83k70j145M364j065
$$ plain form
2239 118 -1350 778 291 907 2340 3801 3081 -1576 -1889 -1330 -658 -822 -909 -901 -2202 -650 -814 1183
2221 1183 -1503 -2164 577 3368 -1120 -1884 -71 -318 -2683 -3275 -3825 -1759 -1476 -4921 -6943 -4759
2205 -4759 -3744 -1055 -3337 -5506 -3222 -4697 -4892 -1807 -836 -3364 -5548 -3243 -2552 -3229 -1997 -715
2189 -715 954 2131 1765 -2219 -2272 -1254 -4271 -6033 -5002 38 1784 -2216 -1840 -1933 -1190 -2754 -2645
2172 -2645 -3345 -3883 -3896 -1712 -1907 -3452 -3811 -579 -731 -923 -386 -2579 391 321 -2386 -2287 -2350 -2683 -3680
2153 -3680 -1127 -2029 -5782 -897 1764 4703 1545 298 4852 3001 -961 -2081 -743 1950 1141
2138 1141 1866 1230 -717 -72 -558 -957 -3010 -545 1776 347 -289 2727 1619 710 -1679 -3407 -3254
2121 -3254 -1728 -2709 -1288 1926 -502 -4296 -4728 -3981 -1611 205 150 -2113 -801 -751 2979 2924 845
$$ packed form
2239A18j468K128m87O16J433J461p20m657l13N59O72j64q7Qj301J552j64J997
2221A183k686o61K741K791m488p64J813k47k365n92n50K066K83l445k022K184
2205d759J015K689k282k169K284j475j95L085R71k528k184K305O91o77J232J282
2189g15J669J177l66l984n3J018l017j762J031N040J746m000L76r3P43j564J09
2172b645p00n38j3K184j95j545l59L232j52j92N37k193K970p0k707R9o3l33r97
2153c680K553r02l753M885K661K939l158j247M554j851l962j120J338K693q09
2138A141P25o36j947O45m86l99k053K465K321j429o36L016j108r09k389j728J53
2121c254J526r81J421L214k428l794m32P47K370J816n5k263J312N0L730n5k079
$$ plain form
2104 845 -178 -3037 -1679 -574 -224 -1465 -1917 -5058 -6083 -6950 -2871 647 1299 -1580 -2883 -3037
2088 -3037 -818 -687 496 737 1224 2655 -2689 -942 -99 533 1362 2451 -1701 -3345 30 1774
2072 1774 3011 4044 941 -2770 -2635 -830 -2845 -6044 -5105 -4806 -2499 -1014 1979 1253 -833 291
2056 291 303 761 2092 1362 -778 -432 -2090 972 280 -1697 753 2991 3401 -104 -525 -1187 -2692
2039 -2692 551 3173 2283 -847 2265 5557 1484 -281 -1976 -2309 -2071 -283 -2932 -3161 -1247 -1332
2023 -1332 62 -2664 -1043 639 205 -1071 -742 -1512 -1460 -2614 -947 1582 -1297 1137 591 -102 877
2006 877 3103 3239 1001 1965 1667 632 290 -816 1279 -1452 314 531 -337 -1427 68 -522 -5072
1989 -5072 -1547 -1159 -975 -2269 -1284 -1038 -1854 995 1432 1138 398 -2050 -2578 1075 1306 567 1338 -1258
$$ packed form
2104H45j023k859J358J105L50j241m52l141j025q67M079L518O52k879j303j54
2088c037K219J31J183K41M87J431n344J747Q43O32Q29J089m152j644L375J744
2072A774J237J033l103l711J35J805k015l199R39K99K307J485K993p26k086J124
2056B91J2M58J331p30k140L46j658L062o92j977K450K238M10l505m21o62j505
2039b692L243K622q90l130L112L292m073j765j695l33K38J788k649k29J914q5
2023a332J394k726J621J682m34j276L29p70N2j154J667K529k879K434n46o93R79
2006H77K226J36k238R64k98j035l42j106K095k731J766K17q68j090J495n90m550
1989e072L525L88J84j294R85K46q16K849M37k94p40k448n28L653K31p39P71k596
$$ plain form
1971 -1258 -2877 -1955 -29 1295 503 2559 -965 -3518 -528 419 -1116 985 -1329 -4001 -1849 -211
1955 -211 -1490 -3442 -1533 1520 2665 813 -3258 -1388 -1311 -1130 2079 -130 0 -469 455 -596 -1244
1938 -1244 390 -1393 -2496 -2537 -1670 -1385 -1091 -1706 -3340 -2334 -193 -1345 796 1637 -1911 -354 661
1921 661 461 787 -1939 -2354 -166 -3548 -4149 -2869 -238 -5897 -5660 -2186 -972 2135 3248 507
1905 507 -814 1161 -2385 -523 -3341 -5239 -2326 -1685 -1474 -3337 -4416 -1331 -867 -2203 -2981 -2159
1889 -2159 -744 -1133 -828 2650 2565 289 2446 1527 331 719 983 887 415 490 2522 5083 4313 540
1871 540 -1681 -3363 -3298 -3517 519 -506 1093 3661 2374 -954 -1594 1498 3205 1828 -2014 -1945 -1474
1854 -1474 662 -153 288 1897 1248 1305 -254 786 1172 -526 -2208 8 -15 389 965 1442 1999 492
$$ packed form
1971a258j619R22J926J324p92K056l524k553K990R47j535K101k314k672K152J638
1955b11j279j952J909L053J145j852m071J870P7J81L209k209J30m69R24j051o48
1938a244J634j783j103m1Q67K85K94o15j634J006K141j152K141Q41l548J557J015
1921F61k00L26k726m15K188l382o01J280K631n659K37L474J214L107J113k741
1905E07j321J975l546J862k818j898K913O41K11j863j079L085M64j336p78Q22
1889b159J415l89L05L478q5k276K157r19j196L88K64r6m72P5K032K561p70l773
1871E40k221j682O5k19M036j025J599K568j287l328o40L092J707j377l842O9M71
1854a474K136q15M41J609o49N7j559J040L86j698j682K216k3M04N76M77N57j507
$$ plain form
1836 492 85 2580 2214 1312 3352 3507 190 242 2686 -1442 -666 -1112 588 544 3098 2016 540 -871
1818 -871 -2129 1506 678 1283 -2349 -87 2564 769 -442 94 213 60 79 1193 3653 2129 929
1801 929 3595 2693 349 3402 1022 708 1735 880 1088 -1981 -576 1562 2267 1106 2237 4228
1785 4228 1440 938 1534 -1776 -67 1389 -518 -831 -2308 -604 -659 932 167 -3830 -2454 -1046
1769 -1046 221 2088 73 1002 3164 3081 -3263 -2536 -107 -2825 -2676 -931 941 3185 -1286 -1660
1753 -1660 -684 16 292 -1616 -2660 -1009 1795 4885 5385 4364 2700 2016 5065 3842 1814 437
1737 437 3292 2405 1292 462 2175 -2633 -3788 1540 4059 5082 4137 1325 -972 69 1546 2098
1721 2098 -43 274 1627 -627 -453 714 999 -97 -1396 1159 207 2760 461 708 1418 -725
$$ packed form
1836D92m07K495l66r02K040J55l317N2K444m128P76m46J700m4K554j082j476j411
1818h71j258L635q28O05l632K262K651j795j211N36J19j53J9J114K460j524j200
1801I29K666r02k344L053k380l14J027q55K08l069J405K138P05j161J131J991
1785D228k788n02N96l310J709J456j907l13j477J704n5J591p65l997J376J408
1769a046J267J867k015R29K162q3o344P27K429k718J49J745J872K244m471l74
1753a660R76P00K76j908j044J651K804L090N00j021j664o84L049j223k028j377
1737D37K855q87j113q30J713m808j155N328K519J023r45k812k297J041J477N52
1721B098k141L17J353k254J74J167K85j096j299K555r52K553k299K47P10k143
$$ plain form
1705 -725 -2034 945 1719 474 1877 1666 -2271 2077 5879 3468 854 -2259 -1304 -2690 -1677 1396
1689 1396 4329 1489 -1086 -2757 2991 6980 4296 1032 -975 1923 586 682 413 3220 2154 68
1673 68 1265 1931 2666 1103 3137 5082 2395 2177 1361 -807 -469 -1796 -2941 -1555 3048 2963 2064
1656 2064 5016 7260 5914 7762 4850 5034 3464 -2543 -7581 -6682 -2292 -3319 -10275 -13883 -12272
1641 -12272 -4146 -80 5723 7349 4288 2611 2212 5506 2823 1888 702 -3206 -314 -3392 -4411
1626 -4411 -5848 -5792 -1117 -3805 -1962 49 119 -633 -704 253 162 2241 844 81 1395 -1982 -3014 -32
1608 -32 580 1234 78 1281 -195 -1242 -456 1504 -1134 -2480 -3126 -4155 -2905 -5102 -6872 -3282
1592 -3282 484 877 1285 2639 2378 1406 1285 -1272 -876 -609 -179 1880 1006 -4845 -3101 -2297 917
$$ packed form
1705g25j309K979P74j245J403k11l937M348L802k411k614l113R55j386J013L073
1689A396K933k840k575j671N748L989k684l264k007K898j337R6k69K807j066k086
1673F8J197O66P35j563K034J945k687k18q16k168L38j327j145J386M603q5q99
1656B064K952K244j346J848k912J84j570o007n038Q99M390j027o956l608J611
1641a2272Q126M066N803J626l061j677l99L294k683r35j186l908K892l078j019
1626d411j437N6M675k688J843K011P0p52p1R57r1K079j397p63J314l377j032K982
1608c2O12O54j156J203j476j047P86J960k638j346o46j029J250k197j770L590
1592c282L766L93M08J354k61r72j21k557L96K67M30K059q74n851J744Q04L214
$$ plain form
1575 917 2640 2197 1549 4195 2856 -1039 -1881 -56 547 1701 1689 4021 1086 -1539 -127 2215 -777
1558 -777 -488 1159 -951 -2128 -972 -666 -1573 -4051 -508 71 -839 466 -648 -2379 -1163 -204 563
1541 563 1866 3378 1677 41 261 681 2823 -377 -437 726 2854 3905 2677 -2663 -3108 723
1525 723 -1972 -864 1612 -419 -1315 101 -949 -1662 602 966 117 249 2091 3275 863 787 2349
1508 2349 840 -62 -292 1523 -858 -933 1850 2124 1255 -1185 -2212 323 1664 3489 4941 4518 3973
1491 3973 1348 1450 3863 -350 810 2826 7149 2984 -1371 -3607 -776 149 653 3397 1650 937
1475 937 335 -2020 -4563 -1708 440 -1633 -1168 -123 958 -498 -1474 -1295 -638 228 210 -1036 -127
1458 -127 1257 2184 2353 1488 3579 22 510 2148 -1052 710 3196 1671 -1068 -51 489 2426
$$ packed form
1575I17J723m43o48K646j339l895q42J825O03J154j2K332k935k625J412K342k992
1558g77K89J647k110j177J156L06r07k478L543N79r10J305j114j731J216R59P67
1541E63J303J512j701j636K20M20K142l200o0J163K128J051j228n340m45L831
1525G23k695J108K476k031q96J416j050p13K264L64q49J32J842J184k412p6J562
1508B349j509r02k30J815k381p5K783K74q69k440j027K535J341J825J452m23n45
1491C973k625J02K413m213J160K016M323m165m355k236K831R25N04K744j747p13
1475I37o02k355k543K855K148k073M65J045J081j456r76J79O57Q66j8j246R09
1458a27J384R27J69q65K091l557M88J638l200J762K486j525k739J017N40J937
$$ plain form
1442 2426 1077 1001 300 2536 5876 973 969 510 76 593 1074 2088 2764 1096 2631 3592 2591 2240
1424 2240 3299 2596 1370 1321 2125 953 166 2907 -379 -3267 -4000 -1367 3200 5444 3055 1530
1408 1530 2081 2121 -67 1866 4407 1178 2222 2405 -354 -2114 -2360 -2395 -481 1169 1154 1018 3890
1391 3890 3292 2900 5147 6874 3177 3154 1837 147 -74 -981 -994 2748 414 -1200 107 3061 1645
1374 1645 982 3501 649 1429 4663 2530 130 1593 1386 1644 165 -1899 702 3934 3605 2127
1358 2127 4152 2363 3425 3617 2851 -128 -1874 59 2542 4132 3888 6009 6436 4410 1758 -569
1342 -569 202 16 -76 498 -941 175 -1132 1533 4544 5696 7551 7361 4996 5188 3336 960 142
1325 142 -152 1668 1784 4095 3506 -10 419 369 3456 2891 953 430 2626 2259 1385 -1362 192 -2513
$$ packed form
1442B426j349p6p01K236L340m903mm59m34N17M81J014O76j668J535R61j001l51
1424B240J059p03j226m9Q04j172p87K741l286k888p33K633M567K244k389j525
1408A530N51M0k188J933K541l229J044J83k759j760k46l5J914J650j5j36K872
1391C890n98l92K247J727l697k3j317j690k21r07j3L742k334j614J307K954j416
1374A645o63K519k852P80L234k133k400J463k07K58j479k064K601L232l29j478
1358B127K025j789J062J92p66k979j746J933K483J590k44K121M27k026k652k327
1342e69P71j86r2N74j439J116j307K665L011J152J855j90k365J92j852k376q18
1325A42k94J820J16K311n89l516M29n0L087n65j938n23K196l67q74k747J554k705
$$ plain form
1307 -2513 -910 2691 388 -1857 694 1651 377 3087 4218 2751 2065 3414 4906 1469 -830
1292 -830 -2224 -860 -382 -3209 -1448 586 -3464 -3997 571 3736 3248 5874 3248 -231 -538 -2821
1276 -2821 1246 2037 1371 3542 3223 -306 -2578 331 1424 2753 3416 3259 2509 2989 3204 5507 8214
1259 8214 3492 3837 3201 2033 1095 1408 1014 3435 3187 4365 1742 1516 2917 4583 1546 2309 774
1242 774 426 -909 445 3314 1583 3430 799 1320 2071 -1102 34 3876 336 36 3092 4569
1226 4569 3084 1365 741 -831 123 1531 1428 4146 2740 5331 6612 5487 2880 1116 868 -187
1210 -187 1561 1152 1717 -787 -802 1515 1133 2150 2149 1700 4321 3473 4107 2326 1850 2581 5743 5063 -366
1191 -366 1621 3794 971 747 66 1163 2563 1793 1406 410 1464 -504 -762 1794 4406 3458 3660
$$ packed form
1307b513J603L601k303k245K551R57j274K710J131j467o86J349J492l437k299
1292h30j394J364M78k827J761K034m050n33M568L165m88K626k626l479l07k283
1276b821M067P91o66K171l19l529k272K909J093J329O63j57p50M80K15K303K707
1259H214m722L45o36j168r38L13l94K421k48J178k623k26J401J666l037P63j535
1242G74l48j335J354K869j731J847k631N21P51l173J136L842l540l00L056J477
1226D569j485j719o24j572R54J408j03K718j406K591J281j125k607j764k48j055
1210a87J748m09N65k504j5K317l82J017jm49K621q48O34j781m76P31L162o80n429
1191c66J987K173k823k24o81J097J400p70l87r96J054j968k58K556K612r48K02
$$ plain form
1174 3660 3850 3307 2424 1063 4366 2904 -2443 -2556 186 1356 -522 -2190 -359 1165 -547 1721
1158 1721 2480 1032 267 -1365 -691 -191 373 263 1310 2776 -601 628 2568 2988 2610 1160 1788
1141 1788 876 1865 2705 3927 4816 2168 -435 1807 2890 1806 3670 1267 -164 768 -63 -245 -760
1124 -760 1820 1090 1013 2317 1247 3853 3119 1790 1559 4762 6666 6596 5016 6824 5523 3914 2931
1107 2931 394 680 3762 3628 4079 1820 3357 6160 5287 5438 3894 2827 3335 4516 1591 3542
1091 3542 1739 1785 4113 2542 168 424 224 1082 3884 2907 1159 1549 2314 853 3154 4610 3347
1074 3347 1725 -80 4399 2963 1230 4603 4091 3255 2996 1970 426 2303 2837 4187 3983 442
1058 442 -971 2373 1723 425 2775 3744 1967 1893 1484 1450 3343 3632 1965 1449 1370 -405 -1708 -596
$$ packed form
1174C660J90n43q83j361L303j462n347j13K742J170j878j668J831J524j712K268
1158A721P59j448p65j632O74N00N64j10J047J466l377J229J940M20l78j450O28
1141A788r12R89Q40J222Q89k648k603K242J083j084J864k403j431R32q31j82n15
1124g60K580p30p7J304j070K606p34j329k31L203J904p0j580J808j301j609r83
1107B931k537K86L082j34M51k259J537K803q73J51j544j067N08J181k925J951
1091C542j803M6K328j571k374K56k00Q58K802r77j748L90P65j461K301J456j263
1074C347j622j805M479j436j733L373n12q36k59j026j544J877N34J350k04l541
1058D42j413L344o50j298K350R69j777p4m09l4J893K89j667n16p9j775j303J112
$$ plain form
1040 -596 3654 3676 2821 1851 2832 2921 1481 2400 4868 2357 2617 4364 873 2331 5223 738 58 -478
1022 -478 204 939 1045 4318 7370 3299 1175 1249 1004 4836 5793 3028 1256 3041 4518 3967 3713
1005 3713 3785 3475 104 1998 4479 1715 -677 179 2410 747 2260 2573 901 -598 -657 -172 1470
988 1470 1814 2389 1599 535 -698 -2107 597 872 1494 647 1262 2685 2801 3245 2484 1809 3097 1476
970 1476 2239 4699 3563 2034 -713 142 72 -310 951 3130 2917 731 3387 5451 2709 2416 4814
953 4814 2113 1379 4397 1786 -313 2874 3164 1921 3615 1376 745 1901 3384 4313 1153 776
937 776 3167 2450 622 1930 1179 2135 950 2304 1675 2837 6621 4112 1913 -591 1407 -2781
921 -2781 -632 2798 2220 3228 2259 1955 920 1920 3961 5879 5378 3347 1775 -1659 -464 2864
$$ packed form
1040e96M250K2q55r70R81Q9j440R19K468k511K60J747l491J458K892m485o80n36
1022d78O82P35J06L273L052m071k124P4k45L832R57k765j772J785J477n51k54
1005C713P2l10l371J894K481k764k392Q56K231j663J513L13j672j499n9M85J642
988A470L44N75p90j064j233j409K704K75O22q47O15J423J16M44p61o75J288j621
970A476P63K460j136j529k747Q55p0l82J261K179k13k186K656K064k742k93K398
953D814k701p34L018k611k099L187K90j243J694k239o31J156J483R29l160l77
937G76K391p17j828J308p51R56j185J354o29J162L784k509k199k504J998m188
921b781K149L430n78J008r69l04j035J000K041J918n01k031j572l434J195L328
$$ plain form
905 2864 2675 -530 1407 2644 1046 -1635 308 1263 -604 298 1922 2274 1033 4434 2104 -1421
889 -1421 -1301 1803 789 633 4397 2665 1697 3031 4981 4038 2869 2264 1505 2672 3427 855 2213
872 2213 1174 953 1161 1465 363 -247 2650 3676 1235 -186 1445 3236 5970 1441 757 2278
856 2278 3011 -1197 92 2740 2512 -201 -412 1751 -243 2453 2528 1507 -110 -817 -2476 -3065 -342
839 -342 1463 1922 -1459 -3459 -4958 644 2072 -913 116 -1368 -1615 -3365 -3075 1247 3664 5416
823 5416 4045 1914 2488 455 1891 2214 1523 -1449 -912 1447 1557 1788 27 -3099 2233 2012 5
806 5 -1739 -3319 1169 3198 6098 5597 3936 1241 4505 7036 2864 4295 4414 4069 4216 1640 3602
789 3602 3832 4450 2287 -1483 -1834 -2383 -1653 2199 1315 3180 2428 1518 2817 1125 1886 4492 1865
$$ packed form
905B864j89l205J937J237j598k681J943R55j867R02J624L52j241L401k330l525
889a421J20L104j014j56L764j732r68J334J950r43j169o05p59J167P55k572J358
872B213j039k21K08L04j102o10K897J026k441j421J631J791K734m529o84J521
856B278P33m208J289K648k28k713k11K163j994K696P5j021j617p07j659n89K723
839c42J805M59l381k000j499N602J428k985J029j484k47j750K90M322K417J752
823E416j371k131N74k033J436L23o91k972N37K359J10K31j761l126N332k21k007
806Ej744j580M488K029K900n01j661k695L264K531m172J431J19l45J47k576J962
789C602K30O18k163l770l51n49P30L852q84J865p52r10J299j692P61K606k627
$$ plain form
772 1865 1211 -1136 425 809 -121 -1285 1108 3607 504 -1357 -1327 -1296 611 1100 2606 5183 3207
755 3207 3786 3898 926 -343 750 564 2356 -62 1194 2821 3004 6688 5805 2512 598 1714
739 1714 390 -246 807 1394 797 -482 -436 -900 616 -191 1740 3857 1373 121 56 1347 -82
722 -82 -197 -2189 -1208 1397 1853 2409 384 1220 3523 1750 640 2678 2303 1338 -895 -31 1048 1149
704 1149 3617 7097 4707 3027 1285 3405 4937 2512 656 788 321 2502 3021 4006 3324 4509
688 4509 4768 3127 1689 3881 2115 595 -10 1863 1990 2180 4873 1934 -1027 -801 -903 682 2385
671 2385 2500 477 575 1106 1406 926 -842 -191 747 2059 -99 -2115 -1661 725 1149 1634 587 1397
653 1397 1492 1938 869 2474 3378 2839 4398 3881 3917 3225 1427 -203 -894 2049 6517 5168 2709 2088
$$ packed form
772A865o54k347J561L84r30j164K393K499l103j861L0L1J907M89J506K577j976
755C207N79J12k972j269J093j86J792k418J256J627J83L684q83l293j914J116
739A714j324o36J053N87n97j279M6m64J516q07J931K117k484j252o5J291j429
722h2j15j992R81K605M56N56k025Q36K303j773j110K038l75r65k233Q64J079J01
704A149K468L480k390j680j742K120J532k425j856J32m67K181N19R85o82J185
688D509K59j641j438K192j766j520o05J873J27J90K693k939k961K26j02J585J703
671B385J15k023R8N31L00m80j768O51R38J312k158k016M54K386M24M85j047Q10
653A397R5M46j069J605R04n39J559n17L6o92j798j630o91K943M468j349k459o21
$$ plain form
635 2088 1682 2542 1421 -599 -1804 -1748 -1498 395 299 1171 2913 419 -2151 528 1563 610 -496
618 -496 -627 -735 1938 1376 4132 2321 1441 419 -406 987 733 48 491 92 644 -411 -1696 76
600 76 1264 2076 -73 914 712 -505 -2472 -3711 -3874 -4256 -2517 1320 650 -35 -1299 -1462 -2149 -2246
582 -2246 -336 2411 2762 142 -210 -58 -1036 -2109 -1457 -1054 -1811 -443 -896 1103 4666 899 1685
565 1685 24 399 1961 1189 1293 -443 -1197 -4747 -1371 3222 2357 511 1525 1048 -404 2064 2030
548 2030 183 -30 -852 -4293 -154 842 -856 -532 -390 -995 760 -480 1418 3833 -1028 -3344 -1700
531 -1700 816 4753 2550 -3797 47 -617 -1879 -1195 -1121 2543 2493 1114 3226 1906 2456 3709 4045
514 4045 161 -390 236 2641 3871 2912 879 796 -1580 -3352 -2299 -774 -2238 343 5322 2445
$$ packed form
635B088m06Q60j121k020j205N6K50J893r6Q72J742k494k570K679J035r53j106
618d96j31j08K673n62K756j811q80j022q25J393k54o85M43l99N52j055j285J772
600G6J188Q12k149R87k02j217j967j239j63l82J739L837o70o85j264j63o87r7
582b246J910K747L51k620l52J52r78j073O52M03p57J368m53J999L563l767P86
565A685j661L75J562p72J04j736p54l550L376M593q65j846J014m77j452K468l4
548B030j847k13q22l441M139R96j698L24J42o05J755j240J898K415m861k316J644
531a700K516L937k203o347L844o64j262O84P4L664n0j379K112j320N50J253L36
514D045l884n51O26K405J230r59k033q3k376j772J053J525j464K581M979k877
$$ plain form
498 2445 392 -675 1315 1910 -959 -1718 439 -739 -554 317 -680 -1317 -1677 -3568 -2627 657 2097
$$ packed form
498B445k053j067J990N95k869p59K157j178J85Q71r97o37l60j891R41L284J440
$$ [...]
##END NTUPLES=NMR SPECTRUM
##END=
