##TITLE=1H_CA-9258-1
 DMSO
 8 sc, 
 4.4.2024
##JCAMPDX= 6.0         $$ Bruker NMR JCAMP-DX V2.0
##DATA TYPE= NMR SPECTRUM
##DATA CLASS= NTUPLES
##ORIGIN= UXNMR, Bruker Analytische Messtechnik GmbH
##OWNER= root
$$ XWIN-NMR		Version 3.5
$$ Thu Apr  4 14:37:37 2024 Russian Standard Time (UT+4h)  she@DPX200
##.OBSERVE FREQUENCY= 200.1309
##.OBSERVE NUCLEUS= ^1H
##.ACQUISITION MODE= SIMULTANEOUS
##.ACQUISITION SCHEME= undefined
##.AVERAGES= 8
##.DIGITISER RES= 18
##SPECTROMETER/DATA SYSTEM= spect
##.PULSE SEQUENCE= zg30
##.SOLVENT NAME= MeOD
##.SHIFT REFERENCE= (INTERNAL, MeOD, 0, 15.6885)
##AUDIT TRAIL= $$ (NUMBER, WHEN, WHO, WHERE, WHAT)
$$ ##TITLE= Audit trail, XWIN-NMR		Version 3.5
$$ ##JCAMPDX= 5.01
$$ ##ORIGIN= Bruker BioSpin GmbH
$$ ##OWNER= she
$$ F:/spectra/data/she/nmr/H-F/1/pdata/1/auditp.txt
$$ ##AUDIT TRAIL=  $$ (NUMBER, WHEN, WHO, WHERE, WHAT)
(   1,<2024-04-04 14:36:17.79 +0400>,<she>,<DPX200>,
      <created by zg, POWCHK disabled, PULCHK disabled
       configuration hash MD5:
       00 E9 B6 7A A2 85 ED C7 34 08 36 98 17 FE 4E 26
       data hash MD5: 16K
       48 42 CD ED EF B0 3C 89 7B EE CE 4D 0C 71 86 90>)
(   2,<2024-04-04 14:36:26.65 +0400>,<she>,<DPX200>,
      <Start of raw data processing
       efp BC_mod = 2 LB = 0.24 FT_mod = 6 PKNL = 1 PHC0 = -25297.94 PHC1 = 7.58731 SI = 16K 
       data hash MD5: 16K
       3E 36 63 96 94 39 FF F6 1B FF 29 9D A9 EB EE D5>)
(   3,<2024-04-04 14:36:45.23 +0400>,<she>,<DPX200>,
      <pk PHC0 = -83.10693 PHC1 = 3.4 
       data hash MD5: 16K
       43 61 14 73 D4 30 90 36 4F FA 19 5D 8A 0E D9 E8>)
(   4,<2024-04-04 14:36:48.95 +0400>,<she>,<DPX200>,
      <abs ABSG = 5 
       data hash MD5: 16K
       0D 7C EC B7 49 E5 BE 93 F3 64 89 C2 FA EE 70 79>)
$$ ##END=
$$ 
$$ hash MD5
$$ E0 B9 24 98 00 61 0F 31 58 5A 4A 69 25 DE E6 7A
##$RELAX= 
##$RELAX= 
##$RELAX= 
##$RELAX= 
##$RELAX= 
##$RELAX= 
$$ Bruker specific parameters
$$ --------------------------
##$DU= <F:/spectra>
##$EXPNO= 1
##$NAME= <H-F>
##$PROCNO= 1
##$TYPE= <nmr>
##$USER= <she>
##$AMP= (0..31)
100 100 100 100 100 100 100 100 100 100 100 100 100 100 100 100 100 100 
100 100 100 100 100 100 100 100 100 100 100 100 100 100 
##$AQSEQ= 0
##$AQ_mod= 1
##$AUNM= <au_zg>
##$AUTOPOS= <>
##$BF1= 200.13
##$BF2= 200.13
##$BF3= 200.13
##$BF4= 200.13
##$BF5= 200.13
##$BF6= 200.13
##$BF7= 200.13
##$BF8= 200.13
##$BYTORDA= 1
##$CFDGTYP= 0
##$CFRGTYP= 5
##$CHEMSTR= <none>
##$CNST= (0..31)
1 1 145 1 1 1 1 1 1 1 1 1 1 1 1 1 1 1 1 1 1 1 1 1 1 1 1 1 1 1 1 1 
##$CPDPRG= <>
##$CPDPRG1= <>
##$CPDPRG2= <>
##$CPDPRG3= <>
##$CPDPRG4= <mlev>
##$CPDPRG5= <mlev>
##$CPDPRG6= <mlev>
##$CPDPRG7= <mlev>
##$CPDPRG8= <mlev>
##$CPDPRGB= <>
##$CPDPRGT= <>
##$D= (0..31)
0 1.2 0 0 0 0 0 0 0 0.06 0 0.03 0 0 0 0 0.0002 0 0 0 0 0 0 0 0 0 0 0 0 
0 0 0 
##$DATE= 1712226977
##$DBL= (0..7)
120 120 120 120 120 120 120 120 
##$DBP= (0..7)
150 150 150 150 150 150 150 150 
##$DBP07= 0
##$DBPNAM0= <>
##$DBPNAM1= <>
##$DBPNAM2= <>
##$DBPNAM3= <>
##$DBPNAM4= <>
##$DBPNAM5= <>
$$ [...]
##$SUBNAM3= <"">
##$SUBNAM4= <"">
##$SUBNAM5= <"">
##$SUBNAM6= <"">
##$SUBNAM7= <"">
##$SUBNAM8= <"">
##$SUBNAM9= <"">
##$SW= 18.0517689322627
##$SWIBOX= (0..15)
0 0 2 0 0 0 0 0 0 0 0 0 0 0 0 0 
##$SW_h= 3612.71676300578
##$TD= 16384
##$TD0= 1
##$TE= 0
##$TE2= 300
##$TE3= 300
##$TEG= 300
##$TL= (0..7)
0 120 120 120 120 120 120 120 
##$TP= (0..7)
150 150 150 150 150 150 150 150 
##$TP07= 0
##$TPNAME0= <>
##$TPNAME1= <>
##$TPNAME2= <>
##$TPNAME3= <>
##$TPNAME4= <>
##$TPNAME5= <>
##$TPNAME6= <>
##$TPNAME7= <>
##$TPOAL= (0..7)
0.5 0.5 0.5 0.5 0.5 0.5 0.5 0.5 
##$TPOFFS= (0..7)
0 0 0 0 0 0 0 0 
##$TUNHIN= 0
##$TUNHOUT= 0
##$TUNXOUT= 0
##$USERA1= <user>
##$USERA2= <user>
##$USERA3= <user>
##$USERA4= <user>
##$USERA5= <user>
##$V9= 5
##$VALIST= <valist>
##$VCLIST= <CCCCCCCCCCCCCCC>
##$VD= 0
##$VDLIST= <DDDDDDDDDDDDDDD>
##$VPLIST= <PPPPPPPPPPPPPPP>
##$VTLIST= <TTTTTTTTTTTTTTT>
##$WBST= 1024
##$WBSW= 4
##$XGAIN= (0..3)
0 0 0 0 
##$XL= 0
##$YL= 0
##$YMAX_a= 253014
##$YMIN_a= -284658
##$ZGOPTNS= <>
##$ZL1= 120
##$ZL2= 120
##$ZL3= 120
##$ZL4= 120
##$ABSF1= 15.68852
##$ABSF2= -2.363369
##$ABSG= 5
##$ABSL= 3
##$ALPHA= 0
##$AQORDER= 0
##$ASSFAC= 0
##$ASSFACI= 0
##$ASSFACX= 0
##$ASSWID= 0
##$AUNMP= <proc_1d>
##$AZFE= 0.1
##$AZFW= 0.1
##$BCFW= 0
##$BC_mod= 2
##$BYTORDP= 0
##$COROFFS= 0
##$CY= -3
##$DATMOD= 1
##$DC= 0
##$DFILT= <>
##$DTYPP= 0
##$F1P= 0
##$F2P= 0
##$FCOR= 1
##$FTSIZE= 16384
##$FT_mod= 6
##$GAMMA= 0
##$GB= 0
##$INTBC= 1
##$INTSCL= 3.70164e-10
##$ISEN= 128
##$LB= 0.24
##$LEV0= 0
##$LPBIN= 0
##$MAXI= 10000
##$MC2= 0
##$MEAN= 0
##$ME_mod= 0
##$MI= 1.114404
##$NCOEF= 0
##$NC_proc= -5
##$NLEV= 6
##$NOISF1= 3.799351
##$NOISF2= 2.8
##$NSP= 0
##$NTH_PI= 0
##$NZP= 0
##$OFFSET= 15.68852
##$PC= 1
##$PHC0= -25381.05
##$PHC1= 10.98731
##$PH_mod= 1
##$PKNL= yes
##$PPARMOD= 0
##$PSCAL= 0
##$PSIGN= 0
##$REVERSE= no
##$SF= 200.129566621028
##$SI= 16384
##$SIGF1= 3
##$SIGF2= 2
##$SINO= 5.538805
##$SIOLD= 16384
##$SREGLST= <1H.CDCl3>
##$SSB= 0
##$STSI= 16384
##$STSR= 0
##$SW_p= 3612.71676300577
##$SYMM= 0
##$S_DEV= 0
##$TDeff= 16384
##$TDoff= 0
##$TI= <>
##$TILT= no
##$TM1= 0
##$TM2= 0
##$TOPLEV= 0
##$USERP1= <user>
##$USERP2= <user>
##$USERP3= <user>
##$USERP4= <user>
##$USERP5= <user>
##$WDW= 1
##$XDIM= 16384
##$YMAX_p= 380176587
##$YMIN_p= -121694
$$ End of Bruker specific parameters
$$ ---------------------------------
##NTUPLES= NMR SPECTRUM
##VAR_NAME=  FREQUENCY,     SPECTRUM/REAL,   SPECTRUM/IMAG
##SYMBOL=    X,             R,               I
##VAR_TYPE=  INDEPENDENT,   DEPENDENT,       DEPENDENT
##VAR_FORM=  AFFN,          ASDF,            ASDF
##VAR_DIM=   16384,         16384,           16384
##UNITS=     HZ,            ARBITRARY UNITS, ARBITRARY UNITS
##FACTOR=    0.220516191357247, 1,           1
##FIRST=     3139.73679488495, 0,            0
##LAST=      -472.979968120819, 0,           0
##MIN=       -472.979968120819, -121694,     0
##MAX=       3139.73679488495, 380176587,    0
$$ Real data points
##PAGE= N=1
##DATA TABLE= (X++(R..R)), XYDATA
$$ [...]
8851a514m063q4J759M10n12k087R07m918k357k224l763K788k138M386R67o1J430
8834a1074l8M649K115L678J791j240j763K161l929k624k328q27j132k906k24j097
8818a4788l546j013K393j924J121N92K518M115K543N873J186l145K534J342l322
8803c521L453Q24m579j073o574j951K108k844k101J334n20k112k626M380J722
8788a4080J160J131K011L866j803J759N409P05n96j203m623j919k239q98j284
8773a2604l569j512k260O28Q05J523M251k317L477L957K282J028k148J729P73
8758c957J302m78k773j292k098l029J35l49j848J755j797l482J674K381k917L170
8742a3603M331R01Q88L733L533J084j458k375M392k605m548j080k058k263l022
$$ y = [-1514, -5577, -5661, -3902, -3492, -4004, -6091, -5184, -10102, -12459, -14683, -18446, -15658, -17796, -13410, -12443, -12504, -11074, -11112, -6463, -4348, -670, 1121, -119, -1882, 279, -3650, -6274, -8602, -9429, -10561, -13467, -13691, -14788, -18334, -19347, -16954, -18878, -17757, -17165, -14647, -10532, -7989, -2116, -930, -4075, -1541, -199, -3521, -68, 756, -3823, -4896, -11470, -13421, -11313, -14157, -16258, -14924, -15444, -17556, -20182, -15802, -14080, -12920, -11789, -9778, -5912, -7715, -5956, -547, 158, -438, -1641, -6264, -8183, -10422, -11320, -12604, -16173, -17685, -19945, -19317, -18512, -16989, -12738, -15055, -11578, -7621, -5339, -4311, -6459, -4730, -3957, -2655, -3133, -5906, -7198, -9296, -12325, -12190, -12539, -14387, -12632, -14429, -17911, -16237, -13856, -16773, -13603, -9272, -8371, -7483, -3750, -217, 867, -591, -2966, 1426, -1179, -5727, -6807, -8865, -11128, -14150]
8727a4150j257J876j331j992k266O67M328N422k392O35N857J248J770j134O69
8712b050J876j491k720k922k722r28k125j166j503k027l402j001K004J223l876
8697b2830P276J001K985L157Q76M159o57N01O4P36J437n74J213m37p851k622j546
8680a3112m333K984j692j069M55k264M783L690L201L160j288M583M235j576j253
8665E04K283l386p157l116l360ql47l734m858K814J3L408K066k39K69L907M338
8648f603J309q69J801L4J988R01j458L132l564l111k292l653J204j390k207k295
8632a7073j190J719o38j084N440J709L749m13L307o16j11J478j46J050k245m981
8616a0045r21j184j110o17n553l101P43j143M255j545j08L030K63L651J29M335
$$ y = [-14150, -15407, -13531, -14862, -16854, -19120, -18453, -14125, -8703, -11095, -10460, -4603, -3355, -1585, -2719, -2050, -174, -1665, -4385, -7307, -10029, -10957, -13082, -14248, -15751, -17778, -21180, -22181, -20177, -18954, -22830, -15554, -14553, -11568, -8411, -7535, -3376, -4033, -3532, -3468, -2732, -1295, -1869, -656, -1093, -8944, -11566, -13112, -17445, -14461, -16153, -17222, -16767, -19031, -14248, -10558, -7357, -4197, -5485, -902, 3333, 1757, 504, 2787, -599, -7756, -10872, -14232, -14240, -14587, -18321, -23179, -20365, -20352, -16944, -14878, -15117, -14848, -10941, -6603, -5294, -6163, -4362, -4328, -2340, -1439, -2897, 235, -3329, -6440, -8732, -12385, -11181, -12571, -14778, -17073, -18263, -16544, -17182, -18266, -12826, -11117, -7368, -7781, -4474, -5090, -5201, -3723, -3869, -2819, -5064, -10045, -10966, -12150, -13260, -13877, -19430, -22531, -21788, -22931, -18676, -20221, -20329, -17299, -17036, -13385, -13256, -8921]
8600h921j20L40j220J62L404q93J588k881n16j239n885l860l086n245L141j504
8584b6735n104o377k9439l3486N1441N8457j2896O342j326R44k384J378p41k298
8570b224l008j557m632m70j676l907m237j116L356L432M754Q99K012k50J178L426
8554d020P03K189j513K622L21m194j836m594k57J597l334o069K179N45K135m442
8538a7968j666J474N336O321m243j80L392O044K610n92L98o04m506N98k734r62
8522g282k590m110Q04k335J903l606k48L904j857R8K863j316L612K176N720Q33
8506a431L527K417l383m118l506J933k804k974l187k050J277m305n295J769K203
8491a9927J886N608L478K200l10j196L018K492K117L725k542k634J655k433m628
$$ y = [-8921, -9041, -8701, -9921, -9759, -6355, -7248, -5660, -8541, -9057, -10296, -16181, -20041, -23127, -28372, -25231, -26735, -31839, -38216, -67655, -101141, -49700, 8757, -4139, 2203, 877, 1821, -563, 815, 74, -2224, -5232, -6789, -11421, -11891, -13567, -17474, -21711, -22827, -19471, -16039, -11285, -10386, -8374, -8624, -7446, -4020, -3317, -1128, -2641, -19, 302, -3892, -5728, -10322, -10579, -8982, -12316, -18385, -16206, -15661, -13526, -17968, -19634, -18160, -12824, -6503, -10746, -10926, -7534, -1490, 1120, 528, 926, 322, -4184, -3586, -6320, -7282, -9872, -13982, -13178, -15513, -13610, -17216, -17464, -13560, -15417, -15319, -12456, -13772, -10160, -7984, -2264, -1431, 2096, 4513, 1130, -2988, -6494, -4561, -7365, -10339, -13526, -15576, -14299, -18604, -23899, -22130, -19927, -18041, -12433, -8955, -6755, -7065, -8261, -5243, -2751, -634, 3091, 549, -2085, -430, -2863, -7491]
8476g491k439J195j681m141n96k161j072o36J598O068J125l50J044L489P053J32
8460A137m25j13k850M189J042n325o167k186m668j560K646k083m29J327k51R55
8444a4761L7k798Q558O250j019j390J395M767M22j245J47j067p21j559j449j282
8428e715o443p161O66O10J203q44L709J233J023L277L615L910J524q64J688j755
8412c24k535L175j732j038l276l553n72k187j241j539J208J794M294l940j107
8397a2573K418L573K546P54N76K776p04l63M274n100J88j850j822k78n726o54
8381a1965m903j987N487l68J200k277M185k006n61N040M981O341l395j734J65
8366a797j803K991J261j844m536r34m925J803n796o91j727L570K083p23k141M649
$$ y = [-7491, -9930, -8735, -10416, -14557, -15153, -17314, -18386, -19022, -17424, -11356, -10231, -10581, -9537, -6048, 1005, 1137, 712, 599, -2251, 1938, 2980, -2345, -8512, -10698, -15366, -16926, -14280, -16363, -16792, -15465, -15716, -14761, -14724, -17522, -8964, -2714, -3733, -5123, -3728, 1039, 1461, 216, 363, -704, -1425, -2984, -4433, -5715, -12158, -19319, -18653, -18043, -16840, -17684, -13975, -12742, -11719, -8442, -4827, -917, 607, -257, 1431, -324, -2859, 316, -1416, -2454, -5730, -9283, -9855, -12042, -13283, -14822, -13614, -11820, -7526, -11466, -12573, -10155, -6582, -4036, -3282, -2706, 70, -634, -997, 3277, -1823, -1635, -3485, -5307, -5585, -11311, -11965, -16868, -18855, -13368, -13736, -12536, -14813, -10628, -12634, -13195, -8155, -3174, 3167, -228, -1962, -1797, -3600, -609, 652, -1192, -5728, -6662, -11587, -9784, -15580, -16271, -17998, -14428, -12345, -13068, -15209, -10560]
8350a0560K801M761L280p02N410m18l791l332K626p592k780N44j146L588k219
8335i530l798l532k996J23J035O74N464m42o62O164K216J795n20m59N312q74J375
8318A345m91n975j565l714j614l768k596k771L233o26j122o01P795k819N912N161
8302d216K876O460m047j375j548n686N618o01K42k584k692J876l521m123j486
8287a4807P43n463J272j655L709J234K348N843P051l936L126J864j095O227m306
8272B155j257l654n710K960M198m812n6m661K155k700r45k514L337M241M82k50
8256g031k667P521O447L345l009M191k675p448L792j981k556m125m842m702j43
8241a5883O566p57j047j176j193P461l86Q38L302J283J579Q41Q138j696q098l909
$$ y = [-10560, -7759, -2998, 282, -420, 4990, 4572, 781, -2551, 75, -7517, -10297, -9753, -10899, -7311, -9530, -13328, -16860, -19856, -19733, -18698, -18024, -12560, -13002, -13664, -7500, -5284, -3489, -4009, -4468, 844, -30, 1345, 854, -5121, -6686, -10400, -12014, -15782, -18378, -21149, -17916, -18542, -19664, -20265, -12470, -15289, -9377, -4216, -1340, 5120, 1073, -302, -1850, -7536, -1918, -2519, -2277, -4861, -7553, -5677, -9198, -13321, -14807, -14064, -19527, -18255, -19910, -16201, -14967, -12619, -6776, 275, -3661, -535, 1329, 234, 6461, 2155, 898, -2756, -8466, -5506, -1308, -6120, -6176, -10837, -8682, -11382, -12327, -14841, -11504, -7263, -6781, -7031, -9698, -2177, 4270, 7615, 4606, 8797, 6122, -1326, 2466, 485, -2071, -6196, -11038, -15740, -15883, -9317, -10074, -11121, -12297, -13490, -6029, -6415, -5577, -2275, -992, 587, 1428, 9566, 7870, -228, -4137]
8225d137L108k164P961o138o709j09k189K77q51j525J3599P96O02n367K664j203
8209a385p363m220O309J8136l507L300O307o191n166N709j5351j1780O115J8040
8195H953Q162J3720L9680j0096n9176q977q117o294Q619m731K586N054J4484P059
8181A0926l531q045j1150m61L191K064q403k001L601l580l045r66m08J2941l973
8166a2840N628J893j478M827K464K742p518j227J37K850j114M778o931j0170p848
8151b3807P34K534O530K144j876o601k164j544P138o74J698N272k424J2308K907
8136B175l43O06p353k513j20m161l429L313J83m927p28l269l837N988O654K329
8120i432R78n84O10L822L211J532L816k766l716J341j48j0113p62K632k932K43
$$ y = [-4137, -1029, -3193, 4768, -1370, -8079, -8188, -10377, -10100, -10951, -12476, 1123, 1919, 2521, -2846, -182, -1385, -8748, -12968, -6659, 11477, 7970, 11270, 17577, 11386, 6220, 11929, -3422, -15202, -9087, 8953, 17115, 30835, 70515, 60419, 1243, -7734, -15851, -22145, -13526, -18257, -15671, -10617, 3867, 10926, 7395, -650, -11800, -12261, -9070, -7006, -15409, -17410, -13809, -17389, -20434, -21400, -21808, -8867, -12840, -7212, -5319, -6797, -1970, 494, 3236, -4282, -5509, -5372, -2522, -3636, 1142, -5789, -15959, -23807, -23073, -20539, -14009, -11865, -13741, -20342, -22506, -24050, -16912, -17586, -15888, -10616, -13040, -732, 2175, 1832, 2438, -4915, -7428, -7548, -11709, -15138, -11825, -11642, -16569, -17297, -20566, -24403, -18415, -11761, -9432, -8454, -9038, -8428, -4606, -1395, 137, 3953, 1187, -2529, -1188, -1336, -11449, -12211, -9579, -12511, -12268]
8104a2268m389j601N313k517q38k717M334O203j118K888Q87K83j053n75L913K306
8088i49n04m16l745Q66l833o137j774n468l14K504M150j349M562K697m298K568
8072a1440J432K05P527j896J314O442l289r72m251j586j232k274k521n246L631
8057a4156j367m444K968K16Q54J906L883L262O028J269j54K36J855J677N84m406
8041B11p690J813k461k544n237l073M17R42K906J64M060K347m358M124K546K669
8025c164K724j454N366M335m24m541j597j632K50o737m454j203k97p3K0O25k399
8008a4655l065L5K252P710k251N622L930o72L797J148O62J34k290l441k387j812
7992e283o069l631J330l178J964Q41j921J86l248K126L939L500M166J501K142
$$ y = [-12268, -16657, -18258, -12945, -15462, -16300, -19017, -14683, -8480, -9598, -6710, -5823, -5540, -6593, -7168, -3255, -949, -1453, -1869, -5614, -4748, -8581, -14718, -16492, -21960, -22274, -19770, -15620, -16969, -12407, -9710, -14008, -11440, -10008, -9803, -2276, -4172, -2858, 3584, 295, -677, -4928, -6514, -7746, -10020, -12541, -17787, -14156, -15523, -19967, -16999, -16783, -15929, -14023, -10140, -6878, -850, 419, 265, 501, 2356, 4033, 4617, 211, -7479, -5666, -8127, -10671, -15908, -18981, -18564, -17622, -14716, -14552, -10492, -8145, -12503, -8379, -5833, -3164, -440, -1894, 3472, 7807, 7383, 2842, 1245, -387, -137, -6874, -11328, -12531, -12828, -12901, -12881, -12256, -14655, -17720, -17685, -15433, -7723, -9974, -4352, -422, -1094, 2703, 3851, 4513, 4647, 2357, -1084, -3471, -5283, -11352, -14983, -13653, -16831, -14867, -14026, -15947, -15761, -19009, -16883, -12944, -9444, -5278, -3777, -1635]
7977a635L942K465j567j771l402J110l297m18J14m905l415n30k861j801l812K622
7961a9161j39M331P780K778n56k76O795k5j847M536l130l306k288K311l510m572
7945a0279l400l340j480j56k448K686J101l006P369L576r60L413J994N152L887
7930D109K539l957j478K887l551l317n112l506j776k279k210L66R22p73K603J294
7914a3239J038J797O071j856J700L918L91J820M827j039j661j337m344k794l414
7899h122q72l588j892q44j539j114p54k900M234M669K568q49N273L935L711n53
7883A363J090L569l470k058R42n097j317k408m106n839k859M647j30k933J75n96
7867a9027M945M867N744k995K598J907K362K075m041O5M173j938m452o585j426
$$ y = [-1635, 2307, 4772, 3205, 1434, -1968, -858, -4155, -4573, -4459, -9364, -12779, -13309, -16170, -17971, -21783, -19161, -19300, -14969, -7189, -4411, -4967, -5243, 1552, 1527, -320, 4216, 1086, -2220, -4508, -2197, -5707, -10279, -13679, -17019, -18499, -18655, -21103, -18417, -17316, -20322, -12953, -9377, -10337, -6924, -4930, 222, 4109, 6648, 2691, 1213, 4100, 549, -2768, -7880, -11386, -13162, -15441, -17651, -17285, -16363, -17136, -14533, -13239, -12201, -10404, -4333, -6189, -4489, -571, -180, 1640, 6467, 5428, 3767, 2430, -1914, -4708, -8122, -8994, -12582, -14474, -15318, -16857, -17971, -18725, -21625, -17391, -12722, -10154, -11003, -5730, -1795, 1916, 1363, 2453, 6022, 2552, 494, 1436, -3661, -4978, -7386, -11492, -17331, -20190, -15543, -15673, -18606, -18431, -19027, -14082, -9215, -3471, -6466, -3868, -1961, 401, 2476, -1565, -1500, 2673, 735, -3717, -10302, -11728]
7852a1728j080n335k673N53K297L587j548O155L013P93M7M783J322Q76K63L228
7836D553k758n59m511r998L231K838n597M91k660Q02l755J667k827K157M505O292
7820f129k887L115K912N829Q69L557j896J270k818l357m776j411k833J277o450
7805a3728K015K4568j34549L8600N2872K392J1369j287O604P70M534J210M290
7792c40q5R25k129j03k59J348n982j290m951r79j10L50o457L674J787L059j18
7775a1660L027j033J458M674L204J064P20O34K278o13l469m762j732J02m733k314
7759a3155K782p470Q38l242N49Q7L907N908J360J437M050l211M283N879J222K667
7743G891j144k306l522l118k536n441j582P54j396l874k048j360K54K881J670
$$ y = [-11728, -12808, -18143, -20816, -20263, -17966, -14379, -15927, -9772, -6759, -5966, -5919, -1136, 186, 1062, 1325, 4553, 1795, 1236, -3275, -13273, -10042, -7204, -12801, -12310, -14970, -14168, -17923, -16256, -19083, -16926, -12421, -6129, -9016, -5901, -2989, 2840, 3709, 7266, 5370, 6640, 3822, 465, -4311, -5722, -8555, -7278, -13728, -11713, 12855, -121694, -83094, -30222, -27830, -16461, -17748, -11144, -10374, -5840, -4630, -340, -425, 500, -1629, -1732, -1991, -643, -6625, -7915, -12866, -13845, -13955, -13605, -20062, -16388, -14601, -11542, -11660, -8633, -9666, -8208, -3534, -330, 734, 1454, 2088, 4366, 3753, 284, -4478, -6210, -6108, -10841, -13155, -10373, -17843, -17005, -20247, -19698, -19611, -15704, -9796, -8436, -6999, -2949, -6160, -1877, 4002, 5224, 7891, 6747, 4441, 919, -2199, -4735, -10176, -11758, -11004, -12400, -16274, -18322, -19682, -19428, -16547, -14877]
7728a4877O466L589O64P59M690J512J07M432n013l927m282J914m281o374n53k
7712a5176k471k941R25M595k300M736K391K997J161LN002J414q00N165o77j09
7696C915j350o087j084n632k895j496k200N44j174p80L522L579K768l557L644
7681h283M521K4J726L699M712k583k598J856k002k361l386q5J47p554m321k158
7665a8646R86K115k767M425O70j063J974M734L459K830N274L854Kk513l738k503
7649i07k586m774L163m5p943l345R39m9l929J073o85q94N350N117M320K427M371
7632A603K547L01j352J954k685J059K748q736j297m681o81j252m33l013k912K035
7616a4795J811q36M793L860l32M893J846M332J090Q87p79l053l236l462l221k467
$$ y = [-14877, -8411, -4822, -4158, -3399, 1291, 2803, 2910, 7342, 2329, -1598, -5880, -3966, -8247, -14621, -15174, -15176, -17647, -20588, -19663, -15068, -17368, -12632, -10241, -7244, -6083, -6080, -1078, 336, -464, 4701, 4024, 3915, 2565, -3522, -4606, -10238, -13133, -14629, -16829, -16285, -17459, -18239, -14717, -11138, -8370, -11927, -8283, -3762, -3738, -2012, 1687, 6399, 3816, 1218, 3074, 1072, -1289, -4675, -4760, -4613, -12167, -16488, -18646, -17660, -15545, -18312, -13887, -13217, -14280, -12306, -7572, -4113, -1283, 3991, 7845, 7847, 5334, 1596, -907, -3493, -8267, -5104, -5149, -13092, -16437, -15498, -15547, -19476, -18403, -19088, -19982, -14632, -9515, -5195, -2768, 1603, 4150, 4451, 3099, 5053, 2368, 3427, 6175, -2561, -3858, -8539, -9220, -10472, -10905, -13918, -16830, -14795, -12984, -13820, -9027, -5167, -5499, -606, 1240, 5572, 6662, 7549, 6770, 3717, 481, -2981, -6202, -8669]
7600h669j448l338m483Q29J28j556J091k639K611K026M735N240L341J958K180
7585B006J929J493J13j860L33n647l268n008l068n6k80O14n690N51L51K904K900
7568a1683K365J756L795J805J745J968K138J653L946k278l041k906k954j715j480
7553d886k533k914j023l642j220r16K525K923M327O564m87M98L740L500K558j87
7537H827o42k227k02j814n488l016J20k320o140m431l170P16J538J682L873L120
7521i574J221J108P061J491N448O06K3N71l251l969o77k566p13l193l63k936m359
7504a4072Q52n844L344K115K005K738o40L565q8K467M542L327L155J481m585k61
7488D101j501r03o070j464m73m307k634n790n572P206L022K509L149K235l35K083
$$ y = [-8669, -10117, -13455, -17938, -17109, -16981, -18537, -17446, -20085, -17474, -15448, -10713, -5473, -2132, -174, 2006, 3935, 5428, 5541, 3681, 4014, -1633, -4901, -9909, -12977, -13033, -13313, -12699, -18389, -17838, -17487, -14583, -11683, -9318, -7562, -3767, -1962, -217, 1751, 3889, 5542, 9488, 7210, 4169, 1263, -1691, -3406, -4886, -7419, -10333, -11356, -14998, -16218, -17134, -14609, -11686, -7359, -795, -1282, -784, 2956, 6456, 9014, 8827, 8185, 5958, 5756, 3942, -1546, -4562, -4442, -6762, -12902, -17333, -20503, -19787, -18249, -16567, -12694, -9574, -8353, -7245, -184, 1307, 6755, 7361, 7384, 7955, 4704, 735, 58, -2508, -3221, -6414, -6777, -9713, -14072, -13220, -19064, -15720, -13605, -11600, -8862, -9502, -5937, -6025, -3558, 984, 4311, 7466, 8947, 4362, 4101, 2600, 1697, -4373, -5837, -6310, -10617, -13251, -19041, -24613, -17407, -14385, -11876, -8727, -6492, -6827, -4744]
7472d744M265N070L890L338Q93j786N70q919m922l598K39o34m727m063j297M33
7456a5992J330J35j824M988N092K722k84N027J853J824J779K890j750l624K298
7441F464l375o689j614j709k623o38n481J304k564O347R50q45J829M850L485K315
7425B006K217J628l62J62L72j36m623n939p85p96n566k693m649P80Q16l41L131
7408a4778k49K862L374J680O607J146K088R07J397R13k725L9m030L6l876p051
7392a1660l022O00k882K267q29k024N01L832r43l99O935L075N554R66n42N052
7376F481J279J826j503p848J119l921m072m940j154j775o580n69O16J506L781
7361a5754J129L681M199K029N712K601J452P73k158O406n433l388J400k576l762
$$ y = [-4744, -479, 4591, 8481, 11819, 12712, 10926, 11496, 2577, -2345, -5943, -5704, -6338, -11065, -15128, -16425, -15992, -14662, -14527, -16351, -11363, -6271, -3549, -3833, 1194, 3047, 4871, 6650, 9540, 7790, 4166, 6464, 3089, -3600, -5214, -6923, -9546, -10184, -15665, -14361, -16925, -10578, -9628, -10473, -8644, -3794, -309, 2006, 4223, 5851, 5489, 5651, 6023, 5887, 1264, -4675, -5460, -6256, -11822, -14515, -19164, -18384, -17568, -17909, -14778, -15027, -12165, -8791, -7111, -504, 642, 2730, 3637, 5034, 5947, 3222, 3261, -769, -733, -4609, -11660, -14682, -14082, -16964, -14697, -15526, -17550, -17049, -13217, -14160, -14559, -7624, -4549, 1005, 1971, 1429, 6481, 7760, 9586, 8083, 235, 1354, -2567, -6639, -11579, -12733, -14508, -21088, -21657, -21041, -19535, -15754, -14625, -10944, -6745, -4716, 996, 3597, 5049, 5822, 3664, 10070, 4637, 1249, 2649, 73, -3689]
7346c689p207k823l401r49R03j500j632N820K989L976L965J023K732J340N364
7331F911M549j313l522m17o45p767P40k892l833O03l040k181K29k137L865K377
7315h473J558K334L452j49L822N030m90K794J627l021J194j975o716l343j53j290
7299c799n598J20j975m465L106K471j744K324j485N266Q533J702N737J531O93
7284A2417k93j676m212m369m496r53l396k361l12j124l607j974J577J74N792J017
7268g796K267L677J782O490K002l99M856j569j992j869l520r29k559q86m315p084
7252a1844j624j12L94m66J148M122K575L802j0L000N236j18O31O8K433K991l509
7235H717n66l108m240l053l138j964k303k069q26j255P20K349J688M021K946N089
$$ y = [-3689, -10896, -13719, -17120, -18069, -17166, -18666, -20298, -14478, -11489, -7513, -3548, -2525, 207, 1547, 6911, 11460, 10147, 6625, 6208, 5563, -2204, -1464, -4356, -8189, -7586, -10626, -12807, -12578, -14715, -10850, -8473, -6915, -4581, -1129, -1278, 2544, 7574, 7084, 9878, 11505, 8484, 9678, 7703, 987, -2356, -2509, -3799, -9397, -9277, -11252, -15717, -12611, -10140, -11884, -9560, -11045, -5779, 2754, 4456, 10193, 11724, 12417, 12124, 10448, 6236, 1867, -2629, -3582, -6978, -9339, -9651, -10775, -14382, -16356, -14779, -14605, -8813, -7796, -5529, -1852, -70, 6420, 8422, 8023, 12879, 11310, 9318, 7449, 3929, 3000, 441, -445, -4760, -11844, -13468, -13580, -13186, -13652, -12504, -8382, -5807, -2005, -2015, 985, 6221, 6103, 6734, 6802, 9235, 12226, 8717, 8151, 5043, 803, -2250, -5388, -7352, -9655, -11724, -12550, -13805, -13085, -10736, -9048, -5027, -2081, 3008]
7219C008J309J99N478o79j025J650j466j504l612J617p900m316l186j136q92l123
7203a5578K756M19r11J832N515M305M046J605M777K120J867J019j354K971m037
7188A1352m346o439j761L64k337m258n546k365o35L431P372L831l207L910K239
7173A605P537K909j369P14j392L444k326j723K09n033k047n35p394P33j809n261
7157a1738j304N48J630L188O823L908L05K901L552M341k45o91o83j41j575r31
7141I888m270j829o323n619l704r62K785l996J405N190K681p32L444L490L242
7126D690K955R566r73k256J775r96k214k466k875k493p486k734j811m833j665
7111a3816j896K256K377K657n29L590N324M903L689N78J246L892L41k707j686
$$ y = [3008, 4317, 4516, 9994, 9315, 8290, 9940, 8474, 6970, 3358, 4975, -2925, -7241, -10427, -11563, -12455, -15578, -12822, -12403, -13314, -11482, -5967, -1662, 2384, 3989, 8766, 10886, 12753, 13772, 12418, 15389, 11352, 7006, 567, -1194, -830, -3167, -7425, -12971, -15336, -15971, -12540, -5168, -1337, -4544, -634, 1605, 9142, 12051, 10682, 11396, 10004, 13448, 11122, 9399, 9608, 4575, 2528, 1993, -5401, -4668, -6477, -11738, -13042, -12494, -10864, -7676, -853, 3055, 3360, 6261, 9813, 14154, 13909, 13218, 12535, 12394, 10819, 9888, 5618, 3789, -2534, -8153, -11857, -12819, -10034, -14030, -12625, -7435, -4754, -5486, -2042, 1448, 4690, 7645, 17211, 16238, 13982, 15757, 14761, 12547, 10081, 7206, 4713, -2773, -5507, -7318, -12151, -13816, -15712, -13456, -11079, -8422, -8951, -5361, -37, 4866, 8555, 9133, 10379, 14271, 14612, 11905, 10219]
7096A0219l334m779p564J125J126k078l980n194K369N47j232J613K275M995M078
7081A86L581M360K385J770K287L22p35l442k81n018o896m126j711R73j078l131
7065a0554k713J322N986J016J796M097J515j682L519O135L897L90M09k000j190
7050A1943p35l767q17o035l082n666m931n06j825L965M23K820P531J672M496M437
7034I923K862K750r39M83M560l671J085m257k403j465m752l748l046j834l153
7019g605J778N45j355J286J605M392K220L599O435K304L331J107j782q46k335
7004A4679j977m216l775m7m058m791k726l292j663J256L266J879L101N007K116
6989D759K864L248K679L564n3m60k183q97K243m611k728o159r67j709p258p91
$$ y = [10219, 6885, 2106, -5458, -4333, -3207, -5285, -9265, -14459, -12090, -11543, -12775, -11162, -8887, -3892, 186, 3767, 8127, 10512, 12282, 14569, 14891, 14156, 10714, 10433, 5415, -1481, -5607, -7318, -6345, -7423, -10554, -13267, -11945, -5959, -4943, -3147, 950, 2465, 783, 4302, 10437, 14334, 14724, 15133, 13133, 11943, 11208, 7441, 6624, 589, -2493, -8159, -13090, -13596, -15421, -11456, -11033, -8213, -682, 990, 5486, 9923, 12785, 15535, 14596, 15079, 19639, 15968, 17053, 12796, 10393, 8928, 4176, 428, -2618, -4452, -7605, -5827, -5282, -6637, -5351, -3746, 646, 2866, 6465, 12900, 15204, 18535, 19642, 17860, 17014, 14679, 12702, 8486, 4711, 4664, 606, -4185, -6911, -10203, -11866, -10610, -7344, -5465, -2364, 2643, 4759, 7623, 10871, 13550, 17114, 17061, 16601, 14418, 13521, 15764, 11153, 8425, 2266, 1299, -410, -7668, -8459]
6973h459k766Q51O422J222K53K858M231O425M462N182pj706M252l073N62j70o179
6956A4360l404m580N39l488n091k709m415K047K489J96K117N010N681N314L457
6941A7523K535o20P4m52l792k541q46R63n936l664k871n751j338l225j697j263
6925a2901L72O099J515N971M694P50M706K477J235q75K704L884m890m131l743
6910G867l191j112m543m363l320r63R87l664J889K127p00Q591M009M427K334L222
6894A3597Q274j305j067Q52j503m369o280J397l931k980n771l906L38j700j683
6879a0037P81J742K695L958M957P560k989L394K267P821p79l199n60n530r85k977
6863H119n174m721p325l440M62j650M557O09J844K871J649P284L084M788N182
$$ y = [-8459, -11225, -10374, -3952, -2730, -2477, 381, 4612, 11037, 15499, 20681, 20674, 18968, 23220, 20147, 20709, 20539, 14360, 10956, 6376, 6915, 3427, -1664, -4373, -8788, -6741, -4252, -4056, -1939, 3071, 8752, 14066, 17523, 20058, 19438, 19512, 19060, 15268, 12727, 11881, 12844, 6908, 3244, 373, -5378, -6716, -9941, -11638, -12901, -12529, -6430, -4915, 1056, 5750, 6500, 11206, 13683, 14918, 14043, 16747, 20631, 15741, 11610, 7867, 4676, 3564, -979, -5342, -8662, -9625, -8638, -12302, -10413, -8286, -8986, -395, 3614, 8041, 10375, 13597, 21871, 20566, 19499, 20351, 18848, 14479, 8199, 9596, 5665, 2685, -3086, -6992, -6654, -8354, -10037, -9256, -7514, -4819, -861, 4096, 11656, 8667, 12061, 14328, 22149, 21370, 18171, 17611, 12081, 11096, 8119, 2945, -1776, -9101, -12541, -12079, -13729, -9172, -8563, -6719, -3848, -2199, 5085, 8169, 12957, 18139]
6848A8139p27M204p11k38K6n226O4m445m821m644n624m229l798N53J423J361L561
6831e132J831L696N806K563M958K343M245K988L183l236n310o06l736l207n211
6816E175m853L37p528k995k155P49O101J379J584K497K132O484K813N061L194
6801A9975j113O409m964J755k155n071j628q429m250j796l519k544m201l23K831
6786i023K718P092K621L610K938K804N399K789J492m65k47j159k588l685l468
6771A0828n256k649n590m596m76k519N98j602K825M088N318M399L544P536M314
6756B0762r55j97p1L708j869k007j309r270J424m692n386l481m217K952J086n09
6740d031N90R51O098M676M401M591R5K605O16K222K122j642j536p189k177p044
$$ y = [18139, 17412, 21616, 20905, 20667, 20693, 15467, 15531, 11086, 6265, 1621, -4003, -8232, -12030, -11477, -10054, -8693, -5132, -3301, 395, 6201, 8764, 13722, 16065, 20310, 23298, 26481, 23245, 17935, 17329, 13593, 10386, 5175, 322, 659, -6869, -9864, -12019, -11270, -5169, -3790, -2206, 291, 2423, 8907, 11720, 16781, 19975, 18862, 25271, 20307, 22062, 19907, 14836, 13208, 4779, 529, -1267, -4786, -7330, -11531, -11854, -9023, -6305, 787, 3408, 7018, 9956, 12760, 18159, 20948, 22440, 21975, 21728, 20569, 17981, 14296, 10828, 5572, 2923, -2667, -7263, -7739, -10258, -9660, -11262, -8437, -4349, 969, 5368, 8912, 16448, 20762, 19807, 19610, 19539, 23247, 21378, 19371, 18062, 8792, 10216, 5524, 138, -3343, -7560, -4608, -3522, -4031, -3441, -2490, 3608, 8284, 12685, 17276, 17371, 19976, 20592, 22814, 24936, 23294, 21758, 14569, 12392, 5348]
6724E348j0140m15k926j169K540M416j510p33M103K929N953N191K511P824K188
6709B6110J775J844j154o52n401o363m410j584K022m182o860m636j541L69L272
6694a391N082l19N392N435K030M817M298K509J656j380k27K91m543k332l352p239
6678A0727j0681k206L930l252k101j315K39L375N090L191J820N452M717L229M206
6663B6421K088Q89j059p77k858l575m311o986n878M66l518p71j253l29K728k408
6647a131L709O068N494Q180k043K632N137j79L500J54m80j070o512n681l348k713
6631A1717n872m589l601j919L007K748J683J394M74O169K092O415O368J000N248
6616C2334R24m30k920m317r46n510m095j508o866l585n923k328l58J518N358K939
$$ y = [5348, -4792, -5207, -8133, -9302, -6762, -2346, -3856, -4589, -486, 2443, 8396, 13587, 16098, 23922, 26110, 27885, 29729, 28575, 27923, 22522, 16159, 11749, 10165, 12187, 8005, 1145, -3491, -5032, -4663, -1391, 3691, 3372, 8764, 14199, 16229, 21046, 25344, 27853, 29509, 28129, 27902, 28193, 23650, 21318, 17966, 10727, 46, -2160, 1770, -1482, -3583, -4898, -4659, -1284, 3806, 6997, 8817, 14269, 18986, 22215, 26421, 28509, 29398, 28339, 27562, 24704, 21129, 16818, 9832, 3954, 4420, 902, 131, -1122, -1451, 1277, -1131, 2578, 8646, 14140, 22320, 20277, 22909, 28046, 27867, 31367, 31521, 31041, 29971, 23459, 17778, 14430, 11717, 5845, 1256, -2345, -4264, -1257, 1491, 3174, 4568, 5042, 11211, 13303, 19718, 26086, 27086, 32334, 33258, 32828, 29908, 25591, 24645, 19135, 15040, 13532, 6666, 3081, -2842, -5170, -5528, -4010, 1348, 4287]
6600D287J076M443O228O502N17K883Q017p53Q15L67k475m499o826j389n546l776
6584I871l566k945j604n90l97J218K659N793K44N151N281P086P731J83j641J007
6568C5481p55k149o153k660n404l944j906n600l753m240J165J465M114N799K700
6553A4160L439O36M850R394j132L141q7j325K333k881j721n616n041l514m869
6538A1767k115l159k817M47k72L251J766K227R680K058M630J334K855L299l21
6523C4630K876J970k683l059p859n777l604j563n802k571j04m650K545L195L249
6508A0793O082M746K543K635N948K418n41N685j47r1n984m655l506o724o565o283
6492F354l451m161j607K717J231r42O038K69O714O880O610N753J36L231P23k267
$$ y = [4287, 5363, 9806, 16034, 22536, 23053, 25936, 33953, 33200, 34015, 34382, 31907, 27408, 20582, 19193, 13647, 9871, 6305, 3360, 1756, 1166, 769, 1987, 4646, 10439, 10683, 15834, 21115, 28201, 35932, 36115, 34474, 35481, 34726, 32577, 26424, 23764, 18360, 14416, 12510, 6910, 3157, -1083, 82, 1547, 5661, 11460, 14160, 17599, 18235, 23085, 32479, 31347, 34488, 34401, 33076, 35409, 32528, 30807, 25191, 20150, 16636, 11767, 9652, 6493, 3676, 4123, 3851, 7102, 8868, 11095, 20775, 22833, 27463, 28797, 31652, 34951, 34630, 37506, 39476, 36793, 33734, 25875, 20098, 16494, 14931, 9129, 6558, 6454, 1804, 4349, 7544, 10793, 16875, 21621, 24164, 26799, 32747, 35165, 34624, 40309, 40162, 40071, 34087, 29432, 25926, 19202, 12637, 6354, 2903, -1258, -2865, -148, 1083, 141, 6179, 6448, 13162, 20042, 26652, 32405, 32541, 35772, 36495, 34228]
6476C4228K895k095l879m115o430l017n247m435m037k90J014j858J046K338j18
6461F000O136O011O352Q921K188Q99K315K289L99n071l801o825l573m949n649
6446A1642j837l508J89m228j38K079N956P430L196M884Q28M556P867P8R16J563
6430D1473j666l321l902l198m875j853n218o892q63m341j438M674K634K686J411
6415A5311P204J579L164L921L477L613L372J961J33o181n807k618n278k326l153
6400A8372n728n052j822j140J528M514K882L084O214M550M006J266N002Q743L08
6385D6727j050k820l51j250n120q780o854j317l456l821j344M70j970K384L667
6370A5115L168J465P627N375N290N649L289K63N59n606K876o69p121r164q27l046
$$ y = [34228, 37123, 35028, 31149, 27034, 20604, 17587, 12340, 7905, 3868, 3578, 4592, 2734, 3780, 6118, 6000, 12136, 18147, 24499, 33420, 35608, 36507, 38822, 41111, 41510, 36439, 32638, 25813, 22240, 17291, 11642, 9805, 6297, 6486, 2258, 2120, 4199, 10155, 17585, 20781, 25665, 26493, 31049, 38916, 38994, 39910, 41473, 39807, 36486, 32584, 29386, 24511, 22658, 17440, 10548, 9685, 5344, 3906, 8580, 11214, 13900, 15311, 22515, 24094, 27258, 31179, 34656, 38269, 41641, 43602, 43735, 37554, 31747, 29129, 23851, 21525, 18372, 12644, 7592, 5770, 4630, 6158, 10672, 13554, 16638, 22852, 27402, 31408, 32674, 37676, 46419, 46727, 45677, 42857, 42506, 41256, 36136, 27356, 20502, 19185, 15729, 11908, 10564, 11034, 9064, 11448, 15115, 18283, 19748, 27375, 32750, 38040, 43689, 46978, 47241, 47800, 42194, 45070, 44401, 37280, 28116, 27289, 24243]
6354B4243o464j120n534J768k943J213N833K28M860Q200M550P503n86O143K646
6339E0540O46J017m648n961j297l463q023l507m775l364k241k655k248K702J876
6324A4599M745M959O455O886N505M324J363J933N821k888n50j702p040q233p309
6309B8868o45n898m0k389l990K280n34K256N186o69P171N515R674M117J296J943
6293E4141K421k054l310k882m739o772m358l618l519n695k154p43R84M866J04
6278B2672K928N850M633N941O280K726Q540J930O09k469m493m057n976l850p618
6263C3646l702L58r033k098q55j282M14M960M511J729M398M931Q749N916L089
6248E5731K435K199j330r59l646m926m799r177k116m775n971k753l046q1L230
$$ y = [24243, 17779, 16659, 11125, 12893, 9950, 11163, 16996, 17224, 22084, 30284, 34834, 42337, 41751, 47894, 50540, 51186, 52203, 47555, 41594, 40297, 36834, 28811, 25304, 20529, 17165, 14924, 12269, 10021, 12723, 14599, 19344, 24303, 30758, 37644, 43149, 47473, 48836, 50769, 56590, 53702, 53152, 51450, 44410, 36177, 28868, 28223, 22325, 22285, 19896, 15906, 18186, 17652, 19908, 25094, 24425, 31596, 37111, 46785, 50902, 52198, 54141, 56562, 54508, 51198, 48316, 43577, 36805, 32447, 28829, 25310, 19615, 17461, 16718, 17702, 22568, 22672, 25600, 31450, 36083, 42024, 48304, 51030, 59570, 61500, 62109, 59640, 55147, 51090, 45114, 41264, 33646, 29944, 30302, 21269, 19171, 18316, 17034, 17448, 22408, 26919, 28648, 33046, 37977, 46726, 52642, 55731, 58166, 60365, 59035, 58076, 54430, 49504, 44705, 35528, 33412, 28637, 22666, 19913, 16867, 16786, 20016]
6233B0016L482L212O184P288J377M929O279N103J630o30J874m840l674m323m125
6218D3782o123q396l629J37n941k586p0K153M443K631O388M654N174O755K598
6203E1970N915M800J234j702n015j571m730l806n886m497m821o409k581j496r54
6188B0451M303P56O876P590L744M123K767O999L802K823K522J224r85n684L0j0278
6172E1063r298n019k387k811o430l108k87K586L997J904O838R625M525P126K375
6157F0699N60J527K300N065l892j773o953o814k293q145l479q577l109k507k678
6142A9931L820Q64N567R006M908P594L789Q996O731k09L513j73j81m619q013m666
6126E6858p606m462p780n163k552k608K279j2K038M351N176J0311N680L629J0074
$$ y = [20016, 23498, 26710, 32894, 40182, 41559, 46488, 52767, 57870, 59500, 58870, 60744, 55904, 52230, 47907, 43782, 37659, 29263, 25634, 25771, 19830, 17244, 17174, 19327, 23770, 26401, 32789, 37443, 42617, 49372, 51970, 57885, 62685, 63919, 62217, 57202, 55631, 50901, 47095, 41209, 36712, 31891, 25482, 22901, 21405, 20451, 24754, 25510, 32386, 39976, 43720, 47843, 50610, 57609, 61411, 64234, 66756, 67980, 66995, 61311, 61341, 51063, 41765, 36746, 34359, 31548, 25118, 22010, 21723, 24309, 28306, 30210, 37048, 46673, 51198, 58324, 60699, 61259, 62786, 65086, 70151, 66259, 64486, 57533, 50719, 48426, 40281, 36802, 28225, 25116, 22609, 19931, 23751, 24615, 30182, 39188, 44096, 51690, 55479, 64475, 71206, 70997, 74510, 74337, 74156, 69537, 61524, 56858, 49252, 44790, 37010, 31847, 29295, 26687, 28966, 28954, 30992, 35343, 40519, 50830, 56510, 60139, 70213]
6111G0213M257J927j629J054l379l385j998p667l800p274n146m454l524j068J016
6096C5143R09M071J664P182O362R039N516K577M969O167O74j070l412l609m412
6081G1770m116p731k987o635o520k436j767l05j43K361O848K616J0032J0339O328
6066G7654M876J179P876J513j156M18m291n069p549n789k424o896j759l680k831
6051E2072n58L241K822L070N897P256L391O254M567R049L737K678l2n595m086
6036I3763p987r362n108q251n507m824o265l202J034L62K147N523M450M720Q215
6021F9708N578K959M919M698M130K14k36o455m430n610p438k029q951l742k780
6006E0535l557j371j590J404O490M705Q503N461O717Q095M729M285L72L195K75
$$ y = [70213, 74470, 76397, 74768, 75822, 72443, 69058, 67060, 59393, 55593, 48319, 43173, 38719, 35195, 34127, 35143, 36052, 40123, 41787, 48969, 55331, 64370, 69886, 72463, 77432, 83599, 84273, 83203, 79791, 76182, 71770, 67654, 59923, 56936, 50301, 43781, 41345, 39578, 39273, 39130, 41491, 48339, 50955, 60987, 71326, 77654, 82530, 83709, 91585, 93098, 91942, 92360, 88069, 83000, 75451, 69662, 67238, 60342, 58583, 54903, 52072, 51514, 54755, 57577, 60647, 66544, 73800, 77191, 83445, 88012, 97061, 100798, 103476, 103444, 97849, 93763, 85776, 76414, 71306, 63055, 57548, 52724, 46459, 43257, 44291, 44653, 46800, 52323, 56773, 61493, 69708, 75286, 78245, 83164, 87862, 91992, 92206, 91970, 85515, 81085, 75475, 68037, 66008, 57057, 53315, 50535, 46978, 45607, 44017, 45421, 51911, 56616, 65119, 70580, 77297, 85392, 90121, 94406, 94778, 97973, 98248]
5991I8248l178j577r328q927o547n178m230p363r37j270L788J656K181N558K867
5976F5763J0455P424N905O830O605N680l310l419k452l629j727j2148o175o337
5962F9465m588m03n225k575n88M155M161K878P298Q432R065O981M236O352L751
5947A13395L419K34n655l069r322o297n879r419j564p560p043J188N31K127P402
5932G2488R064N139Q744O335N082P808M942M939q57j994l623n139l466o004q215
5917I5243k754j0689m818k449k746J098J560Q009M320N278P154N514P721O471
5903A18912O844P9K975j410k846m267l541m898n409q156p616m177L95k029l88
5888H4468l51M658R432Q745M850J0190R057Q178O925M38N25R29j600n145n958
$$ y = [98248, 95070, 93493, 84165, 75238, 68691, 63513, 59283, 51920, 50983, 49713, 53501, 55157, 57338, 62896, 65763, 76218, 83642, 89547, 96377, 102982, 108662, 105352, 101933, 99481, 95852, 94125, 81977, 75802, 69465, 64877, 64474, 59249, 56674, 56086, 60241, 64402, 67280, 74578, 83010, 92075, 99056, 103292, 109644, 113395, 116814, 117048, 111393, 108324, 99002, 92705, 86826, 77407, 75843, 68283, 61240, 62428, 62959, 65086, 72488, 81552, 86691, 95435, 101770, 106852, 114660, 119602, 124541, 123684, 121690, 118067, 112928, 109462, 103458, 95243, 92489, 81800, 76982, 74533, 71787, 72885, 74445, 82454, 86774, 92052, 99206, 104720, 112441, 118912, 125756, 125835, 128810, 127400, 124554, 120287, 116746, 111848, 106439, 98283, 90667, 86490, 86885, 84856, 84468, 84117, 88775, 98207, 106952, 111802, 121992, 131049, 139227, 146152, 146590, 147115, 148044, 146444, 141299, 135341]
5873A35341n068q238q706r260k732J509m865L232J106M565P766N054J0711P129
5859A37544J1098P416O953O840K8J175m093o046m943r058k818p690p332k731l513
5844A22830l203m67N367M11P404R528O505Q245J1920N791Q229N689N329L09n47
5829A93340p224m432k369q361m125m598q882j544K49K413Q63O615Q785Q856Q258
5814A87844J2784J4698J0024Q753J1239K295Q937J152j423j665l676j405n526
5801B44031j795n128m785J563M426Q781Q709R140J3196J5067J6441J8152J4483
5788C42281J5011J4539R527R287N906N058M74J930j98L8j126K04J184L771P555
5773D15441J2145J0030J2704J4908J9771J9042K3346K1648J6916J7963K1567K1460
$$ y = [135341, 130273, 122035, 113329, 104069, 101337, 102846, 97981, 101213, 102319, 106884, 114650, 119704, 130415, 137544, 148642, 156058, 163011, 169851, 169879, 171054, 166961, 160915, 155972, 146914, 144096, 136406, 129074, 126343, 122830, 119627, 119160, 124527, 124938, 132342, 141870, 148375, 156620, 168540, 174331, 182560, 188249, 193578, 193887, 193340, 186116, 181684, 179315, 170954, 166829, 162231, 153349, 151805, 152054, 154467, 155330, 161945, 170730, 179586, 187844, 200628, 215326, 225350, 234103, 245342, 247637, 256574, 257726, 256303, 254638, 250962, 249557, 244031, 242236, 237108, 232323, 233886, 238312, 247093, 255802, 264942, 278138, 293205, 309646, 327798, 342281, 357292, 371831, 381358, 390645, 396551, 401609, 402083, 404013, 403815, 403853, 402727, 402931, 404115, 407886, 415441, 427586, 437616, 450320, 465228, 484999, 504041, 527387, 549035, 565951, 583914, 605481, 626941]
5761F26941J3819J0617J1154Q016J0532O016P091M178O026J3902J0632J8605K1754
5748G69283K2897L3885K9606L6728L7117L4848M1320L7171M0011L5445L4481L5706
5736A188498L1998L2136L0728L2528L7144L4700M6125N3603O4578P0040Q2396
5725A704474J02281J15138J32789J52459J74154J98964K15783K40709K70391K97309
5715C604451L28236L55316L88150M20642M55873M80635M95056M85064M12679K47543
5705G673645p4191m36953o74829p44466o91777o10822n20771m51097m04256l40404
5695B724079k94227k54272k25885j95166j65400j47912j25603j03844q5748p5649
5685A050373o3386m7309m1238l6835k8703k0741k0524k1029j8948k0800k4043
$$ y = [626941, 640760, 651377, 662531, 670547, 681079, 687095, 694186, 698364, 704390, 718292, 728924, 747529, 769283, 792180, 826065, 855671, 892399, 929516, 964364, 1005684, 1042855, 1082866, 1118311, 1152792, 1188498, 1220496, 1252632, 1283360, 1315888, 1353032, 1387732, 1433857, 1487460, 1552038, 1622078, 1704474, 1806755, 1921893, 2054682, 2207141, 2381295, 2580259, 2796042, 3036751, 3307142, 3604451, 3932687, 4288003, 4676153, 5096795, 5552668, 6033303, 6528359, 7013423, 7426102, 7673645, 7599454, 7162501, 6487672, 5743206, 5051429, 4440607, 3919836, 3468739, 3064483, 2724079, 2429852, 2175580, 1949695, 1754529, 1589129, 1441217, 1315614, 1211770, 1126022, 1050373, 986987, 939678, 898440, 861605, 832902, 812161, 791637, 770608, 751660, 730860, 706817]
5674G06817k4717k1181k4688k7111k8507k6355l0183k3582k8294k4922k1449j5394
5662D10434j2531r412p35J30Q87M109L456K727K417J329J886k016k870r865j3855
5647C76091j2413j3700j5783j4514j1884j7625j0640r890r583n917l633L422K933
5634B56864P844P004M645J0824K260O111N279K651j770p422j0504j1539j3823
5621B58424j2902j2269m484r914j0009m606o441n71J08O333Q601P652J1589P377
5607B38888J1005N736P504M768n847j094n671o964q524j3325j1234j1031q558
5594A95653p596m758r42j895R528O987R575J0515J3709J3974J2026P385R010O603
5580B79774L108k089l435j2081j2365p757j2702j2553j1237q499m405o454j080
$$ y = [706817, 682100, 660919, 636231, 609120, 580613, 554258, 524075, 500493, 472199, 447277, 425828, 410434, 397903, 388491, 387756, 387886, 388773, 392882, 396338, 399065, 401482, 402811, 404697, 402681, 399811, 389946, 376091, 363678, 349978, 334195, 319681, 307797, 290172, 279532, 269642, 260059, 254142, 250509, 253931, 256864, 264708, 271712, 276357, 287181, 289441, 295552, 300831, 303482, 301712, 294290, 283786, 272247, 258424, 245522, 233253, 228769, 218855, 208846, 204240, 197799, 197228, 197336, 203669, 212270, 219922, 231511, 238888, 249893, 255629, 263133, 267901, 262054, 260960, 255289, 248325, 239801, 226476, 215242, 204211, 195653, 188057, 183299, 182357, 180462, 189990, 196977, 206552, 217067, 230776, 244750, 256776, 264161, 273171, 279774, 282882, 280793, 277358, 265277, 252912, 245155, 232453, 219900, 208663, 200164, 195759, 189305, 188225]
5567A88225K843N520P971Q184J0879R044J5277P253O689Q161j078R75p173l509
5553B59261j0863j0896j0304j0982p627j1936l874p94m453L590O471R293Q633
5540B15519J2672J2702J0797J0977O637L557L574k495J238q720j0812r537j0018
5527B36091r162j2373n914r920m009J527o47Q796R550Q700J2624J0601J3587J1409
5513B70860J0929O833K755J216p385k591p439r858j1180j1537j0896r815q096
5500B13796n088L304K400L298J0390O985J1155J6143J0169J5430O402P514N570
5487C07468K077m024p091n723q590j0719j1944j5850j0457q066K614l690J836
5474B27841J0260P291J2980R842J4346J5058R276J2870M447P248J11k281m086
$$ y = [188225, 191068, 196588, 204559, 212743, 223622, 232666, 247943, 255196, 261885, 270046, 268968, 269943, 262770, 259261, 248398, 237502, 227198, 216216, 208589, 196653, 192779, 191985, 187532, 191122, 197593, 206886, 215519, 228191, 240893, 251690, 262667, 269304, 272861, 276435, 273940, 275178, 266458, 255646, 246109, 236091, 226929, 214556, 208642, 198722, 194713, 196240, 195593, 204389, 213939, 222639, 235263, 245864, 259451, 270860, 281789, 288622, 291377, 292593, 285208, 282617, 275178, 265320, 254140, 242603, 231707, 221892, 213796, 208708, 212012, 214412, 217710, 228100, 235085, 246240, 262383, 272552, 287982, 294384, 301898, 307468, 309545, 305521, 298430, 292707, 284117, 273398, 261454, 245604, 235147, 227081, 229695, 226005, 227841, 238101, 245392, 258372, 268214, 282560, 297618, 306894, 319764, 324211, 331459, 331570, 329289, 325203]
5461C25203r768j0720j3797r953q496r763l496n139j298L70L674O977R229J6937
5447B89960J4658J3660J3160J1001Q017K848P339j118l917j1440j3148q999j4984
5434C07037j1407q068o445o289m233O751P155Q783J3584J2047J6825J3536J4311
5421C63587J0377J0511Q618J991j843o470q518q997j4238r018j1061q875j2393
5408C13671m132J316j393P432Q472J2579J4876J6475J8101J3530J7310R792M614
5395D32643K747n86k85j2040q546r643j3812j0109j1886r272r263L687O106m34
5381C59307J5961J3220J9312J5385J0602J9928J4606J1774O104L657J1o748m255
5368D78864j1692j1490j8106j2576j3637j3659n006n475o03n48N128J1069J1482
$$ y = [325203, 315435, 304715, 290918, 280965, 272469, 262706, 259210, 254071, 252773, 253143, 256817, 263794, 273023, 289960, 304618, 318278, 331438, 342439, 350456, 353304, 360643, 359525, 355608, 344168, 331020, 322021, 307037, 295630, 287562, 281117, 274828, 270595, 277346, 284501, 293284, 306868, 318915, 335740, 349276, 363587, 373964, 384475, 393093, 395084, 393241, 386771, 378253, 369256, 355018, 346000, 334939, 326064, 313671, 309539, 310855, 309462, 316894, 325366, 337945, 352821, 369296, 387397, 400927, 418237, 428029, 432643, 435390, 434804, 434519, 422479, 413933, 404290, 390478, 380369, 368483, 359211, 349948, 353635, 359741, 359307, 375268, 388488, 407800, 423185, 433787, 453715, 468321, 480095, 486199, 489856, 489867, 483119, 478864, 467172, 455682, 437576, 425000, 411363, 397704, 392698, 387223, 386620, 386072, 391200, 402269, 413751]
5355D13751J5622J5352J3937J9388J0699J1147L624J061n454o251q712j2170j0237
5342D61757j5013j0526j836r22J877Q66J0781J2352J4962K1452J9463K1722J9465
5329E56400J9806J3620P878J0364j77L127o798r930j0180j4131p642j1933p787
5316E42617m050k222N737Q270J8032J6254K1581J9169J8037K4820J9788J8650
5304G06683J3690Q240O232j470K055o632p999p519j0079q328p949K441K713J0168
5290G02246J6105J2537K0551K0853K8659K9956K6068K3951J5592J8936J1459Q736
5278I35649K497o99J777q546k758n015l938P53Q32J2996J2271J8137K0682K8227
5264A012865K8962L2099L7863K7382K9054K9786K1667K5992J2560J0082O161Q949
$$ y = [413751, 429373, 444725, 458662, 478050, 488749, 499896, 503520, 504581, 499127, 492876, 484164, 471994, 461757, 446744, 436218, 434382, 433460, 435337, 436203, 446984, 459336, 474298, 495750, 515213, 536935, 556400, 576206, 589826, 597704, 608068, 607891, 611018, 604220, 594290, 584110, 569979, 562337, 550404, 542617, 538567, 536345, 542082, 550352, 568384, 584638, 606219, 625388, 643425, 668245, 688033, 706683, 720373, 728613, 734845, 733375, 735430, 728798, 720799, 713280, 703201, 694873, 686924, 689365, 692078, 702246, 718351, 730888, 751439, 772292, 800951, 830907, 856975, 880926, 896518, 915454, 926913, 935649, 938146, 937447, 939224, 930678, 927920, 922905, 918967, 919720, 920552, 933548, 945819, 963956, 984638, 1012865, 1041827, 1073926, 1111789, 1139171, 1168225, 1198011, 1219678, 1245670, 1258230, 1268312, 1274473, 1283422]
5252A283422J731J138O288p37P049R980J7838K8839L1387L7290L8851M6222M8335
5239A557633N3470N9744N5880O2154N4411O2638O1789O6395P7366P6672R4184
5228B282336R7180J16511J33085J48410J70678J89908K24123K43189K64133K82680
5218D152233K63249K14160J16401j2169j50143k63366l27769l39234l12748k75678
5208C064936k35211k01924j76965j48098j32710j07283r2448p1157n4931m2857
5198A801352j7366p739L311J5506J7654K8395K6722K7703K0548J7586J0529K677
5186A946878p095j7923j3701k1925k2998k1283j9247j1753j0057R110J0763K1074
5174A841843L0204M0333M6638M5520N3736M3996M0645L9522L0329K4603J3781
$$ y = [1283422, 1285153, 1286291, 1292579, 1291842, 1298891, 1308871, 1326709, 1355548, 1386935, 1424225, 1463076, 1509298, 1557633, 1611103, 1670847, 1726727, 1788881, 1843292, 1905930, 1967719, 2034114, 2111480, 2188152, 2282336, 2379516, 2496027, 2629112, 2777522, 2948200, 3138108, 3362231, 3605420, 3869553, 4152233, 4415482, 4629642, 4746043, 4733874, 4583731, 4320365, 3992596, 3653362, 3340614, 3064936, 2829725, 2627801, 2450836, 2302738, 2170028, 2062745, 1970297, 1899140, 1844209, 1801352, 1783986, 1776247, 1779558, 1795064, 1812718, 1841113, 1867835, 1895538, 1916086, 1933672, 1944201, 1946878, 1939783, 1921860, 1908159, 1886234, 1863236, 1841953, 1822706, 1810953, 1800896, 1810006, 1820769, 1841843, 1872047, 1912380, 1959018, 2004538, 2058274, 2102270, 2142915, 2182437, 2212766, 2237369, 2251150]
5163B251150R303r04p905j2459j8807r102j1558k747m206O664J5935K3475L1802
5150B270641L5113M9271M9655N1869M8664M2755M7242L4384L2432J8210Q238N321
5138B693795l89m899j1011q708q722J499P219R323L0039L0218M3444M8048N5897
5125B885753O3459N8073N9348N0577M8761M0757L2098K4564J1027J1574n802m481
5113C275708r869j0459j1013p439J743L701J7426K6611M0553N8177O2364P0767
5101C518270O9206P8969P3638P1861O5314N4914M7850L2357L1784J7293J1061
5090D072517J1320Q206J2851J4286K8752L0743L9242N8126O2114P0035P4126Q4846
5078D567164P6409Q0548Q3671P6225P9907O4824O7055N4487N0768M2765L4786
$$ y = [2251150, 2260453, 2259549, 2251644, 2239185, 2220378, 2211276, 2199718, 2196971, 2192765, 2199429, 2215364, 2238839, 2270641, 2305754, 2355025, 2404680, 2456549, 2505213, 2547968, 2595210, 2629594, 2662026, 2680236, 2688474, 2693795, 2693406, 2688507, 2677496, 2668788, 2660066, 2661565, 2668784, 2678107, 2708146, 2738364, 2781808, 2829856, 2885753, 2949212, 3007285, 3066633, 3117210, 3165971, 3206728, 3238826, 3263390, 3274417, 3285991, 3280189, 3275708, 3265839, 3255380, 3244367, 3236928, 3238671, 3242372, 3259798, 3286409, 3326962, 3385139, 3447503, 3518270, 3587476, 3666445, 3740083, 3811944, 3877258, 3932172, 3980022, 4012379, 4044163, 4061456, 4072517, 4083837, 4092043, 4104894, 4119180, 4147932, 4178675, 4217917, 4276043, 4338157, 4408192, 4482318, 4567164, 4643573, 4724121, 4807792, 4884017, 4963924, 5028748, 5095803, 5150290, 5201058, 5243823, 5278609]
5067E278609L0163K4744L3976L1860M8456N9312O5492Q6238R2856J20086J20354
5056E992146J33013J37657J29258J29214J17868J11756R7318Q9795P1639N9601
5046G069265N2572L9795M6023M1306N0078N7043P1363Q5567R6973J24126J32804
5035G866915J59193J67801J80396J87767J96623K04988J99625J99066J87478J79412
5025I729264J67630J55473J54609J44078J53402J52044J63691J74517J96568K19657
5015A1410933K38045K73760K98684L31505L53624L73524L92558L92045L92687
5006A4457365L68004L59197L41548L52658L50122L60697L65586L64305L81468
4997A7700950L92900M23452M51073M93048N42763N95862O62264P04932P50506
$$ y = [5278609, 5308772, 5333516, 5367492, 5399352, 5447808, 5507120, 5572612, 5658850, 5751706, 5871792, 5992146, 6125159, 6262816, 6392074, 6521288, 6639156, 6750912, 6848230, 6938025, 7009664, 7069265, 7121837, 7161632, 7207655, 7248961, 7299039, 7356082, 7427445, 7513012, 7609985, 7734111, 7866915, 8026108, 8193909, 8374305, 8562072, 8758695, 8963683, 9163308, 9362374, 9549852, 9729264, 9896894, 10052367, 10206976, 10351054, 10504456, 10656500, 10820191, 10994708, 11191276, 11410933, 11648978, 11922738, 12221422, 12552927, 12906551, 13280075, 13672633, 14064678, 14457365, 14825369, 15184566, 15526114, 15878772, 16228894, 16589591, 16955177, 17319482, 17700950, 18093850, 18517302, 18968375, 19461423, 20004186, 20600048, 21262312, 21967244, 22717750]
4988B2717750P53161P62164P45293P42773P53139P67730P72551P55562P48436
4979B9518559P40389P41013P39227P27952P35415P25528P28383P16855P51137
4970C6124458P92857Q57248R50180J043527J122578J199741J289386J349693J395509
4961D6125177J404589J408694J399238J386293J431938J450982J460375J435777
4953E7503063J414327J371880J387361J473958J597428J689434J766898J890022
4945G0094371J982606K076640K182491K335348K501174K673570K793877K846704
4937H9486781K890630K947312L119456L321247L526472L701021L945172M246464
4929A17184555M650316N120848N614525O145587O655529P289775Q066840Q901726
$$ y = [22717750, 23470911, 24233075, 24978368, 25721141, 26474280, 27242010, 28014561, 28770123, 29518559, 30258948, 30999961, 31739188, 32467140, 33202555, 33928083, 34656466, 35373321, 36124458, 36917315, 37774563, 38724743, 39768270, 40890848, 42090589, 43379975, 44729668, 46125177, 47529766, 48938460, 50337698, 51723991, 53155929, 54606911, 56067286, 57503063, 58917390, 60289270, 61676631, 63150589, 64748017, 66437451, 68204349, 70094371, 72076977, 74153617, 76336108, 78671456, 81172630, 83846200, 86640077, 89486781, 92377411, 95324723, 98444179, 101765426, 105291898, 108992919, 112938091, 117184555, 121834871, 126955719, 132570244, 138715831, 145371360, 152661135, 160727975, 169629701]
4921A69629701R632625J0357056J1109439J1931051J2741177J3481348J4130952
4914B53013349J4756361J5290452J5852945J6069334J5740682J4977252J3563680
4907C59264055J1554649Q161212J196671o794385j4066684j8502882j9709773
4900C21102863j9438170j8525100j8128855j7559077j6852726j5960862j4689321
4893A99948752j3537887j2609400j1560827j0540902r602620q802644q079336
4886A25215136p358443o585109n930074n359932m907472m485050m139954l866282
4878H2582820l674050l480567l316568l155154l011809k852711k707357k565224
4870E7819380k440356k300846k159006j999705j849828j695732j558550j426171
$$ y = [169629701, 179262326, 189619382, 200728821, 212659872, 225401049, 238882397, 253013349, 267769710, 283060162, 298913107, 314982441, 330723123, 345700375, 359264055, 370818704, 378979916, 380176587, 373382202, 359315518, 340812636, 321102863, 301664693, 283139593, 265010738, 247451661, 230598935, 214638073, 199948752, 186410865, 173801465, 162240638, 151699736, 142097116, 133294472, 125215136, 117856693, 111271584, 105341510, 99981578, 95074106, 90589056, 86449102, 82582820, 78908770, 75428203, 72111635, 68956481, 65944672, 63091961, 60384604, 57819380, 55379024, 53078178, 50919172, 48919467, 47069639, 45373907, 43815357, 42389186]
4862D2389186j325232j225466j139398j052907r91761r51651r29220r12476r09649
4853C2951426q99345r14638r21190r18665q95764q73838q49997q35146p95603
4844B5047240p44931o90011o30015n73678n39480n20120m97980m70321m47095
4835A9933609m24017m18111m13421m26019m37616m44867m51980m56238m59910
4826A6001430m65072m59721m52368m35763m10085l84601l54248l28929k89223
4817A2421420k58315k30194j98540j81011j68915j63036j65231j66255j74922
4808A0715001j87563k05727k16045k26506k37374k44217k46790k45213k35747
4799H669819k25231k07330j88625j66092j50079j25000j03022q1338o1633n7135
$$ y = [42389186, 41063954, 39838488, 38699090, 37646183, 36654422, 35702771, 34773551, 33861075, 32951426, 32052081, 31137443, 30216253, 29297588, 28401824, 27527986, 26677989, 25842843, 25047240, 24302309, 23612298, 22982283, 22408605, 21869125, 21349005, 20851025, 20380704, 19933609, 19509592, 19091481, 18678060, 18252041, 17814425, 17369558, 16917578, 16461340, 16001430, 15536358, 15076637, 14624269, 14188506, 13778421, 13393820, 13039572, 12710643, 12421420, 12163105, 11932911, 11734371, 11553360, 11384445, 11221409, 11056178, 10889923, 10715001, 10527438, 10321711, 10105666, 9879160, 9641786, 9397569, 9150779, 8905566, 8669819, 8444588, 8237258, 8048633, 7882541, 7732462, 7607462, 7504440, 7423102, 7361469, 7304334]
4789G304334n5545n5700o2184p2125q0951r2312j09689j20831j33071j40634j50175
4778F231117j47481j48562j36676j29874j12042r8212p8757o3271m9961m3232
4768E223049k8723k3812k8253k9296l6974m6091n2565p1268p9982q9938r7084
4757D639063j05279j09105j06434j03455r4361q5742p6523o4712n1523l9357k2853
4746C779719r427p088j671l31k57l650r089k1184l0387m6331n4777p1827q4864
4733C438836q9521r0317r0441q0524p7821o4213m7900l7408j9002m454R61J0586
4721B848782J5030J6352J6710J3174p69p347k0065k9783l5951m3091n6218n8449
4709B658375o2058o3603o2465n8518n0325m4896l4771k5050j7105r834K912O439
$$ y = [7304334, 7248789, 7193089, 7130905, 7058780, 6977829, 6885517, 6775828, 6654997, 6521926, 6381292, 6231117, 6083636, 5935074, 5798398, 5668524, 5556482, 5458270, 5379513, 5316242, 5266281, 5223049, 5194326, 5170514, 5142261, 5112965, 5075991, 5029900, 4977335, 4906067, 4826085, 4736147, 4639063, 4533784, 4424679, 4318245, 4214790, 4120429, 4034687, 3958164, 3893452, 3841929, 3802572, 3779719, 3770292, 3763204, 3761533, 3761202, 3760945, 3757295, 3748206, 3727022, 3696635, 3650304, 3595527, 3523700, 3438836, 3349315, 3258998, 3168557, 3088033, 3010212, 2945999, 2898099, 2860691, 2841689, 2837235, 2838196, 2848782, 2863812, 2880164, 2896874, 2910048, 2909279, 2901932, 2881867, 2852084, 2816133, 2773042, 2716824, 2658375, 2596317, 2532714, 2470249, 2411731, 2361406, 2316510, 2281739, 2256689, 2239584, 2229750, 2232662, 2239101]
4697B239101P495R009N522k252r606j7796k5824l8160m1653n0182n5644n5803
4685A964207n1386m6664m0386l3363k1922j1680j556L897J3635J7689J8715K3191
4673A834377J8377J6863J3039n68q224j6277k5593l0301l3911m2619m2653m3781
4661A638729l7382l2630l1587k3984r260k774J919J0711J7574K0074K2385J8706
4649A592481J8485J2891Q385j162r456k0230k5391k7003l3532l6138l1293k9420
4637A418617k4129j3861m975O114R541J6522K4438K4647K6038K8035L2076K4425
4625A567488J9738J1521J0416K615j916q328j2015j7831j3466j3021j0830k691
4613A531680J0349J9991L1909M5026N9668P2960Q9392J06543J13040J31162J43638
$$ y = [2239101, 2246596, 2255605, 2261127, 2258875, 2249269, 2231473, 2205649, 2167489, 2125836, 2075654, 2020010, 1964207, 1912821, 1866157, 1825771, 1792408, 1770486, 1758806, 1757250, 1761147, 1774782, 1792471, 1811186, 1834377, 1852754, 1869617, 1882656, 1882088, 1873864, 1857587, 1831994, 1801693, 1767782, 1725163, 1682510, 1638729, 1601347, 1568717, 1537130, 1513146, 1503886, 1501112, 1503031, 1513742, 1531316, 1551390, 1573775, 1592481, 1610966, 1623857, 1632242, 1631080, 1621624, 1601394, 1576003, 1549000, 1515468, 1479330, 1448037, 1418617, 1394488, 1380627, 1375652, 1381766, 1391307, 1407829, 1432267, 1456914, 1482952, 1510987, 1543063, 1567488, 1587226, 1598747, 1609163, 1611778, 1609862, 1601534, 1589519, 1571688, 1558222, 1545201, 1534371, 1531680, 1542029, 1562020, 1593929, 1638955, 1698623, 1771583, 1860975, 1967518, 2080558, 2211720, 2355358]
4602B355358J56496J65369J76755J90962K08343K24414K36333K45603K26216J69606
4592D355455O4348n9355j87373k92129l43352l41828l08003k60003k17081j81248
4582B229431j48718j25559j07863r7068q5761p8990p5384o8407o2063o3743n7783
4571A258092n2622m7459m4403l8224l5555k8114j6814j0828j0219o464l069K088
4559I66409M228J340k781l587r825q636j4225j7716k2912k9830k5822k3900k6961
4546G85782k5305j9407j7201q275q566n502M012P249R490J1046J0095O612P599
4533G57629K747R54k237p547j6248j5346k3988k4333k3084j8941k2422j9643j4195
4520E73346j0429n961J628L961J0699J5813J1176R176J4068P828N543M617o169
$$ y = [2355358, 2511854, 2677223, 2853978, 3044940, 3253283, 3477697, 3714030, 3959633, 4185849, 4355455, 4419803, 4360448, 4173075, 3880946, 3537594, 3195766, 2887763, 2627760, 2410679, 2229431, 2080713, 1955154, 1847291, 1750223, 1664462, 1585472, 1510088, 1441681, 1379618, 1315875, 1258092, 1205470, 1158011, 1113608, 1075384, 1039829, 1011715, 994901, 984073, 973854, 967390, 964321, 966409, 970637, 971977, 969196, 965609, 955784, 947148, 932923, 915207, 892295, 862465, 836643, 812743, 785782, 760477, 741070, 723869, 715594, 707028, 701526, 705538, 712787, 722277, 733323, 743418, 750030, 757629, 760376, 761330, 759093, 751546, 735298, 719952, 695964, 671631, 648547, 629606, 607184, 587541, 573346, 562917, 556956, 558584, 562545, 573244, 589057, 600233, 609409, 623477, 631305, 636848, 641465, 635296]
4507F35296m390j0978j3888j7472j8344k1082k1822j9359j3538j3026p595j820
4495D71982o40L396Q794J0624J3642J1608J0027J1354M989M479o75k183r571j1780
4481E26046j5698j8420j7897j6667j8685j5545j1388o288J380r5N251P826J1911
4468D31731J1050J5726J3995O861O325J925J343j535o914j0816j9231j8991j6647
4455D14822k1286j8756j8562j2935q441j1717p576J713O788R223J0278J0994J2892
4442C67437O402Q158L196p15n452n691q465r903j4665j7877j6437j5646j7112
4429B73230p646k299m793R22M926P633J0713J1495J1874J3052R775O332K031J860
4415C39105J39m621j2330j2010j3966j5891j2220j3108j1463p971o796k838K612
$$ y = [635296, 630906, 619928, 606040, 588568, 570224, 549142, 527320, 507961, 494423, 481397, 473802, 471982, 471342, 474738, 483532, 494156, 507798, 519406, 529433, 540787, 545776, 550255, 549580, 547397, 537826, 526046, 510348, 491928, 474031, 457364, 438679, 423134, 411746, 405458, 406838, 406743, 411994, 419820, 431731, 442781, 458507, 472502, 479363, 485688, 487613, 488956, 487421, 480507, 469691, 450460, 431469, 414822, 393536, 374780, 356218, 343283, 334842, 323125, 315549, 317262, 324050, 333273, 343551, 354545, 367437, 373839, 381997, 385193, 384478, 379026, 373335, 364870, 354967, 340302, 322425, 305988, 290342, 273230, 265584, 263285, 258492, 259414, 264340, 271973, 282686, 294181, 306055, 319107, 328882, 335214, 337245, 339105, 339244, 334623, 322293, 310283, 296317, 280426, 268206, 255098, 243635, 235664, 228868, 226030, 228642]
4402B28642L618N371J0073R171J4038J4445O451P800P946j354m040k900r907j0443
4388B78911j4705j3142j1593j2160j2631j1846m449l588J45P874P613J0077J2630
4375B33136Q611J2295J0007P124O611p31q55n138n901r061j3102j6251j3689j2261
4361B00795j0171o175m533l397j673J261P540J0665J3106J0378P181J1250Q174
4348B44401L712J697k589n246p379q320j3427j1065j4354j3298j1049m339m170
4335A54574m062R5K785O358J2623J1764Q095R330Q787R192N439J1j396j357o339
4320B15899q156j0592j3686j3361j1202j2728o224o061j676K27N141K797Q461
4307A48839J3147J0961O953Q690P935L948M328J559m563o497r480j0321j0238
$$ y = [228642, 232260, 237631, 247704, 256875, 270913, 285358, 291809, 299609, 307555, 306201, 302161, 299261, 289354, 278911, 264206, 251064, 239471, 227311, 214680, 202834, 198385, 194797, 194942, 202816, 210429, 220506, 233136, 241747, 254042, 264049, 271173, 277784, 277053, 276198, 271060, 265159, 256098, 242996, 226745, 213056, 200795, 190624, 184449, 179916, 176519, 174846, 176107, 183647, 194312, 207418, 217796, 224977, 236227, 244401, 248113, 249810, 247221, 241975, 234596, 226276, 212849, 201784, 187430, 174132, 163083, 158744, 154574, 150512, 150607, 153392, 159750, 172373, 184137, 192232, 201562, 210349, 219541, 224980, 224991, 223595, 222238, 215899, 207743, 197151, 183465, 170104, 158902, 146174, 139950, 133889, 132213, 132440, 137581, 140378, 148839, 161986, 172947, 179900, 188590, 196525, 200473, 204801, 206360, 201797, 195300, 185820, 175499, 165261]
4294A65261j0945j1915r092l621q796k780K104J208O549O544J0385Q650J0367
4281A63919Q817P759O321N68k081m628l252q104j1275q266j3224j1722j1517q737
4267A04578k382m432K077N180K214N686P115J0946R941J0758O347N181J141J917
4253A66267j990m263m551j3574j5885p921j1972p902o245p343l502r1M058N682
4239I0768K753O506J4375R668Q520O824L366P64J758k72n169j0576o223r161j0381
4224A03520o068k892o256n544q87M154L556Q361O835O249J0352J2317Q961P619
4210A50277K532L808K201m067o104p823j1589n858j0454j1126r694q270o32J700
4196H4901k346n38P748P779N982P517J2251M641O742M566L152j16k75l403p181
$$ y = [165261, 154316, 142401, 133309, 129688, 120892, 118112, 120216, 121424, 127973, 134517, 144902, 153552, 163919, 172736, 180495, 186816, 187384, 185303, 180675, 177423, 169319, 158044, 149778, 136554, 124832, 113315, 104578, 102196, 97764, 99841, 105021, 107235, 112921, 120036, 130982, 140923, 151681, 158028, 163209, 164350, 166267, 164277, 160014, 155463, 141889, 126004, 118083, 106111, 98209, 91964, 84621, 81119, 81028, 85086, 90768, 93521, 100027, 114402, 124070, 132590, 139414, 142780, 143544, 145302, 145030, 139861, 129285, 123062, 113901, 103520, 97452, 94560, 88304, 82760, 81873, 86027, 89583, 97944, 104779, 111028, 121380, 133697, 142658, 150277, 152809, 156617, 158818, 154751, 148647, 140824, 129235, 123377, 112923, 101797, 92103, 83833, 83201, 84901, 82555, 82017, 89765, 97544, 103526, 111043, 123294, 127935, 134677, 139243, 142395, 142279, 142004, 138601, 131420]
4181A31420r166r661p954r050r888q053n594j028k10o05N705N094P130R320R342
4166A06802Q310P630N053J619J640O19n923o632r977p479q181o910j0315p741
4152F8515p148j729N00J021L598Q440Q233J0173J0663N540P168N148L351J176
4138A24649j973o647p391j0048r215n494q720p712n200n810m179k52N340L012
4124F0360N763P271N515P787P470M846K911M346P72k068k722m309l808o777r196
4109G8161r770j1392l206k470m149J20Q93N158N978R252R732N632P210M797J015
4094I6961L164m11J71k718q733p116o511p539m113p065o817l916k571j970K230
4079D3046N679K432N435J0055Q360R545M659K433M094O24m19k464q975o409q752
$$ y = [131420, 122254, 112593, 104639, 95589, 85701, 77648, 72054, 71026, 70816, 70211, 75916, 81010, 88140, 97460, 106802, 115112, 122742, 127795, 129414, 131054, 131673, 125750, 119118, 109141, 101662, 93481, 86571, 76256, 68515, 61367, 59638, 60138, 61159, 64757, 73197, 81430, 91603, 102266, 107806, 114974, 120122, 123473, 124649, 122676, 116029, 108638, 98590, 89375, 83881, 75161, 67449, 62249, 56439, 52260, 52008, 57348, 60360, 66123, 73394, 78909, 86696, 94166, 99012, 101923, 106269, 107041, 104973, 102251, 97942, 94134, 87357, 78161, 68391, 56999, 53793, 51323, 47174, 47294, 48187, 53345, 59323, 68575, 78307, 83939, 91149, 95946, 96961, 100125, 99714, 99885, 97167, 88434, 81318, 74807, 67268, 63155, 56090, 49273, 45357, 42786, 40816, 43046, 48725, 51157, 56592, 66647, 75007, 84552, 89211, 91644, 95738, 96362, 95943, 93479, 84504, 78095, 69343]
4064F9343o106p655p540p003n811k781L473L336L783N782P965L667P731Q884K878
4049G9946M447M108q71J960m50p724j0535o600n028j0299p323m848l709j398r35
4034C0741K146K577O810P230M837O625J0115Q437K742O974k445m576l010n147
4020G4056p178n786n502q164q681m185n202l666k204L190M945J0228O675M175
4006E2701P564P838O432O806P221J160P20l696o270m246l233r892j0512m367o559
3991D1667p002l040j158M026O184J830P575O403O738M935P055N688L236o31k777
3976H0729l03j199p798q215n490o660p932r191n458m70J091R5K589M496K801N036
3960D4121Q833O039N729N111M720N28P17l494q975q189l009n073o608m542n601
$$ y = [69343, 63237, 55582, 48042, 41039, 35228, 32447, 35920, 39256, 43039, 48821, 56786, 60453, 68184, 77068, 79946, 84393, 88501, 87630, 89590, 89140, 81416, 70881, 64281, 59253, 48954, 41631, 36783, 33074, 31676, 30741, 32887, 35464, 42274, 49504, 54341, 60966, 71081, 79518, 82260, 89234, 86789, 82213, 79203, 74056, 66878, 61092, 55590, 47426, 38745, 34560, 29358, 25692, 23488, 26678, 31623, 41851, 48526, 52701, 60265, 68103, 74535, 81341, 88562, 89722, 90442, 86746, 80476, 76230, 72997, 63105, 52593, 48226, 41667, 34665, 31625, 30467, 34493, 40677, 42507, 50082, 56485, 63223, 68158, 75213, 80901, 84137, 83506, 80729, 80426, 79227, 71429, 63214, 57724, 51064, 43132, 33941, 28483, 28013, 29104, 29199, 31788, 36284, 39085, 44121, 52954, 58993, 64722, 69833, 74553, 75081, 75798, 72304, 63329, 55140, 52131, 47058, 40450, 35908, 30307]
3945C0307k078l087l326K686L134M165N821N636O714N799Q161M218K459L17R20
3930G1846m110o374k626q209p668n954l879k354n563o360q62K834K116L469P867
3915C4173P667O508O507P100K648p13P85J977l406l629l652r406n999m421r532
3900B6607p707l464m221J822N735o4J135P635P497N233M599N113O489L042L184
3885F2635j170j757j727r882p229q618p285l088m011n062N83J068l513J753O271
3870A8968O145P897M389P352M701K635J708J503o96o46j683m684p361o598r742
3855B3888p190l204l212j603k479Q88L221O556K668R055M244O096N999M583L974
3840E3484J837M51k059k549n267q883o672m101o989o974p2k969k097l567M936
$$ y = [30307, 28229, 25142, 21816, 24502, 27636, 31801, 37622, 43258, 49972, 55771, 63932, 68150, 70609, 70926, 71846, 67736, 61362, 58736, 50527, 42859, 36905, 33026, 30672, 25109, 18749, 17887, 20721, 22837, 26306, 34173, 41840, 48348, 54855, 61955, 64603, 63890, 64675, 66652, 63246, 59617, 55965, 46559, 40560, 36139, 26607, 18900, 15436, 11215, 13037, 18772, 18708, 19843, 27478, 34975, 40208, 44807, 49920, 56409, 59451, 62635, 61465, 59708, 57981, 48099, 40870, 32252, 24967, 21879, 17868, 12806, 13389, 14457, 10944, 12697, 18968, 25113, 33010, 37399, 44751, 49452, 52087, 53795, 55298, 54602, 53956, 52273, 47589, 40228, 33630, 23888, 16698, 13494, 10282, 8679, 6200, 7088, 10309, 16865, 19533, 28588, 32832, 38928, 44927, 49510, 53484, 55321, 55772, 53713, 51164, 45897, 37014, 30342, 26241, 19252, 12278, 12206, 9237, 7140, 3573, 8509]
3825H509N708N392M788N380O662J741M619M793K724l777k896K47k205q858o098
3810B6729p594p936k508l283r87k316J637J439M032P938O074L693K507P036M460
3795D0921N677J574J67o102m399k581o973q008n323l834o569l721l474j105J029
3780b721K767N686J710L482K653K525L645N118n28K292K748l031n115l161m779
3765A3291m275l934m773o066n890J17l20P47K602K820L813P860P860Q930N406
3750B8188M653Q2M12L55J750j871m474o627o283m123n505m693n167m707j294K276
3734g028K547O719M411L544N256Q423P602J091p3L567J497k570m258k80j016n768
3718B3664p097l545m013m659k843O75j346L229N208M108K990N546M936L597N168
$$ y = [8509, 14217, 19609, 24397, 29777, 36439, 38180, 42799, 47592, 50316, 46539, 43643, 43890, 41685, 32827, 26729, 19135, 11199, 8691, 5408, 4421, 2105, 3742, 5181, 9213, 17151, 23225, 26918, 29425, 36461, 40921, 46598, 48172, 48339, 42237, 37838, 35257, 28284, 20276, 14953, 11119, 4550, 829, -2645, -3750, -2721, 46, 5732, 7442, 10924, 13577, 16102, 19747, 24865, 24337, 26629, 29377, 26346, 21231, 18070, 13291, 9016, 5082, 309, -5757, -11647, -11530, -11850, -11103, -8501, -5681, -1868, 5992, 13852, 22782, 28188, 32841, 32923, 33335, 33690, 35440, 33569, 29095, 22468, 16185, 12062, 6557, 1864, -3303, -8010, -9304, -7028, -4481, 2238, 6649, 10193, 15449, 23872, 31474, 32565, 32492, 36059, 37556, 34986, 30728, 30448, 29432, 23664, 16567, 13022, 9009, 4350, 1507, 2182, 836, 4065, 9273, 13381, 16371, 21917, 26853, 30450, 35618]
3703C5618L437K177J77l303m478k986m860n114p783l631m151k648o128J096L502
3688I25k029N870N572O198N333M970N939K400N504K640k180j468n438l475l709
3673B7052p258k969n921p049j636r9j190J924o65j162R187Q294K596K911N430
3658B9445L692K545K166j570p6M69j784p206n783j508m547o817k650k170L29Q55
3642E390J245J417K755L030L890N012M655M837N21J930R94m41k176o436m805k491
3626A9327l876n488q547n099J615k692J091K638M760L290J042K309Q697P009K412
3611B8488L063J95J365m49k310n374l882n061o619m717l161o238k381J233j549
3596g397J337N279M053L369J662O703P197L969K915R89m16Q89k37k273o579o550
$$ y = [35618, 39055, 41232, 41409, 38106, 33628, 30642, 25782, 20668, 12885, 9254, 5103, 2455, -3673, -2577, 925, -1104, 4766, 10338, 16536, 21869, 26839, 32778, 35178, 40682, 43322, 41142, 39674, 34236, 30761, 27052, 19794, 16825, 10904, 3855, 2219, 2120, 930, 2854, 2189, 1027, 10214, 18508, 21104, 24015, 29445, 33137, 35682, 37848, 36278, 36202, 36671, 34887, 27681, 21898, 20390, 15843, 9026, 6376, 4206, 4535, 5390, 6635, 8052, 10807, 13837, 17727, 22739, 27394, 32231, 32752, 34682, 35676, 35235, 33059, 26623, 21818, 19327, 15451, 9963, 1416, -3683, -2068, -4760, -3669, -1031, 3729, 7019, 8061, 10370, 19067, 26076, 28488, 31551, 31746, 33111, 32662, 30352, 24978, 21096, 16035, 9416, 4699, 1538, -4700, -7081, -5848, -7397, -6060, -781, 3272, 6641, 8303, 15006, 22203, 26172, 29087, 30076, 29660, 30549, 30312, 28039, 21460, 14910]
3580A4910q429j643m823m681k109l559J063J686L647M423M347O014M412K816O200
3565B4274M949p0k423J92j922l754m844p804j567j925n775m764r13j070k471J498
3549h389Q17M636O120K855M662K914p05M036O005j041jj119m317k777n532k621
3533E543o415m656k385q76J731k422J64M504o05M179O069M105N787O388N96L72
3517B2079J982k034j608k251n205n675o176j822l064m598p59j996l742R06N125
3502h838M093M564N585K565M558L160M5M948K427l246K06J329l248m708q701p910
3486c171j994j028m949K83J488L28K427R99M757O330O449N875L571l27K702P2
3470B3812o39M14k436r345m097j802l678n022l519l675m127K577M670K00j757
$$ y = [14910, 6481, 4838, 15, -4666, -6775, -10334, -9271, -7585, -3938, 485, 4832, 10846, 15258, 18074, 24274, 29223, 29153, 26730, 26922, 25000, 21246, 16402, 8598, 7031, 5106, -669, -5433, -6346, -7416, -9887, -8389, -7572, -2936, 3184, 6039, 10701, 13615, 12910, 16946, 22951, 21910, 21909, 20790, 16473, 13696, 8164, 5543, -872, -5528, -7913, -8789, -7058, -9480, -9316, -4812, -5417, -1238, 4831, 8936, 14723, 21111, 21707, 22079, 24061, 22027, 20419, 18168, 12963, 7288, 1112, -710, -3774, -8372, -9131, -11127, -14869, -13963, -8838, -4745, -181, 5404, 7969, 12527, 15687, 15732, 20680, 23107, 19861, 20067, 21396, 18148, 13440, 4739, -3171, -5165, -6193, -11142, -10859, -9371, -9043, -6616, -5617, -860, 5470, 11919, 17794, 21365, 21038, 23740, 23812, 23173, 23587, 21151, 11806, 7709, 5907, 2229, -2793, -6312, -9987, -14114, -11537, -6867, -6667, -8424]
3455h424O084K576N272L514J124M290L437K53K308j692l997k543l452m178l419
3440A153m667l102k912k575R1K441J817L192K219M378O569N813M323l49L087J692
3424B3170K94L66l055p860o294m831m267J61l996l628n60j765K36L128L391N593
3408H3P44L197P299K959J155K687j96M89R5k531m292n652k515l120m849l380p14
3391h541l294J970j61M38N751L688K251K666O571M432L481J043J192Q82l238k138
3375A6993n163m170k518m793l280l818k078k191o88K075Q57J425L956J543O647
3360D797L627O491M176k325J776P80m614k336j45p83k342n721n355l499o62k215
3344h350k084M44L535L071M123L433K334K445J684L598K196Q32M48j484j059n762
$$ y = [-8424, -2340, 236, 5508, 9022, 10146, 14436, 17873, 18126, 20434, 18742, 14745, 12202, 8750, 4572, 1153, -3514, -6616, -9528, -12103, -12012, -9571, -7754, -4562, -2343, 2035, 8604, 14417, 18740, 18391, 21478, 23170, 23464, 23830, 20775, 12915, 6621, 1790, -2477, -2316, -6312, -9940, -10500, -12265, -12029, -8901, -5510, 83, 827, 4024, 11323, 14282, 15437, 18124, 17928, 18417, 18512, 15981, 11689, 6037, 3522, 402, -4447, -7827, -8541, -11835, -9865, -10026, -9588, -3837, -149, 2102, 4768, 11339, 15771, 19252, 20295, 21487, 22369, 19131, 16993, 11830, 7660, 5142, 349, -2931, -6749, -8827, -11018, -11706, -9631, -8774, -7349, -3393, -1850, 4797, 8424, 14915, 19091, 16766, 18542, 19322, 14708, 12372, 12227, 11444, 9102, 3381, -1974, -5473, -6135, -8350, -10434, -9990, -6455, -3384, 739, 4172, 6506, 8951, 10635, 14233, 16429, 17261, 17709, 16225, 15166, 9404]
3328I404j761l620n577k020m590j503l08K17J656k366M25N173N179N56N975J201
3312H041L429K364j25J83j713j938O29o119n432n451n332m766O48J195j331m67
3296a6185J928O468L197L522K841M324N799J25k88J524Q26k413k620k287o754
3281GP32k866r185m231o94O45l69K492K198k32M770L544M014K042J553M858L556
3264A2834m581L644n24j236n422o893o89k929j749k125m372j236k886r4L856q34
3248a5236M170M288K553K313M886N837L908J061J627l455j745j675m401l716m320
3233c905n477o306j779J925r56l618M872L499K066M307M566L746N040J905L99
3218A0284R27K482j216k660l121l130p57j947l075m554l986l709j203k78J399
$$ y = [9404, 7643, 4023, -1554, -3574, -8164, -9667, -9975, -9758, -8102, -10468, -10043, -4870, 309, 865, 6840, 8041, 11470, 13834, 13709, 13892, 12179, 10241, 10870, 4751, -681, -6132, -11464, -16230, -15582, -14387, -15718, -16185, -14257, -7789, -4592, -1070, 1771, 6095, 11894, 12019, 11731, 13255, 14081, 11668, 9048, 6761, 7, 739, -2127, -11312, -15543, -16237, -15592, -15961, -13469, -11271, -11503, -6733, -3189, 825, 2867, 4420, 9278, 12834, 8253, 11897, 11373, 10137, 4715, -2178, -2867, -5796, -7545, -9670, -14042, -15278, -18164, -18258, -14402, -15236, -11066, -6778, -4225, -1912, 2974, 8811, 12719, 13780, 15407, 11952, 10207, 8532, 4131, 415, -3905, -9382, -15688, -17467, -15542, -16498, -20116, -15244, -11745, -9679, -5372, -806, 2940, 7980, 9885, 10284, 11211, 13693, 12477, 9817, 6696, 3566, 2809, 862, -2213, -6767, -10753, -14462, -15665, -15943, -14544]
3203a4544K675L448K690K072L473L427P26N998N288L561k943n217k305l398l092
3188A859o308l872m609L08o91K00r84k293L796L229M222J917M922L614J185N707
3172A2202l59j719J503q50l003m908l891n997k710j304n860O35k12J876k718K651
3156a4664M829J841M384N489Q068J182k230j7q24J99k4j347l654l013m856m534
3140i171l261j955q33o76k094o62L940L189L338L722L690J22L075N585L991j168
3124A0832n10k074k412k783m026n792m250q14j965j972j134j3M247L537N32J122
3108g475L972K642L676J124M96O412J428j755j171l108K532l571r899o034K94
3093a0437J955l755k490K107j332M371J750L911L829K147K152L681O311L787q28
$$ y = [-14544, -11869, -8421, -5731, -3659, -186, 3241, 3967, 9965, 15253, 18814, 15871, 10654, 8349, 4951, 1859, -4449, -8321, -12930, -12622, -13313, -13113, -14097, -16390, -12594, -9365, -5143, -3226, 1696, 5310, 6495, 12202, 11843, 10124, 11627, 10777, 7774, 2866, -1025, -7022, -9732, -11036, -16896, -16261, -16473, -14597, -17315, -14664, -9835, -7994, -3610, 1879, 9947, 11129, 8899, 8882, 8058, 8257, 8233, 6886, 3232, 219, -4637, -9171, -12432, -14387, -15220, -15896, -17990, -18652, -14712, -11523, -8185, -4463, -773, -651, 2424, 8009, 12000, 10832, 10322, 8248, 5836, 3053, -973, -6765, -11015, -11829, -13794, -15766, -16900, -16913, -12666, -9129, -8597, -7475, -3503, -861, 2815, 3939, 4435, 10847, 12275, 10520, 9349, 6241, 8773, 5202, -4697, -10731, -10437, -8482, -12237, -14727, -12620, -13952, -9581, -7831, -3920, -91, 2056, 4208, 7889, 14200, 17987, 17159]
3078A7159j088k958o237m381j448l487m612n86j697m017p0J346j167J062K165
3063a0016O284K919K472J376M313N033k419n46P93Q55k863m093l916k267j868
3048c943m191k938j066k599J206K495m24K832N291J537J786M274L674K179j499
3033H614J365j480j436k068j813k919j993o025n924j263j394q76J361j43L030
3018a2964K966L081L427m80L924M079K660J657Q95j275k306K0j026m278m968j983
3002f571m748j448k342M68l01n75lN654M268J286M486O230k10L076K128O3l802
2985G659m111K520j457m917l856j033l168j390k240j430J190r0J022J124L765
2970f412N888N63L783M131J12Q03N43j655k036K748j31p441k101k573J386j715
$$ y = [17159, 16071, 13113, 6876, 2495, 1047, -2440, -7052, -7638, -9335, -13352, -13422, -12076, -13243, -12181, -10016, -3732, -813, 1659, 3035, 7348, 12381, 9962, 9416, 10209, 11064, 8201, 4108, 192, -2075, -3943, -8134, -11072, -12138, -14737, -13531, -11036, -11460, -8628, -3337, -1800, -14, 4260, 7934, 10113, 8614, 9979, 8499, 7063, 4995, 3182, 263, -1730, -7755, -13679, -14942, -16336, -17212, -15851, -15994, -12964, -9998, -6917, -3490, -3970, -46, 4033, 6693, 8350, 9245, 7970, 5664, 5684, 4658, 380, -4588, -6571, -11319, -12767, -15109, -14641, -14942, -15517, -15520, -9866, -5598, -4312, 174, 6404, 6194, 9270, 11398, 11461, 7659, 3548, 6068, 4611, -306, -4162, -5195, -8363, -9753, -11993, -13423, -12233, -12323, -11301, -10177, -6412, -524, 39, 3822, 7953, 8065, 8868, 9411, 7756, 5720, 8468, 8337, 896, -1205, -3778, -2392, -4107]
2954d107n988k124J706j585M37L198K874L771K879R85M489L122Q52l10J694k995
2938H898l056k937l077k904n034j347m78k949j532K755n77K589L840p6K629K644
2922f12K622N038j404J345N40R28j996m019m10j021J23m394n065n042k656L8J730
2905a4255K044m48K974K048M275N920K363j983j255N629J704j719K056j601k225
2890E527k426o994l072k882j121l027j310J20K115K812q86J318M607L832J827
2875D40K129K079j318k80J497J123l22n586l980k941k978j671k286k031k301J065
2859a7361Q32j304K024M848K961M680L320J671K751l64R18J026l294o908p07j349
2843f256L44j991k500j768l276j377p07Q91M955O79J483J644O389J673J607L936
$$ y = [-4107, -10095, -12219, -10513, -12098, -11661, -8463, -5589, -1818, 1061, 2046, 6535, 9657, 10509, 10199, 11893, 8898, 5842, 2905, -172, -3076, -8110, -9457, -9935, -12884, -14416, -11661, -12238, -9649, -5809, -5885, -3256, -612, 2010, 7048, 5644, 6989, 7529, 8457, 6461, 2442, 2032, 1011, 1134, -3260, -8325, -13367, -16023, -15985, -14255, -12211, -12659, -9685, -7637, -3362, 2558, 4921, 2938, 1683, 7312, 9016, 7297, 9353, 7752, 5527, 3101, -3893, -6965, -9847, -10968, -13995, -15305, -15185, -13070, -10258, -11144, -9826, -5219, -1387, 440, 2569, 4648, 3330, 3050, 4547, 5670, 5348, -238, -4218, -7159, -10137, -11808, -14094, -16125, -18426, -17361, -16529, -17833, -15809, -10961, -8000, -3320, 0, 1671, 4422, 4058, 4976, 6002, 2708, -4200, -4907, -6256, -5912, -7903, -10403, -12171, -15447, -16824, -17531, -16640, -11685, -11006, -9523, -7879, -1490, 183, 1790, 5726]
2827E726K17Q98k9N65l581k483j984j923m429k361L20r60q13J025k499L267j994
2810a1038J721M751M999K102j939L746L197M508k560n753r85l295m395k862j913
2795i716l937j481J67l152J51J429k838N327R91L739M995L981K192N49K237o04
2779D030o24k473j004j343j252j983m792l813K943k162r25Q69K015j063K516j154
2763a0215M259M473Q16L481J632K498K569l454j150O3k300l898m670m238l589
2748a3723J760p78k794k860L151K794J155M054L769L500K096j442M580L664j056
2733G870m7J524j475m975l586p94l021l469j641l039n70N16J218j32L231P91j422
2716i021M528P024L005Q36L96K431K356n354k217l043m879k271j823m059l341
$$ y = [5726, 5943, 6841, 6812, 7377, 3796, 1313, -671, -2594, -7023, -9384, -9064, -10024, -10837, -9812, -12311, -9044, -11038, -9317, -4566, 433, 2535, 596, 4342, 7539, 12047, 9487, 3734, 2749, -546, -4941, -7803, -9716, -13653, -15134, -14967, -18119, -17968, -16539, -19377, -14050, -13059, -9320, -4325, -344, 1848, 2397, 4634, 4030, 3406, 933, -71, -1414, -2666, -4649, -9441, -13254, -10311, -12473, -13398, -12529, -10514, -11577, -9061, -10215, -5956, -1483, -667, 2814, 4446, 6944, 9513, 6059, 4909, 4972, 2672, -1226, -5896, -10134, -13723, -11963, -12741, -15535, -18395, -15244, -12450, -11295, -7241, -3472, 28, 2124, 682, 5262, 8926, 7870, 7823, 9347, 7872, 2897, -689, -1483, -4504, -7973, -9614, -12653, -13223, -12707, -11489, -11621, -8390, -7599, -9021, -4493, 2531, 5536, 6372, 6768, 9199, 11555, 6201, 3984, 941, -3938, -6209, -8032, -12091, -15432]
2701a5432Q43j268k057m50R22K366L997J403N078K589L108L325L871L91J794J261
2685A1741m185N30m081n439n095j563J69l382l390o03j23j398M153L141J926N549
2669b050L059J196j007K465K466Q08q98k62j427o072k899l354l435n32k028j923
2653a5893j619M71J350N931K468N980r33j07M118K887K594j960l912r43J784r11
2637A305k796n377l111j398k175k982J26l99O88l19J949L495L823M417N111R84
2621C341M549K08k316K742k17n03l364l051n118j627l341p61j783j114k401j310
2605a6066M397K796K977J141M662J069N99M027N410r07J216k913k067k815j352
2590B174l146m961k494k118o73r63q97o26J90K450K730L836K974M169J180j60
$$ y = [-15432, -14589, -15857, -17914, -18364, -17442, -15076, -11079, -9676, -4598, -2009, 1099, 4424, 8295, 8686, 10480, 11741, 7556, 8086, 4005, -1434, -6529, -8092, -7923, -11305, -14695, -15298, -15421, -16819, -12666, -9525, -7599, -2050, 1009, 2205, 1198, 3663, 6129, 6937, 6039, 5777, 4350, -1722, -4621, -7975, -11410, -11942, -13970, -15893, -17512, -17041, -15691, -9760, -7292, -1312, -2245, -2352, 1766, 4653, 7247, 5287, 1375, 432, 2216, 1305, -1491, -6868, -9979, -11377, -13552, -16534, -16408, -16807, -16119, -16438, -14489, -10994, -7171, -2754, 2357, 3341, 7890, 8098, 5782, 8524, 8307, 7804, 4440, 1389, -3729, -5356, -8697, -9458, -11241, -12355, -14756, -16066, -11669, -8873, -5896, -4755, -93, 976, 1575, 5602, 11012, 10105, 11321, 8408, 6341, 3526, 2174, -972, -5933, -8427, -10545, -11218, -12181, -13078, -13704, -13514, -11064, -8334, -4498, -1524, 2645, 3825, 3665]
2574C665L290K204O57l459j272k163j764k012l310m900o98m654n31j871K26L284
2558a3308L524K491J192O06N554M907L777j667k163K06j020j12l839n489K244
2543c097r22k481k40k034j562Nm36k163p1L554K514K04M542L468L662J361Q95
2526G199k99K826j790k402k125j635l342m548l931l624k210Q39m48P8L239K960
2510i213M812M131N93k40K214N810Q27m98n18k281N90n020n251j838j69q69M83
2493f437l662k786P7K228J171j286N542M894J590K741K816l41k576J266P10R14
2477F861k597j954kl541j491l252j928k227J50J617J084j569J079J472K723M43
2461c132K638M69L521K220J567k643Q83j077J60m44l589k489l347l496n3R94J047
$$ y = [3665, 6955, 9159, 9816, 6357, 5085, 2922, 1158, -854, -4164, -9064, -9762, -14416, -14947, -16818, -16592, -13308, -9784, -7293, -6101, -5495, 59, 4966, 8743, 7076, 4913, 5119, 4099, 3987, 148, -5341, -3097, -4019, -6500, -6740, -8774, -10336, -10331, -10767, -12930, -13001, -9447, -6933, -6729, -2187, 1281, 4943, 6304, 7199, 6900, 9726, 7936, 5534, 3409, 1774, -1568, -6116, -10047, -13671, -15881, -15042, -15490, -15412, -12173, -9213, -4401, -270, 323, 83, 2297, 8107, 8934, 8436, 7918, 5637, 6227, 1207, -4044, -5882, -6051, -6920, -6437, -10099, -12885, -12808, -10580, -9409, -10695, -5153, -259, 1331, 4072, 6888, 6547, 3971, 5237, 5947, 6861, 4264, 2310, 2308, -1233, -2724, -5976, -7904, -10131, -9981, -8364, -7280, -8849, -7770, -6298, -3575, -3132, -494, -25, 3496, 5716, 7283, 4640, 5523, 4446, 4606, 4162, 573, -1916, -5263, -8759, -8812, -7818, -6771]
2444f771j597q63L835L618J742K109l14N92K951N022j024r23j65m157K32k897
2428A390l209n870j250j452J89R90J670K66K188N02K664J683J708J694j354K364
2412D173M110m56j718j756L008j370l170n482k564n460q62j628j988K652K470
2397a0041K759k22o20M349L591R29m81J016N757K810m267l061j993o5j766q71
2381b176m333k527r05R97O34j894j271k13L145M393K149J521k41N005K45O46M902
2364A0077k266k914j111q45l363j477m219l751m280N56K73J697J489J802J039
2349g293K002P57L120O34L539L062j166j070K714k27m952L87j815k729j233j696
2333e966l63l14k511j849J214K48R07L210K183n9M767K009L650J314p65N58N36
$$ y = [-6771, -8368, -9231, -5396, -1778, -36, 2073, 1759, 2351, 5302, 10324, 9300, 8377, 8212, 4055, 4287, 1390, -1819, -7689, -8939, -10391, -10202, -9212, -7542, -7276, -5088, -4586, -1922, -239, 1469, 3163, 1809, 4173, 8283, 7827, 6109, 4353, 7361, 5991, 2821, -2661, -5225, -10685, -11547, -13175, -15163, -12511, -10041, -7282, -7504, -8124, -3775, -184, 745, 264, 1280, 7037, 9847, 5580, 2519, 526, 461, -1305, -2176, -6509, -9036, -9941, -8944, -8310, -10204, -11475, -11688, -8543, -4150, -2001, -480, -721, 4284, 4529, 5175, 10077, 7811, 4897, 3786, 2941, -422, -1899, -6118, -9869, -14149, -13593, -13320, -11623, -10134, -8332, -7293, -5291, -4534, -1414, -780, 2759, 5821, 4655, 3585, 6299, 6072, 1120, 1507, -308, -3037, -4270, -5966, -6329, -6643, -9154, -11003, -9789, -9541, -8634, -5424, -3241, -3300, 1467, 3476, 7126, 8440, 7675, 8233, 8769]
2316H769k321k087l347k875l818l099L05l871J378n71R36Q08J934J50K907O41
2300d161N196L987k76K463K82L16k74k822j686j579l605k898l739J486k285k648
2284a2243j153j447K431L612L361J400K659M258k38J459L774j80l284J658m020
2269B047k328m85j358m59q20k721k928P93j24j545P71J537O661M783J327m712
2253D39k75L648O94j69K65J500O61k473j561k400l421l877o200L411J409l318
2237a1667M20M168M455q02k201K424K262J520J202L012j4O13K01l843p90j80k140
2220a360n73j905k151k373J070o38j598O60L930L353J066M122J261K356J689l937
2204D972k029o3j454j638K86j503m000j538k496l01J572O54L67j913j618M817
$$ y = [8769, 6448, 4361, 1014, -1861, -5679, -8778, -8473, -12344, -10966, -11537, -10601, -9793, -7859, -7709, -4802, -4161, 1035, 5022, 4746, 7209, 7491, 7807, 7533, 4711, 3025, 1446, -2159, -5057, -8796, -7310, -9595, -12243, -13396, -14843, -12412, -8800, -5439, -4039, -1380, 2878, 2640, 4099, 7873, 7693, 4409, 6067, 2047, -281, -766, -2124, -2583, -3403, -6124, -9052, -8259, -8383, -9928, -9157, -7620, -959, 3824, 5151, 439, 164, 3812, 4506, 4337, 4602, 6102, 6763, 4290, 2729, 329, -3092, -6969, -13169, -9758, -8349, -11667, -11247, -7079, -2624, -3426, -5627, -3203, -941, 579, 1781, 4793, 4779, 5392, 5593, 1750, 960, 780, -1360, -1933, -3838, -5989, -8362, -7292, -7930, -9528, -8868, -4938, -1585, -519, 3603, 4864, 7220, 8909, 4972, 2943, 2880, 1426, -212, 74, -1429, -5429, -6967, -9463, -9764, -8192, -7538, -7171, -9084, -10702, -5885]
2188e885O99K488N539l207J112K557J186L136o21O63j915r14n91m353j189l86
2172a681k506l032j731l517K788J953K642j498K98L565L85K148M892J330L69j866
2156D539K80k015r82m450j177k16l422j638k900M8j859j73L964L542M97K325L648
2139A1J43J611K952L379J292l066m356L426k65m383K82k455m377n80N11K25k744
2122h394l02P14P28K965L233K010L435K174j646j387J108L935L45j437k086m003
2106A392k124j577k649j989k680j67o3j09J83L340K056L539Q27p62K976J132k027
2089A298J424J112j055j020k8j783k925k747j676M96j948l030j033P06J626O1
2073a0522K841K304L150M66M564J372L06Q64j63j085q27q6m818k667K03k352k61
$$ y = [-5885, -5186, -2698, 2841, -366, 746, 3303, 4489, 7625, 7004, 7667, 5752, 4838, 4247, -106, -1295, -1681, -4187, -7219, -8950, -12467, -9679, -7726, -5084, -6582, -6284, -2719, -2334, -186, 4706, 6036, 6405, 4539, 4819, 2804, 1822, -2628, -3805, -4021, -7443, -9081, -11981, -11933, -13792, -13965, -10001, -6459, -5962, -3637, 11, 154, 1765, 4717, 8096, 9388, 6322, 1966, 5392, 5127, 744, 1026, -1429, -5806, -6386, -5875, -5650, -8394, -8696, -7982, -7254, -4289, -1056, 954, 4389, 6563, 4917, 3530, 4638, 8573, 8918, 7481, 5395, 1392, -732, -2309, -4958, -6947, -9627, -9794, -9857, -9966, -9783, -6443, -4387, -848, -21, -783, 2193, 3325, 1298, 2722, 3834, 2779, 1759, 1731, -52, -2977, -5724, -7400, -6904, -8852, -11882, -12915, -12209, -10583, -10522, -7681, -5377, -2227, -1761, 2803, 4175, 4481, 5345, 5182, 4097, 3270, 3184, -1634, -4301, -4098, -6450, -6711]
2056f711j668O83J178n34k490K784J392K866L772J887J2n12L56J870J492J074
2040G451j36j214m373l579j012L30l281k190m85m42k256j174r45N718P87J907
2024d894O462J268K418K251m68l76K327o693K00M14k580n378j830k033R8M28k654
2007a1040O56K036J825o43R97M302L72R67J159M570NQ42r52r50k963j52l81l969
1989c319K74l052j476j907k857M951j094q15L877K806J106L180K794l65k46K402
1973F259P28J59J1j976k768k042k586l274k096l26J58Q46j405L70L759r53K077
1956c059J921K584L476k186K215J188J505J456J132n920m371O66J3p51n17j556
1940b204k842r19J358J93q73J483j639L331M437Q49L587O1k276J936J78l114J98
$$ y = [-6711, -8379, -7696, -6518, -7052, -9542, -6758, -5366, -2500, 1272, 3159, 3171, 2659, 3015, 4885, 6377, 7451, 7315, 6101, 1728, -1851, -2863, -2533, -5814, -8004, -8489, -8931, -11187, -12361, -13306, -7588, -6801, -4894, 1568, 2836, 5254, 7505, 7037, 6661, 8988, 2295, 2495, 2909, 329, -5049, -6879, -8912, -8814, -8386, -11040, -10384, -8348, -6523, -7166, -6169, -1867, -1495, -528, 631, 5201, 5206, 6048, 5096, 4146, 1183, 1031, 650, -3319, -3045, -6097, -7573, -9480, -12337, -7386, -8480, -9295, -5418, -2612, -1506, 1674, 4468, 4103, 3857, 6259, 6987, 7146, 7157, 5181, 2413, 371, -2215, -5489, -7585, -7911, -7753, -6907, -8312, -7942, -4183, -5136, -3059, -1138, 1446, 4922, 2736, 4951, 6139, 7644, 9100, 10232, 4312, -59, 607, 620, -131, -648, -2204, -5046, -5965, -4607, -4414, -5287, -3804, -5443, -2112, 2325, 3174, 6761, 6822, 4546, 6482, 6660, 3546, 3744]
1923C744p82k689l898k177R37l309k72l16j260j91L095J172L82J181J65P001L061
1906E844j131P99K587k661j517j043j624l77j850k983k846J224q14q2j820j624
1890i918j138M558M098J956l52J779J9m77K707L96r92j641k34K94k403k677j622
1873e647r58l719p25j640L236P66O70q01K505L873K307M374k95J592J382l620
1857C300K101m73k433o38k771j286l238j371Q19j124N55k144r14J575O90K977
1841d375J226L057L319l92Q58L07K579K489k549l08l227l006N52k461k373p07
1825e011m418m90K673j199n77L485K40L402Q37L047K077l142R97J236L685j580
1809E262l550j465q24Q8m239l61k324N25p52q66k82J888K995r32K373J950L001
$$ y = [3744, 2962, 273, -3625, -5802, -4865, -8174, -8446, -8762, -10022, -10213, -7118, -5946, -5564, -4383, -4218, 2783, 5844, 4713, 5512, 8099, 5438, 3921, 2878, 1254, 877, -973, -3956, -6802, -5578, -6392, -6474, -8294, -9918, -11056, -6498, -2400, -444, -796, 983, 1002, 525, 3232, 3628, 2636, 995, 761, 1055, -1348, -4025, -5647, -6605, -10324, -11049, -12689, -9453, -8687, -8017, -8818, -6313, -2440, -133, 4241, 3946, 5538, 6920, 3300, 5401, 4928, 2495, 1857, -914, -2200, -5438, -6809, -5990, -7114, -6559, -8703, -9617, -8042, -7352, -4375, -3149, -92, 3227, 2835, 3693, 4000, 6579, 9068, 6519, 6211, 2984, -22, 530, -1931, -4304, -5011, -9429, -9919, -7246, -8445, -9022, -5537, -5297, -1895, -1058, 1989, 4066, 924, 1921, 3157, 6842, 5262, 1712, 247, -577, -489, -4728, -5089, -7413, -6888, -7640, -8506, -8788, -6900, -3905, -4837, -2464, -514, 2487]
1792B487O78L525M88j753m93K515m828l171Q35N38l796m084j515j285K483M54
1776f922O49Q84K17j15L105k78L115L797k213Q93j906Q70P02k827K279R81m920
1759a689n287J051q17Q50k011J126J443L097M07K164j689j85K415K361J570J025
1743E831l8k703k523k00K771Q62p187k644P10j802o28K417l37m618J721o28J755
1726g241k15N181M268J807O66J346N03r5j526j711j974j700l77L67m070j356k203
1709h330j861J150K84L941J768J517P06l42K698K461J391M10k441J220k150o50
1693A772Q76j711j636J49j102k597j600J369o03J26r52K433j347R03J767L175
1677A022L008Q52q3j228K616J763K83m419l412j75m584k998j144n57m49J143r72
$$ y = [2487, 3165, 6690, 7178, 5425, 4932, 7447, 2619, -552, 283, 821, -2975, -7059, -8574, -9859, -7376, -6922, -6273, -5389, -5172, -5287, -2182, -2460, 655, 4452, 2239, 3132, 1226, 2096, 2798, -29, 2250, 3231, -1689, -6976, -5925, -6742, -5892, -7903, -6777, -5334, -2237, -1830, 334, -1355, -1540, 875, 3236, 4806, 5831, 5793, 3090, 567, 367, 3138, 4000, -3187, -5831, -5121, -6923, -7551, -5134, -5471, -10089, -8368, -8996, -7241, -7456, -2275, 1993, 3800, 4466, 5812, 6315, 6220, 4694, 2983, 1009, -691, -1068, -701, -4771, -6127, -8330, -10191, -9041, -8757, -4816, -3048, -1531, -825, -1167, 1531, 3992, 5383, 5793, 3352, 4572, 2422, 1772, 2648, 937, -699, -550, -1652, -4249, -5849, -4480, -5083, -4957, -5909, -3476, -4823, -3920, -2153, 1022, 4030, 4882, 4799, 3571, 6187, 7950, 8233, 3814, 402, 227, -4357, -7355, -8499, -9056, -9505, -8362, -9334]
1660i334K702Pk8M758J065J605J255R12q61j806j249K278k897k142l864J72l64
1643g791N314m076J584N68L394Q66m286r70j029j485j787J891j620j078Q37J155
1627h513K858O275K834J109j27L384p92Q16J124n292o495m172k006r65R91n84
1611i555k363J069K849N832M206J559M521Q77r06k100k399k252m599m684n81j870
1595a0396N8J17J868l44m69L793L378j8J204K844K002K10k38m13J754J186k340
1578D196k762k690J244j613j312o74j374l018p21k20J101Q89K470K488K455M283
1562D742j241O61K283n4n68K12p53k651l289j714K155N59r30j928j881J341n81
1545c637l650Q89K918J577K223J098j059K734J689K989j825K230m808l70j876
$$ y = [-9334, -6632, -6625, -6653, -1895, -830, 775, 2030, 2942, 2081, 275, -974, 1304, -1593, -3735, -7599, -7427, -7791, -2477, -6553, -4969, -4401, -1007, -141, -4427, -5397, -6426, -7911, -9698, -7807, -9427, -10505, -9668, -8513, -5655, 620, 3454, 4563, 4436, 7820, 7028, 7844, 8968, 3676, -2819, -6991, -8997, -9962, -8971, -9555, -11918, -10849, -8000, -2168, 2038, 3597, 8118, 8995, 8089, 5989, 3590, 1338, -3261, -7945, -8526, -10396, -10338, -10221, -8353, -8697, -9166, -5373, -1995, -2013, -809, 2035, 4037, 4247, 4009, 3596, 5350, 6536, 4196, 1434, -1256, -12, -1625, -2937, -3611, -4985, -8003, -8724, -8944, -7843, -6954, -4484, -1996, 459, 4742, 3501, 4162, 6445, 6391, 5823, 6035, 5282, 2631, -658, -2372, -217, 342, -588, -2516, -4397, -3056, -3637, -7287, -6398, -3480, -1903, 320, 1418, 359, 3093, 4782, 7771, 5946, 8176, 3368, 2998, 1122]
1530A122l271J208k277l872p41k17K59q79K701L89q91M211J7L854J734O62J332
1513E341K34Q53l85j237J938k544k024k530l15m693j351J900R84j988o52k267
1497h736N480J731O88L561P8M537J209l287J515K401l528k068k778j838k92j617
1481b944l737j31q24J364k438n45L147K213r74M130J322J112J675n23J717l16
1465D248K752J133k763m305k490k325J09p9l734j870J316p55K867R76J748K793
1449c79j593J96J98L969J863K366r83Q60l39j210Q20k174m116k457j180o16r9
1432d874m110L735P45K148K86l86J362K040L567J86j296J367M45K149j355j900
1416D109j875m842P79J779k698k622k634J009o33j746K905K347P49j424K817M092
$$ y = [1122, -2149, -941, -3218, -7090, -7831, -8048, -7789, -8668, -5967, -5578, -6469, -2258, -2241, 1613, 3347, 4009, 5341, 5575, 6428, 6043, 4806, 6744, 4200, 2176, -354, -669, -5362, -6713, -4813, -3829, -5817, -6469, -8736, -3256, -1525, -837, 2724, 2802, 7339, 8548, 5261, 6776, 9177, 5649, 3581, 803, -1035, -1327, -2944, -6681, -6812, -7636, -6272, -8710, -9255, -6108, -3895, -4869, -739, 583, 1695, 3370, 2847, 4564, 4248, 7000, 8133, 5370, 1065, -1425, -3750, -3641, -3720, -7454, -9324, -8008, -8763, -5896, -4920, -3172, -379, -1972, -1776, -1578, 2391, 4254, 6620, 5637, 6497, 6158, 4948, 5768, 3594, -522, -2979, -4159, -4775, -4874, -8984, -5249, -4504, -2356, -2070, -2456, -1094, 946, 4513, 4699, 3403, 4770, 5215, 7364, 6009, 4109, 2234, -2608, -1829, -50, -2748, -5370, -8004, -6995, -7628, -9374, -6469, -4122, -3373, -4797, -1980, 2112]
1400B112k058j574L687K835J001l332k243j213k54o16k151k742k090k364J653
1385i349M039r85k09K974J100R48K102K201P52J411k85j02J761j78j485j414q49
1368B432n18j46j750j060q84l435qk354J301J767K28L529K264N733J681q2Mm145
1350D557L854J429n812k737Q07k06l718J136l778k944j056j32N351P75j168K538
1334a104J825J537K004J677J227l12k220J35j042o95n86k01j465l776j262J28
1318d130k202P18K398O97j166l02K403N35N09M457J593K005J185j341l59n33k250
1301D217l254k181K936j553J50l070k468L368j416j455K701j610n30N005L132
1286C972q8J687Q60M23N18r88J931J08j353k242p55n556k643P8K31J3j180k22
$$ y = [2112, 54, -1520, 2167, 5002, 6003, 2671, 428, -785, -1039, -1655, -3806, -6548, -8638, -11002, -9349, -5310, -6295, -6504, -3530, -2430, -1482, 620, 2821, 3573, 4984, 4699, 4597, 6358, 6180, 4695, 3281, 2432, 1914, 1768, 18, -1042, -1926, -5361, -5369, -7723, -6422, -4655, -4427, -898, 1366, 7099, 8780, 8698, 8702, 4557, 8411, 9840, 4028, 1291, 2098, 1892, -1826, -690, -4468, -7412, -8468, -8600, -3249, -2474, -3642, -1104, 721, 2258, 4262, 5939, 7166, 6854, 4634, 4769, 3727, 3032, 2446, 2245, 780, -2996, -4258, -4130, -6332, -5614, -3216, -2519, -3685, -3987, -1584, -1049, -540, 3917, 5510, 7515, 8700, 7359, 7000, 6467, 4217, 963, -1218, 1718, 165, 315, -2755, -5223, -1855, -3271, -4726, -2025, -3635, -4165, 840, 3972, 3884, 5571, 6431, 6854, 7372, 6384, 8315, 8423, 7070, 4828, 4073, -1483, -4126, -4048, -3817, -3804, -4984, -5206]
1268e206J703J346j545J657M648k08L239J478l82l56k270j295K887j154q92m979
1252a329j334q34K183K452j911k636p93Q66K307J788N12O58K178P21J834L615
1236A0277L231m477o51j274N26k415k836j299J58k994k859K390N3K373j168J632
1220F67K43K199K94J262q38j858M455J800m44j09N44j552l697k553k138M072j929
1203D18O67j593k209o49N97P85K165J443L390K116q20l90p65J671J986k068M55
1186G199R1k810k95k715l426K42q17j627J710N0J853P62J581K493j113K986J509
1169G673m0K31K941N27j931l171j350j06q96n35j215k260j672J253p84Lj299J397
1151a234M229j00n18K314J053L180l08k13o52K259j9m350m550m498K629k4l982
$$ y = [-5206, -3503, -2157, -3702, -2045, 2603, 2395, 5634, 7112, 6730, 6374, 4104, 2809, 5696, 4542, 3650, -1329, -2663, -3497, -1314, 1138, -773, -3409, -4202, -3336, -1029, 759, 1271, 1929, 4107, 4828, 6662, 10277, 13508, 9031, 8380, 7106, 7632, 5217, 2381, 1082, 1240, -1754, -4613, -2223, -2170, 203, -965, 667, 910, 3109, 3403, 4665, 3827, 1969, 6424, 8224, 7780, 7671, 8215, 6663, 2966, 413, -1725, 2347, 418, 1085, -508, -2717, -3366, -2769, -1984, 181, 1624, 5014, 7130, 6310, 5920, 5155, 6826, 8812, 6744, 7199, 7290, 4480, 4185, 1470, -1956, -1714, -2531, -4158, -2448, -2398, -545, 217, 1798, 4291, 3178, 6164, 7673, 7633, 7864, 10805, 11332, 9401, 6230, 4880, 4774, 3878, 3343, 2128, -132, -1804, -551, -1335, -1332, -2631, -1234, 2995, 2895, 2377, 4691, 5744, 8924, 8616, 8403, 7751, 10010, 9991, 5641, 1091, -3407, -778, -802, -4784]
1134d784k831K053j471R10J54M357N0J347J161j31L620J42J850N76j70K2j164
1117E691k700j122j170j938k686q31O02R76o63k139K510k74J660N61L024J617
1101C118j280L070P11j750M849J282l454j313j326P63n187j345l819j153K804
1086d030m3Q61j182j25J035K625L507L420J742j682K29K400l03m206M02K374j570
1069E454m457k286R4j485j682o69Q28J738p21j756N14L672K369R72K518L280K857
1052A1240j531j384j037k221j980k933n41O70m14k713J538M23j254j931K978J381
1036B91J098k102o15M392L183n38P1j125K693r96k205L0K829p20l308l813m1j369
1018b245n71k867j06K311j31K184J74K329K764K994j383J552q69j445J293K73
$$ y = [-4784, -7615, -5562, -7033, -6123, -5969, -1612, -1562, -215, 946, 815, 4435, 4577, 6427, 7003, 6833, 6855, 5691, 2991, 1869, 699, -1239, -3925, -4756, -4154, -3178, -3841, -5980, -3470, -3744, -2084, -1523, 1501, 3118, 1838, 4908, 5619, 3869, 8718, 10000, 6546, 5233, 3907, 4670, -517, -1862, -5681, -6834, -4030, -4073, -3212, -4394, -4519, -3484, -859, 2648, 6068, 7810, 6128, 6357, 8757, 8454, 4248, 4650, 7024, 5454, 997, -1289, -1195, -2680, -4362, -5031, -4203, -2465, -3186, -4942, -4428, -756, 1613, 2585, 5103, 8383, 11240, 9709, 8325, 7288, 5067, 3087, 154, -387, 283, -131, -2844, -1306, -883, -2137, -4068, -1090, 291, 1389, -713, -1328, 3064, 6247, 5709, 5780, 4655, 7348, 6352, 4147, 4177, 7006, 6286, 2978, -835, -876, -2245, -2816, -5683, -5789, -3478, -3609, -1425, -1251, 1078, 3842, 6836, 5453, 7005, 6136, 4691, 5984, 6257]
1002F257O93k964M77k466m546K12J77r34k262K021J634M02O59O43J525J906L295
985F729J727L31N80m385j108R44K449j389n579k021L259l87k532M83Q8k63r55
968b029J293N676N0J165J050J88N42q85P83M67j675j822l394J229p06m723k611
951e402K812O96k070q55j914l98J657K044L074K287K72N21M024K098K29k499J610
934H186l245o79j1j952o77j741m495j154j615R25J253L542M203q65j833o95J489
917F36L93K184L050J264M50j182j016k00k782k639k335J084r56O67j620j334j7
900d353n83L521J806L045k191J588N766K001k448j865P74j301K497k687l771j616
884A83J607m79m87l079j375j895J137J555K193Q79O14j849P00K145L202J290r0
$$ y = [6257, 6950, 3986, 4463, 1997, -2549, -2337, -2160, -3094, -5356, -3335, -1701, -1299, -640, 3, 1528, 3434, 6729, 8456, 8787, 9367, 4982, 3874, 4818, 7267, 5878, 299, -1722, 1537, 1150, -1382, -899, -811, -1074, -2029, -736, 4940, 4990, 6155, 7205, 7393, 7935, 7050, 7833, 8300, 6625, 4803, 1409, 2638, 1932, -2791, -5402, -2590, -1894, -3964, -4819, -6733, -7131, -5474, -3430, -356, 1931, 2203, 2724, 6748, 8846, 9075, 6576, 8186, 4941, 4262, 4251, 2299, 1622, -119, -4614, -5768, -7383, -6458, -5205, -1663, 2540, 1675, -158, -853, 636, 1029, 3213, 6263, 7527, 7977, 6795, 5779, 5579, 2797, 158, -2177, -1093, -2049, -1382, -3002, -4336, -4353, -4936, -1415, 391, 3436, 1245, 2833, 8599, 10600, 8152, 6287, 7061, 5760, 8257, 5570, 1799, 183, 1790, 1311, 824, -2255, -3630, -5525, -4388, -2833, -640, 239, 853, -996, -296, 1849, 5051, 6341, 6251]
867F251K937j382p07j266q44P15n687n834K48J737J02L76K029l94o71M848j78
850B280R13P90J543n89J06M385l939k018J96r81q4J126j804k029R34k651J902
833H0j593k119k050J279M500P78J828K501k679J8M381J099k20o40j427q1k946
816B709k475k517l6m22J195p91r19L60j375L042j817r69J235J034L433P13K643
799E043L266j084j20k670J290l152J132K483k834k826j177n28rm158j914M37L539
782c282j761L41L905J475p29L970Q6p32j414K324K516j980k33j561o80l033l095
$$ y = [6251, 9188, 7806, 7099, 5833, 4989, 5704, 17, -5817, -5569, -3832, -3730, -3354, -1325, -1719, -2390, 2458, 2280, 3193, 3983, 5526, 4937, 5043, 9428, 5489, 3471, 3667, 2686, 2602, 3728, 1924, -105, 829, -1822, 80, -1513, -3632, -5682, -4403, 97, 875, 2703, 5204, 2525, 2543, 6924, 8023, 7803, 7163, 5736, 5655, 2709, 234, -2283, -2319, -2741, -1546, -2337, -3256, -2896, -4271, -1229, -3046, -4015, -2780, -1746, 1687, 2400, 5043, 8309, 7225, 7105, 4435, 5725, 2573, 3705, 6188, 3354, 528, -649, -1177, -1186, -5344, -7258, -6821, -3282, -5043, -4702, -797, 678, -51, 3919, 4005, 3273, 1859, 4183, 6699, 4719, 4486, 2925, 2245, -788, -3883]
$$ [...]
##END NTUPLES=NMR SPECTRUM
##END=
