##TITLE=1H_CA-9256-6A
 
 8 sc, 
 1.4.2024
##JCAMPDX= 6.0         $$ Bruker NMR JCAMP-DX V2.0
##DATA TYPE= NMR SPECTRUM
##DATA CLASS= NTUPLES
##ORIGIN= UXNMR, Bruker Analytische Messtechnik GmbH
##OWNER= root
$$ XWIN-NMR		Version 3.5
$$ Mon Apr  1 15:47:23 2024 Russian Standard Time (UT+4h)  she@DPX200
##.OBSERVE FREQUENCY= 200.1312
##.OBSERVE NUCLEUS= ^1H
##.ACQUISITION MODE= SIMULTANEOUS
##.ACQUISITION SCHEME= undefined
##.AVERAGES= 8
##.DIGITISER RES= 18
##SPECTROMETER/DATA SYSTEM= spect
##.PULSE SEQUENCE= zg30
##.SOLVENT NAME= D2O
##.SHIFT REFERENCE= (INTERNAL, D2O, 0, 17.0724)
##AUDIT TRAIL= $$ (NUMBER, WHEN, WHO, WHERE, WHAT)
$$ ##TITLE= Audit trail, XWIN-NMR		Version 3.5
$$ ##JCAMPDX= 5.01
$$ ##ORIGIN= Bruker BioSpin GmbH
$$ ##OWNER= she
$$ F:/spectra/data/she/nmr/H-F/1/pdata/1/auditp.txt
$$ ##AUDIT TRAIL=  $$ (NUMBER, WHEN, WHO, WHERE, WHAT)
(   1,<2024-04-01 15:46:17.56 +0400>,<she>,<DPX200>,
      <created by zg, POWCHK disabled, PULCHK disabled
       configuration hash MD5:
       00 E9 B6 7A A2 85 ED C7 34 08 36 98 17 FE 4E 26
       data hash MD5: 16K
       AC 8E D6 48 5A 53 73 68 50 FF BD F1 8A E2 3E 94>)
(   2,<2024-04-01 15:46:23.15 +0400>,<she>,<DPX200>,
      <Start of raw data processing
       efp BC_mod = 2 LB = 0.24 FT_mod = 6 PKNL = 1 PHC0 = -25300.58 PHC1 = 6.587305 SI = 16K 
       data hash MD5: 16K
       48 2E 4C DE FF EC 6B 1A 11 B2 67 91 77 39 3E 8B>)
(   3,<2024-04-01 15:46:42.76 +0400>,<she>,<DPX200>,
      <pk PHC0 = -82.78664 PHC1 = 7.600001 
       data hash MD5: 16K
       31 3D 9F 4C 4F FF F9 5D 97 53 8B CD FD E1 2C C4>)
(   4,<2024-04-01 15:46:45.70 +0400>,<she>,<DPX200>,
      <abs ABSG = 5 
       data hash MD5: 16K
       6A C9 B8 85 3A 8C 3E 1B 48 51 DA E6 94 A2 00 98>)
$$ ##END=
$$ 
$$ hash MD5
$$ FA 1C 47 B4 6A 31 C9 0B 48 CE 7D F5 B7 72 A5 FC
##$RELAX= 
##$RELAX= 
##$RELAX= 
##$RELAX= 
##$RELAX= 
##$RELAX= 
$$ Bruker specific parameters
$$ --------------------------
##$DU= <F:/spectra>
##$EXPNO= 1
##$NAME= <H-F>
##$PROCNO= 1
##$TYPE= <nmr>
##$USER= <she>
##$AMP= (0..31)
100 100 100 100 100 100 100 100 100 100 100 100 100 100 100 100 100 100 
100 100 100 100 100 100 100 100 100 100 100 100 100 100 
##$AQSEQ= 0
##$AQ_mod= 1
##$AUNM= <au_zg>
##$AUTOPOS= <>
##$BF1= 200.13
##$BF2= 200.13
##$BF3= 200.13
##$BF4= 200.13
##$BF5= 200.13
##$BF6= 200.13
##$BF7= 200.13
##$BF8= 200.13
##$BYTORDA= 1
##$CFDGTYP= 0
##$CFRGTYP= 5
##$CHEMSTR= <none>
##$CNST= (0..31)
1 1 145 1 1 1 1 1 1 1 1 1 1 1 1 1 1 1 1 1 1 1 1 1 1 1 1 1 1 1 1 1 
##$CPDPRG= <>
##$CPDPRG1= <>
##$CPDPRG2= <>
##$CPDPRG3= <>
##$CPDPRG4= <mlev>
##$CPDPRG5= <mlev>
##$CPDPRG6= <mlev>
##$CPDPRG7= <mlev>
##$CPDPRG8= <mlev>
##$CPDPRGB= <>
##$CPDPRGT= <>
##$D= (0..31)
0 1.2 0 0 0 0 0 0 0 0.06 0 0.03 0 0 0 0 0.0002 0 0 0 0 0 0 0 0 0 0 0 0 
0 0 0 
##$DATE= 1711971977
##$DBL= (0..7)
120 120 120 120 120 120 120 120 
##$DBP= (0..7)
150 150 150 150 150 150 150 150 
##$DBP07= 0
##$DBPNAM0= <>
##$DBPNAM1= <>
##$DBPNAM2= <>
##$DBPNAM3= <>
##$DBPNAM4= <>
##$DBPNAM5= <>
$$ [...]
##$SUBNAM3= <"">
##$SUBNAM4= <"">
##$SUBNAM5= <"">
##$SUBNAM6= <"">
##$SUBNAM7= <"">
##$SUBNAM8= <"">
##$SUBNAM9= <"">
##$SW= 18.0517418723606
##$SWIBOX= (0..15)
0 0 2 0 0 0 0 0 0 0 0 0 0 0 0 0 
##$SW_h= 3612.71676300578
##$TD= 16384
##$TD0= 1
##$TE= 0
##$TE2= 300
##$TE3= 300
##$TEG= 300
##$TL= (0..7)
0 120 120 120 120 120 120 120 
##$TP= (0..7)
150 150 150 150 150 150 150 150 
##$TP07= 0
##$TPNAME0= <>
##$TPNAME1= <>
##$TPNAME2= <>
##$TPNAME3= <>
##$TPNAME4= <>
##$TPNAME5= <>
##$TPNAME6= <>
##$TPNAME7= <>
##$TPOAL= (0..7)
0.5 0.5 0.5 0.5 0.5 0.5 0.5 0.5 
##$TPOFFS= (0..7)
0 0 0 0 0 0 0 0 
##$TUNHIN= 0
##$TUNHOUT= 0
##$TUNXOUT= 0
##$USERA1= <user>
##$USERA2= <user>
##$USERA3= <user>
##$USERA4= <user>
##$USERA5= <user>
##$V9= 5
##$VALIST= <valist>
##$VCLIST= <CCCCCCCCCCCCCCC>
##$VD= 0
##$VDLIST= <DDDDDDDDDDDDDDD>
##$VPLIST= <PPPPPPPPPPPPPPP>
##$VTLIST= <TTTTTTTTTTTTTTT>
##$WBST= 1024
##$WBSW= 4
##$XGAIN= (0..3)
0 0 0 0 
##$XL= 0
##$YL= 0
##$YMAX_a= 295106
##$YMIN_a= -289456
##$ZGOPTNS= <>
##$ZL1= 120
##$ZL2= 120
##$ZL3= 120
##$ZL4= 120
##$ABSF1= 17.07239
##$ABSF2= -0.9794979
##$ABSG= 5
##$ABSL= 3
##$ALPHA= 0
##$AQORDER= 0
##$ASSFAC= 0
##$ASSFACI= 0
##$ASSFACX= 0
##$ASSWID= 0
##$AUNMP= <proc_1d>
##$AZFE= 0.1
##$AZFW= 0.1
##$BCFW= 0
##$BC_mod= 2
##$BYTORDP= 0
##$COROFFS= 0
##$CY= -3
##$DATMOD= 1
##$DC= 0
##$DFILT= <>
##$DTYPP= 0
##$F1P= 0
##$F2P= 0
##$FCOR= 1
##$FTSIZE= 16384
##$FT_mod= 6
##$GAMMA= 0
##$GB= 0
##$INTBC= 1
##$INTSCL= 3.70164e-10
##$ISEN= 128
##$LB= 0.24
##$LEV0= 0
##$LPBIN= 0
##$MAXI= 10000
##$MC2= 0
##$MEAN= 0
##$ME_mod= 0
##$MI= 1.114404
##$NCOEF= 0
##$NC_proc= -5
##$NLEV= 6
##$NOISF1= 3.799351
##$NOISF2= 2.8
##$NSP= 0
##$NTH_PI= 0
##$NZP= 0
##$OFFSET= 17.07239
##$PC= 1
##$PHC0= -25383.37
##$PHC1= 14.18731
##$PH_mod= 1
##$PKNL= yes
##$PPARMOD= 0
##$PSCAL= 0
##$PSIGN= 0
##$REVERSE= no
##$SF= 200.129589668195
##$SI= 16384
##$SIGF1= 3
##$SIGF2= 2
##$SINO= 5.538805
##$SIOLD= 16384
##$SREGLST= <1H.CDCl3>
##$SSB= 0
##$STSI= 16384
##$STSR= 0
##$SW_p= 3612.71676300577
##$SYMM= 0
##$S_DEV= 0
##$TDeff= 16384
##$TDoff= 0
##$TI= <>
##$TILT= no
##$TM1= 0
##$TM2= 0
##$TOPLEV= 0
##$USERP1= <user>
##$USERP2= <user>
##$USERP3= <user>
##$USERP4= <user>
##$USERP5= <user>
##$WDW= 1
##$XDIM= 16384
##$YMAX_p= 373535627
##$YMIN_p= -25712
$$ End of Bruker specific parameters
$$ ---------------------------------
##NTUPLES= NMR SPECTRUM
##VAR_NAME=  FREQUENCY,     SPECTRUM/REAL,   SPECTRUM/IMAG
##SYMBOL=    X,             R,               I
##VAR_TYPE=  INDEPENDENT,   DEPENDENT,       DEPENDENT
##VAR_FORM=  AFFN,          ASDF,            ASDF
##VAR_DIM=   16384,         16384,           16384
##UNITS=     HZ,            ARBITRARY UNITS, ARBITRARY UNITS
##FACTOR=    0.220516191357247, 1,           1
##FIRST=     3416.69032583613, 0,            0
##LAST=      -196.026437169639, 0,           0
##MIN=       -196.026437169639, -25712,      0
##MAX=       3416.69032583613, 373535627,    0
$$ Real data points
##PAGE= N=1
##DATA TABLE= (X++(R..R)), XYDATA
$$ [...]
7602B8316J018q13j754k150m181j178J338P95n83l128n56M40p01m481K26r6K007
7585A4519R90R95m387k76k09K669K245K38j616m579K607K767l068Q45o453L001
7569A0288L321J962l345M84O28N561m1k854j442q44m63k80J452j831J286P73o259
7552H396l76N10J298k43j573n50l25K23j08J428j679K751J46j108m06P02j372
7535G714M933O6l223k878l35n55L06J590K19k07l685K856M647O34j674k306L970
7518A2072K99L082k982M042J152J9811k9539k1958J2307J002P158q00r98m37J179
7503E390j965L822j221J21j874K218K96L383q46k853jR14k927j004q70j041N663
7486G205k419l696N52k522K977K846J113j146j066J038P76j123L162r31L51j184
$$ plain form
7602 28316 29334 28521 26767 24617 20436 19258 20596 21391 20808 17680 17124 17564 16863 12382 12608 12512 14519
7585 14519 15509 16504 12117 11841 11632 14301 16546 16784 15168 10589 13196 15963 12895 13740 7287 10288
7569 10288 13609 15571 12226 12710 13338 18899 18858 16004 14562 13718 13255 12975 14427 12596 13882 14655 8396
7552 8396 8020 8530 9828 9585 8012 7462 7137 7360 7252 8680 7001 9752 9898 8790 8384 9086 7714
7535 7714 12647 12713 9490 6612 6277 5722 6028 7618 7837 7630 3945 6801 11448 12082 10408 8102 12072
7518 12072 12371 15453 12471 16513 17665 37476 7937 -14021 -1714 -712 6446 5646 4648 4211 5390
7503 5390 3425 7247 6026 6147 4273 6491 6787 10170 9324 6471 6470 7384 4457 3453 2583 1542 7205
7486 7205 4786 1090 1642 -880 2097 4943 6056 4910 3844 4882 5658 4535 7697 6766 7117 5933
7470E933J262O04j495J169j126J154j27k506M2K618Q36k247j015j624q96k931
7454c49J394M153m499l273j705K734R46j612j321K526K534L76P94L132j764k131
7438A935k232j072k16R38r69j781K001M9j331L653J949j076r75P12j472k689L290
7421G14J457k756o9l18J866j244q15n76P31J31oN98K4j618J494K927j324j466
7403b50k022n23p77L367N1p73p31O22J386k285j290m968L090M134k008M09j668
7386d236J077p43k295j914J689L300l505r99K969J790r53j967Mo78K595O08k083
7369e341J406K517M413l193j578q57J28k451j317J369k363J799J022K45j644Q47
7353d998l619L500O59N16K129j474p33J542l546j55Q72J461o22m63N33J20K79
$$ plain form
7470 5933 7195 7799 6304 7473 6347 7501 7374 4868 4910 7528 8364 6117 5102 3478 2582 -349
7454 -349 1045 5198 699 -2574 -4279 -1545 -599 -2211 -3532 -1006 1528 1904 2698 5830 4066 1935
7438 1935 -297 -1369 -1585 -647 -1616 -3397 -1396 -1347 -2678 975 2924 1848 873 1585 113 -2576 714
7421 714 2171 -585 -654 -972 894 -350 -1165 -1741 -1010 -879 -885 -287 -263 -1881 -387 2540 1216 -250
7403 -250 -2272 -2795 -3572 -205 -154 -927 -1658 -1036 350 -1935 -3225 -8193 -5103 -969 -2977 -2568 -4236
7386 -4236 -3159 -3902 -6197 -8111 -6422 -3122 -6627 -7626 -4657 -2867 -3820 -5787 -5783 -6461 -3866 -3258 -5341
7369 -5341 -3935 -1418 2995 -198 -1776 -2633 -2505 -4956 -6273 -4904 -7267 -5468 -4446 -4201 -5845 -4998
7353 -4998 -8617 -5117 -4458 -3942 -1813 -3287 -4020 -2478 -6024 -6179 -5307 -3846 -4468 -4931 -4398 -4278 -3999
7336c999J735k087r76R03q30j225J942J891L4j441l072N598l556LJ602j108J429
7319c157k468L909K072n610j329J534J860k504m16l13m29K700L138k131j426l364
7303g934M48J070J601l037N96Q81R31j060m01j143J795J414j983o14M65L51k542
7286i162K334J510k69J508L981q0k790J144j042j101o6J85o76j977K066J71O54
7269c610k162l43l934J039J260o30j033L30P79K250p61J44M599q23l158m9p59
7252f861j410L811j271P96R70k837O81l05j922Q16n15M58J222Q24K828k285R13
7235d087m41k084j512N549Q26k908j858K955o75n426j054L725n09q8P78j008M833
7218b984l80J271j09j963J16p9l143j227L211M390j136k222j892j346M27j666
$$ plain form
7336 -3999 -2264 -4351 -5327 -4424 -5254 -6479 -4537 -2646 -2612 -4053 -7125 -1527 -5083 -5080 -3478 -4586 -3157
7319 -3157 -5625 -1716 356 -5254 -6583 -5049 -3189 -5693 -6109 -6422 -6851 -4151 -1013 -3144 -4570 -7934
7303 -7934 -7486 -6416 -4815 -7852 -7256 -6375 -5444 -6504 -6905 -8048 -6253 -4839 -6822 -7436 -6971 -6620 -9162
7286 -9162 -6828 -5318 -5587 -4079 -98 -178 -2968 -1824 -2866 -3967 -4033 -3848 -4524 -6501 -4435 -4264 -3610
7269 -3610 -5772 -6115 -10049 -9010 -7750 -8380 -9413 -9083 -8304 -6054 -6815 -6671 -2072 -2895 -6053 -6102 -6861
7252 -6861 -8271 -4460 -5731 -4935 -3965 -6802 -6121 -6426 -8348 -7532 -8047 -7589 -6367 -5543 -2715 -5000 -4087
7235 -4087 -4528 -6612 -8124 -2575 -1749 -4657 -6515 -3560 -4235 -9661 -10715 -6990 -7499 -7587 -6809 -7817 -2984
7218 -2984 -3364 -2093 -2202 -4165 -4049 -4128 -7271 -8498 -5287 -897 -2033 -4255 -6147 -7493 -7066 -8732
7202h732K652J709o58j781N35p7p25p14l05J065J144R15o67R89l066j965L446
7185f235P32J543m130P37L904k649r05k068j97O29J836m03J772J890j01k192k674
7168h511J657j346L2L318k381J347l415L198L61m4j142l78Q79K283K060L40j489
7151c231r82j618J304J243o41l796J304L549p7j425r03j455j330j820L254L269
7135c355k245J062k201K813l207K31J736K096J243l697j380J474L000L7p73j261
7119d427m40K395k469l035j168J862K186J871K60J4j705j074M10J9K089L461m427
7102d178o354p20L381K992l186j08J567j565J493j96N04p51K440j08k21K94l738
7085h454L046k30l424M791J593j620j714k933O18R01J929O64o67l361k604K132
$$ plain form
7202 -8732 -6080 -4371 -5029 -6810 -6275 -6352 -7077 -7791 -8096 -7031 -5887 -4972 -5639 -4650 -7716 -9681 -6235
7185 -6235 -5503 -3960 -8090 -7353 -3449 -6098 -7003 -9071 -9268 -8639 -6803 -7206 -5434 -3544 -3645 -5837 -8511
7168 -8511 -6854 -8200 -8168 -4850 -7231 -5884 -9299 -6101 -5740 -5784 -6926 -7304 -6425 -4142 -2082 -1742 -3231
7151 -3231 -4213 -5831 -4527 -3284 -3925 -7721 -6417 -2868 -2945 -4370 -5273 -6728 -8058 -9878 -6624 -3355
7135 -3355 -5600 -4538 -6739 -3926 -7133 -6902 -5166 -3070 -1827 -5524 -6904 -5430 -2430 -2393 -3166 -4427
7119 -4427 -4867 -2472 -4941 -7976 -9144 -7282 -5096 -3225 -2965 -2951 -4656 -5730 -5320 -5301 -3212 249 -4178
7102 -4178 -10532 -11252 -7871 -4879 -8065 -8173 -6606 -8171 -6678 -6874 -6370 -7121 -4681 -4789 -5010 -4716 -8454
7085 -8454 -5408 -5638 -9062 -4271 -2678 -4298 -6012 -8945 -8327 -7426 -5497 -4833 -5500 -8861 -11465 -9333
7069i333Q53k61K410K136p97L136k052K726K479M503j0512j3848N810j60M36K593
7053i881M197K105j523k528l15Q44J749J002R35l980K244K063q85J870n90k167
7037d860j605j213K76J43j621K811k352j172K841n77p92L260l014K317J154j505
7021e909r39l831L93K57K440L359K179k359q70j626j281J015P75l634J011J541
7005g479L165J562l486o8j521r57L12L350K024J914j173j851n95k369J798O50
6989d724J566r91j862Q36k131l94J415K392j441l628P24J889o65K426J941n81
6973c228k194l036J877k79j234M88j288j62M98K185J724L19j539K303m66k162
6957f194P92k135k541J139L529n42K010J2j716l168J620K69k217j86R14n49J023
$$ plain form
7069 -9333 -8480 -8741 -6331 -4195 -4992 -1856 -3908 -1182 1297 5800 -4712 -18560 -12750 -12910 -12474 -9881
7053 -9881 -5684 -3579 -5102 -7630 -7945 -7101 -5352 -4350 -3415 -7395 -5151 -3088 -3973 -2103 -2693 -4860
7037 -4860 -6465 -7678 -7402 -7259 -8880 -6069 -8421 -9593 -6752 -7329 -8121 -4861 -7875 -5558 -4404 -5909
7021 -5909 -6848 -10679 -10286 -10029 -7589 -4230 -2051 -4410 -5280 -6906 -8187 -7172 -6397 -10031 -9020 -7479
7005 -7479 -4314 -2752 -6238 -6306 -7827 -8784 -8472 -5122 -3098 -1184 -2357 -4208 -4803 -7172 -5374 -4724
6989 -4724 -3158 -4149 -6011 -5175 -7306 -7700 -6285 -3893 -5334 -8962 -8238 -6349 -7014 -4588 -2647 -3228
6973 -3228 -5422 -8458 -6581 -6860 -8094 -7606 -8894 -9056 -8558 -6373 -4649 -4330 -5869 -3566 -4032 -6194
6957 -6194 -5402 -7537 -10078 -8939 -5410 -5952 -3942 -3930 -5646 -8814 -7194 -6925 -9142 -9328 -8414 -8963 -7940
6940g940q61j175Q92K692k86R04r10k709k71M777l88m017K03k24M82j663o34N954
6922e174J789k141p27k364J638j026M738j73l101j743R44J666j234k312K423J606
6906e191n67k010%j843J714N293j824N98J274o1k513p88K206M61j47m88K60l47
6888c973l105j337r49J006m95J083o71m75J780J306K915o71N29k732N80J175m93
6871d527J688Q85r94m570o13L035K250k931J610j335R31J771j22K885k159k531
6855d727J798j591k441K126P54J257j764J142P76j015j666J063k128l62N955k322
6839c145j696l362L13P51j807R71rL71K843K030j811j995r3K152O14m95q91m13
6821e672j693n23J356M120j238r68k855k312O54j428J28M472L46K015J04k262
$$ plain form
6940 -7940 -8801 -9976 -9084 -6392 -6678 -5774 -6684 -9393 -9664 -4887 -5275 -9292 -9089 -9313 -8831 -10494 -11128 -5174
6922 -5174 -3385 -5526 -6253 -8617 -6979 -8005 -3267 -3440 -6541 -8284 -7340 -5674 -6908 -9220 -6797 -5191
6906 -5191 -5758 -7768 -7768 -9611 -7897 -2604 -4428 -3830 -2556 -2617 -5130 -5918 -3712 -3251 -3398 -3886 -3626 -3973
6888 -3973 -7078 -8415 -9364 -8358 -8853 -7770 -8441 -8916 -7136 -5830 -2915 -3586 -3057 -5789 -5209 -4034 -4527
6871 -4527 -2839 -1954 -2948 -7518 -8131 -5096 -2846 -5777 -4167 -5502 -4571 -2800 -2922 -37 -2196 -4727
6855 -4727 -2929 -4520 -6961 -4835 -4081 -2824 -4588 -3446 -2670 -3685 -5351 -4288 -6416 -6778 -823 -3145
6839 -3145 -4841 -8203 -7890 -7139 -8946 -7975 -7984 -7613 -4770 -2740 -4551 -6546 -6639 -4487 -3873 -4368 -5259 -5672
6821 -5672 -7365 -7888 -6532 -2412 -3650 -4618 -7473 -9785 -9131 -10559 -10431 -5959 -5613 -3598 -3494 -5756
6805e756J021p1O1l221J0n45n20K023J979q90L60O35J413J079m437J064L340j698
6787d153k134J000J822J167j098p20m240J260K723R8o29k216Q49R04J300M38k064
6770e693J510j193j489J064j646K090j572O05J498J389J779o92m987J689O58j256
6754f246r79K210J477l757K701j312k433J332j02l244k977M000L294j861K769
6739e128J258k189K565Q37Q98J368N7k190p73l908p8K437Q66k924j695J491O1
6722g047R5K43r75l29l36J270L786j93J896m265l034K356K729n55j33P36P75j675
6704d656L10J119Q60j401j097l008m26N350l116L208j808j948J973J349r30j277
6688e498K52J01p8j651K167O18o29n19J802q20m900k113K477N622J683k892j535
$$ plain form
6805 -5756 -4735 -4806 -4745 -7966 -7956 -8501 -9021 -6998 -5019 -5909 -5549 -4914 -3501 -2422 -6859 -5795 -2455 -4153
6787 -4153 -6287 -5287 -3465 -2298 -3396 -4116 -8356 -7096 -4373 -4275 -4904 -7120 -6271 -5367 -4067 -3629 -5693
6770 -5693 -4183 -5376 -6865 -5801 -7447 -5357 -6929 -6324 -4826 -3437 -1658 -2350 -7337 -5648 -4990 -6246
6754 -6246 -7225 -5015 -3538 -7295 -4594 -5906 -8339 -7007 -7109 -10353 -13330 -9330 -6036 -7897 -5128
6739 -5128 -3870 -6059 -3494 -2657 -1759 -391 -334 -2524 -3297 -7205 -7283 -4846 -3980 -6904 -8599 -7108 -7047
6722 -7047 -6952 -6709 -7684 -8013 -8349 -7079 -3293 -3486 -1590 -5855 -8889 -6533 -3804 -4359 -4492 -3756 -2981 -4656
6704 -4656 -4346 -3227 -2367 -3768 -4865 -7873 -8299 -2949 -6065 -2857 -4665 -6613 -4640 -3291 -4221 -5498
6688 -5498 -5246 -5145 -5223 -6874 -4707 -4089 -4718 -5237 -3435 -4255 -9155 -11268 -8791 -3169 -1486 -4378 -5913
6671e913J24P25j422L109K02k786j575k522n34L196L548n171N11J016J932M5J870
6654c645N47j098J278k409j77l1q1J38n52k182J180K296J939o235O75L205M44
6637d708j880k319l23J757M363p20o44j169N52J351j466K16j678Q43M667K108
6621I50k536j603R48N03L26k222k112LL44L532j320j278K822L107k78j001k832
6604b647M50l151j163M426k253K66j779m53J564L141j318k596M08J33M91R16n98
6587d163J262k76k86m15j086k822K097M225l392q56r15J182J655p59j504q47K346
6570d554l56n60j28J169q98J958Q14n43j087k138K159J363o37j110J103J165J9
6553b261M43j680K08N86l27K322m83l24J071m215k372K164J076k611K16K861l498
$$ plain form
6671 -5913 -5789 -5064 -6486 -3377 -3175 -5961 -7536 -10058 -10592 -7396 -3848 -9019 -8508 -7492 -5560 -5515 -3645
6654 -3645 -3098 -4196 -2918 -5327 -5504 -5535 -5616 -5478 -6030 -8212 -7032 -4736 -2797 -9032 -8357 -5152 -4708
6637 -4708 -6588 -8907 -9230 -7473 -3110 -3830 -4474 -5643 -5091 -3740 -5206 -4990 -6668 -5825 -1158 950
6621 950 -1586 -3189 -2241 -1738 -1412 -3634 -5746 -5743 -5399 -1867 -3187 -4465 -1643 1464 1186 185 -2647
6604 -2647 -2197 -5348 -6511 -2085 -4338 -4072 -5851 -6304 -4740 -1599 -2917 -5513 -5105 -4972 -4481 -3565 -4163
6587 -4163 -2901 -3177 -3463 -3878 -4964 -7786 -5689 -1464 -4856 -5712 -6627 -5445 -3790 -4549 -6053 -6900 -4554
6570 -4554 -4910 -5470 -5598 -4429 -5327 -3369 -2555 -3098 -4185 -6323 -4164 -2801 -3438 -4548 -3445 -2280 -2261
6553 -2261 -1818 -3498 -3290 -2704 -3031 -709 -1192 -1516 -445 -4660 -7032 -4868 -3792 -6403 -6187 -3326 -6824
6536f824L49J627k239J311q38K141M208k941l281k107O96N034J986j061R74l54
6520a319j616q30K11J970L124k929n336k421M357L207R90j11j653j65p00j15l419
6503f755K683M7J57K583m185N85P97k562L16L674M506k021l529K538R31p26l342
6486d303K184j62L58k955n63K72J724n38L36J55r74P71n75N12J985J520k052R06
6468a399k133R93J955j199l714j66K723K565J261q92j401l013K790J953j620k247
6452c544m45J882k06L216n200K99p05K145l50p92j143J914l07J746o05l414m4
6435e553J079N75q44K208K951j489k659J751J872Q7j413l792j435K911k70K682
6419a339k88J721j329J16q98l955J755R03Q23L753m96l286k066K203q54p06L61
$$ plain form
6536 -6824 -6475 -4848 -7087 -5776 -6614 -4473 -265 -3206 -6487 -8594 -7898 -2864 -878 -1939 -965 -1319
6520 -1319 -2935 -3765 -3554 -1584 1540 -1389 -6725 -9146 -4789 -1582 -592 -703 -2356 -2521 -3221 -3336 -6755
6503 -6755 -4072 -4025 -3868 -1285 -5470 -4885 -4088 -6650 -6334 -2660 1846 -175 -3704 -1166 -235 -961 -4303
6486 -4303 -2119 -2281 -1923 -4878 -5441 -5169 -3445 -3983 -3647 -3492 -4466 -3695 -4270 -3758 -1773 -253 -2305 -1399
6468 -1399 -3532 -2539 -584 -1783 -5497 -5663 -2940 -375 886 -6 -1407 -4420 -1630 323 -1297 -3544
6452 -3544 -3989 -2107 -2313 903 -4297 -3998 -4703 -2558 -2908 -3700 -4843 -2929 -3236 -1490 -2095 -5509 -5553
6435 -5553 -4474 -3899 -4743 -2535 416 -1073 -3732 -1981 -109 -22 -1435 -5227 -6662 -3751 -4021 -1339
6419 -1339 -1627 94 -1235 -1119 -2017 -5972 -4217 -3314 -2491 1262 766 -2520 -4586 -2383 -3237 -3943 -3582
6402c582J568J402K60Q36l04j891j133r80j702J026k84M69K109j629j741K309
6386c267l95l379L09J409K485M1r68j110j539R84K425p14M35k09l433K498K153
6369b275r02j213k713J304M7K070N67k971K644k327M85J551R72m33j448J741M811
6352A910l873j378K756l590m012M965O88j854P37l571p18K635K347p18K655k821
6336c842J21K945l93J819K388q71K66k540J420m015l35j677O53r69Q15N19j186
6319d882L284L08j348j725J214J339j009r91k63J034L292k131l082k57K118R08
6303b191j081r77J488P91j155J908j46O22L557j344l949j731P87J360R64l925
6287e022l56J713J005J382p30l000P48J833k61m72K08J12J124J088j138J775J292
$$ plain form
6402 -3582 -2014 -612 -352 484 180 -1711 -2844 -3824 -5526 -4500 -4784 -4315 -2206 -3835 -5576 -3267
6386 -3267 -3662 -7041 -6732 -5323 -2838 -2797 -3765 -4875 -6414 -5430 -3005 -3719 -3284 -3493 -6926 -4428 -2275
6369 -2275 -3177 -4390 -7103 -5799 -5752 -3682 -3115 -6086 -3442 -5769 -5284 -3733 -2761 -3194 -4642 -2901 1910
6352 1910 -1963 -3341 -585 -4175 -8187 -3222 -2534 -4388 -3651 -7222 -7940 -5305 -2958 -3676 -1021 -3842
6336 -3842 -3721 -776 -1169 650 3038 2167 2433 -107 1313 -2702 -3037 -4714 -4061 -5030 -4215 -3696 -4882
6319 -4882 -1598 -1290 -2638 -4363 -3149 -1810 -2819 -3810 -4073 -3039 253 -1878 -4960 -5217 -3099 -2191
6303 -2191 -3272 -4249 -2761 -1970 -3125 -1217 -1363 -741 2816 1472 -2477 -4208 -3421 -2061 -1097 -5022
6287 -5022 -5378 -3665 -2660 -1278 -2008 -5008 -4260 -2427 -2688 -3160 -2952 -2840 -1716 -628 -1766 9 1301
6270A301M56j49j408j89q73K40j336P68m266K227p10k35o84k03M276J615k362
6253a532k854j309L333k73j825J236k171L34K609Q35j075L499j258k013Q64O59
6237i41N00k179j532L803j437k514L456k09M11K093m878k277M252j060j549J600
6221b461r8J257L148l20r38J032l64j751K29j110j642L278q18k544M34J087J067
6204e14P74r08J480K852j708j465k537k66n30L1k561K791K708J081R7o68M3r70
6186b70m82n009j95L534K181k986J725J261l770R5J746n91j1n54n51j501M605
6169g73K107o43l961R26n4r66P79L81j038J689R80j889J753j150k077P90J816
6152a330O471j640k732J62L50j106j461J578J002K09L57j063l48R02j636J622
$$ plain form
6270 1301 1757 1608 200 11 -862 -622 -1958 -1190 -5456 -3229 -3939 -4174 -4858 -5061 -785 830 -1532
6253 -1532 -4386 -5695 -2362 -2635 -4460 -3224 -5395 -5061 -2452 -1617 -2692 807 -451 -2464 -1600 -941
6237 -941 -441 -2620 -4152 -349 -1786 -4300 -844 -1053 -642 1451 -3427 -5704 -1452 -2512 -4061 -2461
6221 -2461 -2559 -1302 1846 1526 588 1620 1256 -495 -266 -1376 -3018 260 -558 -3102 -2668 -1581 -514
6204 -514 260 -648 832 3684 1976 511 -2026 -2292 -2822 -2791 -5352 -2561 147 1228 1325 657 700 -270
6186 -270 -752 -5761 -5956 -2422 -241 -3227 -1502 -241 -4011 -3916 -2170 -2761 -2772 -3326 -3877 -5378 -773
6169 -773 1334 691 -3270 -2344 -2398 -3364 -2585 -2204 -3242 -1553 -573 -2462 -709 -1859 -3936 -3146 -1330
6152 -1330 5141 3501 769 931 1281 175 -1286 292 1294 1503 1860 797 449 1351 -285 1337
6136A337J028n0q25K123j264n03K56k202J121N67m25K844k632R67K938l040l756
6119a516j312M010j83p07J066K050p84l933K725R81J194L32j048k024o96l301
6103c146M654k443k294P11k08K802L80o15p5J522l179k49n61J192k20J811J832
6086A914K446n76j307k126O54r15L251J053r31J910k165k45j890j03p74J252j901
6069d53P74J352l85l204P53J594o7Q43l37o92l19r83k104j141j543N588K94j723
6051a753K046j525M23l489M400K917j698k347J872j75q4O59K36j738J184j344
6035d16O88K817k435n8l000q8K452J174PJ116j19K10n33j128p93L159j564Q22
6017B311j452R14q46j124J372M402m00k399j438J929J309m333k324N88o56L400
$$ plain form
6136 1337 2365 2315 1490 3613 2349 1846 2102 -100 1021 1588 1163 4007 1375 2342 5280 2240 -1516
6119 -1516 -2828 1182 999 292 1358 3408 2624 -1309 1416 2397 3591 3923 2875 851 155 -3146
6103 -3146 1508 -935 -3229 -2518 -2726 76 456 -159 -234 1288 -1891 -2140 -2701 -1509 -1729 82 1914
6086 1914 4360 3784 2477 351 1005 90 3341 4394 3463 5373 3208 2963 1073 970 196 1448 -453
6069 -453 321 1673 1288 -1916 -1163 431 364 1207 870 178 -141 -1124 -3228 -4369 -5912 -324 -30 -1753
6051 -1753 293 -1232 -809 -4298 102 3019 1321 -1026 846 671 587 1246 1482 -256 928 -416
6035 -416 272 3089 654 596 -2404 -2492 -40 1134 1141 2257 2138 2348 1815 687 -106 3053 1489 2311
6017 2311 859 1773 927 -197 1175 5577 5177 2778 1340 3269 4578 245 -2079 -1491 -2147 1253
6001A253j470N86j313L59L002j541K325k501k426P82J233K393J26k95j347j00
5985A066j077k45K425R50K564o2k601k008K367j902m23J034m63M5J047O95l44
5968C068O87J305l140j453n41J226J168k038K160R13K515j152k128J224m4J158
5952D928J85j794o34p88k868K138P82l5k362J768j233K053l067K299M334n919
5936b13l87k475q70N025R18k63k51N266q0j997m3r20L147J129l341j442k129O64
5918A738L21k68J839m568m540K181O714K305K5l005J8J503P20j639j056L93L367
5901F048l345l699K724l20J409O16K353L03k404L44j536p09K063R41j692j788
5885A308p03Q25l270K281M03l40K405n50n7M27J679K51k569L115o60J829q28O47
$$ plain form
6001 1253 -217 369 -944 -585 2417 876 3201 700 -1726 -944 289 2682 2808 2513 1166 1066
5985 1066 -11 -256 2169 3119 5683 5621 3020 1012 3379 1477 1054 2088 1625 1670 2717 3412 3068
5968 3068 3755 5060 1920 467 -74 1152 2320 282 2442 3355 5870 4718 2590 3814 3770 4928
5952 4928 5113 3319 2685 1897 -971 1167 1949 1914 -448 1320 87 2140 -927 1372 5706 -213
5936 -213 -600 -3075 -3945 1080 1998 1735 1484 6750 6670 4673 4630 3710 6857 7986 4645 3203 1074 1738
5918 1738 2059 1791 3630 -938 -5478 -3297 3417 5722 5747 2742 2760 4263 4983 3344 2288 2681 6048
5901 6048 2703 -996 1728 1408 2817 3433 5786 6089 3685 4029 2493 1784 3847 4788 3096 1308
5885 1308 605 1430 -1840 441 844 504 2909 2359 2302 2729 4408 4659 2090 5205 4545 6374 5546 6193
5867F193k509K92K814l490O62j909j496L343J635k069j69N79J591M32J483k66
5851G116m554j153J631J512J175r67j997J317K200r07J443J177m517J191J140
5836E807J840l29k57j642k95k32j46o60J648J786m402R04J139J014N5k647O20
5819D203L880M44R76j081Q59j711l435J745J450m04k180p24J624j007K01K421
5803G261K085k807K049k178j202K457p43l136J800j786J245Q74J357L28j710K355
5787H249p45m96L502K12m803j541K010J715o15q88K06J682R45M08p69l125Q49
5770F796j325J567k1j441J098J974K10r10K76P6k219O07Q64J916M16O60l469J955
5752I030J43K48J413j999K9K96m75k510N329K56o28Q41M907j149k186j660P68
$$ plain form
5867 6193 3684 3976 6790 3300 3962 2053 557 3900 5535 3466 3297 3876 5467 5899 7382 7116
5851 7116 2562 1409 3040 4552 5727 4760 2763 4080 6280 5373 6816 7993 3476 4667 5807
5836 5807 7647 7318 7061 5419 5124 4892 4746 4086 5734 7520 3118 4022 5161 6175 6230 3583 4203
5819 4203 8083 8527 9503 8422 9281 7570 4135 5880 7330 6926 4746 4022 5646 4639 4840 7261
5803 7261 9346 6539 8588 6410 5208 7665 6922 3786 5586 3800 5045 5919 7276 7604 5894 8249
5787 8249 7504 7008 10510 10722 5919 4378 6388 8103 7488 6600 6806 8488 9433 9841 9072 5947 6796
5770 6796 5471 7038 7017 5576 6674 8648 8858 7948 8224 8300 6081 6688 7552 9468 9884 10544 7075 9030
5752 9030 9173 9421 10834 8835 8864 9160 8685 6175 11504 11760 11132 11973 16880 15731 13545 11885 12653
5735A2653J427j652j97M332J512K64L45P64k426k90J598k02J807q08L02N29j652
5718A8306L739l359K672J012J716J511Q73j822l23J419K680O58L655M121O53J555
5702C9066M98K985K737o341L930R006K012j35j970r44m841j596n527q29j00j0
5686C7941o37k901l597k776n10o124Q77L668m14j278k104j303M81R25j818J80
5670B0610J738M82j454L14j978j307n46K210j283k096K816J763k868j315k803
5655A4283j473K287l01k100K508J992J975l857l208K435J754m27L392j035k269
5640A5956k575K582j2j51j593l189J194j987r62j634J325J860J179j869J301K444
5624A3869m80l350N23l85J155k409k79M80j955K519l032j483K508J454N76n40
$$ plain form
5735 12653 14080 12428 12231 16563 18075 18339 18684 19448 17022 16732 18330 18128 19935 19127 19429 19958 18306
5718 18306 22045 18686 21358 22370 24086 25597 26470 24648 24325 25744 28424 29082 32737 36858 37511 39066
5702 39066 39564 42549 45286 38945 42875 51881 53893 53758 51788 50844 46003 44407 38880 38051 37951 37941
5686 37941 37304 34403 30806 28030 27520 21396 22273 25941 25527 24249 22145 20842 21323 22248 20430 20610
5670 20610 22348 22830 21376 21690 19712 18405 17859 20069 18786 16690 19506 21269 18401 17086 14283
5655 14283 12810 15097 14796 12696 15204 17196 19171 15314 12106 14541 16295 15868 19260 18225 15956
5640 15956 13381 15963 15951 15800 14207 11018 12212 10225 9263 7629 8954 10814 11993 10124 11425 13869
5624 13869 13389 10039 10562 10177 11332 8923 8644 9124 7169 9688 6656 5173 7681 9135 9711 9171
5608I171r65j045l098L803K050l956Q3K244m47j806N05J155K4J092j374k1j374
5591F041P50P26R32J129j694k266N159m099k508N156J200k142L75k530J283k296
5575E216j190L768J070J483Q64Q91m070R15k035J492J113J615P68o79q55N25M49
5558A1340j97j280J550j879K572j703o08j136Q30J338L52M73O84q97k246K367
5542A1560j442k099M596j554q31j213L103j165Q96K516k963O97l45K8K40n10J162
5525A2676j14k16K502k012j658p97K15j854K256Q82j162n37J963K676j857j258
5509A1705J94n13N0j142j021J712R79j270l584K349K360K82q65j139j894J385
5493I588R97N74K204l087M52M4j63n01L54j588R70l63K657L08j452j293Q52j6
$$ plain form
5608 9171 8206 7161 4063 7866 9916 5960 6043 8287 7840 6034 6539 7694 7718 8810 7436 7415 6041
5591 6041 6791 7517 8449 9578 7884 5618 10777 6678 4170 9326 10526 8384 8759 6229 7512 5216
5575 5216 4026 7794 8864 10347 11211 12102 8032 8947 6912 8404 9517 11132 11900 11221 10366 10891 11340
5558 11340 11143 9863 11413 9534 12106 10403 9795 8659 9489 10827 11179 11652 12336 11439 9193 11560
5542 11560 10118 8019 12615 11061 10230 9017 12120 10955 11851 14367 11404 12101 11756 11784 12024 11514 12676
5525 12676 12562 12346 14848 12836 11178 10381 10596 8742 10998 11880 10718 10181 12144 14820 12963 11705
5509 11705 11899 11386 11436 10294 9273 10985 11964 10694 7110 9459 11819 12101 11236 10097 8203 9588
5493 9588 10585 11159 13363 10276 10728 10772 10609 10108 10462 8874 9844 9481 12138 12446 10994 9701 10553 10537
5475A0537j603R04K074j829J688J371k199j070o81Q93P30N33J140j831M40K880
5459A3977j52n34N46j079j363K144J377k240K310K700j272q43p99J313j020j961
5443A3104k476K564L59k767K691P93l744Q48o1j196K126j589L289o34O01j872
5427A2036n28J799J677N65k67k2R89l664j917M377K606m257l675M599J509Q83
5411A6710o65r66K531J295l129l233j637L078M51j334l64J647Q37l268k163K716
5395A2506o59K743K504j572J29r96j299J9J66K190J482m24r68k174l5N95L37J347
5377A5891k177K799p65l16K51j320O35K522j177j686j7J771r59J407m12q84N53
5360A6116p03k029O07Q78K084J476r0M14l066k099J059J590j501j289n82J349
$$ plain form
5475 10537 8934 9838 11912 10083 11771 13142 10943 9873 9192 10085 10815 11348 12488 10657 11097 13977
5459 13977 13825 13291 13837 12758 11395 13539 14916 12676 14986 17686 16414 15571 14772 16085 15065 13104
5443 13104 10628 13192 13551 10784 13475 14268 10524 11372 11311 10115 12241 10652 13941 13307 13908 12036
5427 12036 11508 13307 14984 15549 15282 15260 16249 12585 10668 15045 17651 13394 9719 14318 15827 16710
5411 16710 16045 15079 17610 18905 15776 12543 10906 13984 14435 13101 12737 14384 15221 11953 9790 12506
5395 12506 11847 14590 17094 15522 15651 14655 13356 13375 13541 15731 17213 16789 15821 13647 13612 14207 14544 15891
5377 15891 13714 16513 15748 15432 15683 14363 14998 17520 16343 14657 14640 16411 15452 16859 16447 15563 16116
5360 16116 15413 13384 13991 14869 16953 18429 18339 18753 15687 13588 14647 16237 14736 13447 12865 14214
5344A4214R57J493p89L160j519k107m10J439j669M060K774j761j249J13O03l150
5328A6159J739k811K917l19k818K938J634n94k292m93o11J793N66M20J628l89
5312A9467k288j123L31J432R4k012J105J266J023J59J079o64j212p58M20J584
5296A9903m29k52l10J691k049j349o72J28Q24O66o23j011K900K691k980Q22J594
5279B1544m624M69J101M94J535K81j085K949j916l120Q03J594J221R74R06k364
5263B0762l049K31%P18J812j665M13m027L407M41J138O94j420p28L95k321R80
5246A7781k079M62K352l87L332n14k542j677M67L089M815l498K93J544l164m10
5230A9864J78l038n36K103k171K047K891p99k02L635o09j584qO31K808j552j636
$$ plain form
5344 14214 15171 16664 15875 19035 17516 15409 14999 16438 14769 18829 21603 19842 18593 18706 19309 16159
5328 16159 17898 15087 18004 17685 14867 17805 19439 18845 16553 16060 15449 17242 17808 18228 19856 19467
5312 19467 17179 16056 16387 17819 17913 15901 17006 18272 19295 19454 20533 19869 18657 17899 18319 19903
5296 19903 19474 19222 18912 20603 18554 17205 16533 16661 17485 18151 17528 16517 19417 22108 19128 19950 21544
5279 21544 16920 17389 18490 18984 20519 20800 19715 22664 20748 17628 18431 20025 21246 22220 23126 20762
5263 20762 17713 17944 17944 18662 20474 18809 19222 15195 18602 19043 20181 20875 19455 18727 19122 16801 17781
5246 17781 15702 16164 18516 18129 21461 20947 18405 16728 17195 20284 25099 21601 21894 23438 20274 19864
5230 19864 20042 17004 16468 18571 16400 18447 21338 20539 20337 23972 23363 21779 21771 22402 25210 23658 22022
5213B2022j732R86J473Q4l488j827J368K002L938k364k938R42j743J460j68j94
5197A9821J995N29l073J946L74L94K02k477M86j279J768J763K752L20l277k475
5181A9769n01K469K668l34l554j143L240J76k264J38J627j763k741K631M331o80
5165B4069k034J594j853K87j029J368k12K74J582Q03m911J137m38n05p21j259
5149A8152J871K077J228p98l025n74M262J698j876q97L793k34j851j746O82j397
5133B1365J682j89K236O2m845l50J080L290k934O38J026k224J877K401j195n06
5117B3414M427K213k537m3r54r26K66J4R0L082k114k921J869J373J599k318J187
5100B7721j353K180m52o07M04k568k681M16q05K396K834M43j696P65J677J695
$$ plain form
5213 22022 20290 21276 22749 22833 19345 17518 18886 20888 24826 22462 19524 20466 18723 20183 20015 19821
5197 19821 21816 22345 19272 21218 21592 21986 22188 19711 20197 18918 20686 22449 25201 25521 22244 19769
5181 19769 19268 21737 24405 24071 20517 19374 22614 22790 20526 20664 22291 20528 17787 20418 24749 24069
5165 24069 22035 23629 21776 22063 21034 22402 22190 22464 24046 24849 19938 21075 20637 20132 19411 18152
5149 18152 20023 22100 23328 22530 19505 18931 23193 24891 23015 22118 25911 25677 23826 22080 22762 21365
5133 21365 23047 22858 25094 25156 20311 19961 21041 24331 21397 22035 23061 20837 22714 25115 23920 23414
5117 23414 27841 30054 27517 27474 26520 25594 25860 25874 25964 29046 26932 24011 25880 27253 28852 26534 27721
5100 27721 26368 28548 28096 27489 27893 25325 22644 23060 22255 24651 27485 27928 26232 26997 28674 30369
5084C0369j543j408J216q32l41K139l13l279M91J948p89M68q26J990J217N38j478
5067B9567k140K455m02l78j316r8j573Q25M53k005P82K338j59J09N55R0N35j260
5049B8378R04j100J808j809k691J127J821j399j660j445j146Q45L503M612J094
5034C2842J978m347r74q00r56j74j309L504N51j598k75p85J399k51J017j5j970
5017B7837Q71R05L1N86j06K294k388J304Q89k305r32L268l96l116j270L98L388
5000C1258l48j473Q30j731j968J095N50J981L162O34k575j910j979K359n22J68
4984B9531J113j355J781K708j409L540K562k169j222N67k571l37N445m79m445
4969C3260j926L09r68L40K170j831K150j363k783K717P98L86R21Q81K063j119
$$ plain form
5084 30369 28826 27418 28634 27802 27461 29600 29287 26008 26499 28447 27658 28126 27300 29290 30507 31045 29567
5067 29567 27427 29882 29480 29102 27786 27688 26115 26940 27393 25388 26170 28508 28349 28458 29013 29103 29638 28378
5049 28378 29282 28182 29990 28181 25490 26617 28438 27039 25379 23934 22788 23633 27136 31748 32842
5034 32842 34820 30473 29499 28699 27743 27569 26260 29764 30315 28717 28442 27657 29056 28805 29822 29807 27837
5017 27837 28708 29613 29644 30230 30124 32418 30030 31334 32223 29918 28986 32254 31858 28742 27472 27870 31258
5000 31258 30910 29437 30267 28536 26568 27663 28213 30194 33356 33990 31415 29505 27526 29885 29363 29531
4984 29531 30644 29289 31070 33778 32369 35909 38471 36302 35080 35647 33076 32739 38184 37705 33260
4969 33260 31334 31643 30675 31015 33185 31354 33504 32141 29358 32075 32873 33259 34180 35061 37124 36005
4953C6005r93j385r35J432o9J072J558j0j53j205j713M41J250J242l217K733m82
4936C5571j788j658K052J056J844k343q42M86J510P92q48J77N69J872J114M23
4920C9987k100p60M18o72J647N70j879M35k539O73J784J310k283o72J61m38J995
4903C7637K60j429J935J805m11Q12J191J00j19k886J403J246m6l120k89L769K121
4886D3979J888j878o32k314l095J122P21K194K562l999k953L45J565J318J215
4871D2038j663o53L018K83r96j156N78J257o9J87l814j899J000K451L195J903
4855D5660l032j613J489j303j354o85o97L203L80q77K807k130L33R5J045q81j740
4838D0700K233K211k204m041K011M290k072Q95j513ql297J846J160P86o61o27
$$ plain form
4953 36005 35012 33627 32692 34124 34055 35127 36685 36675 36522 35317 33604 34045 35295 36537 33320 36053 35571
4936 35571 33783 32125 34177 35233 37077 34734 33892 34378 35888 36680 35832 36009 36578 38450 39564 39987
4920 39987 37887 37127 37545 36873 38520 39090 37211 37646 35107 35780 37564 38874 36591 35919 36080 35642 37637
4903 37637 37897 36468 38403 40208 39797 40609 41800 41900 41781 38895 40298 41544 41498 38378 38089 41858 43979
4886 43979 45867 43989 43357 41043 37948 39070 39791 41985 44547 40548 37595 37940 39505 40823 42038
4871 42038 40375 39722 42740 43023 42027 40871 41449 42706 42637 42824 39010 37111 38111 40562 43757 45660
4855 45660 42628 41015 42504 41201 39847 39162 38465 41668 42048 41171 43978 41848 42181 42276 43321 42440 40700
4838 40700 42933 45144 42940 38899 40910 45200 43128 44023 42510 42502 39205 41051 42211 42997 42336 41709
4822D1709R14J380M099j55k59k088K580j487j89j403j75p51L841j105J441j794
4806D6558P4K301l22N77j752k450j02p47k227J345J48L261m81J750k866J206K943
4789D9216P56q40m69L94j022j139K115O44K168m349P85j700j385L678J826j34
4773E0544j181J055j339J146J451J164j3r59j350j418N25K249n00m6j876k066
4757D7386N42M049j222l97P18R38k10j734j526J825J974Q63J960j530j488O01
4741E2749J602l93m488P64R63K379j291L111J553J444j485k659L104j466m83j723
4725E3681o20P26p55p2o7k32J547J669m75k173r20J204K454K858m563l6K097j044
4707E5279J499J091k098J430p29Q44P84p37K272r56j445J053j057K85L155j898
$$ plain form
4822 41709 42623 44003 48102 47947 47688 45600 48180 46693 46504 45101 44926 44175 48016 46911 48352 46558
4806 46558 46632 48933 48611 49188 47436 44986 44884 44137 41910 43255 43403 46664 46183 47933 45067 46273 49216
4789 49216 49972 49132 48663 49057 48035 46896 49011 49655 51823 47474 48259 46559 45174 48852 50678 50544
4773 50544 49363 50418 49079 50225 51676 52840 52827 51868 50518 49100 49625 51874 51374 51328 49452 47386
4757 47386 47928 51977 50755 50358 51076 52014 51804 50070 48544 50369 52343 53206 55166 53636 52148 52749
4741 52749 54351 53958 49470 50234 51197 53576 52285 55396 56949 58393 56908 54249 57353 55887 55404 53681
4725 53681 53061 53787 53032 52960 52893 52661 54208 55877 55402 53229 52309 53513 55967 58825 54262 54226 56323 55279
4707 55279 56778 57869 55771 57201 56472 57316 58100 57363 59635 58679 57234 58287 57230 57515 60670 58772
4691E8772j482Q56K421L28J785p69q83J435l011k337m46K163K20J209L80n96j291
4674E8754J699J457j207j094J200M293j10k364j628O16j168L10k464Q79J512r95
4658E9690n56J978J653K552m352k315k395K840J268M376j348P66m46J397J918
4643F7026k91k60m40q07l946m26N49N56K484L753j238M4n16k653k304N32K781
4626F4844K548M155j142j885k257o88m88K027L158k488K563j159j437j858J162
4611F7055k78J605J877n72P65l26l222L050j012j227p81J878L484J465m414R17
4595G0264O60j556l88K002J605j528L481l41j915J687m45j488J995N24j033K446
4579G5970Q19j363k795J023q17J251j965j16o93J299J724p88k6J498K186n13L723
$$ plain form
4691 58772 57290 58146 60567 60895 62680 61911 61028 62463 59452 57115 56669 58832 59052 60261 60641 60045 58754
4674 58754 60453 61910 60703 59609 60809 65102 64992 62628 61000 61616 60448 60758 58294 59173 60685 59690
4658 59690 59134 61112 62765 65317 60965 58650 56255 59095 60363 64739 63391 64157 63711 65108 67026
4643 67026 66735 66475 66035 65228 61282 60856 61405 61961 64445 68198 66960 67004 66488 63835 61531 62063 64844
4626 64844 67392 71547 70405 68520 66263 65575 65087 67114 70272 67784 70347 69188 67751 65893 67055
4611 67055 66777 68382 70259 69687 70452 70126 66904 69954 68942 67715 66934 68812 72296 73761 69347 70264
4595 70264 70924 69368 68980 70982 72587 71059 74540 74199 72284 73971 73526 72038 74033 74557 73524 75970
4579 75970 76789 75426 72631 73654 72837 74088 72123 72007 71314 72613 74337 73549 73523 75021 77207 76694 80417
4562H0417ol73n30j60j467k758j435K780L84K355J781p48j814M91M19p70K505
4545H1071K333O22j127J014P08j664P98R25l33j504J806p66j624L75K971j135
4529H4470j840K716K020k209M23J487N32q58m096K070K295j467m2k408n8R83K128
4512H6146K223k422J089K581j251o79L97J303j321L238M72l189K333j57l799k19
4496H6745K279j62K806L477K740l999k495K40j319l64J370J950o73R86J82K481
4480I6244J653j708o93J806k537k03M76O33O14J526m98R43K607k327J119k50l115
4463I6290R18j69l24j420N455k206j278L924k237j41q32O86M9K216L715K019k429
4446A04236L7k088J898K17J356K464Q61k522l722J763K128j456K217J952k32q01
$$ plain form
4562 80417 80411 80038 79508 79348 77881 75123 73688 76468 76852 79207 80988 80240 78426 78917 79336 78566 81071
4545 81071 83404 84026 82899 83913 84621 82957 83755 84680 84347 82843 84649 83883 82259 82634 85605 84470
4529 84470 82630 85346 87366 85157 85580 87067 87599 86741 82645 84715 87010 85543 85501 83093 83035 84018 86146
4512 86146 88369 85947 87036 89617 88366 87687 88084 89387 88066 91304 91776 88587 90920 90763 86964 86745
4496 86745 89024 88862 91668 95145 97885 93886 91391 91631 90312 89948 91318 93268 92595 93581 93763 96244
4480 96244 97897 96189 95496 97302 94765 94562 95038 95671 96285 97811 97313 98256 100863 98536 99655 99405 96290
4463 96290 97208 97039 96715 95295 100750 98544 97266 101190 98953 98812 97980 98666 98715 100931 104646 106665 104236
4446 104236 104273 102185 104083 104300 105656 108120 108981 106459 102737 104500 106628 105172 107389 109341 109109 108308
4430A08308K150L24q50m19p32r14K886R19M62J445J587j592Q04j162j891L762
4414A15087j425J198K718k61Q21O60K740q97J886j681J790n27j605P79K77L71
4398A21931k383p31K454q22J469J078j217o24k41K210p14J097J58J754j748J75
4382A23846Q94K585j291K558J943k110o89k134J491J832j238L224K557K696L169
4367A39333r53n3P20j445o74K95j99k449N258K955k980J589P77J049L451M97l63
4350A46808O78K403l975j362R38J915N3L834j647J289K696k884L436L9R54J135
4334A56310K43J196k046N24j182J320M961K385O37q68M372J57j286N172j074J238
4318A72059J600M08K967j850J503L242k97K369L398J588J230J543o73O71M672
$$ plain form
4430 108308 110458 110782 109932 109513 108781 107867 110753 111672 112134 113579 115166 113574 114378 113216 111325 115087
4414 115087 113662 114860 117578 117317 118138 118798 121538 120641 122527 120846 122636 122109 120504 121283 121560 121931
4398 121931 119548 118817 121271 120449 121918 122996 121779 121155 120914 123124 122410 123507 123665 125419 123671 123846
4382 123846 124740 127325 126034 128592 130535 128425 127736 125602 127093 128925 127687 130911 133468 136164 139333
4367 139333 138380 138327 139047 137602 136928 137223 137024 134575 139833 142788 139808 141397 142174 143223 146674 147171 146808
4350 146808 147486 149889 145914 144552 145490 147405 147458 151292 149645 150934 153630 150746 154182 154221 155175 156310
4334 156310 156553 157749 155703 156227 155045 156365 161326 163711 164348 163480 167852 168009 166723 171895 170821 172059
4318 172059 173659 174067 177034 175184 176687 179929 179632 182001 185399 186987 188217 189760 189087 189758 194430
4303A94430J049k079K347N552K583J566L31K819J767J038L392M348J890L901M991
4288B29925p95k48M902L129M798J393L679M852K171M078q04L645L313J300J616
4273B66954O274M281M614J506P482O785L316L448M141P779L294P786N939N218
4259C38817N170P326N359R310P240N431Q700P835P670O705J1504J1610O494J2314
4245D51485Q011J0075Q369P602Q487R270O857O253O335N021K275k16O63K60l888
4230E26859R99n398o536o010r722j0372j1275q297q504r252j0270j1808j1005
4217D19409p483o162r271p818r355q711m651o410n888o915o080n426q061n758
4203C21420n609l543m352l921n340j188j662m241k451o646j75l91m424k678j895
$$ plain form
4303 194430 195479 193400 195747 201299 203882 205448 205779 208598 210365 211403 214795 219143 221033 224934 229925
4288 229925 229130 228882 233784 236913 241711 243104 246783 251635 253806 257884 257080 260725 264038 265338 266954
4273 266954 273228 277509 282123 283629 291111 297896 301212 304660 308801 316580 319874 327660 333599 338817
4259 338817 343987 351313 356672 365982 373222 378653 387353 395188 402858 409563 421067 432677 439171 451485
4245 451485 459496 469571 477940 485542 494029 503299 510156 516409 522744 527765 530040 529824 530487 530747 526859
4230 526859 527858 522460 515924 509914 500192 489820 478545 470248 461744 452492 442222 430414 419409
4217 419409 411926 405764 396493 388675 379320 370609 365958 359548 353660 346745 340665 335239 327178 321420
4203 321420 315811 312268 307916 303995 298655 297467 295805 291564 289113 282467 282292 281901 277477 274799 272904
4188B72904l570L5m921k852j512K122l514l748P13J668j314k166P52k783m96j988
4172B49330j346Q16j379k376k059K572J113j669l106L984K04l940j079o0o65L411
4156B43751m28j983J961J888K72k729l39j392j62k30j742K727J879l22j388q96
4140B40867j157J208J184L076r28j555P04j451J689l417J306J492J224J144O21
4125B46007K117P84m18j418K038J814R08r25M458J492j20j860j231K502R98j137
4109B56009J373J476K98M56J320J051L951j550q45O89J152J73j158J279K573J813
4093B70060r18j066L5J239L030M53L04P63o98J059K116O45K50L123q7P3J61K078
4075B82620N46Q92n50mJ954Q73o0R33j15M243K85l274Q2K475k071L181K273L099
$$ plain form
4188 272904 269334 269369 264448 261596 260084 262206 258692 254944 255657 257325 256011 253845 254597 251814 251318 249330
4172 249330 247984 248800 247421 245045 242986 245558 246671 245002 241896 245880 246084 242144 241065 241005 240340 243751
4156 243751 243323 241340 243301 245189 245461 242732 242393 241001 240839 240609 238867 241594 243473 243151 241763 240867
4140 240867 239710 240918 242102 245178 244250 242695 243399 241948 243637 240220 241526 243018 244242 245386 246007
4125 246007 248124 248908 248490 247072 249110 250924 251832 250907 255365 256857 256737 254877 253646 256148 257146 256009
4109 256009 257382 258858 259156 259612 260932 261983 265934 264384 263539 264228 265380 265553 264395 265674 268247 270060
4093 270060 269142 268076 268111 269350 272380 272833 273137 273900 273202 274261 276377 277022 277272 280395 280308 280381 280542 282620
4075 282620 283166 284058 283508 283504 285458 286331 286271 287204 287089 291332 291617 288343 288425 290900 288829 292010 294283 297382
4057B97382j170L132L365r68l8J505p60K431Q02P3k63R6M92L007K655N15K087
4040C14343J22J13j53P09L585M99j326R46n70K11K562J432N79K605K833j132R38
4023C28296M599p4L69Q49K274n5K760l07P06L313k05K148M40k199K245K313O45
4006C48117J660M418Q05k434K932K645J296l61J858L021p32N00L016J534q95L327
3990C70707K551o93l190J483M436M509p35L620n43K076M923l574J78L641J013
3975C90402J194K742K627L102J79j32L378J274J920J409R95J813K478L885J687
3960D18953K489L581M056O98r11J309L699J680J466L463K436J547L557j547P31
3945D47207K515L882K676P45K142K978K763K473M731K393M008K611L261K256J706
$$ plain form
4057 297382 296212 299344 302709 301741 301703 303208 302448 304879 305681 305754 305491 305587 306079 309086 311741 312256 314343
4040 314343 314465 314578 314425 315134 318719 319218 317892 318838 318268 318479 321041 322473 323052 325657 328490 327358 328296
4023 328296 332895 332821 333190 334039 336313 336258 339018 338711 339417 342730 342525 344673 345113 342914 345159 347472 348117
4006 348117 349777 354195 355000 352566 355498 358143 359439 359078 360936 363957 363225 363725 366741 368275 367380 370707
3990 370707 373258 372565 369375 370858 375294 379803 379068 382688 382145 384221 389144 385570 385748 389389 390402
3975 390402 391596 394338 396965 400067 400246 400114 403492 404766 406686 408095 409090 410903 413381 417266 418953
3960 418953 421442 425023 429079 429777 428866 430175 433874 435554 437020 440483 442919 444466 448023 446476 447207
3945 447207 449722 453604 456280 457025 459167 462145 464908 467381 472112 474505 478513 481124 484385 486641 488347
3930D88347K529M089J03P76L263K561K201m66N923J951M142L057j78N983J533
3915E25814J691K159M141K342L817O216r3J537L426R22N178K298M173Q64M929
3900E69414L817K566K394K523P007L899N408P57K245Q98J646J872K706K747L969
3885F13868N024n20J285O969M783M582K011J005O192N627K942P079M070O860K529
3870F74306M799P600N988O760M127O243K047N037M338J658K433L904M820N757
3856G39817L481M858J0715Q136K404J0396O850M579O181M305N427N538N292J0841
3842H28820P190M609R828Q857P269Q050M379Q419P782L815Q026P440R907P257
3828I31648Q769R291R505J2411J5361R811J2341J2825J0390J0047J0105J0578
$$ plain form
3930 488347 490876 494965 495068 495844 499107 501668 503869 503403 509326 511277 515419 518476 518298 524281 525814
3915 525814 527505 529664 533805 536147 539964 546180 546087 547624 551050 551972 557150 559448 563621 564485 569414
3900 569414 573231 575797 578191 580714 587721 591620 597028 597785 600030 600928 602574 604446 607152 609899 613868
3885 613868 618892 618372 619657 626626 631409 635991 638002 639007 645199 650826 653768 660847 664917 671777 674306
3870 674306 679105 686705 692693 699453 703580 709823 711870 716907 721245 722903 725336 729240 734060 739817
3856 739817 743298 748156 758871 767007 769411 779807 786657 791236 797417 801722 807149 812687 817979 828820
3842 828820 836010 840619 850447 859304 866573 874623 879002 887421 895203 899018 907044 914484 924391 931648
3828 931648 940417 949708 959213 971624 986985 996796 1009137 1021962 1032352 1042399 1052504 1063082
3816A063082J0340J0737J0738J2683J2829J0177J4675J3507J3564J3676J3354
3805A199362R019J1637J4847J6585J4088J7902J5430J1878J8320J7996J4906J8873
3793A380843K0107J6641J8312K0784K3814J5576J9203J7657K3686K0742K0849
3782A598214K3443K5627K4767K4471K7718K8805K8157K8453L5402L6205L8772
3771A920034L8699M4491M8095N3705O2962O9281P9782R1210R8708J10866J25269
3760B743102J42422J60592J87532K23073K54278K85295L00529K87584K27406J18938
3750D930751j5884j52006k57102l19993l25679k93724k45531j91747j46400j09714
3740B872971q5322o8535n7568n9303n5014n6909n7443n4106m3623l2927k6504
$$ plain form
3816 1063082 1073422 1084159 1094897 1107580 1120409 1130586 1145261 1158768 1172332 1186008 1199362
3805 1199362 1208381 1220018 1234865 1251450 1265538 1283440 1298870 1310748 1329068 1347064 1361970 1380843
3793 1380843 1400950 1417591 1435903 1456687 1480501 1496077 1515280 1532937 1556623 1577365 1598214
3782 1598214 1621657 1647284 1672051 1696522 1724240 1753045 1781202 1809655 1845057 1881262 1920034
3771 1920034 1958733 2003224 2051319 2105024 2167986 2237267 2317049 2408259 2506967 2617833 2743102
3760 2743102 2885524 3046116 3233648 3456721 3710999 3996294 4296823 4584407 4811813 4930751
3750 4930751 4914867 4762861 4505759 4185766 3860087 3566363 3320832 3129085 2982685 2872971
3740 2872971 2787649 2719114 2661546 2602243 2547229 2490320 2432877 2378771 2335148 2302221 2275717
3729B275717k2572j6376j1260j3978o196k885j244k331L607O085M297J1071J0331
3716B234266J0291Q100P071J1504J0212J1847J1109J0657J2003J4339J3289J3280
3704B367968J2949J6400J6948J2906J1047J4709J5731J5585J3865J5642J7570
3693B531320J4832J5129J4938J8898J7673K0702K0698J6955J8659K0395K3637
3682B733836K4669K2269K3659K5998K3524K3129K8430K5896K3211K8201K2841
3671C005663K9163L0075L0547K7642K7105L1079K6775K7512K8326K6618K4462
3660C314967K5844K5742K7643L0237L3019L0119L2581K8346K9477L2665L2656
3649C643296L0316K8196L5023L3870L7167L6207L6490L4750L8732L6889L6054
$$ plain form
3729 2275717 2253145 2236769 2225509 2211531 2205335 2202450 2201206 2198875 2202482 2208567 2212864 2223935 2234266
3716 2234266 2244557 2252657 2259728 2271232 2281444 2293291 2304400 2315057 2327060 2341399 2354688 2367968
3704 2367968 2380917 2397317 2414265 2427171 2438218 2452927 2468658 2484243 2498108 2513750 2531320
3693 2531320 2546152 2561281 2576219 2595117 2612790 2633492 2654190 2671145 2689804 2710199 2733836
3682 2733836 2758505 2780774 2804433 2830431 2853955 2877084 2905514 2931410 2954621 2982822 3005663
3671 3005663 3034826 3064901 3095448 3123090 3150195 3181274 3208049 3235561 3263887 3290505 3314967
3660 3314967 3340811 3366553 3394196 3424433 3457452 3487571 3520152 3548498 3577975 3610640 3643296
3649 3643296 3673612 3701808 3736831 3770701 3807868 3844075 3880565 3915315 3954047 3990936 4026990
3638D026990L7473L9219M1341M3534M7974N4042N3557M5743N2947N6257N7650
3627D556727N8219N6668N1134N2198N4899M7258M7485N0633M9894N1739N8735
3616E135589N1299N4419N3535N1385N4312N7033N9020N4664N5459N2746M7579
3605E727040M3287L8865L7207L6159L7120L6749M5339N6257O1743O6703O9572
3594F256041P4897Q0398Q1698Q4537Q8572Q0608R2845R7914R6118R2502R7737
3583G223867R5777R4038R8234J01577J01966J00390J01878J06968J11582J11923
3573H248200J17149J23583J25971J32572J31749J38962J41428J48342J53096J50211
3563I611263J58411J63391J71505J81112J87980J94978K00196K02815K04793K09732
$$ plain form
3638 4026990 4064463 4103682 4145023 4188557 4236531 4290573 4344130 4389873 4442820 4499077 4556727
3627 4556727 4614946 4671614 4722748 4774946 4829845 4877103 4924588 4975221 5025115 5076854 5135589
3616 5135589 5186888 5241307 5294842 5346227 5400539 5457572 5516592 5571256 5626715 5679461 5727040
3605 5727040 5770327 5809192 5846399 5882558 5919678 5956427 6001766 6058023 6119766 6186469 6256041
3594 6256041 6330938 6411336 6493034 6577571 6666143 6746751 6839596 6937510 7033628 7126130 7223867
3583 7223867 7319644 7413682 7511916 7613493 7715459 7815849 7917727 8024695 8136277 8248200
3573 8248200 8365349 8488932 8614903 8747475 8879224 9018186 9159614 9307956 9461052 9611263
3563 9611263 9769674 9933065 10104570 10285682 10473662 10668640 10868836 11071651 11276444 11486176
3553A1486176K10405K24721K33315K32378K37007K35759K38021K41706K58991
3544A3598479K75714K90447L05961L25962L32665L41071L51574L64336L76272
3535A6562481L84625M03465M21411M39020M57414M84313N11000N23355N40716
3526B0727800N61593N72015N80824N99807O22126O50925O90371P34359P76797
3517B6516617Q32563R03667R52665R70060R62871R51240R41389R10632Q67414
3508C4809118Q26897P99198Q10274Q32554Q43277Q32643Q26168Q42238Q68755
3499D2291122R17884R89913J058649J108044J139385J185477J244446J298271
3491E1233191J340038J393707J455486J539434J648727J749412J809678J867382
$$ plain form
3553 11486176 11696581 11921302 12154617 12386995 12624002 12859761 13097782 13339488 13598479
3544 13598479 13874193 14164640 14470601 14796563 15129228 15470299 15821873 16186209 16562481
3535 16562481 16947106 17350571 17771982 18211002 18668416 19152729 19663729 20187084 20727800
3526 20727800 21289393 21861408 22442232 23042039 23664165 24315090 25005461 25739820 26516617
3517 26516617 27349180 28252847 29205512 30175572 31138443 32089683 33031072 33941704 34809118
3508 34809118 35636015 36435213 37245487 38078041 38921318 39753961 40580129 41422367 42291122
3499 42291122 43209006 44198919 45257568 46365612 47504997 48690474 49934920 51233191
3491 51233191 52573229 53966936 55422422 56961856 58610583 60359995 62169673 64037055
3483F4037055J952963K039664K065448K073299K076405K097014K177769K317270
3475H0836887K489384K623648K693496K696721K708884K805148K995316L194501
3467A03043985L335436L475047L690058L968816M331274M734251N092149N469581
3459A37140597N952902O623223P398373Q142706Q902497R685159J0398490J1055449
3451B05299396J1822655J2666803J3759904J5132798J6468279J7547679J8349481
3444C11046995J8722081J8360272J5879394Q881155O45730m993222j1893431j8765150
3436C37883824k1644741k1282249j9540195j7943664j6465983j5072697j3791307
3429B12142988j2568318j1632946j0976141j0183178r380156q636457p961303
$$ plain form
3483 64037055 65990018 68029682 70095130 72168429 74244834 76341848 78519617 80836887
3475 80836887 83326271 85949919 88643415 91340136 94049020 96854168 99849484 103043985
3467 103043985 106379421 109854468 113544526 117513342 121844616 126578867 131671016 137140597
3459 137140597 143093499 149716722 157115095 165257801 174160298 183845457 194243947 205299396
3451 205299396 217122051 229788854 243548758 258681556 275149835 292697514 311046995
3444 311046995 329769076 348129348 364008742 372889897 373535627 368542405 356648974 337883824
3436 337883824 316239083 294956834 275416639 257472975 241006992 225934295 212142988
3429 212142988 199574670 187941724 176965583 166782405 157402249 148765792 140804489
3422A40804489p347366o913250o507935o044059n624217n206239m799709m461549
3414I3900165m188665l930041l667382l432259l238108l049288k855263k666497
3406F6872662k489297k353414k234109k129940k032249j935041j821537j711590
3398E0165485j623636j572006j517717j444860j379382j324101j264758j205841
3390C8833184j158616j110217j053330r89988r42859r02678q61732q24186q00648
3381C0188930p64349p27783p15735p04696o88329o52291o19977n91839n72183
3372B4151748n73067n80063n72718n59790n53708n40519n21959n08584m99776
3363A9241564m86616m63862m45977m26740l98535l83753l72872l59914l44817
$$ plain form
3422 140804489 133457123 126543873 120035938 113991879 108367662 103161423 98361714 93900165
3414 93900165 89711500 85781459 82114077 78681818 75443710 72394422 69539159 66872662
3406 66872662 64383365 62029951 59795842 57665902 55633653 53698612 51877075 50165485
3398 50165485 48541849 46969843 45452126 44007266 42627884 41303783 40039025 38833184
3390 38833184 37674568 36564351 35511021 34521033 33578174 32675496 31813764 30989578 30188930
3381 30188930 29424581 28696798 27981063 27276367 26588038 25935747 25315770 24723931 24151748
3372 24151748 23578681 22998618 22425900 21866110 21312402 20771883 20249924 19741340 19241564
3363 19241564 18754948 18291086 17845109 17418369 17019834 16636081 16263209 15903295 15558478
3354A5558478l31700l22245l08578k99926k93983k84079k71891k62047k57909
3345A2926120k50561k40597k33176k27761k19474k10866k05971k01316j89938
3336A0946460j87243j85871j80079j72796j68283j62096j63806j64607j64357
3327I397322j57147j49472j43268j41109j36048j33663j31827j31649j24010j21779
3317H027350j21240j15863j07319j09901j10134j06209j01680j00617j04192j02500
3307F947695j05977j01492j00858j00929r9850r2697r3610q7959q6317q3170q6121
3296E908715q7477q3049p8973p6147q0176p4451p0400o7601p1588o8540o4731
3285E085582o3236n8219n8865o3230n9847o4758o8468p4042p5502p7294p7746
$$ plain form
3354 15558478 15226778 14904533 14595955 14296029 14002046 13717967 13446076 13184029 12926120
3345 12926120 12675559 12434962 12201786 11974025 11754551 11543685 11337714 11136398 10946460
3336 10946460 10759217 10573346 10393267 10220471 10052188 9890092 9726286 9561679 9397322
3327 9397322 9240175 9090703 8947435 8806326 8670278 8536615 8404788 8273139 8149129 8027350
3317 8027350 7906110 7790247 7682928 7573027 7462893 7356684 7255004 7154387 7050195 6947695
3307 6947695 6841718 6740226 6639368 6538439 6438589 6345892 6252282 6164323 6078006 5994836 5908715
3296 5908715 5821238 5738189 5659216 5583069 5502893 5428442 5358042 5290441 5218853 5150313 5085582
3285 5085582 5022346 4964127 4905262 4842032 4782185 4717427 4648959 4574917 4499415 4422121 4344375
3274D344375q0194p9466p5019p1193o7389o3991n6079n5182n1992n1962n1222
3263C640686n0743m4870m1227m4011m2514m3280m3543l9157l5310l1050k6143
3252C198838l3021k7301k7353l3808l2460k8121k8291l4514k9823k4027k5978
3241B874141k6291k9053k7227k9847k5927k5931k9675k7119k6692k2334k6125
3230B577920k8327k3721k3902k5417k4713k3301k3936k6973k3902k2509k1110
3219B310109k2485j8810j9224k0874j5887j4199k0942j8283j4524j3498j3158
3208B118225j8753j2411j5845j3355r800j1644j0449j1568r954r798r016r783
3196A975849j0670j3470j3354j0840q480j3676j2872j1553r920j3111j0512r525
$$ plain form
3274 4344375 4264181 4184715 4109696 4038503 3971114 3907123 3851044 3795862 3743870 3691908 3640686
3263 3640686 3589943 3545073 3503846 3459835 3417321 3374041 3330498 3291341 3256031 3224981 3198838
3252 3198838 3165817 3138516 3111163 3077355 3044895 3016774 2988483 2953969 2924146 2900119 2874141
3241 2874141 2847850 2818797 2791570 2761723 2735796 2709865 2680190 2653071 2626379 2604045 2577920
3230 2577920 2549593 2525872 2501970 2476553 2451840 2428539 2404603 2377630 2353728 2331219 2310109
3219 2310109 2287624 2268814 2249590 2228716 2212829 2198630 2177688 2159405 2144881 2131383 2118225
3208 2118225 2099472 2087061 2071216 2057861 2048061 2036417 2025968 2014400 2004446 1994648 1985632 1975849
3196 1975849 1965179 1951709 1938355 1927515 1919035 1905359 1892487 1880934 1871014 1857903 1847391 1837866
3184A837866p810r005n347o192r358p719o697q770p101m988m470n328M86n15r12
3169A754140k516m605R6J81J396p00m144K104J412j284L516N195N148N274O141
3154A771354M620P426Q955J1665J3787J1801J5035J9359K2766K6376K9016M2533
3142A984693M5869N2315O7313Q0667R6025J08793J26737J48569J78022K18914
3132C107917K55587K89359L02079K77119K09833R7063m7841j84626k82685l34531
3122C689274l39573l02920k58210k14890j74742j44335j24862j08593r5100q3589
3112A842460p2992o2481n6241n5526m7012m2373l9250l7272l4538l3141k8506
3101A333128k8945k7896k1846k4832k1750k0694j5532k1212j5640j4072j7402
$$ plain form
3184 1837866 1830056 1821051 1815704 1809512 1800154 1792435 1785738 1776968 1769867 1764879 1760409 1755081 1755567 1755052 1754140
3169 1754140 1751624 1747019 1747115 1747296 1748692 1747992 1743848 1745952 1747364 1746080 1749596 1754791 1759939 1765213 1771354
3154 1771354 1775974 1783400 1792355 1804020 1817807 1829608 1844643 1864002 1886768 1913144 1942160 1984693
3142 1984693 2030562 2082877 2150190 2230857 2326882 2435675 2562412 2710981 2889003 3107917
3132 3107917 3363504 3652863 3954942 4232061 4441894 4538957 4491116 4306490 4023805 3689274
3122 3689274 3349701 3046781 2788571 2573681 2398939 2254604 2129742 2021149 1926049 1842460
3112 1842460 1769468 1706987 1650746 1595220 1548208 1505835 1466585 1429313 1394775 1361634 1333128
3101 1333128 1304183 1276287 1254441 1229609 1207859 1187165 1171633 1150421 1134781 1120709 1103307
3090A103307j6923j2722j1862j9090j2982j5841j1869j1514j3375p211r096j0877
3078I49945q771n793r323j1104j0294j1106r529r344o846n331q389r637o840o180
3064H31458p166n702o102q272p326l783q169r768o286p084p592p099o932q076
3050G32101m621k593o083n891q887m241l105n759p291o102m962o840k132m828
3036F58766m806m399k168n389n737k797j176p736m432n315l246j895p188o126
3022E96356l138k140n337j979r73m739n949l885k395m011j291l115l433l741o310
3007E43920m812l023j506k449l077l176J88l014l680m970m786k266k250n136o492
2992D93471p45j726p980l509k313m813J84l501r44j885o195l646k90j459m305
$$ plain form
3090 1103307 1086384 1073662 1061800 1042710 1029728 1013887 1002018 990504 977129 969918 960822 949945
3078 949945 941174 935381 926058 914954 904660 893554 884025 874681 867835 862504 854115 844478 837638 831458
3064 831458 824292 818590 812488 804216 796890 793107 784938 775170 768884 761800 754208 747109 740177 732101
3050 732101 727480 724887 718804 712913 704026 699785 696680 690921 683630 677528 672566 665726 663594 658766
3036 658766 653960 649561 647393 642004 636267 633470 632294 624558 620126 614811 611565 609670 602482 596356
3022 596356 593218 591078 585741 583762 582789 578050 572101 568216 565821 561810 560519 557404 553971 550230 543920
3007 543920 539108 536085 534579 532130 529053 525877 526065 523051 519371 514401 509615 507349 505099 499963 493471
2992 493471 492726 491000 483020 479511 477198 472385 472569 469068 468124 466239 460044 456398 456108 454649 450344
2977D50344j445j627k404k659j550m373l205p18l701m759J249n975J362k555n252
2962D12732j678k726l03j429k779k510k567K18m62k309m443l761m94n144n22j614
2946C80209l723J568j556k516l4j122k025k859l442k994j051j717l100J024k81
2931C56381j355J588k146l910j473n28l673o45k902k421j386J980j652j740o62
2916C35456j277l898l246l104J615k047k819O25k90k109m249j550J350k931k061
2901C09465L242l507l533J39k019j477l97l220j117n43j806l357j37l782k029
2886B85922M91m71O63K7j817m234j069l70j090m03l436k588n050O7J667k916J356
2869B66749m72j131O0o90k451J875l027m330p01k214l306K85K495j485J445j41
$$ plain form
2977 450344 448899 447272 444868 442209 440659 436286 433081 432363 428662 423903 425152 419177 420539 417984 412732
2962 412732 411054 408328 408025 406596 403817 401307 398740 398958 398496 396187 391744 387983 387489 382345 381823 380209
2946 380209 376486 378054 376498 373982 373948 372826 370801 367942 364500 361506 360455 358738 355638 356662 356381
2931 356381 355026 356614 354468 350558 349085 348557 344884 344239 341337 338916 337530 339510 337858 336118 335456
2916 335456 334179 330281 327035 323931 325546 323499 320680 321305 321015 318906 314657 313107 314457 311526 309465
2901 309465 312707 309200 305667 305806 303787 302310 301913 298693 297576 297033 295227 291870 291733 287951 285922
2886 285922 286413 285942 286605 286632 284815 280581 279512 279142 278052 277649 274213 271625 266575 266642 268309 265393 266749
2869 266749 266277 265146 265206 264516 262065 263940 260913 256583 255882 253668 250362 250647 253142 251657 253102 252961
2853B52961l813j314j472l434j130K083l159k104L038J283l905j346Q65l066J785
2838B37272n631j371M61l469l187J531O45j700O7k288Q21j466n10k94l410O83
2822B18154o53k358J43k416j059L34j062j94j640k222N47N31P11o35j000l110
2806B04071j425K25k690J675j076j126k662k109M48M27l81j428k393J0Q26l567
2790A88825K611M00J019L170k417l391l118m886K282k633L247k255r49o09j399
2775A79897k76m123J179n2k240k388N34K928m80j564K565l754r03K29J565L154
2759A76271K077k78r22m883j789j175J105l98Q35K16P86j941r09q09l000L76K792
2742A68354k943l393m94k826k756J116j1K181k751k471K845k47m497j474m06p64
$$ plain form
2853 252961 249148 247834 246362 242928 241798 243881 240722 238618 241656 242939 239034 237688 238553 235487 237272
2838 237272 231641 230270 230731 227262 224075 225606 226251 224551 224618 222330 223151 221685 221175 220881 217471 218154
2822 218154 217501 215143 215286 212870 211811 212145 211083 210889 209249 207027 207574 208105 208816 208181 207181 204071
2806 204071 202646 202871 200181 201856 200780 199654 196992 194883 195331 195758 195377 193949 191556 191566 192392 188825
2790 188825 191436 191836 192855 196025 193608 190217 187099 182213 184495 181862 185109 182854 181905 181296 179897
2775 179897 179621 175498 176677 176625 174385 171997 172531 175459 174979 173415 175980 172226 171323 171552 173117 176271
2759 176271 178348 178070 177148 172265 170476 169301 170406 170008 170843 171059 171845 169904 168995 168186 165186 165562 168354
2742 168354 165411 162018 161524 158698 155942 157058 157047 159228 156477 154006 156851 156604 152107 150633 150227 149463
2726A49463K43N69P03j537j728K92j9k518J250j245j427m69p83j278p98K443M355
2709A47516j557j638n095o66m53k890L66j557k270J762k577q05J971R07j612L093
2693A34495l5l027l274j143M002k64m354K575L91j606m0l01O23K861j322l116
2677A26465j046o20j843q04K047k778O65J6l046K090p75j157M18k183l022J610
2661A16037L31j83J395j693r95r34J049N70J448j649l063m362k34J425P81J99
2645A10122n30J018N62o18l6j132n64P21N60J482j313l511k59K221J189l575j777
2628A04560J487J98l078j465J078N58J127J850j356m28j377o66P86j288j533o08
2612I9845L02k13k862Q31M398J250k400l496l32j378Q65r30k579L529K385l514
$$ plain form
2726 149463 149706 150275 150978 149441 147713 148005 147986 145468 146718 145473 144046 143577 142794 141516 140718 143161 147516
2709 147516 145959 144321 139226 138560 138107 135217 135583 134026 131756 133518 130941 130136 132107 133014 131402 134495
2693 134495 134460 131433 128159 127016 131018 130754 126400 128975 129366 127760 127720 127419 128042 130903 129581 126465
2677 126465 125419 124799 122956 122152 124199 121421 122086 122102 119056 121146 120371 119214 119632 117449 114427 116037
2661 116037 116368 116185 117580 115887 114892 113958 115007 115577 117025 115376 112313 107951 107717 109142 109923 110122
2645 110122 109592 110610 111172 110554 110518 109386 108822 109543 110103 111585 110272 106761 106502 108723 109912 106337 104560
2628 104560 106047 106245 103167 101702 102780 103338 104465 106315 104959 104531 103154 102488 103274 101986 100453 99845
2612 99845 100147 99934 97072 97903 102301 103551 101151 97655 97323 95945 96810 95880 93301 96830 99215 95701
2596I5701j928Q41m53J203J59K243q68k314O48j772k736j141J276L46J19J771
2580I3095J252R72j92p74j530l218j719n54p2N19N66j853K433q04L05o22K178
2563H9982k386k707o04Q92J545j256K260m443J339o15l77l032n98j411J957j465
2547G9081j049K395m32j62l764L61J001J128N71O10j265j922l6q71k262l197J94
2530G0381J369R95L229j854k974l468Q4K119m90l530k188J047K098J595J188J06
2514F9707k59k173J133J872j938l243L3J943m47K53o78l542K651K729l020q98
2498F4123q69j64L793o37k269o90j883q78n95J083J806p8l73J790p56O80n42q67
2480F2674l18j926R52J42j710J227J781k718l668K317l410M223J405n76l53l885
$$ plain form
2596 95701 93773 94614 94161 95364 95523 97766 96898 94584 95232 93460 90724 89583 90859 91205 91324 93095
2580 93095 94347 95319 95127 94353 92823 89605 87886 87332 87260 87779 88345 86492 88925 88121 88426 87804 89982
2563 89982 87596 84889 84285 85177 86722 85466 87726 83283 84622 84007 83630 80598 80000 78589 80546 79081
2547 79081 78032 80427 79995 79833 76069 76430 77431 78559 79130 79740 78475 76553 76517 75646 73384 70187 70381
2530 70381 71750 72745 75974 74120 71146 67678 67762 69881 69391 65861 63673 64720 66818 68413 69601 69707
2514 69707 69448 67275 68408 70280 68342 65099 65132 67075 66628 66881 66203 62661 65312 68041 65021 64123
2498 64123 63254 63090 66883 66246 63977 63287 61404 60526 59931 61014 62820 62742 62369 64159 63403 64083 63541 62674
2480 62674 62356 60430 61382 61524 59814 61041 62822 60104 56436 58753 55343 59566 60971 60395 60042 56157
2464E6157q30o74L607O55p5L031l760o240J218R45J292k590j800n10L065k93J408
2447E4606L75n98J90j013J014J38p79k660o35O43R53j264j225O77J823m30l7J496
2429E3274j222N3m99R58p80R67m248k198L833j728o72o06N09J253L67P13l53j843
2411D7778j422R31k051l35j284L461K942k169l32J037j528m066q05J852J143j336
2395D3816K130m420O23J809K558K54J928j401k831P20Q24K062q30j176j392P56
2379D5430j712L021j483n32J432k258J278O01k037l136M5J576K68j058K332J623
2363D5390l578k366j200j440J858J761J784K207r25l679p50K76N93m48p83p30
2347C7970n92R35j96l19L708k058k494J246k153k685L747L4R0l86j179M008n69
$$ plain form
2464 56157 55327 54653 58260 58915 58840 61871 58111 51871 53089 54034 55326 52736 50936 50426 53491 53198 54606
2447 54606 54981 54383 54573 53560 54574 54712 53933 51273 50638 51281 52234 50970 49745 50422 52245 51815 51778 53274
2429 53274 52052 52105 51606 52564 51784 52751 48503 46305 50138 48410 47738 47132 47641 48894 49261 49974 49621 47778
2411 47778 46356 47287 45236 44901 43617 47078 50020 47851 47519 48556 47028 42962 42157 44009 45152 43816
2395 43816 45946 41526 42149 43958 46516 46770 48698 47297 44466 45186 46010 48072 47242 46066 44674 45430
2379 45430 43718 46739 45256 44724 46156 43898 45176 45777 43740 40604 40649 42225 42493 41435 43767 45390
2363 45390 41812 39446 38246 36806 38664 40425 42209 44416 43491 39812 39062 39338 39931 39483 38700 37970
2347 37970 37378 38313 38117 37798 41506 39448 36954 38200 36047 33362 37109 37143 37233 36847 35668 39676 39107
2330C9107l341j180J869Q24J400J683K62n376P7K794n98k085O53M450L35l714
2314C7160L4J332L214l134k318m11R52K203R6j566j93k559K657J996l565nj527
2297C4366J381J199j073l275j631M391K039j669k07j006J188r10p16J548k108
2282C3517P63K601K93K151q86j217j308j839K46K85j727m41K412J4o37k67k071
2265C1889k713K606M866o55l389m87m24m53K432K061J639m660k468L439k815j451
2249B9417L469l29K581j283K685K755k239l743k10k257k190M90K10l97K38P06
2233B9903L5J869j578J390J897J452k235J747r0n54M54j550J774K2l67j358J456
2216C4267n31L128J203q00p23j825r23j97K338P7k40j709Q05j24k540O80J14q32
$$ plain form
2330 39107 35766 34586 36455 37279 38679 40362 40624 35248 35325 38119 37521 35436 36089 40539 40874 37160
2314 37160 37194 38526 41740 38606 36288 35877 36829 39032 39128 37562 37369 34810 37467 39463 35898 35893 34366
2297 34366 35747 36946 35873 32598 30967 35358 37397 35728 35521 34515 35703 34793 34077 35625 33517
2282 33517 34280 36881 37174 39325 38439 37222 35914 34075 34321 34606 32879 32438 34850 34864 34227 33960 31889
2265 31889 29176 31782 36648 35993 32604 32117 31693 31240 33672 35733 37372 32712 30244 33683 30868 29417
2249 29417 32886 32557 35138 33855 36540 39295 37056 33313 33103 30846 28656 29146 29356 28959 29197 29903
2233 29903 29938 31807 30229 31619 33516 34968 32733 34480 34390 33836 34290 32740 34514 34536 34169 32811 34267
2216 34267 33736 36864 38067 37267 36544 34719 33796 33599 35937 36014 35774 34065 34870 34746 32206 32886 33000 32168
2198C2168L6k705M48L97L713K825k548n44P57k181m92N796Q20k290j895Q52P33
2181C5890P03L759K689j384k063j11m048J061K567j452k355j544m177j460J721
2166B9796K167k21K366j022l035n72r28J404L52r09j142J258K735m657O58j759
2150B6491p78O73Q54K308m280k049q1K595J270l85r13l386j134J442k42R70J078
2133B4433j740j380N53k079p82K076J91k336J22R13j653M36Q72l07J231r10k764
2116A6876L527J580J42J994l406k754K074N228m450k995P73L15j198m11K79R2
2100A7666J95J98O6k72k124N05L732k012j506j611p54K413J678R33K64k234O23
2083A7760l19l547J611L13k335L416L423k902m383M12J528k537K991j487n09J109
$$ plain form
2198 32168 32204 29499 29947 30344 34057 36882 34334 33790 34547 32366 31874 37670 38490 36200 34305 35157 35890
2181 35890 36593 40352 43041 41657 39594 39483 35435 36496 39063 37611 35256 33712 29535 28075 29796
2166 29796 31963 31742 34108 33086 30051 29479 28551 29955 30307 29398 28256 29514 32249 27592 28250 26491
2150 26491 25713 26386 27240 29548 25268 23219 23138 25733 27003 26618 25705 22319 21185 22627 22385 23355 24433
2133 24433 22693 21313 21866 19787 19005 21081 21272 18936 19058 19971 18318 18754 19626 19319 20550 19640 16876
2116 16876 20403 21983 22125 24119 20713 17959 20033 25261 20811 17816 18589 18904 17706 17295 17574 17666
2100 17666 17861 18059 18125 17853 15729 16234 19966 17954 16448 14837 14083 16496 18174 19107 19371 17137 17760
2083 17760 17441 13894 15505 15818 13483 16899 20322 17420 13037 13449 14977 12440 15431 13944 13435 14544
2067A4544J323p19J19k209J451L333k807R10J182k48j840j081J078P70j344q01
2051A3661L867p5O01q33l452j376K668k13k301K586K161k112j096J124m70M234
2035A8974l283m14L96j43r27j913J535R19o5l92k829K413p58l078Q80K78j021
2018A0572J378J520M70K835j442m489j960M002J109k299l64p20m09J778j382n52
2002A0047N48J482N45l11k44m79K018k031J9k052m09j152m92p0K248J699p81l63
1984A0222J118J743j6j046l137J351L87O0j368L162j585j906K196M53j058O95
1968A1271K957k730J727k093j700K184j105K65K252r08J85j396m44L838J055n078
1952A0280p68J413k352M05R48J743J417m66k00j577J120K56m85k085K093p05j086
$$ plain form
2067 14544 15867 15148 15267 13058 14509 17842 15035 15945 17127 16879 15039 13958 15036 15806 14462 13661
2051 13661 17528 17453 18054 17221 13769 12393 15061 14848 12547 15133 17294 15182 14086 15210 14740 18974
2035 18974 15691 15277 15673 15530 14603 12690 14225 15144 15079 14687 11858 14271 13513 10435 11315 11593 10572
2018 10572 11950 13470 13940 16775 15333 10844 8884 12886 13995 11696 11332 10612 10203 11981 10599 10047
2002 10047 10595 12077 12622 12311 12067 11588 13606 11575 11594 9542 9133 7981 7489 7419 9667 11366 10585 10222
1984 10222 11340 13083 13067 12021 8884 10235 10622 10682 9314 12476 10891 8985 11181 11634 10576 11271
1968 11271 14228 11498 13225 11132 9432 11616 10511 10776 13028 12120 12305 10909 10465 14303 15358 10280
1952 10280 9512 10925 8573 8978 9926 11669 13086 12620 12420 10843 11963 12219 11734 9649 11742 11037 9951
1935I951j190j834J276J468p92j71K508k661N70k152l917K950K417k250K981J42
1919I296Q33k522p64K091J201q21l89l093N4J106R68j029J605N3k471L740P25
1902A0583k512L41J706k60j512P38J583l49J550J627k471J32L96m86J120m042
1886H144j887k37K643k844J574L053J465K4m34k299K02K163L95J386k709M67m57
1869A0649k790K463J904l741J966K494m213l125l65L776q44N27J09j848r78l04
1853E680J122p8Q1J310J343J95N89k767N67p79l255J166L932j172j591j666j05
1836D572j322j557J129p17J400K843J074j021K373K182k520P52Q53k879J161j298
1820G025l531J198L36R37l826p17M133J032n99j436J945N31j641j723M67j443
$$ plain form
1935 9951 8761 6927 8203 9671 8879 8708 11216 8555 9125 6973 3056 6006 8423 6173 9154 9296
1919 9296 10129 7607 6843 8934 10135 9314 8925 5832 5886 6992 7960 6931 8536 8589 6118 9858 10583
1902 10583 8071 8412 10118 9858 8346 9084 10667 10318 11868 13495 11024 11156 11552 11066 12186 8144
1886 8144 6257 6020 8663 5819 7393 10446 11911 11935 11501 9202 9404 11567 11962 13348 10639 11106 10649
1869 10649 7859 10322 12226 8485 10451 12945 8732 5607 5242 9018 8174 8701 8810 6962 5984 5680
1853 5680 6802 6724 6805 8115 9458 9653 10242 7475 8042 7263 4008 5174 9106 7934 6343 4677 4572
1836 4572 3250 1693 2822 2105 3505 6348 7422 6401 8774 10956 8436 9188 10041 7162 8323 7025
1820 7025 3494 4692 5028 5965 2139 1422 5555 6587 5988 4552 6497 7028 5387 3664 4131 2688
1804B688j407J809j825K399r68M314N96k610J46N83k017r52K364k203J2J233R62
1787E124j804j696L926K162N35l796k413J710r72O56J033j052k054L98N99J073
1771C429R46M56k015Q42J272j717L504J464k208p35k864j519Q6K073J059K05J410
1754E688q87l614J015O1J180K406q74J19j150Q5K314J711J023k587J848k612j559
1737D167J626j263o20J541k56N60j917J72J73j312Q65R41j427O87m08j41L72m52
1719C308O2O68j70j69j784J614J963P15l035R73N681k798n347m76K328k744J012
1702A801N83k949M27J047k48l45J104j219r25J922L875j630l723q03J029Q28l89
1685C85R27O68J016k401o78j802r38J878K220K247j302r30L26l568L08j222R74
$$ plain form
1804 2688 1281 3090 1265 3664 2696 7010 7606 4996 5142 5725 3708 2756 5120 2917 2929 4162 5124
1787 5124 3320 1624 5550 7712 8247 4451 2038 3748 2776 3432 4465 3413 1359 1757 2356 3429
1771 3429 4375 4831 2816 3658 4930 3213 6717 8181 5973 5238 2374 855 941 3014 4073 4278 5688
1754 5688 4801 1187 2202 2263 3443 5849 4975 5094 3944 4029 6343 8054 9077 6490 8338 5726 4167
1737 4167 5793 4530 3910 5451 5195 5755 3838 4010 4183 2871 3736 4677 3250 3937 3529 3388 3760 3308
1719 3308 3370 4038 3868 3699 1915 3529 5492 6207 3172 4145 9826 7028 1681 1205 3533 789 1801
1702 1801 2384 -565 -138 909 661 316 1420 201 -724 1198 5073 3443 -280 -1083 -54 774 385
1685 385 1312 1980 2996 595 -83 -1885 -2823 -945 1275 3522 2220 1290 1616 -1952 -1644 -2866 -1892
1668a892K26P84p70K040j914j368K531M349K34l111k293N22J98j32J791k144k373
1651c322L345j445o03k735M344R39p31J98J049L76k247J672p87J880N08m47j691
1634C03O35K188j1k229m06J10L455j494k886M37Q0l95J00J43J794j752J00k100
1616a928m45j130N29R17L516K249j115m296j685L620m14O07j456j317K597j75
1600G4k577M034K636N34j243k754k311N29J224P59j8j07l49k96o22R88O79k368
1582a188p31j528L4Q54j777l70M302L390k157L61M44J848M71k428m668q44N213
1565A226p23o18j93J108K63j644k267q8L400k024l94K634L623R66j335k813q90
1548B31L393J629k189o16r72n83j399l189O52q39J287j497R09p01P68K472j69
$$ plain form
1668 -1892 -1666 -882 -1652 388 -1526 -2894 -363 3986 4220 1109 -1184 -662 -464 -596 1195 -949 -3322
1651 -3322 23 -1422 -2025 -4760 -416 523 -208 -10 1039 1415 -832 840 53 1933 2441 1994 303
1634 303 938 3126 3115 886 480 590 4045 2551 -335 102 182 -213 -113 30 1824 72 172 -1928
1616 -1928 -2373 -3503 -2974 -2057 1459 3708 2593 -1703 -3388 232 -182 425 -1031 -2348 249 74
1600 74 -2503 1531 4167 4701 3458 704 -1607 -1078 146 905 887 780 431 135 -487 501 1180 -1188
1582 -1188 -1919 -3447 -3413 -2559 -4336 -4706 -404 2986 829 1190 1634 3482 3953 1525 -3143 -3987 1226
1565 1226 503 -115 -308 800 1063 -581 -2848 -2936 464 -1560 -1954 680 4303 5269 3934 1121 231
1548 231 3624 5253 3064 2448 1476 893 -506 -3695 -3043 -3882 -2595 -4092 -3183 -3884 -3116 -644 -813
1531h13k640J374n01l80R86j272j019P41N47K207N53m05M99K214j083o98n52O57
1513D15L181O60k063k220o66p2k218J17K050K1M69L40l46N81k24j505J083o28
1495a025l68L662l01k047R37o41J314R27l382J15K515k392p07K25Q96Q52n13J183
1477A250L59o36j16l443k78K49K792j673J537k458J190j105j593L105q34Q58j671
1460b467j48j79k447j434L490r31j162L610J143j85j340R4K579k53J486M1k886
1443i89p47K15K875j036J41l905J69J404j412j435J56L542J749k746j552M754
1427A183K649N27j852j606r46J258m328k751M949j50J342k483j424K722J359L401
1411C850j126k153K617O76k945k085N4L239k44l091k066o06K121N76K0K914KK888
$$ plain form
1531 -813 -3453 -2079 -2580 -2960 -1974 -3246 -4265 -3524 -2977 -770 -217 -622 -123 2091 1008 310 -242 415
1513 415 3596 4256 2193 -27 -693 -765 -2983 -2866 -816 -795 -326 14 -332 249 25 -1480 -397 -1025
1495 -1025 -1393 2269 1968 -79 858 217 1531 2458 -924 -809 1706 -686 -1393 -1168 -272 580 67 1250
1477 1250 1609 973 857 -2586 -2864 -2615 177 -1496 41 -2417 -1227 -2332 -3925 -820 -1654 -796 -2467
1460 -2467 -2615 -2794 -5241 -6675 -3185 -4116 -5278 -1668 -525 -710 -2050 -1956 623 370 1856 1897 -989
1443 -989 -1736 -1521 1354 318 459 -3446 -3277 -1873 -3285 -4720 -4564 -1022 727 -2019 -3571 1183
1427 1183 3832 4359 2507 901 -45 1213 -3115 -5866 -917 -1067 275 -2208 -3632 -910 449 3850
1411 3850 2724 571 3188 3864 919 -1166 -1112 2127 1883 -1208 -3274 -3880 -1759 -1183 -1163 1751 1753 4641
1393D641l478j917N71J414J946j276N98m09J469o52l009J043K06M27j849j455
1377a730l10O00J736L81q4k108m15L579P68k911O92N78j166j511j566K033K18
1360a216k425J367j260Q5J280J960j081k095j584J921O61J746j117K033J715k352
1344c62Q37j113J262j308J648m92k3J837m14j52r81j8L31j183o37N07O22O60q08
1325B13R6K042k223m29J453k139k422J013J598q45N42J511j250k00k302N1j387
1308d678P96K37L248q55o82K400j476pp38j645n94J565N41J098N38j497k553M000
1290c02J612r25j673N78n57j773k385Q70L335J262J82q84k77K673J024k392J531
1273A899m12j848k493J89j010K414o25N38L91j378k10L005R51k539K825j934k05
$$ plain form
1393 4641 1163 -754 -183 1231 3177 1901 2499 2090 3559 2907 -102 941 1147 1574 -275 -1730
1377 -1730 -2040 -1440 296 677 593 -1515 -1930 1649 2417 -494 198 776 -390 -1901 -3467 -1434 -1216
1360 -1216 -3641 -2274 -3534 -3449 -2169 -209 -1290 -3385 -4969 -3048 -2387 -641 -1758 275 1990 -362
1344 -362 475 -638 624 -684 964 472 449 2286 1872 1720 739 721 1052 -131 -768 -261 361 1021 213
1325 213 309 2351 128 -301 1152 -987 -3409 -2396 -798 -1643 -1101 410 -840 -1040 -3342 -3291 -4678
1308 -4678 -3882 -3645 -397 -1252 -1934 466 -1010 -1017 -1755 -3400 -3994 -2429 -1888 -790 -252 -1749 -4302 -302
1290 -302 1310 385 -1288 -710 -1267 -3040 -5425 -4555 -1220 42 224 -660 -937 1736 2760 368 1899
1273 1899 1487 -361 -2854 -2665 -3675 -1261 -1886 -1348 -957 -2335 -2545 460 1411 -1128 1697 -237 -442
1256d42l810j163m72L350P43j306l26o1K594M92k676j170M92L88J986j129J40
1239b370J247O04j816q62J61J4R39k890J222n50j498J655K363l310j602K522N03
1222c668K067J464r44L91K018n53l177l347M382k352j824N5L35N61L026K5l169
1205d710m439K088K897K409J645k983J794k345Q80l228J07J045J611m2m96K129
1189a638n68o07J562j147j065Q20j392j99J476J908J296j441N50k075o0J65j477
1172c892j759O91J985l219R08n88K528p36K239K370k55k072j827j580K25K137
1156b845n83k727l402J955L322k982K664k47m46l03R77L94L88k92j719K166j320
1139e000O35L54K673m91k53P34J01j290j663j721R20K049J055J684j657m81J741
$$ plain form
1256 -442 -4252 -5415 -5887 -2537 -1794 -3100 -3426 -3487 -893 -401 -3077 -4247 -3755 -3367 -1381 -2510 -2370
1239 -2370 -1123 -519 -2335 -3197 -3036 -3022 -2083 -4973 -3751 -4301 -5799 -4144 -1781 -5091 -6693 -4171 -3668
1222 -3668 -1601 -137 -1081 -690 1328 775 -2402 -5749 -1367 -3719 -5543 -5488 -5153 -4592 -1566 -1541 -4710
1205 -4710 -9149 -7061 -4164 -1755 -110 -3093 -1299 -3644 -2764 -5992 -5885 -4840 -3229 -3271 -3767 -1638
1189 -1638 -2206 -2813 -1251 -2398 -3463 -2643 -4035 -4234 -2758 -850 446 -995 -445 -2520 -2580 -2415 -3892
1172 -3892 -5651 -4960 -2975 -6194 -5286 -5874 -3346 -4082 -1843 527 272 -1800 -3627 -5207 -4982 -2845
1156 -2845 -3428 -6155 -9557 -7602 -4280 -7262 -4598 -4845 -5291 -5594 -4617 -4223 -3835 -4127 -5846 -3680 -5000
1139 -5000 -4365 -4011 -1338 -1829 -2082 -1348 -1247 -2537 -4200 -5921 -5001 -2952 -1897 -213 -1870 -2351 -610
1122f10O7K668L65j438l960P05j154r68J333L605j702j498q18J0L077k220k7M231
1104A666J492l733m066J038J743R88j458k408j8J175R82k354M179Q66k427j174
1088c509Q82j246J466l19j984J088J80k37j093K154m71r70r35L462J413l311K248
1071a182j63k769P92L1J799R45j659j327J823J758j439k306J361J283k969K210
1055a812L5p66J337J149j34J053m89L99l213k596Q71J161J432J485k885p5J438
1038a610j375j462N56R57J74j309K34j546J695o74j214L609K240j62j700j662
1022c249M778o44q19j342l23R28M1J879k127L53l70R40l15Q18q88r49j364P03
1004a950K414O81l038J077M5k636K190j114P1j142N61J354j020K196k053j712
$$ plain form
1122 -610 -543 2125 2490 1052 -2908 -2203 -3357 -4325 -2992 613 -1089 -2587 -3405 -3395 -318 -2538 -2565 1666
1104 1666 3158 -575 -4641 -3603 -1860 -872 -2330 -4738 -4756 -3581 -2599 -4953 -774 92 -2335 -3509
1088 -3509 -2627 -3873 -2407 -2726 -4710 -3622 -3442 -3679 -4772 -2618 -3089 -4059 -4994 -1532 -119 -3430 -1182
1071 -1182 -1345 -4114 -3322 -3291 -1492 -547 -2206 -3533 -1710 48 -1391 -3697 -2336 -1053 -4022 -1812
1055 -1812 -1777 -2543 -1206 -57 -191 862 373 772 -2441 -5037 -4166 -3005 -1573 -88 -2973 -3048 -1610
1038 -1610 -2985 -4447 -3891 -2934 -2760 -4069 -3835 -5381 -3686 -4360 -5574 -1965 275 113 -1587 -3249
1022 -3249 1529 885 66 -1276 -1599 -671 -630 1249 -878 -525 -895 45 -270 548 -340 -1289 -2653 -1950
1004 -1950 464 1145 -1893 -816 -771 -3407 -1217 -2331 -2260 -3402 -2841 -1487 -2507 -311 -2364 -4076
988d076M08N365j268l071k01K242j080N97J446k63j108j024J49r29j558J326O72
971b373K224p78J875k810j790M845k259M50R61p81L37j693j045j669K549J746
955b11r20n37k809K438p36o44J36J406M109j635l9k128K183M065j658j279L021
938D762n71l590j194J609k714m30K756M83N20k065j466j428J336j21j050j078
922d241L571k34J448l353p61l5J622R02q96K255J933l142m37R78m670j310L930
905b440L226j712J801j342J51J07N10r50Q86j288l273m63l94K673o59l4o59m86
887d346J751K983k486j402m72J141m13n54l43J796L3O24k72J945K68j808M38q80
869a997J01J48k100Q18n60J082K358q09j230n23R00j591J646j629p74K64M72Q78
$$ plain form
988 -4076 -3668 1697 429 -2642 -2843 -601 -1681 -1084 362 99 -1009 -2033 -1884 -2813 -4371 -3045 -2373
971 -2373 -149 -927 948 -1862 -3652 1193 -1066 -616 345 -436 -99 -1792 -2837 -4506 -1957 -211
955 -211 -1131 -1668 -4477 -2039 -2775 -3419 -3283 -1877 2232 597 558 -1570 613 4678 3020 1741 4762
938 4762 4191 601 -593 1016 -1698 -2128 628 1111 1631 -434 -1900 -3328 -1992 -2113 -3163 -4241
922 -4241 -670 -904 544 -2809 -3570 -3605 -1983 -1081 -1977 278 2211 -931 -1368 -390 -5060 -6370 -2440
905 -2440 786 -926 875 -467 -316 -209 301 -649 237 -1051 -4324 -4787 -5181 -2508 -3167 -3201 -3860 -4346
887 -4346 -2595 388 -2098 -3500 -3972 -2831 -3244 -3798 -4141 -2345 -2312 -1688 -1960 -15 253 -1555 -1117 -1997
869 -1997 -1896 -1748 -3848 -3030 -3590 -2508 -150 -959 -2189 -2712 -1812 -3403 -1757 -3386 -4160 -3896 -3424 -2546
851b546N30L031q26M84j429j36Q37K54q05j950N98K316J774n851j65K135K371
834F22k429R15p09J465j24J417J33Q4m9l669p39L036j409K907k230m37M23M09
816c84K31n59K105l00K786m81j020j336j179k466K69K993K661m607j557J069M39
799a336k206l15J762J232J063q85O04N25j676K435n75j664j863j552J296K320
783h35j295J666Q07L31J022N48K79k885p44M371j903j943J777K777l492p86l044
766c349k400J486N84L399M78l29j615K26K630N37M6l910j036J960m40J106k35
749h62L22J658J835o40J226l403l11J899j91K98O5j625j751j406K809m57Q55m69
731a48L438j261j858j20K58J795J8n544M77J969m0k012j351L184N77P66J538Q6
$$ plain form
851 -2546 -2016 1015 189 673 -756 -892 -55 199 -606 -2556 -1958 358 2132 -3719 -3884 -1749 622
834 622 -1807 -892 -1601 -136 -260 1157 1290 1374 1325 -2344 -3083 -47 -1456 1451 -779 -1216 -793 -384
816 -384 -153 -712 1393 1093 3879 3398 2378 1042 -137 -2603 -2334 659 3320 -1287 -2844 -1775 -1336
799 -1336 -3542 -3857 -2095 -863 200 -685 -81 444 -1232 1203 628 -1036 -2899 -4451 -3155 -835
783 -835 -2130 -464 343 674 1696 2244 2523 -362 -1106 3265 1362 -581 1196 3973 481 -305 -3349
766 -3349 -5749 -4263 -3679 -280 198 -131 -1746 -1520 1110 1647 1693 -2217 -3253 -1293 -1733 -627 -862
749 -862 -540 1118 2953 2313 3539 136 -175 1724 1533 1831 1896 271 -1480 -2886 -77 -534 321 -148
731 -148 3290 2029 171 51 309 2104 2122 -3422 -2945 -976 -1016 -3028 -4379 -1195 -618 148 1686 1772
713A772j180M90J710L90m692k228M660J81j990p98j290J302k263M096j284j890
697c014K482J253J216J229k899n90P60L204o01l870j553R72K248k438j352J545
681a408n81k394L461J601o76J552j806k157L363J678j275k211r30K033L49K031
665B630Q21o52k974J738o54j084K379j07n87j678o09j161K049P23j635J003J515
648A717N65J466l021k473M118q8j561j394N03j071J36K389P52k383K837j567j682
631g57n39n45J834l690M579J259k566L576O62p90K68N67O05j435J491k041k011
614D67m50J581q79j297m85J7K942q71K032o89k132P23j445o04n42K838J695j13
596B788l873k582O43L08K441j76J659J891j899n91j220P23J580P83j161q9k562
$$ plain form
713 1772 592 1082 2792 3182 -1510 -3738 922 1103 -887 -1685 -2975 -1673 -3936 160 -1124 -3014
697 -3014 -532 721 1937 3166 267 -323 437 3641 3040 -830 -2383 -1411 837 -1601 -2953 -1408
681 -1408 -1989 -4383 -922 679 3 1555 -251 -2408 955 2633 1358 -853 -1783 250 599 2630
665 2630 3451 2799 -175 1563 909 -175 2204 2097 1510 -168 -777 -1938 111 834 -801 202 1717
648 1717 2282 3748 727 -1746 2372 2284 723 -671 -168 -1239 -1103 1286 2038 -345 2492 925 -757
631 -757 -1296 -1841 -7 -3697 882 2141 -425 3151 3813 3023 3291 3858 4463 3028 4519 2478 467
614 467 17 1598 719 -578 -1063 -1046 1896 1025 3057 2368 236 959 -486 -1090 -1632 1206 2901 2788
596 2788 -1085 -3667 -3024 -2716 -275 -451 1208 3099 1200 609 -611 112 1692 2475 1314 1225 -1337
579a337J62L189J35q97k15M30q12p03j531N62R22M70M04j862J18Q81K50J599j441
560C24Q60j109l56J392j173N11J287j557l774K031N483J529l918J37j665O43R40
543A585j239K898J04j168k854K743Q60j764n6J526Q28J799l897j265J883k203
527b20K216o63k22o70L86O29K429J624J642l390J312K349k143o2j207l27j224
510B459J75l39P19j144o60j106L203O71k076J212K82R08R1O20j822j09J322j299
492C107M7j969K371j242K983l010j598L2k78J645j853J700j039j154r72J322l596
475c504J051K534k423L867J739p04j7j428q83L40j859K125J116j355j415o7J388
458E05N71K577j571N95l107M621J238k143M50k25K65k786q85N56j026m00K261
$$ plain form
579 -1337 -1175 2014 2149 1252 1037 1467 655 -48 -1579 -1017 -95 375 779 -1083 -965 -84 166 1765 324
560 324 1184 75 -281 1111 -62 449 1736 179 -3595 -1564 3919 5448 1530 1667 2 645 1585
543 1585 346 3244 3348 2180 -674 2069 2929 1165 1109 2635 3463 5262 1365 100 1983 -220
527 -220 1996 1333 1111 441 827 1456 3885 5509 7151 3761 5073 7422 5279 5217 4010 3683 2459
510 2459 2634 2295 3014 1870 1210 104 3307 3978 1902 3114 3396 4304 4395 5015 3193 3084 4406 3107
492 3107 3154 1185 3556 2314 5297 2287 689 721 443 2088 235 1935 896 -258 -1230 92 -3504
475 -3504 -2453 81 -2342 1525 3264 2560 2543 1115 232 572 -1287 838 1954 599 -816 -883 505
458 505 1076 3653 2082 2677 -430 4191 5429 3286 3736 3511 3776 990 105 661 -365 -765 1496
441A496J301l857j224R53j31P96L648J294O55j208o29N85j598j055M02J364P83
424C575j526K213L091l728n17K080q6k862R36r83j930O5J971L35P64l044j321
407i67K312L413K207k301K8L02j567J403J745k088L6r59l3J978n38j827j170j06
389A868L195J968L53n41k71q75q98l413L610m99l14J259J404K501k249k573j217
372C308M72j177p70N29o49J438J63R84L178q79m76l49K757k022j216l086M998
355G203J33k653j450O5L560J32l941J934R63k125j109O11K002k390J753r89j790
338A909N463L2j374j348k003K339N58j034j865K253K347n51o75j204J775J475
322H097j269n70j795j708K797O0J4n74J459O00k424O6l734K495K83k584o39J498
$$ plain form
441 1496 2797 -1060 -2284 -1331 -1462 -666 2982 4276 4931 3723 3094 3679 2081 1026 1428 2792 3575
424 3575 2049 4262 7353 3625 3108 5188 5102 2240 3176 2193 263 328 2299 2634 3398 354 -967
407 -967 1345 4758 6965 4664 4692 4994 3427 4830 6575 4487 4523 3564 3531 5509 4971 3144 1974 1868
389 1868 5063 7031 7384 6843 6572 5697 4799 1386 4996 4497 4183 5442 6846 9347 7098 4525 3308
372 3308 3780 2603 1833 2362 1713 3151 3314 4298 7476 6597 6121 5772 8529 6507 5291 2205 7203
355 7203 7336 4683 3233 3298 6858 6990 3049 4983 5946 3821 2712 3323 5325 2935 4688 3699 1909
338 1909 7372 7404 6030 4682 2679 5018 5576 4542 2677 4930 7277 6726 6051 4847 6622 8097
322 8097 6828 6258 4463 2755 5552 5612 5626 5052 6511 7111 4687 4753 1019 3514 3797 1213 574 2072
304B072o67L327J25n97K056K511j46j996j632k282k499K062J699K137j47l20n37
287E166j643N6j729J704L786j078m13j489n8K51k047M13J138L94j275J092J299
270E567M2l573P31J033K698R15l03j658J755j842J157P34o94p03k102j699K550
253D608J562l35K69n70O73K621k143q82Q15r74J600J749o04j870J87q93k08j208
235D397L43K142J005j738N65Q06n19J18N9j765p83P03J713R19K33j432k206L72
217D932L33N1j404m589L547J229k005K581Q36j433J783o8n58J57J350o63P62P47
199G588K068k308k561n7J893j05K89J26O07k502K006O27k989k071j80L052j315
182D168J85r30j141m46L688o21J729L97o59K094j657j726n34K201l69P89J946
$$ plain form
304 2072 1405 4732 4857 4260 6316 8827 8681 6685 5053 2771 272 2334 4033 6170 6023 5703 5166
287 5166 3523 3579 1850 3554 7340 6262 5849 4360 4302 4553 2506 2919 4057 4451 3176 4268 5567
270 5567 5609 2036 2767 3800 6498 7413 7110 5452 7207 5365 6522 7256 6562 5859 3757 2058 4608
253 4608 6170 5835 6104 5534 6207 8828 6685 5803 6618 5644 7244 8993 8389 6519 6706 5813 5605 4397
235 4397 4740 6882 7887 6149 6714 7520 7001 7119 7178 5413 4630 5333 7046 7965 8198 6766 4560 4932
217 4932 5265 5316 3912 -677 2870 4099 2094 4675 5511 4078 5861 5793 5235 5392 6742 6079 6841 7588
199 7588 9656 7348 4787 4730 6623 6518 6807 6933 7540 5038 7044 7671 4682 2611 2431 5483 4168
182 4168 4353 3423 2282 1836 5524 4903 6632 7029 6370 8464 6807 5081 4547 6748 6379 7168 9114
165I114l819p23P01K504Q26O17k381M6Q59j200r66j830J105L324j892k670P70
148D385J678K30l034K13J651K580K29k529M76Q39J4j147L095n46m60K457k486
131G645Q5M71J156k406L22R27l82j659K38J032j577j685j023M042K606j203l842
114D747J248N61Q47R74o18j123j11j224L61l63J762l81q75j605MK977M00j625
96E956N3j470K276L24o41p53L10R65K79K31k835P89N06q00R00K67o73k55p56o32
76D041l20K845k017J005K493k435n06L77J022k43o90j5j024K63K235K88j697N51
58F173K174j03r06r64k08J664j160J338j688N55J290j180p73J662J838n2j448
41H212p18K70J444j853n33n58K204J45o78Q19J46jj931q88J695n63k13K593O63
$$ plain form
165 9114 5295 4572 5273 7777 8603 9220 6839 6885 7744 6544 5578 3748 4853 8177 6285 3615 4385
148 4385 6063 6293 3259 3472 5123 7703 7932 5403 5879 6718 6732 5585 8680 8134 7674 10131 7645
131 7645 7730 8201 9357 6951 7273 8200 7818 6159 6397 7429 5852 4167 3144 7186 9792 8589 4747
114 4747 5995 6556 7403 8377 7759 6636 6525 5301 5662 5299 7061 6680 5805 4200 4204 7181 7581 5956
96 5956 6009 4539 6815 7139 6498 5745 6055 7020 7299 7530 4695 5484 5990 5190 6090 6357 5684 5429 4673 4041
76 4041 3721 6566 4549 5554 8047 5612 5106 5483 6505 6262 5572 5557 4533 4796 7031 7319 5622 6173
58 6173 8347 8244 7338 6374 6166 7830 6670 8008 6320 6875 8165 6985 6212 7874 9712 9660 8212
41 8212 7494 7764 9208 7355 6822 6264 8468 8613 7935 8754 8900 8899 6968 6080 7775 7212 6999 9592 10255
22A0255j852k049J866m14M41k721k32J766j099J569j469o77k091K384K108R9k360
5E524Q06L14P2L85J229
0H330
$$ plain form
22 10255 8403 6354 8220 7806 8247 5526 5294 7060 5961 7530 6061 5384 3293 5677 7785 7884 5524
5 5524 6330 6644 6716 7101 8330
0 8330
$$ Imaginary data points
##PAGE= N=2
##DATA TABLE= (X++(I..I)), XYDATA
16383e93751P849M444N977Q376Q340P595P368O900Q396O770P419N456P023M555
16369d97283R057P789Q157N186O356P928N370P267Q268N795Q796N408N517P379
16355c99010O378N542O166R478P119O020N436Q393P292N433O847O081Q093Q839
16341c01893N065P089N173O293Q302P499N343O209P197N779M841P554O277P550
16327b11722O228M060O309M817Q372R115N918L984P857N117M838O351O006P546
16313a25204O645M058L755Q338L569O148P339O171O209N026N935Q471P532N675
16299d0333M942K631M727N308R363N057J666O910N271N651M200N434N645O395
16285C2867O552L521P302N089K845P334N442K977L003Q529K326L550O637L562
$$ plain form
16383 -593751 -585902 -581458 -575481 -567105 -558765 -551170 -543802 -536902 -528506 -521736 -514317 -508861 -501838 -497283
16369 -497283 -488226 -480437 -472280 -467094 -460738 -452810 -447440 -440173 -431905 -426110 -417314 -411906 -406389 -399010
16355 -399010 -392632 -387090 -380924 -371446 -364327 -358307 -352871 -344478 -337186 -331753 -324906 -318825 -310732 -301893
16341 -301893 -296828 -289739 -284566 -278273 -269971 -262472 -257129 -250920 -243723 -237944 -233103 -225549 -219272 -211722
16327 -211722 -205494 -201434 -195125 -190308 -181936 -172821 -166903 -162919 -155062 -149945 -145107 -138756 -132750 -125204
16313 -125204 -118559 -114501 -110746 -102408 -98839 -92691 -85352 -79181 -72972 -67946 -62011 -53540 -46008 -40333
16299 -40333 -35391 -32760 -28033 -22725 -13362 -8305 -6639 271 5542 11193 15393 20827 26472 32867
16285 32867 39419 42940 50242 55331 58176 65510 70952 73929 76932 85461 87787 91337 97974 101536
16271A01536L674P135P554L630K061L898N769M840K999K440M935O669M341K649
16257A64130N205N211N972L018K937O044M029L343M821N357M323M48L012M446
16243B22296M227N604N658L291K276L471K610L422O204K961J955L181K368N263
16229B74787K899K694L991M506L721M261K910L218M289L198K044Q63M409J362
16215C19152K50L614K235M661K717L375J916J477O321K387L309K189K264M081
16201C59948J984j047K513L835L808L198L885M70J694K546K998J495J635L241
16187C92203J319m40J421M161K927K911Q85K511R78M92L836J628Q58O0L859L615
16171D23224n33J709K580M928J976n16J673K293K09J582J152P87l27L373M825
$$ plain form
16271 101536 105210 112345 119899 123529 125590 129488 135257 140097 143096 145536 150471 157140 161481 164130
16257 164130 169335 174546 180518 183536 186473 192517 196546 199889 204710 210067 214390 214838 217850 222296
16243 222296 226523 232127 237785 241076 243352 246823 249433 252855 259059 262020 263975 267156 269524 274787
16229 274787 277686 280380 284371 288877 292598 296859 299769 302987 307276 310474 312518 313381 317790 319152
16215 319152 319402 323016 325251 329912 332629 336004 337920 339397 345718 348105 351414 353603 355867 359948
16201 359948 361932 360885 363398 367233 371041 374239 378124 378594 380288 382834 385832 387327 388962 392203
16187 392203 393522 393082 394503 398664 401591 404502 405387 407898 408876 409368 413204 414832 415690 415750 419609 423224
16171 423224 422691 424400 426980 431908 433884 433368 435041 437334 437543 439125 440277 441064 440737 444110 448935
16156D48935M07J608N07k943J316N201J063%L553K9j074P01L597o10J215J172
16140D64677L210J548K553J745O88N35j573L17l47J757J863l608K723L550r85
16125D78653L160K475Q38O49J195K345r21n27j091j585N88M39J504J359N4j162
16109D87973L470l21j21K63L003L131J66j062J958m25L57J810j222J302J65N31
16093E00978R95l250J070O17N02K968J660O0j17l01j07r33J437k045j276k74M661
16076E06645L541j473J56p36J31M82K245J219k310J93k384J006r42K279L682j024
16060E12710j86K578k149m04J359P1L8J449o88j672K611J698j383j641k747K006
16044E13650K206k061J53K307n61P38J835J105P71l592k44q04K605q75K700j027
$$ plain form
16156 448935 449342 450950 451457 448514 449830 455031 456094 456094 459647 459676 458602 459303 462900 462290 463505 464677
16140 464677 467887 469435 471988 473733 474421 474956 473383 473700 473353 475110 476973 473365 476088 479638 478653
16125 478653 481813 484288 485126 485775 486970 489315 488394 487867 486776 485191 485779 486218 487722 489081 489135 487973
16109 487973 491443 491122 491001 491264 494267 497398 497564 496502 498460 498035 498392 500202 498980 500282 500447 500978
16093 500978 501973 498723 499793 500410 500912 503880 505540 505600 505483 505182 505075 504142 505579 503534 502258 501984 506645
16076 506645 510186 508713 508869 508133 508264 508746 510991 512210 509900 510093 507709 508715 507773 510052 513734 512710
16060 512710 512524 515102 512953 512549 513908 513979 514017 515466 514778 513106 515717 517415 516032 514391 511644 513650
16044 513650 515856 513795 513948 516255 515694 516432 518267 519372 520143 516551 516307 515503 518108 517233 519933 518906
16028E18906j450j384m145K936L028K115j954k171K219q57K216j413J051j075
16014E18022p36j566J728j465R23j191k30P17J427O70K732N50l666j797J598J531
15998E19247J854k365R59n43j302K034j094l05R41j88k071L321J05o77n95J286
15982E20607M71J479j657l903J214J048L086O09J965j840l208J33Q20J549k529
15967E19844O33J546k610k6K637o57k023K18J056n27K574j232K19o378J227J732
15951E18233l326L159L725J236P05j41k683j759K662K123o77k8J442k130L024
15936E25565j757m088k82L223q16J79R45j31K53J80M16l270J337R96l56J009R8
15919E23501j78R14k065l461L130L308j568K105m743j792L174J507L305m23j956
$$ plain form
16028 518906 517456 516072 511927 514863 517891 520006 518052 515881 518100 517243 519459 518046 519097 518022
16014 518022 517286 515720 517448 515983 516906 515715 515485 516202 517629 518299 521031 521581 517915 516118 517716 519247
15998 519247 521101 518736 519695 519152 517850 519884 518790 518485 519426 519238 517167 520488 520593 519916 519321 520607
15982 520607 521078 522557 520900 516997 518211 519259 522345 522954 524919 523079 519871 520004 520824 522373 519844
15967 519844 520477 522023 519413 519387 522024 521367 519344 519562 520618 520091 522665 521433 521652 515274 516501 518233
15951 518233 514907 518066 521791 523027 523732 523591 520908 519149 521811 523934 523257 523229 524671 522541 525565
15936 525565 523808 519720 519438 522661 521845 522024 522969 522838 523091 523271 523687 520417 521754 522750 522394 523403 523501
15919 523501 523323 524237 522172 518711 521841 525149 523581 525686 520943 519151 522325 523832 527137 526714 524758
15904E24758j259j471K164K209m4L67J405K05k55Q24K854n646k471j581K351j31
15888E24279k039Q44K361L86k575K889k800k447k679K683J947J410j596J67m4
15873E22786Q30J450L74q32K707k367l48O82K865j624l227R17J280R31m3J113
15857E27494Q80J93k884j664J749O20Q9n89r24K575K428k680R48j213l694J256
15841E24584j287J922P45J219K427J84l463q53J138O03J985O15l535J830k890
15826E25224r67K016p98j585J465l32J67j658K041J253J974J24j08J006J290j309
15810E29803J862P99l715j220Q34J465k767j872o50K166K13K584K97N92q5j762
15794E28544J813l159j084K311p67o53N069k716j876J922k114J548J321m55m04
$$ plain form
15904 524758 523499 522028 524192 526401 526357 526724 528129 528334 528079 528903 531757 526111 523640 522059 524410 524279
15888 524279 522240 523084 525445 525831 523256 526145 523345 520898 518219 520902 522849 524259 522663 522830 522786
15873 522786 523616 525066 525440 524608 527315 524948 524600 525282 528147 526523 523296 524213 525493 526424 526381 527494
15857 527494 528374 528567 525683 524019 525768 526388 526477 525888 524964 527539 529967 527287 528235 527022 523328 524584
15841 524584 523297 525219 525964 527183 529610 529794 526331 525478 526616 527219 529204 529819 526284 528114 525224
15826 525224 524257 526273 525475 523890 525355 525023 525190 523532 525573 526826 528800 528924 528816 529822 531112 529803
15810 529803 531665 532464 528749 527529 528363 529828 527061 525189 524539 526705 526918 529502 529799 530391 530306 528544
15794 528544 530357 527198 526114 528425 527658 527005 532074 529358 527482 529404 527290 528838 530159 529704 529300
15779E29300n03q81l31o16J38p31M200J161k392r09j222J196j469L884M790m140
15763E31475j153L84r21O48K469O50j758k9j579k649J527J553r20M18K980q35
15747E32260j993K021J085R3l029k68Q11J632j479j307l03l9K230K940o02j958
15731E32094j671l88K439k036Q0K268j51j401J00K517j092l821O08j559J761O21
15715E30369k811J711L375L42j981k22n53j331J137P34K122k078J42k276j128
15700E27552k11M009R71k766K546N28r53J336P45p27K323j387N16j780q73r30
15684E30899k231O137k136J735r46l61k75J703j873l25J330j653N257k162l467
15669E31632j058K39k2q61R21R08n02L919K603k151j099l42J210p33j148k881
$$ plain form
15779 529300 528797 527916 527585 526969 527107 526376 530576 531737 529345 528436 527214 528410 526941 530825 535615 531475
15763 531475 530322 530706 529785 530433 532902 533552 531794 531765 530186 527537 529064 530617 529697 530115 533095 532260
15747 532260 530267 532288 533373 533466 530437 530169 530980 532612 531133 529826 529523 529484 531714 534654 534052 532094
15731 532094 530423 530035 532474 530438 530518 532786 532635 531234 531334 533851 532759 528938 529546 527987 529748 530369
15715 530369 527558 529269 532644 532986 531005 530783 530230 528899 530036 530770 532892 530814 530956 528680 527552
15700 527552 527341 531350 532321 529555 532101 532629 531676 533012 533757 533030 535353 533966 534482 532702 531829 530899
15684 530899 528668 534805 532669 534404 533458 533097 532822 534525 532652 532327 533657 532004 537261 535099 531632
15669 531632 530574 530813 530791 529930 530851 531759 531257 535176 537779 535628 534529 534187 535397 534664 533516 530635
$$ [...]
##END NTUPLES=NMR SPECTRUM
##END=
