##TITLE=1H_CA-9256-1
 
 8 sc, 
 1.4.2024
##JCAMPDX= 6.0         $$ Bruker NMR JCAMP-DX V2.0
##DATA TYPE= NMR SPECTRUM
##DATA CLASS= NTUPLES
##ORIGIN= UXNMR, Bruker Analytische Messtechnik GmbH
##OWNER= root
$$ XWIN-NMR		Version 3.5
$$ Mon Apr  1 15:51:54 2024 Russian Standard Time (UT+4h)  she@DPX200
##.OBSERVE FREQUENCY= 200.1312
##.OBSERVE NUCLEUS= ^1H
##.ACQUISITION MODE= SIMULTANEOUS
##.ACQUISITION SCHEME= undefined
##.AVERAGES= 8
##.DIGITISER RES= 18
##SPECTROMETER/DATA SYSTEM= spect
##.PULSE SEQUENCE= zg30
##.SOLVENT NAME= D2O
##.SHIFT REFERENCE= (INTERNAL, D2O, 0, 17.0724)
##AUDIT TRAIL= $$ (NUMBER, WHEN, WHO, WHERE, WHAT)
$$ ##TITLE= Audit trail, XWIN-NMR		Version 3.5
$$ ##JCAMPDX= 5.01
$$ ##ORIGIN= Bruker BioSpin GmbH
$$ ##OWNER= she
$$ F:/spectra/data/she/nmr/H-F/1/pdata/1/auditp.txt
$$ ##AUDIT TRAIL=  $$ (NUMBER, WHEN, WHO, WHERE, WHAT)
(   1,<2024-04-01 15:50:16.15 +0400>,<she>,<DPX200>,
      <created by zg, POWCHK disabled, PULCHK disabled
       configuration hash MD5:
       00 E9 B6 7A A2 85 ED C7 34 08 36 98 17 FE 4E 26
       data hash MD5: 16K
       23 96 BD 6C BC B1 42 9F 40 32 13 26 AB 49 03 02>)
(   2,<2024-04-01 15:50:51.53 +0400>,<she>,<DPX200>,
      <Start of raw data processing
       efp BC_mod = 2 LB = 0.24 FT_mod = 6 PKNL = 1 PHC0 = -25383.37 PHC1 = 14.18731 SI = 16K 
       data hash MD5: 16K
       1F 61 6E 28 7D 1A 80 A4 DF 65 35 6D 76 EA A4 65>)
(   3,<2024-04-01 15:51:07.90 +0400>,<she>,<DPX200>,
      <pk PHC0 = 5.545306 PHC1 = -6.799999 
       data hash MD5: 16K
       59 A8 69 51 7C A8 89 2E CB 57 97 EB EB 61 DF A0>)
(   4,<2024-04-01 15:51:11.34 +0400>,<she>,<DPX200>,
      <abs ABSG = 5 
       data hash MD5: 16K
       0C 15 90 A4 A0 44 E8 54 28 39 C1 13 18 84 58 72>)
$$ ##END=
$$ 
$$ hash MD5
$$ 15 84 8C 99 59 52 D9 9F 6A 6B 7B 61 4E 01 DC A7
##$RELAX= 
##$RELAX= 
##$RELAX= 
##$RELAX= 
##$RELAX= 
##$RELAX= 
$$ Bruker specific parameters
$$ --------------------------
##$DU= <F:/spectra>
##$EXPNO= 1
##$NAME= <H-F>
##$PROCNO= 1
##$TYPE= <nmr>
##$USER= <she>
##$AMP= (0..31)
100 100 100 100 100 100 100 100 100 100 100 100 100 100 100 100 100 100 
100 100 100 100 100 100 100 100 100 100 100 100 100 100 
##$AQSEQ= 0
##$AQ_mod= 1
##$AUNM= <au_zg>
##$AUTOPOS= <>
##$BF1= 200.13
##$BF2= 200.13
##$BF3= 200.13
##$BF4= 200.13
##$BF5= 200.13
##$BF6= 200.13
##$BF7= 200.13
##$BF8= 200.13
##$BYTORDA= 1
##$CFDGTYP= 0
##$CFRGTYP= 5
##$CHEMSTR= <none>
##$CNST= (0..31)
1 1 145 1 1 1 1 1 1 1 1 1 1 1 1 1 1 1 1 1 1 1 1 1 1 1 1 1 1 1 1 1 
##$CPDPRG= <>
##$CPDPRG1= <>
##$CPDPRG2= <>
##$CPDPRG3= <>
##$CPDPRG4= <mlev>
##$CPDPRG5= <mlev>
##$CPDPRG6= <mlev>
##$CPDPRG7= <mlev>
##$CPDPRG8= <mlev>
##$CPDPRGB= <>
##$CPDPRGT= <>
##$D= (0..31)
0 1.2 0 0 0 0 0 0 0 0.06 0 0.03 0 0 0 0 0.0002 0 0 0 0 0 0 0 0 0 0 0 0 
0 0 0 
##$DATE= 1711972215
##$DBL= (0..7)
120 120 120 120 120 120 120 120 
##$DBP= (0..7)
150 150 150 150 150 150 150 150 
##$DBP07= 0
##$DBPNAM0= <>
##$DBPNAM1= <>
##$DBPNAM2= <>
##$DBPNAM3= <>
##$DBPNAM4= <>
##$DBPNAM5= <>
$$ [...]
##$SUBNAM3= <"">
##$SUBNAM4= <"">
##$SUBNAM5= <"">
##$SUBNAM6= <"">
##$SUBNAM7= <"">
##$SUBNAM8= <"">
##$SUBNAM9= <"">
##$SW= 18.0517418723606
##$SWIBOX= (0..15)
0 0 2 0 0 0 0 0 0 0 0 0 0 0 0 0 
##$SW_h= 3612.71676300578
##$TD= 16384
##$TD0= 1
##$TE= 0
##$TE2= 300
##$TE3= 300
##$TEG= 300
##$TL= (0..7)
0 120 120 120 120 120 120 120 
##$TP= (0..7)
150 150 150 150 150 150 150 150 
##$TP07= 0
##$TPNAME0= <>
##$TPNAME1= <>
##$TPNAME2= <>
##$TPNAME3= <>
##$TPNAME4= <>
##$TPNAME5= <>
##$TPNAME6= <>
##$TPNAME7= <>
##$TPOAL= (0..7)
0.5 0.5 0.5 0.5 0.5 0.5 0.5 0.5 
##$TPOFFS= (0..7)
0 0 0 0 0 0 0 0 
##$TUNHIN= 0
##$TUNHOUT= 0
##$TUNXOUT= 0
##$USERA1= <user>
##$USERA2= <user>
##$USERA3= <user>
##$USERA4= <user>
##$USERA5= <user>
##$V9= 5
##$VALIST= <valist>
##$VCLIST= <CCCCCCCCCCCCCCC>
##$VD= 0
##$VDLIST= <DDDDDDDDDDDDDDD>
##$VPLIST= <PPPPPPPPPPPPPPP>
##$VTLIST= <TTTTTTTTTTTTTTT>
##$WBST= 1024
##$WBSW= 4
##$XGAIN= (0..3)
0 0 0 0 
##$XL= 0
##$YL= 0
##$YMAX_a= 295659
##$YMIN_a= -278566
##$ZGOPTNS= <>
##$ZL1= 120
##$ZL2= 120
##$ZL3= 120
##$ZL4= 120
##$ABSF1= 17.07239
##$ABSF2= -0.9794979
##$ABSG= 5
##$ABSL= 3
##$ALPHA= 0
##$AQORDER= 0
##$ASSFAC= 0
##$ASSFACI= 0
##$ASSFACX= 0
##$ASSWID= 0
##$AUNMP= <proc_1d>
##$AZFE= 0.1
##$AZFW= 0.1
##$BCFW= 0
##$BC_mod= 2
##$BYTORDP= 0
##$COROFFS= 0
##$CY= -3
##$DATMOD= 1
##$DC= 0
##$DFILT= <>
##$DTYPP= 0
##$F1P= 0
##$F2P= 0
##$FCOR= 1
##$FTSIZE= 16384
##$FT_mod= 6
##$GAMMA= 0
##$GB= 0
##$INTBC= 1
##$INTSCL= 3.70164e-10
##$ISEN= 128
##$LB= 0.24
##$LEV0= 0
##$LPBIN= 0
##$MAXI= 10000
##$MC2= 0
##$MEAN= 0
##$ME_mod= 0
##$MI= 1.114404
##$NCOEF= 0
##$NC_proc= -5
##$NLEV= 6
##$NOISF1= 3.799351
##$NOISF2= 2.8
##$NSP= 0
##$NTH_PI= 0
##$NZP= 0
##$OFFSET= 17.07239
##$PC= 1
##$PHC0= -25377.82
##$PHC1= 7.387311
##$PH_mod= 1
##$PKNL= yes
##$PPARMOD= 0
##$PSCAL= 0
##$PSIGN= 0
##$REVERSE= no
##$SF= 200.129589668195
##$SI= 16384
##$SIGF1= 3
##$SIGF2= 2
##$SINO= 5.538805
##$SIOLD= 16384
##$SREGLST= <1H.CDCl3>
##$SSB= 0
##$STSI= 16384
##$STSR= 0
##$SW_p= 3612.71676300577
##$SYMM= 0
##$S_DEV= 0
##$TDeff= 16384
##$TDoff= 0
##$TI= <>
##$TILT= no
##$TM1= 0
##$TM2= 0
##$TOPLEV= 0
##$USERP1= <user>
##$USERP2= <user>
##$USERP3= <user>
##$USERP4= <user>
##$USERP5= <user>
##$WDW= 1
##$XDIM= 16384
##$YMAX_p= 404574374
##$YMIN_p= -30275
$$ End of Bruker specific parameters
$$ ---------------------------------
##NTUPLES= NMR SPECTRUM
##VAR_NAME=  FREQUENCY,     SPECTRUM/REAL,   SPECTRUM/IMAG
##SYMBOL=    X,             R,               I
##VAR_TYPE=  INDEPENDENT,   DEPENDENT,       DEPENDENT
##VAR_FORM=  AFFN,          ASDF,            ASDF
##VAR_DIM=   16384,         16384,           16384
##UNITS=     HZ,            ARBITRARY UNITS, ARBITRARY UNITS
##FACTOR=    0.220516191357247, 1,           1
##FIRST=     3416.69032583613, 0,            0
##LAST=      -196.026437169639, 0,           0
##MIN=       -196.026437169639, -30275,      0
##MAX=       3416.69032583613, 404574374,    0
$$ Real data points
##PAGE= N=1
##DATA TABLE= (X++(R..R)), XYDATA
$$ [...]
9730 -1867 -4785 -6211 -7186 -4541 -6011 -7443 -4422 -2267 -4662 -4957 -4141 -4024 -4996 -2942 -2038 -2209 -132
9713 -132 -350 -4088 -5223 -2830 -1122 -2609 -4248 -3246 -1579 -2036 -4169 -4478 -1837 -127 398 -879
9697 -879 -2841 -2210 -3212 -3592 -4320 -5133 -4483 -962 -1884 -1474 -1248 1016 -3820 -3391 -2877 -1160 -1347 -1585
9679 -1585 13 -2748 -1088 -3690 -3019 -4987 -4441 -4346 -4954 -3887 -707 -2028 -3403 -717 547 -1046
9663 -1046 -4320 -4567 -3148 -3698 -5825 -2705 -1393 -2032 -2411 -3091 -1613 -1360 -2417 -4851 -2770 -1335
9647 -1335 -4 -1247 -866 -3340 -3452 -763 -4113 -1752 215 1064 1275 1471 -1075 -2350 -1067 -989 -2645
9630 -2645 -713 -2600 -643 -575 -3293 -4851 -3888 -2592 -1502 -1928 596 -2090 -3864 -3487 -2169 -738
9614 -738 -1385 -603 -2476 -2728 -3464 -2844 -2462 -4182 -6575 -2283 -3319 -3660 -3640 -4316 -4406 -587 677 -3492
9596 -3492 -1635 -913 -849 -2021 -968 -717 1063 1324 -1994 965 -255 -597 -2335 -2319 -482 1005 -559
9579 -559 -1151 -2523 -5444 -3306 -3243 -1490 -1447 -2313 -1918 -291 -2114 -645 -736 1753 -2108 -2086 845 -1256
9561 -1256 -768 -774 -2018 -2065 -2223 503 3852 3331 1879 430 2148 1765 -1011 -895 3081 1723 2720 1594
9543 1594 -1660 -4339 -3133 497 1156 -982 -215 -2650 -123 -2042 -1791 -2109 709 -1168 -3783 -1745
9527 -1745 193 -2072 -6205 -6057 -2876 -255 -2021 -2219 -1695 1853 2119 1062 -940 -786 -2593 -1586
9511 -1586 -1226 -4235 -2600 -1774 -816 500 -250 61 1833 2164 4167 4209 78 934 1497 -761 -4080
9494 -4080 -2917 -886 26 13 1291 -1181 1817 2664 551 -377 -1568 568 961 2645 3538 2590 1383
9477 1383 1194 478 -8 1481 2417 -1527 1865 -579 -1749 -1962 -1689 2319 3766 2911 2527 3166 -8
9460 -8 -1872 778 -819 -816 1820 1953 965 1411 2859 3218 3699 2656 3736 90 350 -867 824 -309
9442 -309 1711 3607 4660 7156 6277 1725 39 2434 912 1199 -34 -599 575 1081 4144 5768
9426 5768 2831 -1178 2329 5038 3354 1296 462 524 2325 5088 3549 3939 6354 4393 5209 5040
9410 5040 1467 1167 3940 2504 1411 82 4779 3740 2300 5511 5031 1510 -475 2367 1583 2085
9394 2085 2854 1317 3984 6561 4513 3827 5083 5135 5103 8165 8432 7384 6169 5590 7534 9932 9805
9377 9805 5384 5703 5787 6525 8373 7701 2926 3651 5293 4526 3931 3400 3204 3697 2822 1031 3821 1054
9359 1054 4002 4987 3625 68 1134 2364 5334 4241 910 -475 -1065 -573 1755 3417 5336 6205
9343 6205 5091 424 2439 3988 4482 2869 1642 2518 2378 2594 305 -309 2323 974 459 3550
9327 3550 5033 2344 10255 11789 8736 10151 6839 4824 5158 8518 7754 3416 3547 5309 1172 4205
9311 4205 4214 4263 4013 4256 6458 8396 8391 7267 6133 4263 3187 2028 4176 6559 5723 8571 5600 2696
9293 2696 1346 3708 5168 4351 6804 8301 4102 3213 6869 5016 4664 9038 8043 5679 5698 4378
9277 4378 7932 9107 5889 3589 5496 7554 10098 11065 5871 6609 2475 2820 5709 4809 6970 10680
9261 10680 10475 10828 10301 8597 9672 7052 7860 12799 15188 10936 10763 7384 7837 8766 11972 10389
9245 10389 9699 10495 12622 10318 10797 11453 13118 12591 9981 10022 10385 13825 13248 12433 12414 10507 9619 13854
9227 13854 14525 14690 11784 15113 14451 12759 16045 17868 14925 15309 17941 20698 23260 21701 21749 22724
9211 22724 21600 20966 21213 21472 21740 23059 23542 23728 24143 22238 25481 29796 25692 26118 22869 25974 29079
9194 29079 29324 30108 29860 30154 28941 29374 33101 33557 32858 33760 32210 33173 35046 35451 37968 38112 38253 42855
9176 42855 43801 45678 46494 49362 49075 45369 46025 46298 45456 43084 44467 45968 43822 42329 43343 41352
9160 41352 40020 41513 44823 46018 44037 44686 47074 48541 47612 47679 47404 50839 50985 49327 50460 57120
9144 57120 58172 58080 62276 64432 68838 73102 79437 83223 90956 95916 98962 103803 105254 105543 104902 102791
9128 102791 103166 101301 99634 97751 93226 90713 85269 79152 72719 67564 62378 59046 54838 53073 48834
9113 48834 42799 39848 35690 34912 38371 36974 36045 32381 33127 33308 30916 29345 29096 29515 31870 29031
9097 29031 21722 23195 25555 25928 26174 21480 24801 26026 23014 24533 26466 26660 23635 23909 24086 23936
9081 23936 23444 24887 23396 22626 23093 21373 21297 22940 24002 24987 25956 22517 22546 22499 18589 19847 21233
9064 21233 20362 18671 17421 18799 19024 17080 17035 16813 13996 16672 15665 15911 17345 20075 18333 17240
9048 17240 18417 18565 16175 15762 15574 14773 18963 16573 14576 13946 15900 14526 15218 17457 13873 15593
9032 15593 15357 13256 13850 14951 14669 14129 15743 14705 16130 18915 15361 10368 10201 12020 15323 17021
9016 17021 15409 11455 12440 13080 14189 16009 13405 15584 17034 16706 16554 16739 16515 16497 13444 10885 11552
8999 11552 12206 18806 17672 19246 18004 13596 14565 16900 18183 18409 15448 14546 14255 16555 18642 16730
8983 16730 17143 19076 15123 15678 14632 14124 18966 21499 22078 20347 20458 22844 23141 22638 19223 19220 17174
8966 17174 17658 17376 17654 20515 20653 18931 19061 19430 22101 22683 22619 20029 20208 19957 17786 19562 19512 16908
8948 16908 19052 23451 23419 24382 21739 21991 21121 19384 23325 23352 23725 26774 29385 34294 34035 34248 33263
8931 33263 29955 29092 29270 28377 31859 32730 35134 37783 36629 33520 34549 31893 32288 35073 37817 35040
8915 35040 31829 26552 27902 28686 27072 27245 30323 31294 27853 27521 30282 30398 31305 30877 28720 28537 28275
8898 28275 31240 30106 29833 32691 34077 32211 32503 32411 32344 32375 36007 39324 37644 37743 39484 40186 39747 37729
8880 37729 37342 38542 35823 36234 41658 44793 43585 48106 46609 38672 40342 42582 41020 43946 43702
8865 43702 43267 46152 46725 46713 47438 48907 52937 51588 52685 56230 56051 57616 60777 64717 67227 64703
8849 64703 68235 69304 66682 64528 62279 60976 60881 63625 62870 63418 61994 63156 58073 55593 58627 59402
8833 59402 62793 63658 62008 59930 59419 61659 59351 58176 58676 59011 59921 62806 63648 67156 68614 71006
8817 71006 70458 71937 77038 77915 79618 78928 80406 87675 91657 94825 96607 98090 94497 97932 100385
8802 100385 102438 99175 97774 97514 94361 95866 92089 89056 83107 82174 87442 87370 86809 85205 82295 80561
8786 80561 81025 84202 83376 85700 84877 85485 87501 85809 87830 90825 90991 89351 89585 94725 94551 94171 93552
8769 93552 94375 93615 93239 93249 93515 90712 88710 90765 89754 87567 86208 88032 88456 85823 84278 84739 84491
8752 84491 84383 86791 91605 93067 92630 94799 93487 96593 99083 98123 99452 103044 104314 106281 107718
8737 107718 108438 109967 106576 106056 108737 112216 113548 113103 114653 118705 120045 119091 122269 125456 125070 129672
8721 129672 130023 130670 134856 143696 146617 147902 154114 153356 158090 163850 165709 173174 176070 177364 180633
8706 180633 185036 185910 184321 185336 190419 190948 189036 188881 191922 195780 197294 203581 210240 217845 226963
8691 226963 234745 246940 255742 264550 274447 277097 281028 286504 286041 281526 280436 278657 276275 268686
8677 268686 260895 253826 247468 241406 236176 229091 219847 215779 212443 211772 209938 210506 211176 211572 208485
8662 208485 207113 211524 213147 215336 217387 223337 227931 234736 242181 248472 256135 266151 275710 277443
8648 277443 279995 277321 272206 270628 267255 270290 273833 275947 276653 283079 289491 299641 305001 310166
8634 310166 316849 322736 331798 343161 343088 351748 363062 378473 392006 404564 420616 436025 457445
8621 457445 474116 499132 530735 567467 604841 649119 698633 758489 817485 876238 933157 983922
8609 983922 1024252 1052813 1066029 1066297 1057139 1044067 1027760 998049 961813 914276 861506 806541
8597 806541 751742 700853 657978 620951 588327 562439 541303 521413 502557 480093 466261 455448
8585 455448 444104 432930 422136 410623 403667 396546 401122 428143 400563 357800 339946 328606
8573 328606 319848 313831 311499 305365 295273 292344 288054 285301 281905 276609 274036 274450 271212 267219
8559 267219 266715 263600 258061 251534 249838 250373 248758 246693 242113 242925 241736 237314 233167 223294 219580
8544 219580 213956 210464 207649 207950 206991 206241 209336 213284 213319 215953 216961 218598 215129 215070 217594 215274
8528 215274 216903 214323 212747 214705 214865 214559 213124 212974 213186 211080 211784 214496 215999 212762 209973 207304
8512 207304 205493 205833 202808 202052 203492 201315 204584 205856 202720 203205 207987 210899 215061 217657 222510
8497 222510 229039 234028 241560 249406 253089 257290 266302 271473 283209 294633 307542 319637 329185
8484 329185 342916 357070 373418 392057 412880 434070 460101 486542 512647 542700 572562 603168
8472 603168 628988 655647 681379 695826 700982 697475 687938 671451 651226 628173 598082 568397
8460 568397 542166 518412 498785 475016 454913 439982 427903 419449 412770 406732 404080 403571 410425
8447 410425 414675 423838 433816 452624 473872 501193 528987 551861 584690 620879 653813 678940
8435 678940 696631 711428 715994 711249 696020 672952 646399 612826 575806 535737 500000 462979
8423 462979 429069 396868 366999 346323 322200 302226 284647 264088 256451 240145 230095 218089
8411 218089 205838 197259 194634 185559 179543 176049 170497 168328 166299 162014 159828 157169 152239 150806
8397 150806 148013 147621 144176 140776 136251 133024 129000 128221 122652 123183 118681 114901 114810 105687 110111 109587
8381 109587 108094 104237 100063 97310 96024 92719 85716 81302 82561 81241 79809 81546 81395 78244 76906
8366 76906 74633 71889 73381 74015 73582 69423 73119 73066 71618 73844 70713 66686 69076 72033 71304 73455
8350 73455 71482 73597 72762 70118 70317 72865 73144 71570 69123 68925 70583 70686 68941 66434 65153 61276
8334 61276 62891 59019 58527 58655 55461 57436 56538 57417 56602 52122 50031 48058 49467 50779 51117 52398
8318 52398 51114 52939 52864 50119 50112 54928 56987 58672 59605 59934 63548 59632 60046 58102 62003 62576 62411
8301 62411 61660 60684 58908 61880 58115 57650 59936 61944 62784 61989 58168 62887 69215 67929 73188 73810
8285 73810 70845 65316 62286 64516 67171 71845 74657 67430 72371 72307 79756 80941 78834 80428 80538
8270 80538 86653 89644 93112 94471 96683 92613 97373 92464 95314 92642 91125 100266 99935 99583 99926
8255 99926 97937 104922 104695 102818 106878 112688 110873 106248 109127 109192 105288 108592 116560 116683 117728 119272
8239 119272 123147 124103 125997 127827 130573 134256 136293 138125 146390 158464 166367 170532 177466 179645
8225 179645 177943 176260 175982 175407 161405 150574 148187 141747 146072 153230 153910 148733 151938 142261 133125
8210 133125 127810 126207 127487 143458 133265 140226 143486 147991 153424 150541 146232 154152 165474 181759
8196 181759 173538 154360 169864 213057 210968 156240 153311 120844 132596 121105 110259 120369
8184 120369 116312 116907 108290 109525 124218 125928 119638 122917 120265 108370 109612 112367 96856 98541
8170 98541 108573 105456 100083 102965 108139 107326 105402 107865 108497 116353 113934 107530 109230 111704 117292
8155 117292 120222 121768 122457 120941 117044 124016 125430 118643 121245 126370 127373 126532 129237 122995 122749
8140 122749 123767 123312 122760 121661 124415 119396 118857 125576 129678 129857 122664 124257 119758 119184 122455 120654
8124 120654 118220 118434 116205 120125 120559 120592 121434 124408 130016 130653 131651 140636 143863 143630 145160 152693
8108 152693 151463 152426 166361 176263 182772 180689 184657 189377 189386 188350 188812 187218 184879 183096 180514
8093 180514 175624 173183 173118 169165 163251 159480 163813 165871 167558 170772 173645 172724 175301 181890 182252
8078 182252 184838 187186 192486 192098 194563 194743 198046 197085 195370 192213 191647 192074 192115 192591 194619 196446
8062 196446 192980 190149 193884 202092 204292 202445 205966 206661 213115 213893 212704 217055 216900 219068 219768
8047 219768 220061 219656 221692 224826 222228 224327 222270 220351 224689 228496 227302 230661 233423 234661 234489
8032 234489 237853 243394 246056 248505 253518 263801 267660 270575 276235 285470 287806 291519 297642 304776
8018 304776 309448 310895 314658 321151 319471 315857 319968 321117 312127 312504 309795 303200 303395 298439 300169
8003 300169 299233 300314 299869 300793 299932 302764 308121 310375 312767 317833 326334 331167 334691 343706 349514
7988 349514 354748 363838 369523 372418 375978 384494 387308 386378 388621 391389 395497 408734 414963 419499
7974 419499 425806 429353 436082 442802 451497 459546 466294 469570 478093 489217 497174 504865 515292 520821
7960 520821 530259 545617 559699 574344 590140 602019 615296 635137 649864 670979 691646 712853
7948 712853 731457 755943 783480 808482 826518 842907 862169 881204 897377 915242 937606 968336
7936 968336 1002671 1044350 1093805 1142071 1194851 1239306 1281207 1306181 1313154 1308708 1293034 1267101
7924 1267101 1234101 1201066 1168358 1139704 1119163 1103639 1093521 1093395 1093231 1106717 1113744 1133750
7912 1133750 1160087 1192658 1227143 1270862 1317061 1373062 1426831 1481988 1537427 1588759 1636464
7901 1636464 1694859 1762076 1837995 1921163 2015150 2117252 2217012 2313309 2392090 2439704 2452638
7890 2452638 2425140 2355534 2257220 2136648 2010495 1887082 1770672 1670298 1592680 1534465
7880 1534465 1490931 1455900 1429157 1410100 1395624 1394874 1400123 1412772 1439148 1466808 1493896 1514600
7868 1514600 1517374 1502773 1476629 1455592 1438077 1419721 1400920 1372736 1329727 1264591 1204951 1145926
7856 1145926 1090124 1046066 1011646 983696 962617 940695 926822 917517 913287 916653 925909 937237
7844 937237 957740 979880 1004915 1023296 1045231 1056802 1069901 1082310 1095632 1101874 1103946 1096279
7832 1096279 1081584 1064451 1051473 1037473 1020671 1001496 986323 962945 947113 921580 903677
7821 903677 877923 852738 827704 818746 801128 799182 793161 801846 807022 825705 835207 857183 857911
7808 857911 880660 855445 991290 1067885 926507 900877 852989 831386 795484 774900 741724
7797 741724 721976 689952 663054 630961 606738 580782 560725 542361 530152 517219 508400 489762
7785 489762 484319 471566 458985 453991 454398 451010 452306 452515 456943 462458 470384 475812 477093 483924
7771 483924 483816 479874 474742 466331 457988 445675 426229 406483 388076 371975 354136 334903 320280
7758 320280 305582 294877 284640 275050 265665 254966 247040 242468 237914 237605 237333 231517 229603 231227
7744 231227 228479 219369 217567 215372 215824 213331 209098 209199 210101 209386 204822 204027 204507 201863 200318 200346
7728 200346 198755 200417 198379 193925 189525 185780 184728 181500 182942 184977 187468 190607 188009 187532 190402
7713 190402 192937 193480 193292 198139 199092 197327 198303 196474 192210 192709 189819 188833 187490 185981 185724 186271
7697 186271 185007 181119 181110 184882 182813 185611 184911 186700 188154 187631 190342 199183 197978 201317 205630 206096
7681 206096 210894 215627 214232 218281 220475 225116 225730 226936 228011 227326 225523 225522 223064 219303 216898 214421
7665 214421 211702 214739 212660 210054 213440 214404 213398 216539 220801 222070 222469 223212 222955 229400 231181
7650 231181 233048 237283 242318 246138 252683 259665 261625 267272 272361 273040 274686 274605 275268 276387 277246 276938
7634 276938 271778 273321 275937 280385 284600 290251 294132 302459 306891 315463 322954 329897 342992 355666
7620 355666 368392 382213 395923 411777 427691 442775 463858 485253 506246 525257 541584 558545
7608 558545 569115 577137 573317 568209 560643 545591 525425 502656 482648 468389 448822 434296
7596 434296 425336 420170 414977 413533 415421 422612 430444 434436 442670 456086 469903 484043 500988
7583 500988 519015 535766 556934 578865 599591 624416 648022 665303 679027 689167 686777 676315
7571 676315 661111 639161 617413 589809 555110 519770 483502 450588 420527 396674 376369 362284
7559 362284 346897 334330 324832 319622 318047 315057 316585 316505 313994 316037 316218 316810 324900 330442 330255
7544 330255 337398 343546 344627 348420 347610 342840 336263 325391 308257 290024 271556 249132 231655
7531 231655 220922 206311 193748 182894 173889 163333 156474 149444 140881 137604 132599 130524 123518
7518 123518 118267 112931 108919 109053 102915 95860 96428 102823 97035 91961 88489 87005 83644 84653 82018
7503 82018 78411 79054 78971 77801 74211 71772 66842 63876 61514 58358 57312 57724 58129 57772 55385 53160
7487 53160 51171 52544 53644 53297 50943 49748 48084 47794 48628 49718 47350 49353 49144 44376 43939 45022
7471 45022 43858 39094 37966 39894 40569 36919 36441 37464 39207 39204 38952 36530 34720 34650 35018 34591 34532 34171
7453 34171 32503 34547 32809 32296 36574 35174 29891 29766 26016 25677 20553 25053 28945 29417 30869 30041
7437 30041 26260 27068 26483 22678 22882 22059 24502 21402 22750 23837 24464 23610 21114 22735 19828 17537
7421 17537 16576 16912 19220 17581 17399 17239 16639 15551 19927 20113 17306 20772 20467 16911 15612 16563 14569
7404 14569 16128 11921 13514 17149 12047 11568 13979 16724 18321 19774 16000 14168 14099 12924 13482 10270
7388 10270 11124 8543 10612 11269 13971 13438 10747 13285 15179 13060 9458 11278 12788 11271 8713
7373 8713 10907 10343 11654 13391 11074 7047 6392 5304 5601 9392 7499 7019 9301 8318 8697 4204
7357 4204 4505 6280 10806 14731 13094 9914 5673 8565 8663 7493 5157 6775 8271 7362 8210 6893
7341 6893 6729 8750 8955 6982 7330 7005 5533 6208 6439 4256 5467 4360 5896 7400 5696 6104 8456
7324 8456 8092 11470 8482 9828 8543 7556 4303 4396 5747 5067 7632 5605 4783 4709 6635 7553 5420
7307 5420 2991 2888 4373 7899 5972 5869 6106 7339 4840 5792 4764 2152 2145 3353 3932 6246 7927
7290 7927 5164 7855 8418 4831 5197 4687 2834 4092 2899 1594 2054 1428 3232 1021 -1804 -1970
7274 -1970 2263 4660 6331 3502 1249 2777 1423 1623 2740 3596 -993 -1433 908 1708 2970 4029
7258 4029 2459 3108 3689 5778 4126 1489 4071 4417 3508 4951 4154 4437 3612 7767 6222 4477 3902
7241 3902 5345 5966 2757 2073 4963 4658 976 2742 4170 3676 3271 1364 -33 1573 -750 -372
7225 -372 863 2096 633 -173 -2042 -3711 -642 2450 705 1003 3898 4566 3698 4881 6292 4338
7209 4338 8169 6767 5519 5665 3515 3558 5069 1199 1805 2011 639 2259 -775 -1191 -688 2228 2984
7192 2984 3664 4343 2707 -305 278 1182 -818 0 2201 254 2378 1975 -8 -3589 -1410 1079
7176 1079 -651 -1032 -1027 1901 1695 1676 3819 3930 283 78 3957 2076 1244 -736 -650 -630 86 383 -761
7157 -761 -568 1538 -2177 -3689 -3348 -1803 -743 201 -2410 -2417 -1768 -4735 -3303 -2916 -1722 -426 -455 -2288
7139 -2288 -5042 -6803 -5908 -1600 310 -238 -2281 -3602 -129 738 1086 -502 1077 599 -1589 992
7123 992 1074 504 72 -306 1239 -1270 -1557 -103 -2147 -1442 -1950 -1253 -2284 -1540 1354 -3013 -4102 -2066
7105 -2066 -3871 -2392 -3208 -3691 -2311 -242 538 149 1133 842 -1978 -2043 -3057 -5273 -5618 -3217 -1366
7088 -1366 165 1562 -243 -2618 -3107 -1891 -2004 -4234 -4159 -516 -1736 -2648 -4210 -5609 -5040 983
7072 983 -1455 -1413 -1357 -2202 -213 329 -2838 -3794 -4448 -315 -4232 -581 -5183 14085 20006 1570 1918
7055 1918 931 854 101 274 1802 363 -1611 -2649 -2763 -1535 -4014 -4206 -1643 -2279 -5576 -5601 -5464 -2696
7037 -2696 -5685 -4151 -3224 -5088 -4183 -537 -1668 -4016 -3058 -4176 -5068 -3160 495 -943 -4699 -5425
7021 -5425 -5301 -6168 -3999 -4969 -7846 -5191 -3699 -2187 -2806 -2953 -3207 -2298 -1100 -3615 -6610 -4355 -2738
7004 -2738 -3569 -4670 -4382 -3598 -4123 -5935 -6459 -3410 -3174 -1140 -5578 -6336 -5267 -4836 -6816 -9133 -8499
6987 -8499 -7746 -5637 -5623 -2146 -5408 -3664 -1917 -2683 -6027 -4544 -4978 -4411 -3682 -4714 -7420 -6986 -7108
6970 -7108 -7066 -7557 -9124 -9403 -4412 -5184 -7607 -8521 -8596 -5218 -6887 -6714 -7858 -6704 -3877 -4454 -3955 -4745
6952 -4745 -4247 -6942 -7738 -5994 -7986 -5925 -4531 -4484 -4108 -5823 -9363 -5579 -4437 -6352 -6310 -6632 -7433
6935 -7433 -7589 -8093 -8204 -6514 -7404 -6513 -5726 -3564 -4283 -6829 -6501 -4652 -6812 -8564 -7509 -5255 -5901
6918 -5901 -8579 -9073 -6477 -6106 -6230 -8457 -9283 -6949 -8040 -8798 -9016 -6414 -5549 -6707 -5350 -5548 -6080
6901 -6080 -5553 -2489 -2848 -6281 -8986 -7939 -7101 -4597 -3753 -5423 -5713 -9313 -7364 -5508 -3152 -5650
6885 -5650 -9186 -12770 -9345 -5536 -5934 -7696 -5939 -6402 -9088 -7267 -2776 -3005 -2237 -3255 -5427 -9428
6869 -9428 -7914 -8038 -8477 -5361 -2797 -5736 -5308 -6892 -6566 -7858 -6693 -3721 -7187 -6577 -7261 -6672 -7085
6852 -7085 -6383 -8580 -6617 -5883 -5338 -5127 -7854 -6067 -3782 -6167 -9317 -9932 -7573 -7781 -8666 -9025 -7500
6835 -7500 -9918 -11129 -10375 -10032 -8917 -11268 -12126 -10325 -8610 -8502 -10620 -10259 -9023 -7503 -7818 -8587 -6459
6818 -6459 -8439 -8189 -7136 -7049 -8302 -12414 -11161 -5747 -3467 -1042 -7115 -6850 -6991 -8826 -9257 -7360
6802 -7360 -9891 -8785 -4418 -4323 -5477 -6728 -2650 -5286 -4034 -7701 -8031 -7890 -5478 -3377 -4805 -5807
6786 -5807 -8508 -8335 -7363 -8975 -5965 -3915 -5141 -4458 -2931 -1983 -5010 -7317 -6092 -7912 -8341 -9188
6770 -9188 -7550 -5543 -8573 -9865 -9332 -7186 -6393 -4174 -6683 -9876 -10002 -6447 -6696 -5602 -7231 -8664
6754 -8664 -10135 -7116 -8191 -10630 -8618 -6669 -5302 -6080 -2283 -5157 -6971 -6791 -8340 -9982 -6900
6739 -6900 -6834 -7384 -8088 -6133 -4919 -4113 -7058 -7205 -7437 -6561 -4646 -3493 -2889 -1751 -5679 -8230 -8220 -8207
6721 -8207 -9094 -6647 -4383 -6606 -4785 -3377 -5006 -6915 -4710 -4181 -6590 -6257 -7175 -8737 -4844 -5545
6705 -5545 -9530 -6302 -6848 -5891 -4937 -6351 -7093 -8248 -8450 -6334 -8704 -11412 -7978 -5413 -6664 -9941
6689 -9941 -8987 -7076 -8124 -13001 -10055 -8023 -9342 -6867 -6292 -6233 -6847 -8316 -5638 -5056 -3953 -2530
6673 -2530 -1935 -3490 -4085 -5403 -4727 -7749 -8307 -6577 -7559 -8991 -7543 -8640 -10439 -11901 -12877 -7865
6657 -7865 -10505 -9790 -6724 -5952 -7827 -10373 -10661 -11127 -8971 -8167 -8123 -8220 -8271 -8729 -9363 -6924 -5856 -10968
6639 -10968 -8832 -7551 -9121 -8347 -9134 -11348 -13405 -10097 -9808 -9866 -8488 -8088 -5222 -7323 -10865 -6734
6623 -6734 -9359 -11783 -9058 -9567 -6468 -5104 -4752 -5437 -6540 -8390 -6971 -8421 -4642 -5110 -7772 -9888
6607 -9888 -6564 -4003 -14493 -15814 -10458 -7746 -7181 -9122 -10531 -9268 -7138 -7604 -9798 -7623 -6480
6592 -6480 -8240 -7999 -5714 -7246 -7296 -7276 -7656 -8578 -6341 -6988 -6488 -4318 -4684 -5367 -7365 -7527 -7878 -6041
6574 -6041 -6603 -8487 -9279 -10204 -7447 -4333 -3904 -6190 -6457 -7822 -8092 -6694 -3207 -5975 -11353 -8211
6558 -8211 -8321 -6439 -7312 -9887 -6059 -6385 -8602 -11980 -9421 -6555 -6342 -7570 -8414 -7535 -9457 -10674
6542 -10674 -11251 -11119 -11268 -9906 -10836 -9806 -10905 -10808 -10001 -6992 -8032 -10550 -8312 -5952 -5977 -8805 -9296
6525 -9296 -7953 -9900 -9570 -10500 -12230 -14554 -14690 -12272 -10353 -9631 -11221 -10996 -12694 -10252 -8435 -7847
6509 -7847 -8099 -11272 -10126 -8067 -4569 -10042 -9992 -5788 -6121 -8422 -10782 -9349 -9912 -10488 -12235 -12907 -10044
6492 -10044 -8856 -9207 -6219 -4455 -3764 -8244 -8344 -5110 -6500 -5176 -6421 -8720 -6175 -8027 -11110
6477 -11110 -10916 -8340 -9236 -8064 -6777 -4427 -6144 -5312 -9256 -8138 -8809 -8348 -10240 -10606 -7639 -7572 -9338
6460 -9338 -8442 -8657 -8177 -6011 -7300 -10100 -8146 -8644 -6834 -7540 -7204 -6939 -9084 -6435 -7783 -6785 -5944
6443 -5944 -7453 -3161 -6730 -6640 -6184 -8466 -7622 -9903 -8427 -7488 -6579 -8139 -6090 -5047 -2736 -6187
6427 -6187 -7248 -5359 -6100 -7200 -6421 -6201 -5432 -6722 -8020 -10769 -13647 -9573 -7146 -6952 -5849 -8059
6411 -8059 -3930 -4044 -8727 -9745 -6210 -5153 -7473 -9051 -7532 -7045 -8770 -8267 -7480 -10530 -11428 -11595
6395 -11595 -5991 -5413 -7589 -8105 -6944 -5590 -2311 -4626 -5903 -9000 -6850 -5854 -4563 -4664 -8256 -8750
6379 -8750 -10533 -8590 -6290 -6476 -8167 -8437 -6677 -5775 -7286 -8983 -11508 -9632 -5918 -7755 -7998 -8268
6363 -8268 -6637 -9238 -9077 -8994 -7345 -8292 -7234 -6614 -7021 -5792 -8241 -8835 -10472 -14245 -11145 -10215 -7204
6346 -7204 -7704 -12935 -12623 -11906 -11931 -9964 -6520 -8835 -8035 -9688 -7973 -10861 -10570 -9823 -7450 -6228 -6080
6329 -6080 -5645 -3379 -6039 -4951 -6492 -8889 -6215 -5838 -8600 -7771 -7946 -7076 -11318 -12316 -11787 -10303 -10871
6312 -10871 -11076 -10227 -11976 -11618 -9337 -8480 -8511 -10225 -8922 -10143 -10351 -9158 -11656 -13695 -9547 -9365 -6244
6295 -6244 -5819 -9110 -7379 -10712 -12450 -11520 -7854 -6771 -8324 -8741 -5094 -7390 -11201 -12160 -12784 -11664
6279 -11664 -9957 -8640 -9994 -8390 -6245 -7094 -6665 -7082 -7384 -5642 -5793 -5721 -8455 -8688 -9379 -11170 -9435
6262 -9435 -11609 -10755 -6511 -7421 -8281 -7190 -10129 -9006 -9995 -7902 -9207 -8063 -8417 -10976 -10424 -9599 -9513
6245 -9513 -7453 -4193 -4455 -4890 -5737 -6857 -7643 -9579 -10280 -10449 -8717 -7020 -5180 -5797 -9351 -7187 -3152
6228 -3152 -4974 -6179 -8393 -7939 -5814 -6690 -9723 -8539 -4066 -7191 -5775 -6007 -7117 -5099 -6227 -9129
6212 -9129 -8097 -5463 -4735 -3602 -3498 -7303 -7514 -8171 -6219 -7359 -9190 -10576 -6358 -6041 -7634 -6183
6196 -6183 -6596 -9591 -11548 -8224 -5391 -4083 -5436 -5572 -8376 -7291 -5723 -2842 -5488 -6757 -5223
6181 -5223 -6434 -5435 -4568 -5621 -6087 -6910 -7341 -7882 -7214 -6529 -5669 -4672 -3577 -9035 -10838 -9298 -9278 -9350
6163 -9350 -7279 -6543 -8612 -10280 -9670 -9413 -11408 -11499 -11820 -12847 -7067 -721 -1148 -4833 -2398 -4668 -4809
6146 -4809 -5492 -4387 -4564 -5497 -2986 -5832 -7175 -7307 -6314 -6950 -7143 -4818 -2798 -4104 -7604 -6805 -6603
6129 -6603 -8528 -5245 -7337 -10328 -11271 -11964 -9568 -8670 -4968 -3423 -6186 -4709 -3205 -4569 -6079 -9680
6113 -9680 -10413 -8981 -7870 -5504 -6347 -5885 -5183 -4687 -4376 -4812 -7091 -7217 -8337 -8035 -6248 -6811 -9338
6096 -9338 -7853 -6464 -1846 -4100 -4348 -5218 -6233 -3309 -1610 -4964 -8248 -8145 -10183 -8874 -7418 -7808
6080 -7808 -8493 -10072 -6686 -6797 -6316 -3170 -5064 -3088 -3052 -5014 -3095 -4643 -6857 -8965 -8226 -7976 -4595
6063 -4595 -6043 -7271 -5705 -7343 -6818 -7911 -5563 -4373 -5276 -7357 -7685 -5681 -4696 -4341 -4916 -5049 -1801
6046 -1801 -2834 -2588 -4384 -2525 -3312 -3524 -3616 -3107 -1732 -4241 -7205 -7198 -5235 -5946 -4868 -6126 -9596
6029 -9596 -12023 -6900 -3884 -2652 -4813 -8652 -7342 -3780 -2986 -5965 -6830 -7395 -7587 -5804 -4062 -6716
6013 -6716 -8630 -10005 -8362 -5727 -5410 -4867 -5957 -5991 -3541 -3248 -5051 -4733 -3680 -5061 -6997 -5657
5997 -5657 -5882 -6860 -6242 -6036 -4932 -5576 -8172 -6961 -5190 -4507 -2186 -3656 -7301 -7965 -8840 -4503 -3994
5980 -3994 -3181 -6593 -8546 -7212 -6796 -6651 -7299 -8387 -5870 -5627 -7467 -7981 -6089 -6713 -6468 -6052 -8066
5963 -8066 -6944 -8023 -7256 -6370 -6874 -8804 -6426 -7080 -6470 -6157 -3534 -5279 -6957 -6031 -6674 -9172 -9252
5946 -9252 -8361 -11182 -9227 -4772 -7190 -7169 -4399 -6000 -8391 -10173 -10512 -6776 -9265 -8085 -8894 -7650
5930 -7650 -7317 -9732 -11576 -10015 -9192 -6866 -7115 -6275 -4417 -5860 -9068 -10128 -8575 -5554 -4086 -6567
5914 -6567 -7367 -8754 -6675 -9530 -11939 -8824 -8384 -9328 -6808 -5818 -9336 -9619 -10017 -8862 -9073 -10288 -11110
5897 -11110 -11402 -7048 -7859 -6899 -4712 -3447 -1750 -6016 -8545 -7057 -7639 -7831 -8810 -7326 -7690 -7165 -9047
5880 -9047 -6184 -4640 -4290 -5006 -6432 -6807 -6296 -5006 -6329 -5712 -6769 -6548 -4469 -7311 -4820 -4165 -6376
5863 -6376 -5837 -6814 -6975 -8293 -7505 -8722 -6677 -1758 -3288 -4992 -4851 -1907 -3910 -3991 -4642 -8426 -8471
5846 -8471 -5303 -3169 -5452 -6696 -4520 -5188 -3514 -1979 -4744 -7710 -4739 -4364 -3753 -4453 -2616 -4938
5830 -4938 -6005 -7305 -7817 -4364 -2886 -2107 -4379 -4847 -5820 -4649 -2064 -2137 -3813 -6444 -1038 67
5814 67 -2719 -3478 -4234 -4273 -5037 -6844 -7209 -6383 -7084 -7713 -8145 -4723 -5866 -5190 -5622 -7646 -6830 -7710 -7641
5795 -7641 -6164 -2191 -724 -3003 -5164 -6267 -3707 -4222 -3337 -5596 -5131 -4331 -2678 -4172 -3710 -5007
5779 -5007 -3085 -1679 -4839 -6811 -4582 -4928 -4513 -5739 -9228 -7762 -5812 -3343 -5625 -5377 -2774 -6527
5763 -6527 -6145 -5008 -3127 -3181 -4364 -5485 -4032 -1393 1225 1687 -1327 -2451 -5466 -3583 -4322 -2088
5747 -2088 -4342 -5403 -7384 -5738 -4630 -6725 -5540 -5455 -2351 -3648 -2504 -1514 -2284 -3138 -3091 -6276 -6484
5730 -6484 -4764 -2687 -4237 -4769 -2260 1167 3226 3197 2172 65 -1666 -1419 -2350 459 1008 -1518
5714 -1518 -2138 -395 -2852 -3737 -3116 -3914 -2400 -4629 -4327 -4606 -722 -870 285 2502 -764 -3244 248
5697 248 -547 -2740 -1790 -4300 -3772 -2196 -985 2851 -2166 -6021 -4734 -1896 -4407 -3490 -4555 -3565
5681 -3565 -2738 -3056 402 2001 1649 -461 -251 1603 2381 578 836 -281 872 -200 1108 -2071
5665 -2071 -4007 -2074 -2896 165 -76 -2855 -3688 -833 -832 520 -1321 -2156 -1469 -2964 -4268 -4909 -1367
5648 -1367 -316 -1415 -1866 -1284 -2844 474 -152 -139 736 1687 135 -215 2136 136 -1882 -2019 -4543
5631 -4543 -4158 -1236 -868 719 172 -1751 -3745 -2951 -3026 -3275 193 302 -1115 -212 -3453 -3945 -2455
5614 -2455 -1430 -1439 55 889 -1256 -2268 -1128 1691 -1018 -1441 1050 139 -886 -1771 -277 -836 -1232
5597 -1232 -1357 2368 726 -1015 -1291 -3376 -2065 890 -630 -790 -2771 1538 -1692 -1722 -1944 -3792
5581 -3792 -1160 494 -196 322 2319 366 -150 -1496 -689 -1472 -905 -1626 -751 1674 2382 1075 2189
5564 2189 3246 2323 3013 3953 -373 1523 1787 -137 -2121 -305 -1463 -373 -681 -429 1854 2903
5548 2903 -697 -2574 -332 2500 3173 481 1011 3555 1797 707 361 -989 1133 1521 -849 655
5532 655 2024 347 1819 -75 -1231 972 -3082 -2212 611 2402 44 2123 3231 2224 -983
5517 -983 940 2212 4818 3421 1143 1992 568 2622 -357 2862 2797 2866 6110 5513 2795 2193 2454
5500 2454 4661 217 250 1343 803 646 1989 947 -801 708 1311 724 -380 -295 243 1014 11
5483 11 1176 381 749 1459 209 2595 1399 633 2687 4614 3225 3285 3210 1957 3019 352 1396
5466 1396 3764 1038 1859 2960 3374 2393 1901 1830 1969 2959 4686 3745 1610 2418 3535 1089 3261
5449 3261 1588 1800 3137 2413 6506 5584 2678 1890 2457 1818 2299 6727 5797 5148 4994 2650 5272
5432 5272 6116 7384 4513 5015 7220 4041 4377 4413 2247 1871 5586 5229 4837 4542 6207 4081 3059
5415 3059 5424 7074 4930 2387 1669 2042 4480 3211 749 3153 4838 4678 4946 1326 2998 3718
5399 3718 3633 4120 4235 2903 2533 2324 4831 7703 6122 4320 4254 4696 8651 7103 5970 7160 5347
5382 5347 6008 4093 2446 4208 1302 1787 3476 5172 7116 8182 5270 2571 5245 8280 7042
5367 7042 6960 6233 6222 8731 6602 6382 4846 4618 5691 6200 8888 4967 2533 4868 5692 6365 5673 4609
5349 4609 3963 4537 8191 8365 5861 8021 7134 6324 7891 5212 4978 6105 5822 7204 6749 9802 8316
5332 8316 6142 7907 8760 9842 8099 8093 9515 13508 11316 12568 10885 11387 8070 7174 8487 5933
5316 5933 6982 9242 10986 10492 10715 7983 6545 4726 5208 3739 6052 7663 6278 8380 10877 12352
5300 12352 12016 10612 9607 6460 8362 7494 7119 4366 4069 3732 4793 7403 5350 4689 6165 6948
5284 6948 7785 8406 10669 9540 8094 8182 8024 6525 7987 6986 8720 12208 11916 10323 8456 10173
5268 10173 7134 10044 11135 10462 8264 7624 9289 6743 5093 7022 9610 10164 9161 9212 11141 11176
5252 11176 13415 10605 9276 9392 10646 10988 11817 14464 9421 8337 8084 8355 9006 8584 8987 7222 7403
5235 7403 9270 11610 11626 10216 8373 6392 10587 10790 8316 11520 12569 12268 12914 12147 11818 12461 10207
5218 10207 8838 10419 10766 13520 14539 13389 12312 10803 10599 15305 12776 14892 14676 12653 13055 11615
5202 11615 12017 11801 12034 10031 13507 12519 13134 14216 16831 17121 15811 16471 13713 14438 13380 15269 16783
5185 16783 16925 15234 16102 15496 14231 17125 16048 16176 15138 15311 11701 12239 14043 12379 13201 16444
5169 16444 14991 12692 15217 15272 15642 19308 18262 15934 15297 14207 13906 16571 16436 14464 14584 14099 17706
5152 17706 16080 16899 16715 15820 14823 15726 15851 16456 18152 17754 18871 20357 22328 20655 17295 19035 19760
5135 19760 18451 19137 18275 16308 17073 18267 19408 20418 22390 21432 18483 19432 22629 19643 19055 20400
5119 20400 19326 18571 17174 19837 19834 16708 16884 16973 16631 17364 20855 22289 21226 20338 19780 19063 21920 22333
5101 22333 19945 20050 17601 16159 16580 17004 16333 18037 20001 18881 19732 21299 21368 22088 19128 20554 23585
5084 23585 22484 22255 21987 20695 24347 23603 22429 20441 24285 22609 20879 22818 20814 20481 18847 16687
5068 16687 17007 20042 20528 21151 21199 22774 22101 21605 24075 20760 20357 19556 20104 18850 16877 17946 21193
5051 21193 19881 18128 19106 21420 18373 18267 22228 25839 25804 24825 21779 20999 22227 23108 21890 20914 22716
5034 22716 21637 22384 20690 20225 22246 25062 23900 27308 25788 28684 26902 25692 26741 26051 22832
5019 22832 25700 26908 25006 26949 24666 23743 25836 25663 26804 26675 27325 29102 28882 28919 28661 29660 27177
5002 27177 26685 25954 25197 26062 27055 26358 27343 26882 25758 25607 23175 27536 28201 27855 31408 30074 29050
4985 29050 26538 25708 26540 25729 24455 28212 28415 27781 28342 27573 32784 28635 27536 28698 30017 30469 28736
4968 28736 28891 28582 28731 28803 29614 29916 29805 31359 35464 35161 33420 33026 35542 35585 33027 33927 33717 32307
4950 32307 35099 35831 34270 34408 35920 36906 36449 36575 39368 38184 37172 38596 38781 37420 34490 32753
4934 32753 34592 38489 37656 34578 34808 36185 34933 36275 37089 40144 42758 43334 43469 40504 39907 40093
4918 40093 41463 41905 41357 45562 47335 46523 44754 44212 46098 48659 47754 44952 45787 45800 46090 47030 47952
4901 47952 44553 42460 44024 45384 47557 48289 50957 48207 47739 51036 50793 51027 51320 50700 50027 47584
4885 47584 46320 46861 46679 49255 52772 54982 56531 57444 56936 57436 57323 58179 58152 56528 55624 58534 58502 58773
4867 58773 56485 57910 60686 61169 61323 63050 64793 65179 64865 66309 66899 67673 69759 68711 68792 69911 69943
4850 69943 68490 72758 73808 71868 73585 73979 74004 74070 72630 73006 72538 73198 72325 73647 74463 76157 75917
4833 75917 77563 78412 78460 78731 79834 81365 82694 87098 85102 85565 85846 86168 88077 88070 88581 88754 88116 91897
4815 91897 93800 94448 94058 92447 89566 93858 93159 94109 95668 97542 98587 101334 102776 101912 103180 102505
4799 102505 100380 100216 100682 100747 102791 103499 104197 102922 105774 108755 113365 117928 117716 116917 117217 116875 116458
4782 116458 112436 115917 119313 119605 120726 120272 120022 121313 123022 125772 127500 127310 125156 125996 122620 122984
4766 122984 124534 126605 128962 129937 131279 131212 132940 135208 136807 137066 138334 136947 134901 135395 137004 137138
4750 137138 138548 142004 144167 148679 153790 156517 155175 155842 156070 159412 162931 167227 167116 164402 169724
4735 169724 172805 176401 180707 181582 186838 188088 189049 191748 194130 192973 193632 197115 197269 200241 201390
4720 201390 205999 208783 211116 216874 223142 222329 221992 226490 229904 232126 232997 235492 240704 248001 251339
4705 251339 253022 261157 265954 269643 276021 279535 283502 289868 294881 299589 299405 304722 312434 317788 324198
4690 324198 334366 343178 351428 361863 368164 376905 383970 392871 398787 404760 413566 427131 440842
4677 440842 453138 466451 482418 498573 511386 526408 539731 551438 561718 574501 592095 603818
4665 603818 617459 634358 650018 665955 683174 697782 717059 735636 753852 774573 791776 811912
4653 811912 832104 858648 878882 904171 930284 959580 985658 1011350 1041536 1073323 1104909 1135264
4641 1135264 1167763 1205611 1240538 1276841 1315614 1352480 1392946 1435361 1481523 1527642 1571970
4630 1571970 1623543 1676550 1730915 1788860 1850984 1917217 1983158 2055528 2132186 2216965 2304897
4619 2304897 2399483 2505206 2619196 2742296 2875521 3020339 3179831 3355491 3549144 3763749
4609 3763749 3997354 4256783 4534758 4837048 5173367 5538563 5925967 6334654 6762147 7196655
4599 7196655 7632765 8044680 8407108 8693337 8874599 8930269 8852673 8642668 8320661 7915283
4589 7915283 7457984 6975685 6490167 6022928 5573101 5152800 4765732 4408511 4087308 3794324
4579 3794324 3529077 3284981 3066994 2867333 2690062 2530578 2384365 2249676 2123562 2009813
4569 2009813 1905323 1808129 1719078 1632367 1554734 1481562 1414429 1352507 1293230 1242751 1193975
4558 1193975 1147735 1102425 1061258 1020638 984978 953323 918677 886545 858793 831489 802835
4547 802835 779139 756304 736161 716503 697588 679065 660765 645037 628219 612298 597476 581494
4535 581494 566948 549545 532787 521374 509652 493256 482244 472191 459717 450000 436088 426250
4523 426250 417188 408988 401171 397422 389366 380200 372991 367060 358359 349328 345078 336357 327611 326128
4509 326128 318279 314754 310762 301543 296668 290937 286798 281187 274697 271590 266019 261474 258662 252516
4495 252516 252297 247983 242899 240215 234053 230331 226947 227018 226992 222120 216435 212581 212164 208507 206850 205843
4479 205843 203316 201081 198992 196352 196038 193657 192753 186465 183177 183432 182769 183742 181410 182496 180415 177641
4463 177641 176194 175045 171454 169556 169824 169465 166919 167309 167142 166962 167689 166939 163333 161712 161481 161736 163362
4446 163362 162148 161807 160682 157715 157308 159835 158640 156023 158583 156742 154151 155876 155041 152459 151746
4431 151746 148796 148839 146658 145816 143639 143456 144956 143027 142904 139926 142440 142663 142440 144053 141225 140819
4415 140819 140510 142254 139519 137791 139331 135070 134555 136919 135950 133543 135547 137201 138316 138006 136335
4400 136335 131381 129614 132053 131750 132294 133761 135788 137430 136038 135398 133896 134912 135341 134967 134574 134855
4384 134855 135725 134320 134821 137719 135300 135708 139367 138908 138006 137378 138174 142479 144403 146606 148789 147742
4368 147742 148021 149187 146921 149727 154153 155052 155497 154317 155688 155429 154660 159955 162615 161957 165644 168417
4352 168417 170710 172625 173726 174100 177489 177372 176938 177603 179594 182335 186844 188763 195463 196095 200446 207324
4336 207324 206818 211955 214992 216498 221775 224346 225649 229497 232614 239811 242242 247279 251145 256407 259786
4321 259786 263005 270054 274284 281506 284800 292774 299824 305989 315017 318229 328215 338122 351845 362581
4307 362581 372345 385595 403139 417904 434027 451077 471412 497153 524084 552695 584419 625515
4295 625515 669174 722591 790525 871551 961898 1051472 1116708 1123930 1070975 989905 906644 842861
4283 842861 796410 759083 729860 713356 700280 691415 691048 699031 708420 724215 748133 773605 809131
4270 809131 848133 892901 949663 1012768 1092935 1184551 1290134 1419261 1575922 1768829 2005158
4259 2005158 2271033 2524625 2674384 2630417 2400823 2098082 1829057 1612844 1442986 1308812
4249 1308812 1201014 1115319 1045709 992743 953114 927011 911885 900405 902257 911294 932366 960739
4237 960739 996860 1044538 1104912 1179744 1262994 1368256 1495442 1654587 1859897 2100734 2365469
4226 2365469 2590395 2682564 2563986 2277337 1959148 1689845 1479140 1305061 1160185 1041026
4216 1041026 945529 869102 809096 757785 715032 683327 655035 639082 629228 621145 615636 614298
4204 614298 622862 636971 650986 671944 703835 742821 796174 862264 942637 1024874 1081962 1081233
4192 1081233 1012897 903448 795017 709183 635608 574124 521001 477668 446604 419411 392121
4181 392121 368549 348545 336413 326181 315069 306313 296821 289551 282536 275217 269236 263247 258253
4168 258253 253907 247388 243949 240011 234244 230828 231177 227127 223716 219383 218233 216095 212151 207303 205569
4153 205569 203472 202174 202900 200025 199435 198938 197272 196615 192979 191390 190344 190606 191180 190075 189756 186014
4137 186014 184313 186863 188962 187708 182776 180034 181169 183010 182570 180087 179394 180145 179010 177489 175168
4122 175168 174430 175694 173228 175583 175139 174446 174142 171914 169671 171141 170219 171302 172764 172023 170061 170378
4106 170378 171556 171047 169537 170082 169679 169952 170155 172351 173432 170142 167487 168234 169286 169661 169883 170813 171539
4089 171539 173235 177111 178596 178787 179714 180473 183443 182795 182305 184756 183203 184037 188467 187849 188884 192987
4073 192987 192345 194590 194139 192646 192621 191323 191369 195037 192527 194677 193939 192272 193590 194835 196281 196136
4057 196136 196838 199394 198677 197950 199531 198722 200104 202436 204479 201550 200920 200865 202441 202147 199408 200186 201825
4040 201825 201504 199335 198945 203212 205930 208676 209141 208184 207345 207234 209182 212110 215981 215321 212144 212730
4024 212730 212429 212917 216418 215840 215138 211521 213464 215802 217424 218141 220852 223743 222276 221016 224957 226146
4008 226146 226347 229105 228808 229947 226196 225830 229207 229632 233120 234458 231753 232106 239475 239049 236099 233519
3992 233519 236720 239723 240106 240520 240716 243626 245469 245465 246394 250753 249286 249923 249807 250873 252957 255289 257937
3975 257937 258554 259094 260209 261481 261901 263401 264680 266099 264762 265601 267516 266983 268965 271377 273407 270304
3959 270304 271497 272000 272293 274815 274896 275489 278277 280021 278975 284085 286702 284333 283019 284974 290034 291785
3943 291785 293330 295661 297209 299961 301934 302883 303078 301645 303002 302343 300742 302727 304616 304051 304795 304393
3927 304393 307579 315056 311833 313953 315849 316574 317790 318765 321677 324613 327438 325362 325873 326328 331589
3912 331589 334829 336020 337851 342564 346454 347204 344755 342626 344167 348744 348881 347745 348372 348410 345554 349355
3896 349355 353619 357197 356807 357137 360757 363087 365035 367428 366664 365726 364779 371062 375557 376884 376145 374366
3880 374366 377677 377910 381011 385120 389502 391405 391568 394913 402001 403320 404885 409929 417375 423020 430285
3865 430285 438128 447199 451871 460246 466736 472368 478547 482525 484739 489407 489961 492631 495482 500460 504876
3850 504876 506146 511240 516215 519804 523343 527381 531568 534459 539018 542985 548043 553814 562730 571268
3836 571268 576202 580758 584215 584463 582614 582107 581689 582653 584691 587246 589848 591134 595618 598420 602058
3821 602058 608055 611706 615780 620029 624228 627615 632013 637999 646404 648248 653295 661079 664774 672144
3807 672144 678691 687035 695658 704983 715549 723413 733087 742581 748099 758132 769512 777203 782260 788881
3793 788881 797446 804712 812404 819668 826553 832272 837337 847834 856041 859369 866772 875549 888236 898621
3779 898621 908322 916959 927449 939870 951143 959131 974602 989454 1004275 1017287 1028070 1039696
3767 1039696 1054450 1071513 1088908 1101486 1116757 1132867 1147104 1165676 1179219 1198706 1217975
3756 1217975 1237817 1255031 1276321 1301445 1323012 1351568 1375713 1399377 1425706 1451621 1479113
3745 1479113 1510108 1543536 1576341 1612705 1656570 1704584 1757459 1814938 1881186 1961181 2048730
3734 2048730 2143757 2261411 2392804 2543086 2714578 2912100 3145659 3423648 3748355 4114439
3724 4114439 4488448 4817714 5038839 5095578 4967710 4686218 4308204 3899860 3517680 3188842
3714 3188842 2913263 2688733 2507951 2361811 2244537 2150346 2070430 2005723 1955901 1913200
3704 1913200 1882559 1855403 1829580 1812483 1798540 1786860 1777182 1771037 1766838 1765185 1766635 1767715 1769938
3691 1769938 1772658 1777609 1781364 1786846 1791287 1797796 1803853 1813104 1821375 1833356 1845063 1861361 1874849
3678 1874849 1890756 1905315 1919486 1936551 1954677 1970947 1986064 2001925 2014898 2031028 2046804
3667 2046804 2060104 2079570 2097897 2118391 2134841 2152392 2173103 2195949 2215987 2233503 2254128
3656 2254128 2277067 2295820 2314223 2334216 2352771 2374725 2395498 2415184 2437124 2458153 2481830
3645 2481830 2507352 2527286 2545912 2570734 2594366 2616509 2639842 2665736 2687246 2708407 2734038
3634 2734038 2757942 2781617 2807492 2836406 2867576 2899848 2929082 2955411 2983607 3009826 3041494
3623 3041494 3072690 3102536 3135920 3167507 3197584 3228862 3264131 3294148 3326712 3360444 3393774
3612 3393774 3423097 3448026 3473900 3499937 3525301 3549634 3577632 3612380 3644585 3680175 3716140
3601 3716140 3749897 3785927 3812553 3835034 3854266 3870856 3889629 3911317 3942427 3978314 4020462
3590 4020462 4057610 4091407 4117111 4142649 4169929 4197828 4237340 4280151 4324604 4368752 4410624
3579 4410624 4451705 4490449 4529491 4559990 4590791 4624609 4660188 4702580 4752328 4801528 4856846
3568 4856846 4916165 4978904 5048097 5121228 5199273 5280867 5367801 5460106 5557018 5657160 5755560
3557 5755560 5852766 5948405 6049143 6147586 6246193 6352282 6463507 6585559 6711178 6834931
3547 6834931 6955985 7066799 7178355 7284708 7395158 7511300 7638228 7773543 7910146 8050531
3537 8050531 8188344 8322210 8449405 8565527 8683861 8803552 8927788 9068378 9223807 9389408
3527 9389408 9563957 9747048 9934740 10121033 10302699 10482626 10663829 10847764 11039843 11242206
3517 11242206 11459004 11699808 11954285 12222528 12509777 12802559 13106622 13422541 13749825
3508 13749825 14086486 14434255 14799722 15178165 15582981 16008436 16457467 16929531 17427925
3499 17427925 17944363 18476968 19025709 19604438 20222073 20885622 21597271 22341697 23101980
3490 23101980 23855982 24586600 25284905 25957495 26609128 27256927 27925725 28615212 29314603
3481 29314603 30021786 30736866 31458757 32202485 32982141 33793180 34626639 35478119 36356458
3472 36356458 37272454 38237090 39255174 40322544 41446486 42618583 43829761 45074441
3464 45074441 46376217 47756535 49228031 50784698 52415253 54071667 55723817 57358987
3456 57358987 58952577 60486525 62010937 63588871 65247399 66971843 68728235 70522759
3448 70522759 72416711 74437373 76588062 78872954 81304124 83874606 86576517 89388800
3440 89388800 92312478 95358484 98584210 102069926 105838559 109892855 114307139 119180497
3432 119180497 124561238 130471490 137020141 144307971 152387807 161285137 171000611 181518234
3424 181518234 192908067 205178603 218289717 232214827 246861289 262340601 279051050
3417 279051050 297358126 317217590 338198058 359488816 379575749 395810920 404574374
3410 404574374 403319779 392502606 374963170 354386435 333467065 312979875 292860020
3403 292860020 273570856 255511393 238547782 222524675 207519453 193642474 180972399
3396 180972399 169455303 158995368 149411756 140466126 132132017 124497987 117516839 111117894
3388 111117894 105242504 99835870 94856683 90264347 86012010 82034983 78307145 74832181
3380 74832181 71599902 68568647 65710558 63019443 60481836 58095323 55857685 53767236
3372 53767236 51809033 49962912 48200659 46524454 44947328 43455293 42038925 40689863
3364 40689863 39407351 38181258 37011364 35895716 34835056 33827899 32865924 31942064
3356 31942064 31045001 30175232 29342654 28546936 27782987 27044647 26331279 25641184 24977221
3347 24977221 24337161 23715272 23100362 22498321 21903017 21316358 20738432 20174980 19626738
3338 19626738 19097396 18594861 18115256 17651211 17201421 16762819 16340129 15931303 15541586
3329 15541586 15166866 14809220 14465898 14135377 13809932 13489904 13176429 12862427 12549862
3320 12549862 12244094 11949266 11672114 11407879 11157931 10915560 10682747 10456477 10237049
3311 10237049 10029246 9833881 9645939 9465000 9290234 9117225 8944511 8773048 8599704
3302 8599704 8432180 8258876 8092253 7933052 7783285 7639036 7501486 7371182 7240435 7115988
3292 7115988 6993133 6863646 6735298 6605987 6471003 6345519 6233314 6126154 6029326 5943262
3282 5943262 5864321 5788524 5705555 5620858 5532131 5444196 5359649 5285657 5224940 5172739 5125026
3271 5125026 5081580 5037827 4993820 4944450 4893358 4840863 4794501 4749502 4706996 4668286 4629168
3260 4629168 4592234 4554798 4509833 4462804 4410406 4359260 4312015 4262885 4210238 4157454 4101341
3249 4101341 4039955 3973396 3898688 3824133 3748006 3676180 3608102 3543528 3491136 3437001 3391271
3238 3391271 3346175 3297590 3249944 3196665 3140945 3084036 3030678 2986280 2947622 2908563 2869322
3227 2869322 2826491 2779414 2725976 2679499 2633215 2596357 2563909 2531059 2499617 2468607 2438734
3216 2438734 2404926 2374836 2343246 2308977 2275891 2249324 2222642 2196750 2175785 2151497 2127558
3205 2127558 2109594 2089728 2070745 2052210 2032290 2013600 1994656 1978055 1960716 1944052 1922884
3194 1922884 1906989 1891485 1873659 1861752 1850640 1835334 1819117 1804393 1787600 1772720 1758426
3183 1758426 1741937 1729694 1716601 1704368 1696052 1678994 1663428 1652089 1641022 1628608 1617809 1605225
3171 1605225 1594620 1581598 1572056 1563271 1553485 1544919 1532376 1525511 1517590 1503847 1491446 1481313 1469249
3158 1469249 1459611 1455236 1445614 1439354 1430858 1420930 1416714 1410720 1409147 1404130 1392750 1386917 1385330 1385532
3144 1385532 1383599 1382309 1381774 1382703 1383486 1383115 1382133 1380864 1380569 1380783 1379362 1377212 1375392 1376007 1376694 1380907
3128 1380907 1384102 1390436 1399568 1406516 1411555 1420981 1430254 1442508 1457222 1473015 1488890 1511088 1537859
3115 1537859 1570887 1608186 1653065 1714433 1781555 1864319 1956677 2068442 2199789 2350333 2527242
3104 2527242 2746459 3012246 3330042 3690072 4075293 4425093 4672651 4757947 4662076 4403054
3094 4403054 4035993 3633190 3243623 2901895 2610177 2363478 2160999 1994585 1852669 1731489
3084 1731489 1631730 1542971 1465747 1400979 1341970 1291893 1244798 1201332 1163779 1126847 1094928
3073 1094928 1064760 1038157 1017657 995964 974880 956180 939963 922164 905828 892380 878334
3062 878334 863244 847846 834825 823018 809610 796228 785134 773790 763700 751547 739989 735014
3050 735014 727455 716846 707903 696946 688533 682756 676556 666519 656032 649131 642717 637465 631454
3037 631454 621582 615641 608647 602396 597543 592920 585407 575939 569707 564759 557314 548408 548065 544281 539878
3022 539878 533645 527878 523439 521214 516897 512649 506532 502141 496764 488930 486356 482618 476019 476381 472132
3007 472132 467901 462673 455552 451959 449058 446264 442033 440444 437113 437388 436005 432782 428229 424170 420485
2992 420485 419913 416071 410476 404275 401248 397637 390931 390040 383341 376403 375228 371116 367942 362778 360983
2977 360983 361444 357491 354772 350075 343992 337877 336257 336687 335869 330098 329540 328550 328674 324117 321041 320259
2961 320259 317571 314568 315330 320309 322116 328000 330097 328828 330197 333010 334341 333803 334171 338359 339808
2946 339808 340909 340683 341754 343525 348032 350008 352494 351430 344935 335106 328125 324624 315417 309537 306822
2931 306822 302154 296905 294117 292505 283602 282134 284319 283598 279214 274713 273173 267170 266759 266240 264577
2916 264577 261293 259147 256123 255080 252815 250333 248486 247171 242784 243895 242157 238604 236522 236711 235216
2901 235216 233945 233399 229263 225875 226955 226461 222874 222962 220578 220914 218743 218160 216113 214800 214584 213319
2885 213319 212844 213883 209665 204721 203095 204638 204940 203832 199312 196284 198671 196961 195537 194315 190754
2870 190754 189080 187277 184831 186909 186363 185848 182724 181763 180789 178811 179095 179310 178020 176102 176997 174809
2854 174809 173261 172710 170844 168029 168387 168727 166625 163161 161994 160876 159691 158801 156583 157795 158655 157012
2838 157012 156956 154655 151890 150647 151840 151832 151505 151357 152056 149042 147329 145965 144992 147842 148740 144784 141403
2821 141403 140255 137948 137266 137998 140675 138634 137387 137231 134803 132902 131546 132351 127398 124367 123403 124224
2805 124224 124269 125778 125718 126032 123332 120348 121983 120315 121712 120909 120345 122069 122648 123141 123454 121168 114712
2788 114712 111016 111108 109169 110559 109645 108846 109997 109197 106174 106339 106984 107713 107449 108307 105063 102189 105641
2771 105641 105853 103735 102481 102123 104417 103896 102477 102795 101899 98513 98284 99075 98762 94075 95697 97666
2755 97666 95901 94095 95871 96284 92655 91879 92087 91244 92046 90963 89311 87969 89347 91441 90378 94754
2739 94754 92205 89917 90455 92712 96480 97186 98435 101598 98231 96450 97349 96013 94632 94579 94045 95049
2723 95049 96156 95235 93019 92837 91442 89779 89599 89734 87647 87098 86280 84272 79939 81278 82322 81855
2707 81855 82858 79825 78940 79200 77236 74914 77097 77355 76737 72690 73638 73468 73648 75302 75811 75269 72009
2690 72009 69432 70421 70002 69247 70530 70262 69615 65380 62375 63905 64456 66075 65143 63619 65576 63970
2674 63970 65583 65284 63680 65723 61303 55839 59698 63533 65124 66246 65204 59029 57881 60423 55282
2659 55282 55584 55733 52793 51550 52501 54294 53538 54966 52777 53986 54840 52625 52875 52302 51310 49462 50310
2642 50310 52418 51354 50223 50560 49442 48560 45901 46951 48713 49355 49001 52155 51368 48364 48127 44035
2626 44035 41720 42765 43496 42985 42995 42718 42593 43144 41704 41636 43754 41627 39961 36174 35034 36490 37509
2609 37509 37261 37423 38597 36723 35078 37545 39724 43204 40602 39981 39220 37216 36486 33998 33278 33594
2593 33594 36198 38210 38816 36096 35909 31364 33614 35683 34665 35188 28026 27226 22986 23238 27745 32358
2577 32358 33536 29285 30843 33639 31751 28297 28350 27606 29485 27433 26955 27751 26794 26762 26562 29384 30183
2560 30183 28051 27095 24194 24640 26090 27273 26149 22769 20117 22529 21939 19701 21834 23300 25301
2545 25301 26012 24990 20442 17254 21144 21765 22263 20340 20600 21157 20447 19347 17015 18109 17172 16388 18412
2528 18412 16952 18095 16916 17907 19023 16049 14771 14759 16712 14644 14467 13938 17099 17495 15879 15053
2512 15053 14514 14185 16721 16934 16430 16089 15345 14742 14082 16373 19184 16999 17832 18486 18214 20090 18479
2495 18479 15672 16719 16414 18645 20793 21216 19176 19194 19127 19187 17671 19327 18965 15787 16785 13691 14346
2478 14346 12999 12404 15184 13921 15172 14507 11521 11708 12921 13093 11656 12678 12590 14320 13713 14969
2462 14969 13343 13496 13621 11702 13119 13053 12804 14106 15103 12216 10584 7548 10174 12891 11745 10637
2446 10637 8223 7562 7423 10722 10746 9709 9475 7089 7094 8385 10373 8455 11524 12570 9928 10092 8385
2429 8385 10230 11043 7728 6643 8184 8119 8698 10878 11365 10863 11158 10236 10598 8961 10067 10837 9121
2412 9121 8330 7722 8809 9575 7829 14510 13861 14655 14526 12538 11469 10017 9033 10151 10803 11073 13397
2395 13397 11961 13113 14293 13356 14469 15218 17918 15174 17230 18691 16661 17367 22891 23693 20342 18463
2379 18463 16404 14026 16893 18799 13989 15682 16068 14992 15754 14676 13420 16723 17607 19618 18570
2364 18570 20150 17278 21380 24067 24068 26885 28181 26696 26979 26498 31551 36344 36266 35513 32607 29047 28619
2347 28619 26278 25332 24799 25322 21993 19712 17324 16859 18336 16392 16413 15239 14305 17154 18080 18183 19592
2330 19592 18269 18199 19162 18549 18169 18257 17488 22644 25580 24304 22389 25606 25928 22598 23264 19045 18258
2313 18258 19199 17439 15660 14596 15414 14988 17711 15915 17161 17915 17558 18931 16313 15156 16257 18990
2297 18990 20168 18817 18587 17489 14451 17874 17461 18855 18869 15910 16424 16733 16249 17115 20671 22681 25575
2280 25575 23883 22841 26538 26327 25434 26360 27576 24540 20504 22584 23807 25332 25369 25972 25996 24177 22176
2263 22176 23148 23432 21671 20923 23019 21029 21544 23792 23976 24696 26478 26711 26531 27227 27316 29175 27886
2246 27886 29689 30911 29635 27727 24316 25938 26572 30103 31521 32859 31096 31061 30452 31905 32463 34143
2230 34143 38113 38722 37598 38071 39587 38527 36823 38429 40203 39524 39996 40446 42484 45284 47949 48139
2214 48139 52444 54723 55548 55333 57010 58579 62598 65176 67154 72843 71340 72156 74443 77069 79376
2199 79376 79120 81235 85782 86241 85555 84766 81857 79998 82286 85265 88041 91643 93525 94593 99092 105507
2183 105507 110261 113841 116780 123291 126193 131159 136349 138478 140036 144450 148275 152729 163098 168228
2169 168228 170550 177804 179024 179517 183582 185927 185342 188092 192560 193014 193105 194630 199179 205691 209060 218485
2153 218485 230249 237087 243392 251021 258426 270215 276072 281477 286368 295521 306076 314325 323947 332826
2139 332826 342397 355230 363845 372214 379708 388746 397982 407935 420407 426938 431412 443246 459343
2126 459343 470618 486914 506479 527930 546964 575036 605797 635000 670244 707470 752337 805098
2114 805098 863387 929562 1003551 1092005 1189969 1303958 1444297 1618390 1834915 2098598 2402710
2103 2402710 2695170 2872113 2828095 2589502 2284272 2007764 1795446 1632067 1500572 1398072
2093 1398072 1319053 1262126 1223985 1197502 1185984 1185072 1198988 1227877 1270881 1326008 1396980 1482713
2081 1482713 1588446 1715238 1857273 2030052 2242411 2501843 2831776 3254381 3779363 4365689
2071 4365689 4875029 5070704 4801056 4216223 3591915 3065444 2650189 2315781 2042002 1823580
2061 1823580 1648622 1507505 1391561 1297641 1225500 1168020 1123449 1090234 1071548 1066824 1067715
2050 1067715 1084861 1115708 1154403 1206813 1275566 1367294 1485751 1640231 1841539 2087289 2347416
2039 2347416 2543389 2564638 2375749 2066255 1756208 1501148 1297259 1133076 998345 887284
2029 887284 794238 717122 653884 598829 550901 510730 476990 444650 415048 389639 371109 354660
2017 354660 336914 318164 301225 284700 271471 262855 251497 238400 228005 221559 215150 209592
2005 209592 200862 192787 184915 178259 170998 161400 155083 147825 140725 136956 133163 131577 128727 124210
1991 124210 120992 116078 111789 107798 105030 101081 99845 98551 94954 90560 87004 81337 83084 84822
1977 84822 78635 74657 70811 65960 67019 65720 63903 59520 56365 55836 53075 52757 52326 48611 50950
1962 50950 50230 49386 47898 43326 44549 41582 38649 34965 38759 38141 33992 32023 33319 33721 32738 30962
1946 30962 29407 24984 25348 24166 20726 21844 21455 18964 23161 21530 20590 18958 16736 12886 13236 14035
1930 14035 10886 13637 14749 13910 12910 13101 11337 8404 10343 10498 12358 12918 10239 8327 7658 5710
1914 5710 4666 9423 8300 5856 7035 6200 11997 12978 7489 5742 5073 6058 5160 4367 3187 3651 4393
1897 4393 1381 -7 3772 1597 -368 -223 10 -1630 -4652 -4314 -336 1140 -665 -574 -2874 -6330
1881 -6330 -4486 -1737 -1402 -1303 -587 -2576 -3402 -5988 -6311 -5694 -5375 -6032 -8488 -8836 -6697 -7932 -6639
1864 -6639 -6247 -5344 -5399 -6240 -8051 -8175 -9100 -6599 -7033 -9488 -11126 -10759 -9473 -5828 -4553 -7416 -9276
1847 -9276 -6885 -6370 -7588 -3434 -2067 -4862 -5193 -4173 -4779 -6493 -6228 -5419 -5758 -7620 -8578 -4170 -3887
1830 -3887 -2965 -4368 -3233 -2174 -1057 -1598 -3068 14 672 -575 2468 5157 2249 2237 6323 4338
1814 4338 248 -4555 -6054 -6284 -6157 -6900 -9474 -7386 -6717 -5385 -4600 -5824 -6716 -5294 -6513 -5649 -5243
1797 -5243 -5891 -3342 -2839 185 -733 -1724 676 1883 2427 6368 10749 12683 14270 11108 6209 2254
1781 2254 -2743 -1222 38 -3038 -6528 -8154 -7210 -7500 -8269 -6885 -9918 -10878 -9608 -6713 -10270 -10814
1765 -10814 -8987 -11428 -13617 -12899 -11300 -10553 -9574 -10425 -10978 -6916 -5274 -7637 -7627 -4863 -8212 -12019
1749 -12019 -13213 -15138 -13774 -14904 -16660 -18795 -15352 -13894 -15995 -17688 -21680 -22530 -23430 -21640 -20595
1734 -20595 -19930 -18994 -21638 -17384 -17358 -16541 -17978 -20737 -18065 -16300 -17716 -16945 -18355 -19796 -17782 -18204
1718 -18204 -18110 -16972 -15601 -18770 -18992 -20245 -20968 -21275 -19628 -16857 -19366 -18808 -17635 -21357 -18754 -17967
1702 -17967 -19241 -19606 -21803 -18435 -19973 -21081 -24004 -22062 -20725 -20428 -21941 -22726 -22320 -21140 -21801 -21828
1686 -21828 -21981 -24598 -21528 -23581 -23147 -22332 -23274 -23452 -22433 -20526 -21567 -23537 -22182 -20242 -20917 -21222
1670 -21222 -24795 -25436 -20964 -20502 -20801 -21516 -20086 -19999 -21448 -22750 -24670 -27198 -26093 -24094 -24866 -25069 -22217
1653 -22217 -22398 -22327 -23543 -24973 -25490 -23019 -20400 -22150 -23840 -23303 -19774 -21797 -22925 -22542 -22107 -23976
1637 -23976 -21462 -22234 -23354 -22296 -24114 -25198 -25150 -22088 -19792 -22513 -24508 -24088 -21441 -21447 -22878 -24023
1621 -24023 -23546 -22518 -22479 -22891 -21375 -19203 -21862 -21997 -19746 -20113 -25368 -22905 -21185 -23284 -23468 -24247 -26316
1604 -26316 -27655 -21169 -23355 -24975 -24786 -21738 -22080 -23444 -22276 -24547 -25370 -24564 -21128 -24486 -25947 -26128
1588 -26128 -26751 -25232 -22120 -22590 -23423 -22585 -23104 -21369 -21577 -22727 -22727 -23208 -20651 -19929 -19464 -21726 -24008 -25110
1570 -25110 -20656 -17284 -15459 -18620 -23059 -18792 -18721 -22250 -20128 -20896 -24297 -23281 -21124 -19693 -22869
1555 -22869 -21236 -18708 -17658 -19118 -19307 -20007 -22251 -22683 -21713 -21065 -22503 -27359 -25621 -21189 -21826 -21882 -19796
1538 -19796 -18124 -20366 -20345 -21388 -22511 -20663 -22223 -20106 -20752 -21108 -21446 -21547 -21781 -23157 -23049 -22682 -22713
1521 -22713 -22648 -21904 -24266 -24346 -24994 -25820 -21495 -22838 -27266 -25327 -25195 -24409 -24101 -25609 -25465 -23688 -23819 -23921
1503 -23921 -26653 -25402 -23796 -22891 -22951 -22355 -25251 -26357 -24615 -23344 -22029 -19936 -21028 -21737 -25765 -24194
1487 -24194 -24833 -25804 -25224 -23876 -24975 -22786 -20431 -21381 -22684 -24032 -24942 -25723 -23054 -22306 -23055 -23234 -20090
1470 -20090 -21695 -22789 -23934 -24424 -23930 -23767 -20811 -23090 -24648 -22705 -19329 -21376 -20338 -22556 -24094
1455 -24094 -20957 -22445 -20662 -19307 -18653 -20035 -22539 -23566 -23921 -23017 -20605 -24154 -25705 -30275 -25659
1440 -25659 -24595 -24681 -23949 -23519 -22805 -25357 -24095 -18823 -17761 -18781 -20703 -19162 -22231 -22968 -25237 -21549
1424 -21549 -20398 -22029 -23223 -23591 -23634 -21401 -20515 -20859 -22964 -21956 -19768 -21696 -20969 -21636 -22255 -24481 -23329
1407 -23329 -20131 -22024 -22096 -19470 -21071 -20958 -20557 -20605 -22801 -20401 -20527 -22539 -23667 -24842 -22056 -21427 -18960
1390 -18960 -19890 -20388 -18637 -19283 -17332 -15758 -17816 -18175 -19459 -20429 -20920 -21258 -19504 -19301 -19895 -22232 -21911
1373 -21911 -20790 -21535 -20514 -18790 -19532 -19886 -19596 -19939 -19920 -19336 -19659 -19938 -18752 -16906 -19539 -19363 -19421 -19775
1355 -19775 -20536 -20382 -21469 -25318 -23976 -22406 -21476 -21459 -25144 -20611 -18884 -18185 -20455 -17270 -21133 -21266
1339 -21266 -21557 -22444 -22216 -21149 -20182 -19857 -20216 -19268 -20375 -21334 -21994 -23504 -23268 -22326 -20704 -19570 -20598
1322 -20598 -22670 -19747 -19964 -19411 -16195 -18724 -18044 -17356 -20449 -21638 -18304 -18625 -21651 -20531 -20369 -17413
1306 -17413 -18570 -20780 -20081 -16909 -18258 -20663 -21035 -20209 -17551 -19118 -20497 -20120 -18744 -19326 -20434 -19950
1290 -19950 -22459 -19805 -20846 -18713 -20660 -20893 -17709 -16161 -16385 -20546 -23563 -23091 -23503 -21358 -18360 -16418
1274 -16418 -19666 -19566 -19181 -21108 -19382 -21949 -27158 -20922 -19870 -22809 -24246 -20749 -20331 -16826 -16530 -20216
1258 -20216 -18847 -23683 -22358 -19445 -18148 -19538 -18606 -17203 -16716 -16178 -19676 -21724 -19533 -17540 -16611 -16340
1242 -16340 -16456 -19858 -18989 -19116 -17652 -15617 -16839 -16545 -13489 -17103 -21212 -20241 -20684 -20323 -21611 -21172 -21736
1225 -21736 -20776 -18631 -17549 -17736 -17666 -17395 -17263 -17247 -18757 -18267 -17041 -17379 -18212 -15939 -17184 -15624 -14080
1208 -14080 -13692 -14898 -15412 -17852 -17402 -17892 -18624 -16596 -16678 -17419 -20113 -18127 -18885 -20814 -18550 -16562 -15974
1191 -15974 -15651 -15596 -16548 -17766 -16307 -18572 -19852 -20616 -19693 -18629 -18045 -19919 -18419 -13709 -15825 -18854
1175 -18854 -16138 -17378 -18400 -18481 -19374 -20704 -17906 -15637 -19112 -18938 -18534 -18202 -17435 -18521 -19238 -18878 -17157
1158 -17157 -17930 -18325 -19353 -20096 -21726 -20457 -15616 -15707 -17161 -16436 -15474 -16927 -16995 -17724 -20731 -19643 -18737
1141 -18737 -19669 -19221 -17555 -14236 -12270 -13058 -14518 -15248 -15092 -15571 -16318 -13425 -14539 -18644 -19453 -20773 -19016
1124 -19016 -15565 -17508 -18768 -19881 -18497 -17234 -15231 -14795 -15048 -16105 -13648 -15913 -16263 -15266 -15717 -14667
1108 -14667 -15799 -16114 -13671 -13881 -14817 -15574 -14672 -14733 -17849 -18431 -17180 -17410 -14742 -16125 -15382 -16508 -18658
1091 -18658 -18804 -18141 -16365 -14925 -16921 -19386 -16633 -15746 -15270 -15464 -17174 -18351 -17153 -14120 -15091 -12305
1075 -12305 -12798 -15138 -14158 -13831 -12467 -13811 -13464 -15240 -13812 -12023 -12856 -13017 -14948 -12222 -12778 -15803
1059 -15803 -13801 -11176 -10671 -13407 -13617 -17376 -16868 -14118 -14611 -15825 -16284 -16945 -16547 -15169 -13091 -13557 -12442
1042 -12442 -13367 -14557 -15009 -14976 -12545 -11314 -12898 -15577 -18232 -16064 -17261 -14764 -11858 -13707 -14816 -13254
1026 -13254 -13349 -11430 -15402 -16894 -14136 -15468 -15760 -14629 -12485 -15488 -14661 -13790 -11456 -12186 -13782 -13264
1010 -13264 -12429 -10022 -12804 -12194 -12228 -12490 -11643 -14222 -14504 -12029 -12189 -11814 -12209 -13223 -10653 -9395 -11174
993 -11174 -10250 -10966 -12814 -11098 -11210 -15223 -14181 -13103 -13318 -16890 -15775 -13089 -15591 -12907 -10250 -9179
977 -9179 -9993 -11987 -14660 -10074 -9120 -11838 -12862 -11927 -12367 -11188 -7768 -8367 -12363 -10466 -8608 -10446
961 -10446 -10352 -13199 -12256 -10915 -7321 -8798 -10177 -11567 -13499 -10204 -12471 -11308 -9027 -8926 -10572 -11466
945 -11466 -10599 -5844 -9562 -11305 -9331 -11502 -11835 -10241 -9464 -6962 -7937 -11762 -9608 -7674 -10129 -9870
929 -9870 -8044 -6304 -6202 -8277 -7102 -8292 -7735 -6460 -8018 -7048 -4870 -6755 -8719 -6447 -5626 -7374
913 -7374 -7698 -6467 -7876 -8551 -7601 -4715 -6323 -9868 -9277 -10150 -8519 -8162 -7498 -8947 -7577 -6066 -3875
896 -3875 -2665 -4616 -3980 -4734 -5142 -7676 -8206 -8145 -9007 -7376 -6925 -6869 -9105 -10136 -8346 -8105 -8152 -8780 -7701
877 -7701 -6145 -3146 -6208 -9071 -8952 -8501 -8230 -9661 -6784 -5593 -6390 -6078 -7018 -9209 -8528 -4454 -5114
860 -5114 -8179 -9501 -8921 -8550 -8704 -7530 -8426 -6766 -6331 -4427 -3966 -6807 -6836 -8089 -8073 -10197 -6304 -4151
842 -4151 -3528 -3832 -7403 -7405 -9267 -8388 -6188 -8860 -8719 -7885 -9077 -9940 -11349 -10973 -8902 -7544 -7980 -8005
824 -8005 -8006 -5987 -7422 -8698 -10055 -10226 -9400 -9192 -4617 -7367 -6332 -4341 -5988 -7961 -7996 -3311 -4986
807 -4986 -7964 -9703 -5913 -3622 -4036 -2909 -7237 -9353 -8655 -9410 -8133 -6723 -8325 -7716 -8692 -9970
791 -9970 -8935 -9057 -9219 -7759 -6326 -10215 -8695 -2633 -5083 -7523 -4837 -6028 -4069 -6776 -7556 -8469
775 -8469 -9497 -8284 -7738 -6686 -7640 -8975 -3877 -6630 -9093 -7254 -5095 -3038 -3592 -6777 -9060 -8749
759 -8749 -9012 -6640 -6796 -6096 -6039 -7431 -8171 -8818 -5089 -3931 -5427 -7172 -4983 -4342 -5596 -5943 -5893 -3928
741 -3928 -6483 -6861 -3825 -4553 -5480 -4331 -7912 -7353 -4406 -5429 -4821 -7046 -4765 -2111 -3000 -364 836
724 836 -1863 -3861 -5406 -6789 -5006 -5461 -5938 -5449 -1143 -2422 -4472 -4699 -2240 -3801 -4542 -5095 -5224
707 -5224 -4989 -7178 -7941 -6767 -5883 -4634 -3453 -1615 -3850 -1866 -2188 -1907 1189 -1200 -2121 -2981 -2251
690 -2251 -2389 -1758 -3165 -3049 -417 -695 -1835 -2635 -363 -234 -1269 -1112 -4540 -6780 -6114 -1811 -4191
673 -4191 -1881 -576 -880 -980 -370 -2346 -2878 -1119 -3643 -112 993 1450 -2816 -3314 -783 -23 -561
656 -561 -2979 -1663 106 617 -1231 -2773 -1599 1959 2474 837 195 -1378 -2126 -5421 -5676 -5373 -2838
639 -2838 -3712 2219 2777 -54 -1870 -287 954 -1995 -3918 -3192 523 -2170 -2807 -1466 -552 1884
623 1884 1160 3371 4471 1285 1020 285 -82 306 657 -941 62 434 2045 2519 2543 791 2265 4464
605 4464 4452 104 -777 1878 1334 -1379 -3879 -3141 701 1058 2171 3471 987 2543 5103 2318 3203
588 3203 2210 1236 2469 305 -612 1936 2223 412 1837 3180 219 -860 2054 698 212 2329
572 2329 3491 3288 4406 2099 1572 2884 1496 4247 4895 374 1185 3864 1384 -632 -1828 223
556 223 99 -1103 1725 4309 4357 4739 1537 1752 2519 2853 4267 4521 3629 1921 2046 3689 3450 3113
538 3113 5169 3726 3451 4338 2139 1277 5032 5848 1607 1123 5239 5826 4762 6076 4493 5311 5334
521 5334 6193 5472 4311 2830 485 4835 8144 3628 2223 4108 5580 4667 6172 6080 4693 6045
505 6045 5578 5080 4368 3336 6036 6588 3303 3194 1632 2311 1363 2905 4989 6788 6008 7521 7600 7145
487 7145 8621 7806 9140 6268 5321 4522 4006 5653 6634 7205 5410 6958 6780 7743 4343 9173 11663
470 11663 9600 8021 6598 7219 8579 7909 8888 10316 9172 8192 6420 6115 7428 8344 6708 8025
454 8025 9582 9371 11150 9963 6768 7681 9344 8102 9663 8522 8732 7087 8692 10804 9084 9070
438 9070 9060 8908 8795 9768 8354 8712 10554 11370 10259 7402 6086 7564 8672 10152 8254 7951 6955
421 6955 4997 9502 6579 6454 8640 9517 12869 8888 10019 12811 12241 10985 11267 8957 9144 10293
405 10293 8414 7169 7563 5327 5069 7373 8931 9758 8846 7932 7198 9796 9918 8288 10138 8081 9310
388 9310 8243 8958 9286 10689 11724 9912 9741 8044 7443 8780 9746 9152 8691 8417 9924 9684 10033 10446
370 10446 10828 8866 7721 9263 9218 7526 8926 10344 11350 8380 7831 11198 9991 9764 10435 13953
354 13953 11074 11265 11354 8767 8318 10813 12611 10655 10086 9264 9582 9344 10622 10994 9699 9308 9932 12285
336 12285 10962 11921 13827 11753 10118 9463 11334 11651 12862 13985 14405 15210 14362 11283 10428 13714 16174
319 16174 17061 15331 18137 18898 17210 14365 11404 15532 19204 15810 13652 13093 15002 15973 12763 12513
303 12513 13899 13466 11085 12819 11785 10724 14695 13151 13621 13652 9462 11242 12708 13302 15439 16425
287 16425 15267 16108 15449 13102 12640 15405 16093 15446 13997 13681 12600 13368 14025 15274 15411 13214 13349
270 13349 13974 15931 13524 15042 13400 13722 16601 16452 16850 16179 15628 14137 10756 12081 14808 15196 14934
253 14934 14319 15670 15444 17275 14584 15167 12279 8780 10527 14169 14318 14565 11558 11728 11325 13295 14572
236 14572 12464 13470 13533 14245 11210 10457 12539 12872 13685 13264 13498 14370 13500 12305 10645 14853 13382
219 13382 14641 13960 11177 10771 12456 13961 13225 13025 14715 13874 11278 12397 14416 15178 15607 15680 13793
202 13793 13658 13076 10803 9825 10337 13378 16556 16256 13787 11564 11070 9097 8870 12449 11589 10508 14961
185 14961 14515 13235 11573 13872 13598 13383 14172 14461 13494 10865 9286 9320 11148 12352 15082 14347 8471
168 8471 8252 10229 10954 12952 9267 8763 8771 8563 6952 6724 8488 9557 8125 10498 15725 12646 11061
151 11061 8302 7622 10497 8534 8018 7467 9939 9072 7945 7041 5480 6466 5816 4426 5964 7649 7376
134 7376 7671 5328 6664 5209 5579 6353 5505 7205 4560 4933 3775 4253 3128 1584 4041 5454 5008
117 5008 5143 5837 4242 4926 2931 625 2134 2184 3296 2875 3707 107 -2434 -1034 1600 1759 663
100 663 -3288 -322 253 -1878 748 -639 -2412 -3218 -2488 -1916 -460 -2480 -3745 -3539 -3419 -5826 -7460
83 -7460 -7635 -7423 -5873 -6812 -6690 -5397 -3485 -5132 -7879 -7876 -7731 -6170 -7725 -7498 -7960 -7621 -9214 -10548
65 -10548 -9163 -10322 -11207 -11443 -11331 -10766 -9004 -10943 -12782 -12458 -12977 -12149 -12709 -12182 -13793 -13491 -12972 -13610
47 -13610 -13843 -14301 -17140 -16212 -15471 -15538 -16700 -16843 -15527 -15571 -16718 -16513 -19245 -18034 -16452 -18638 -20414 -21825
29 -21825 -21967 -22865 -20860 -22881 -23467 -23192 -23937 -22310 -23213 -22790 -23453 -23188 -21320 -21984 -22395 -23487 -23900 -25460
11 -25460 -28789 -27509 -25696 -26258 -27331 -26338 -24809 -26873 -28382 -30248 -28851
0 -28851
$$ Imaginary data points
##PAGE= N=2
##DATA TABLE= (X++(I..I)), XYDATA
16383 -642306 -635734 -627240 -619021 -613513 -605629 -597134 -589274 -582447 -575356 -568738 -559615 -551708 -544576 -538151
16369 -538151 -532216 -524893 -517021 -509578 -500366 -493036 -485651 -477656 -471027 -465240 -457525 -449818 -441875 -434815
16355 -434815 -427470 -420746 -415695 -410108 -403213 -393554 -384846 -377623 -370628 -364908 -361179 -352054 -341604 -334041
16341 -334041 -327732 -319384 -310952 -306067 -300158 -293683 -286750 -280980 -274224 -266563 -260468 -254300 -246714 -240113
16327 -240113 -232514 -226970 -220045 -213875 -206526 -199765 -194434 -189155 -181289 -175552 -169473 -163529 -156765 -149049
16313 -149049 -141925 -136350 -128823 -124693 -118727 -111435 -106825 -95747 -87832 -84957 -81822 -75299 -67978 -60490
16299 -60490 -56199 -50504 -46843 -39540 -34591 -28163 -23725 -17443 -10042 -4892 -794 4691 13671 18566
16285 18566 23179 28969 33127 39607 43003 47711 55167 62154 65369 69134 76344 81045 82428 88524
16271 88524 93345 97997 104985 112902 115522 117919 126496 130994 133198 138428 143538 147256 152142 157921
16257 157921 165028 171006 172282 177225 180683 185228 188431 190293 196395 200814 207217 211203 217447 221500
16243 221500 224974 225873 229653 233512 237165 243199 251122 252062 251973 256962 260412 263473 264991 270612 275829
16228 275829 278112 284888 287911 289612 293790 299137 298385 302898 307535 310164 313487 318752 321691 323011
16214 323011 324436 325937 330163 331815 337003 341729 345874 347795 349953 352318 353194 356328 356847 359915 363057
16199 363057 365839 368244 371305 374300 377191 380469 385466 386296 386986 391172 393297 396369 399065 398339 401159
16184 401159 406186 408602 408581 409857 413519 413272 413827 413957 417021 421277 423751 425973 428816 428766 429920 433357
16168 433357 435145 436183 438058 442136 443346 442204 447525 447043 446859 446710 449527 454501 457291 455766 457257
16153 457257 458158 459730 461168 462986 462759 463552 465155 466015 470495 473064 471614 472357 474591 474546 474627 476043
16137 476043 479541 480663 478803 478456 480467 481100 483978 486584 487674 485060 488315 487857 486945 487762 490449
16122 490449 494568 492761 492799 495348 494689 494071 496691 499686 496017 497230 498502 500123 503653 503480 501176
16107 501176 502210 506524 505863 507986 506389 508615 508447 507933 507847 507970 508475 510232 511003 510700 511953 511410 512369
16090 512369 508686 506925 508072 513799 517193 515823 515840 515187 513096 515420 515187 514228 512371 512792 515022 519645
16074 519645 521460 519078 517817 516626 518699 518863 516923 518292 518578 521905 523805 522112 522541 521659 521156
16059 521156 523182 524876 521051 519152 522560 524389 525667 527144 524505 523613 524487 525165 524878 525394 527381
16044 527381 525670 523012 524182 527432 526494 524739 522880 521400 524111 528325 529321 528265 528053 526104 524217
16029 524217 526534 530167 528792 525276 522239 521815 524184 527870 527189 529559 529886 530932 528997 530105 529683
16014 529683 528453 529138 529936 529722 528990 526904 528314 530596 528095 528321 529486 527893 527789 532788 530504 528455
15998 528455 527357 526610 528646 528871 528084 529065 530586 529295 529017 530966 528967 527937 528741 528135 528640 527786
15982 527786 530521 532293 533296 533000 534460 534088 531205 531236 528141 526609 530671 533024 531331 533869 530107
15967 530107 530093 528026 527025 531832 531759 527862 526783 528955 529062 530579 531228 530184 529929 531404 533043 534133
15951 534133 534589 534955 534060 530242 531262 532635 530163 531470 531150 529659 530884 530593 532985 534763 533824 536171
15935 536171 535012 532913 533261 532305 531782 533773 532535 530195 529739 532476 533847 533367 536004 534544 534475 534962
15919 534962 535924 536219 536694 539787 535365 534091 535058 535259 538051 536530 536151 535079 536426 534675 535379 536398
15903 536398 534171 534214 536719 533847 535876 534178 532381 533630 533534 532959 534187 532918 534298 537266 536168
15888 536168 534475 535601 537379 535153 532407 535824 538150 536724 535538 533452 532358 533478 535100 535270
15874 535270 536750 534305 534892 533302 535777 533880 533351 536311 536190 536480 534829 533780 534271 537130 540937
15859 540937 539771 537857 539324 534987 534302 538042 536915 538364 539420 536881 534383 534710 535824 538547 539200
15844 539200 535059 534271 534878 534521 536515 536728 538443 542442 539354 539320 539120 536575 540044 537202 538761 538620
15828 538620 537775 534269 538401 537892 534857 536468 538452 539737 536643 535049 536780 538287 540349 536225 536199
15813 536199 538702 539692 540433 538164 539277 538803 541957 540747 538941 538573 535610 534625 535945 541563 539291
15798 539291 538057 537454 541308 538109 536595 537794 539336 539911 537498 538726 536844 537386 540509 538305 538320
15783 538320 539730 538642 540778 538412 536474 539520 542105 542898 541962 540559 538818 537955 540168 539396 538918
15768 538918 537460 537028 536418 538655 540983 543346 539805 539724 538748 538329 539693 540573 541245 541841 538523 539917
15752 539917 541021 540397 539705 542203 538209 541031 544841 541704 542248 541740 540783 542341 539599 542001 543297
15737 543297 540212 539893 539915 540559 538799 538461 540390 538993 538550 539746 539268 540843 542254 542449 544840 544205
15721 544205 544086 542384 541113 541796 543047 542657 542084 543900 545992 543301 544467 546090 543837 541544 543463
15706 543463 544660 543332 542483 542709 543713 543038 543963 546725 545333 543955 545091 543635 545438 542165 541397
15691 541397 542607 542577 541633 541255 541891 545495 544996 543190 543725 544361 545554 544002 543309 544893 545252 545877 543526
15674 543526 544804 543466 545742 547210 545537 545321 547302 542420 542477 544148 545665 543490 544083 544331 544864 548720
15658 548720 546381 546625 544737 544730 547475 546263 546798 546940 547330 545902 545479 547424 545226 544052 545216 546482
15642 546482 546693 545957 545822 546159 545843 548335 546653 548838 547791 548219 550466 548138 548257 545909 545294 547308
15626 547308 546711 548222 550064 546766 545462 547554 549960 549350 549787 548556 549854 548738 547576 547113 544360
15611 544360 546459 548710 545709 545705 545482 546089 546036 547259 549505 548614 549674 549266 547466 548360 549565 549117 548125
15594 548125 545808 544740 549954 553124 551651 550564 549496 550403 548623 548535 550233 549366 546471 545417 546560
15579 546560 547384 549175 550613 550779 550776 551467 553069 550157 545068 544887 545504 548984 550651 550664 551376 549544 548488
15562 548488 548006 547470 547651 548723 550478 551196 549539 550734 548923 551155 551751 552063 552001 551036 550568 548114 545479
15545 545479 548302 548751 547670 545992 548557 545876 546871 549021 549975 552261 553601 552261 551145 550399 550031
15530 550031 550372 550273 548423 549323 550148 548842 550848 551570 549152 549574 548537 549042 552282 553466 555625 551941
15514 551941 551960 553053 553522 552771 551133 550163 552808 552275 551984 554772 553779 552456 552386 552381 551993 550267 551480 554688
15496 554688 555778 554076 554338 553564 552352 551583 553523 555444 556121 554568 554646 555434 555290 553824 552972 553995
15480 553995 553971 553421 555907 558190 558428 556538 553456 553904 552836 555491 557216 553922 551902 552332 551090 551742
15464 551742 551932 552533 555459 556914 557739 555470 556488 554894 551768 553394 555505 554104 553387 554389 555235
15449 555235 558104 554791 554147 556437 557462 555552 553746 557409 558479 555474 553258 554384 555507 556016 554940
15434 554940 556021 555593 560357 558424 554907 552841 555325 556141 553805 554150 553176 557012 558654 555481 553511
15419 553511 554306 553362 554965 554946 557298 559697 559828 559121 560667 563614 561200 558747 558351 561802 560286 558328
15403 558328 559289 561091 559697 559821 555364 554453 556137 554301 555804 557045 559117 561137 560782 560167 557465
15388 557465 556090 556572 557586 558215 558112 555129 555670 560737 560675 558162 558147 558868 558241 561012 558114 559752 561990
15371 561990 559585 558331 559191 558458 559880 559044 557256 554803 557279 557850 557203 556851 555702 556569 560965 560657
15355 560657 557725 557702 560886 561604 562099 559445 559948 558861 558883 559965 561466 561939 557712 558534 562050 560492
15339 560492 560453 559151 560592 564071 562502 564430 564772 565222 562141 560767 562000 563211 561711 563878 563626
15324 563626 562592 561114 561517 560344 560806 561255 559499 560992 560361 559372 561331 561341 562701 563327 564180 564563 562702
15307 562702 561125 560156 558779 559162 561168 563299 563619 563328 560180 559432 564077 565585 566162 565646 561357 561924
15291 561924 564908 564796 563214 562881 563557 563356 563441 562220 559594 561955 559397 559559 560389 558431 560572 561750
15275 561750 563272 565575 563365 564960 566462 564880 564713 563788 563265 565821 567621 565661 563311 561253 562592
15260 562592 560834 562280 562954 563920 567052 566022 565053 565604 565901 566050 562746 564523 568242 569778 568854 566718
15244 566718 563398 563302 562912 562594 564044 567274 566920 566693 561459 560606 566267 567166 563471 564200 566907 568397
15228 568397 568426 568477 568956 569043 569525 568078 569198 569262 569163 569608 571048 572122 568390 569853 571842 569776 569255 568267
15210 568267 565986 565213 566794 569665 567149 567181 568834 569436 567726 567904 568195 566819 566237 566422 567499 568578
15194 568578 568476 568918 569675 568871 569011 566800 569028 569089 571739 568700 568177 569525 571182 569961 570260 570557 571452
15177 571452 568598 569388 570082 570418 566853 566567 569437 568469 571176 568713 567488 570154 569297 569426 570655 569664
15161 569664 570279 570965 571188 571037 571406 570981 571612 569917 573977 573574 571512 571266 572020 573800 569927 568101 569054
15144 569054 570551 570888 573019 569218 569094 571095 572574 570216 570141 571281 570495 570439 568532 568379 565186 568142
15128 568142 569437 570359 575341 574337 570052 569773 571250 572514 575863 573130 572564 575364 573897 571923 567930
15113 567930 566306 571206 571139 570034 571191 574386 576967 576453 574781 574874 574114 574734 573152 572561 575004 572484
15097 572484 576412 574131 574178 573437 574077 574200 572390 571224 572294 572372 575662 572830 569181 573652 575864 574748
15081 574748 575444 575293 572445 571678 571284 574177 574744 575685 574743 577398 576246 574334 578259 577351 576930 577132 578435
15064 578435 576120 573849 573171 572317 573620 576034 576948 576256 576489 576428 576943 575628 573700 574174 578111 579490
15048 579490 576222 577396 579900 578237 578566 577962 577627 578149 576766 577486 574695 576828 579333 576497 577943
15033 577943 576689 577565 578905 578874 579680 578757 574325 572534 575647 577345 577229 576876 576350 574929 578516 578126
15017 578126 577982 580461 577756 575427 576717 578208 580238 578607 578315 577836 578793 578665 580518 581823 581064 581966
15001 581966 580285 578423 578858 579069 581040 581347 579880 580285 579056 580450 581824 578837 576797 577210 576098
14986 576098 578629 578416 576677 576989 579694 578422 579900 580885 579556 578770 579579 578994 578812 581976 580414 578383
14970 578383 580790 581040 582691 581876 581936 579997 579778 578951 580747 581822 581420 579699 579640 582905 581246 580680 582626
14953 582626 582380 583622 582507 580775 580088 579830 581571 579628 583018 580513 581278 579778 579489 583067 585946
14938 585946 583791 585180 581806 579558 580528 581440 583604 584333 586038 582854 583746 585261 585463 583320 581747
14923 581747 581511 584173 582990 583611 584279 584411 584498 583164 583278 584225 585724 585989 583941 583990 582889 585149 583441
14906 583441 583849 584956 585529 583935 582440 584116 580915 582724 583087 582693 582138 582043 586872 587934 588720 588500
14890 588500 587512 587268 585790 587176 586607 585592 587227 585834 584593 585517 586582 585401 584275 586048 588442
14875 588442 588193 588364 586403 584944 585700 587020 586139 585304 585427 585734 586282 585327 587196 584014 583502 587485 588720
14858 588720 588622 588866 586712 584951 583393 585172 583331 584847 584066 586854 586940 584974 587257 586448 588202 591316
14842 591316 590141 591778 589341 588894 587392 587285 586680 588096 587781 587801 586034 587346 594182 592879 589866 588642
14826 588642 588650 589325 589215 587574 589999 587811 589210 589686 589915 586689 588384 591857 589684 588866 589492 589439 588658
14809 588658 591257 589389 589338 589190 587770 588965 589420 587907 589510 589740 589198 590583 589977 589807 589952 591853
14793 591853 590717 592663 593877 594875 592390 588689 589440 588390 588071 590261 589498 590117 589590 592853 592535 590905
14777 590905 590103 589419 588834 590798 592528 593404 594233 593684 590946 591773 590467 590490 593336 595291 596251 592863 590609
14760 590609 589768 592220 594460 597409 594167 594382 595782 596336 595255 591363 589165 591655 592222 593090 594803
14745 594803 595236 595814 594905 593776 593357 593664 591846 590606 591277 592431 591586 590399 592515 593224 592807 593974
14729 593974 592701 593516 594742 594798 594040 593974 593444 596142 593298 591644 594133 591807 595382 594830 592046 595560
14713 595560 599482 597346 596478 595813 593265 595230 596074 597754 595998 594931 593352 596377 597891 597575 598248
14698 598248 594314 592271 591885 594771 595479 598639 593409 593438 595688 593057 595326 597056 595728 594744 594816 596659
14682 596659 597807 597678 596664 597666 596792 594809 595675 595525 598587 595513 595503 597082 597998 596964 596641 597319
14666 597319 594518 595258 596480 596180 598986 598877 594856 597470 597887 598627 597537 596146 599912 597820 598461 601582
14650 601582 600053 598796 600085 598912 597188 597614 598182 597005 595442 595626 594800 594559 598560 598845 601262 599353
14634 599353 597342 597957 596564 598635 599426 598964 597508 598695 598507 597621 596849 601193 602512 597591 596777 599263
14618 599263 601384 601925 601570 598247 599280 602262 599088 599618 601780 600720 599223 601964 600166 598268 598470
14603 598470 599129 600651 600186 600940 602736 602868 600661 599789 602014 601270 598270 597542 597993 597990 599318 601235 600550
14586 600550 597944 598226 598591 599062 598348 597177 601114 601538 599148 601060 604080 599631 598978 599669 600733 603214
14570 603214 604667 602395 602694 605886 604963 604299 602026 602464 603418 604440 604041 603050 605150 607025 604060 604548
14554 604548 604865 602798 602890 604982 605700 604865 603197 604660 603984 601070 600419 598755 602628 602969 603336 603436 603027
14537 603027 603217 605192 606167 601746 601516 603554 605875 605649 606912 604412 607229 607910 606906 606006 601759 602353
14521 602353 605625 609267 606346 604574 606084 603824 606489 608338 605005 606682 604445 605301 604883 606922 605234
14506 605234 606478 608357 608490 608306 607341 609454 608303 606379 607347 607564 608209 605150 606440 607416 607543 610080
14490 610080 607380 607668 610549 608336 608189 609895 609610 610456 610499 610238 607552 608969 609817 608755 607438 608863
14474 608863 610679 608944 609142 611722 610081 609674 609276 606997 608331 610895 610181 609452 611443 609870 608283
14459 608283 608199 606711 607337 608379 611213 609952 607535 608529 611370 609752 609936 609727 609222 610495 607101 609184
14443 609184 611497 610839 608811 608488 612050 611990 612146 614053 612952 613232 615622 612967 610881 607058 606179 607550
14427 607550 608999 609924 611010 611370 610507 611899 609913 611398 610695 611168 613858 614516 612913 611723 612748 614849
14411 614849 613079 612414 609889 611546 610484 609616 610588 611333 614531 615263 615436 611436 611921 610745 612596 612777
14395 612777 613454 614346 611673 613304 614880 611229 611154 616371 617882 615253 611517 613099 617468 616975 615385
14380 615385 613479 612356 612465 611913 609801 612623 613762 615984 614667 611440 611397 612136 612187 612812 614233 610129
14364 610129 614176 618034 617764 617146 614876 614518 616145 615434 617310 615315 614099 614026 612749 613445 610463 612328
14348 612328 613747 612184 614157 611780 612396 613673 614720 614300 613563 613088 614115 617304 614597 615360 616969
14333 616969 618076 618155 617175 616460 612649 610525 615354 618843 619056 616122 618402 619684 618906 620313 617146 618974
14317 618974 621420 618320 615956 615937 616224 618285 619754 620069 617663 621431 621946 617421 615840 615531 618303 618260
14301 618260 617868 615940 617220 614826 615825 618809 619691 618822 616463 618102 620535 619612 617204 618614 617661 619353
14285 619353 620298 620864 621320 623122 623399 621186 621434 621187 616910 616114 619488 620032 621931 624490 620239 620649
14269 620649 624959 622549 620290 620756 622301 624048 624703 619511 619524 621382 623313 623505 621105 619900 622884
14254 622884 621381 621247 622443 624223 620105 618237 620883 620367 625575 623177 622284 623407 624610 623157 622018
14239 622018 623367 625599 627734 624768 622846 623377 620179 621103 624227 623158 622255 624661 622459 623371 625443
14224 625443 623537 623689 623077 622308 622356 621718 622273 621763 621132 621467 622693 626051 623117 624462 626143 626874 625916
14207 625916 624443 625857 623948 623721 621453 624307 622726 622509 622791 623457 625278 625002 627716 625696 625611 625761
14191 625761 626221 625396 626025 626496 626835 626321 627562 630206 628668 630084 629377 625145 625074 624613 626487 628341 628976
14174 628976 628664 628979 628228 626348 627122 627667 628011 628966 630390 627564 626456 629438 629049 626842 626244 627262
14158 627262 627772 629935 631123 629831 630093 625759 626975 628142 628210 626747 624143 624313 624994 625058 627496 626478
14142 626478 626641 627348 625063 627408 631543 633575 630938 631641 631171 631630 632583 632174 632349 631721 632169 630938 628605
14125 628605 628547 631078 634278 635807 631864 632262 633359 632520 632992 629924 632137 633713 633109 631449 633978 634418
14109 634418 634649 633735 630369 635121 637197 632850 630470 632091 633866 633931 635054 632292 632848 631505 630671 633474
14093 633474 629616 631233 632978 633034 631289 629432 629890 630468 634808 634292 632047 633529 632138 632576 632512 631371
14077 631371 634176 636288 635999 634140 634126 634489 632074 629280 632130 631625 635476 636975 635387 633380 632487 635783
14061 635783 636923 633814 636298 635632 631250 630912 631586 632001 631804 634049 635910 635828 638529 636742 635480 637799
14045 637799 635327 634974 633970 634790 633940 635520 637516 638700 638495 637855 633944 633534 638600 638845 637105 636085
14029 636085 635847 636963 639430 641195 639846 638910 637013 636135 634238 636710 638759 636641 633602 635528 637284
14014 637284 636699 636948 639303 641732 639174 640246 639286 639437 642020 641882 639517 638810 640602 639710 638728 637408
13998 637408 639175 642653 639331 637343 638865 641090 639359 638992 638129 635633 638132 638060 639433 639415 640504 639505
13982 639505 639710 639743 639976 639852 639171 638958 640100 640119 638858 636076 639244 642358 641606 639700 640871 643494 643436
13965 643436 641674 640673 641609 641111 639275 638103 639429 640665 641530 642568 641902 643309 640757 637571 639573
13950 639573 641435 643431 642707 642996 643013 645548 644573 645166 648927 647138 644315 643519 646430 647800 645631 646820
13934 646820 644599 642569 640865 639215 642844 644113 642747 643633 642840 643973 643099 645946 648152 647943 645492
13919 645492 643082 641671 641899 643654 643669 643394 645316 646152 644668 644230 645998 644028 642332 642418 642933 645367
13903 645367 645423 644038 644873 648623 647313 644652 645681 648591 645114 641873 644021 642950 647997 648950 647514
13888 647514 647476 649751 648534 647715 646321 643458 644671 647866 646640 645545 645392 646931 646333 646337 649278 646578
13872 646578 644571 645736 648365 648942 648996 646042 648551 650285 649984 647958 647041 647356 645099 645854 647387 648055
13856 648055 647640 647248 646151 647901 649523 648581 649471 650353 651088 651377 650129 647872 646361 647244 649453 647903
13840 647903 649741 648612 648866 646489 645127 648023 650784 651211 650054 649187 650266 648904 650268 649740 647710
13825 647710 649324 650320 649052 649631 649343 649858 649632 650270 655159 652116 649256 649994 650926 650154 650478 652641 650542
13808 650542 652173 654309 653600 652830 651644 649788 649778 652570 652185 653242 651990 652853 652444 652681 653311 651917
13792 651917 649783 648565 651281 653568 654399 652654 652735 654644 653116 652850 651176 650954 655133 653102 654433
13777 654433 656671 655252 654858 653276 654217 653534 651888 652657 653121 653759 652669 651617 655338 658988 654303 654200
13761 654200 655505 653141 652544 651781 656096 655736 653902 651761 650432 651776 656073 652193 652349 652963 652047 652569
13745 652569 652384 656704 656363 655326 653994 654597 653671 653360 653796 655866 656650 657139 656125 656576 657522 661144 657694
13728 657694 655243 657060 659424 660399 655859 657563 659108 656593 656491 658748 656145 659961 662562 658994 657273
13713 657273 655259 653963 657350 656759 657018 657741 656221 657429 659069 660348 657348 656686 657410 657620 655907 657106
13697 657106 657870 660812 660960 659814 659650 659547 662808 662683 663612 660585 660085 663157 663678 662269 660024 657939
13681 657939 659770 659515 660151 659850 659420 658818 661529 662159 662329 663235 660217 659981 657202 659353 660111 663030 661215
13664 661215 662725 664046 662393 662437 660265 658497 662041 664907 664189 663090 659820 659899 659890 665303 663899 663863 664297
13647 664297 665383 663531 661821 664084 663160 663881 664623 666223 664531 663293 661605 664984 665581 662913 666825
13632 666825 663389 659205 658561 660120 663322 665567 666619 667482 665959 663877 664419 665478 668205 667311 664639
13617 664639 663135 662479 665956 667772 665262 665631 664431 666107 664817 664056 664206 662749 663329 665368 667685
13602 667685 665227 667062 665805 669137 668943 668027 669627 668251 666035 668387 668554 667982 668463 668830 668643 663765
13586 663765 662132 662840 666490 665761 667314 668947 666401 665738 668704 668628 668323 673073 671417 667200 665865 665341
13570 665341 665893 668226 670181 670079 668832 670517 672186 668385 667902 670506 670229 670331 669440 667919 670196 670541
13554 670541 671772 673165 671909 670220 671493 674919 675422 672047 669608 666125 669384 669935 666435 666495 668235
13539 668235 670997 669959 667001 669961 668798 667546 670305 672401 668794 669559 673393 671907 670636 672228
13525 672228 673317 669859 671922 675778 673725 670420 670970 673435 673101 674049 671838 671467 672711 673089 671764
13510 671764 672090 672450 674096 671697 672600 675538 672651 672033 671559 672781 671812 673082 672319 674864 675915 674601
13494 674601 675809 677331 673666 671454 674076 677748 676878 672608 670233 675294 678408 675753 677311 676014
13480 676014 675906 676946 678015 677106 675119 676403 678799 679804 680187 678925 674462 676777 675839 676822 675014
13465 675014 675148 675489 675501 675590 675133 677668 677114 677116 676602 677247 676548 677120 677023 676579 677990 679942 679318 679377 679330 676769
13445 676769 675832 677703 678509 676417 677872 677416 678441 678056 678236 677276 679140 681890 678314 678261 681759 681154
13429 681154 680034 679300 678393 679475 679387 681052 682333 681241 680068 679337 680087 680902 681722 682115 683707 680519
13413 680519 678177 680052 680705 681340 682944 683785 680968 682323 682065 680836 680582 680560 682372 681659 681306 682812
13397 682812 682937 684391 684863 681813 680258 682273 682170 683235 681467 680347 676903 677293 680583 680357 682305
13382 682305 680902 682943 683323 680929 680575 683116 685764 686418 687638 686080 684133 685150 686172 684837 684989
13367 684989 684379 684065 685293 683737 683050 683590 685257 683869 684787 687336 685750 686065 682910 683452 683886 686201
13351 686201 686630 684417 683500 683485 683845 684650 688103 686855 685607 685509 684276 685035 686109 685073 687250 688541
13335 688541 689590 689694 687032 687777 689619 687004 687257 688796 685295 681761 682263 686732 688798 690671 688250
$$ [...]
##END NTUPLES=NMR SPECTRUM
##END=
