##TITLE=1H_CA-9251
 CDCl3
 8 sc, 
 7.3.2024
##JCAMPDX= 6.0         $$ Bruker NMR JCAMP-DX V2.0
##DATA TYPE= NMR SPECTRUM
##DATA CLASS= NTUPLES
##ORIGIN= UXNMR, Bruker Analytische Messtechnik GmbH
##OWNER= root
$$ XWIN-NMR		Version 3.5
$$ Thu Mar  7 14:03:27 2024 Russian Standard Time (UT+4h)  she@DPX200
##.OBSERVE FREQUENCY= 200.1313
##.OBSERVE NUCLEUS= ^1H
##.ACQUISITION MODE= SIMULTANEOUS
##.ACQUISITION SCHEME= undefined
##.AVERAGES= 8
##.DIGITISER RES= 18
##SPECTROMETER/DATA SYSTEM= spect
##.PULSE SEQUENCE= zg30
##.SOLVENT NAME= CDCl3
##.SHIFT REFERENCE= (INTERNAL, CDCl3, 0, 15.4593)
##AUDIT TRAIL= $$ (NUMBER, WHEN, WHO, WHERE, WHAT)
$$ ##TITLE= Audit trail, XWIN-NMR		Version 3.5
$$ ##JCAMPDX= 5.01
$$ ##ORIGIN= Bruker BioSpin GmbH
$$ ##OWNER= she
$$ F:/spectra/data/she/nmr/H-F/1/pdata/1/auditp.txt
$$ ##AUDIT TRAIL=  $$ (NUMBER, WHEN, WHO, WHERE, WHAT)
(   1,<2024-03-07 14:02:20.46 +0400>,<she>,<DPX200>,
      <created by zg, POWCHK disabled, PULCHK disabled
       configuration hash MD5:
       00 E9 B6 7A A2 85 ED C7 34 08 36 98 17 FE 4E 26
       data hash MD5: 16K
       15 E1 89 73 2C 27 8D 45 12 DD 47 23 4C 07 3D 3F>)
(   2,<2024-03-07 14:02:22.68 +0400>,<she>,<DPX200>,
      <Start of raw data processing
       efp BC_mod = 2 LB = 0.24 FT_mod = 6 PKNL = 1 PHC0 = -25100.97 PHC1 = 11.18731 SI = 16K 
       data hash MD5: 16K
       7D 14 1C EC EC 28 8E E7 A0 9F A8 CA 55 06 2B 0D>)
(   3,<2024-03-07 14:02:43.32 +0400>,<she>,<DPX200>,
      <pk PHC0 = 160.7462 PHC1 = -5 
       data hash MD5: 16K
       66 21 4F 34 10 22 1D A4 36 B5 AC 4F 13 C5 37 9A>)
(   4,<2024-03-07 14:02:46.67 +0400>,<she>,<DPX200>,
      <abs ABSG = 5 
       data hash MD5: 16K
       1A D0 22 93 B3 34 02 0D C2 1D FF 84 95 24 95 54>)
$$ ##END=
$$ 
$$ hash MD5
$$ 58 65 B8 4D 22 2E C6 1F 33 18 97 18 EA 10 0C 4B
##$RELAX= 
##$RELAX= 
##$RELAX= 
##$RELAX= 
##$RELAX= 
##$RELAX= 
$$ Bruker specific parameters
$$ --------------------------
##$DU= <F:/spectra>
##$EXPNO= 1
##$NAME= <H-F>
##$PROCNO= 1
##$TYPE= <nmr>
##$USER= <she>
##$AMP= (0..31)
100 100 100 100 100 100 100 100 100 100 100 100 100 100 100 100 100 100 
100 100 100 100 100 100 100 100 100 100 100 100 100 100 
##$AQSEQ= 0
##$AQ_mod= 1
##$AUNM= <au_zg>
##$AUTOPOS= <>
##$BF1= 200.13
##$BF2= 200.13
##$BF3= 200.13
##$BF4= 200.13
##$BF5= 200.13
##$BF6= 200.13
##$BF7= 200.13
##$BF8= 200.13
##$BYTORDA= 1
##$CFDGTYP= 0
##$CFRGTYP= 5
##$CHEMSTR= <none>
##$CNST= (0..31)
1 1 145 1 1 1 1 1 1 1 1 1 1 1 1 1 1 1 1 1 1 1 1 1 1 1 1 1 1 1 1 1 
##$CPDPRG= <>
##$CPDPRG1= <>
##$CPDPRG2= <>
##$CPDPRG3= <>
##$CPDPRG4= <mlev>
##$CPDPRG5= <mlev>
##$CPDPRG6= <mlev>
##$CPDPRG7= <mlev>
##$CPDPRG8= <mlev>
##$CPDPRGB= <>
##$CPDPRGT= <>
##$D= (0..31)
0 1.2 0 0 0 0 0 0 0 0.06 0 0.03 0 0 0 0 0.0002 0 0 0 0 0 0 0 0 0 0 0 0 
0 0 0 
##$DATE= 1709805739
##$DBL= (0..7)
120 120 120 120 120 120 120 120 
##$DBP= (0..7)
150 150 150 150 150 150 150 150 
##$DBP07= 0
##$DBPNAM0= <>
##$DBPNAM1= <>
##$DBPNAM2= <>
##$DBPNAM3= <>
##$DBPNAM4= <>
##$DBPNAM5= <>
$$ [...]
##$SUBNAM3= <"">
##$SUBNAM4= <"">
##$SUBNAM5= <"">
##$SUBNAM6= <"">
##$SUBNAM7= <"">
##$SUBNAM8= <"">
##$SUBNAM9= <"">
##$SW= 18.0517328524113
##$SWIBOX= (0..15)
0 0 2 0 0 0 0 0 0 0 0 0 0 0 0 0 
##$SW_h= 3612.71676300578
##$TD= 16384
##$TD0= 1
##$TE= 0
##$TE2= 300
##$TE3= 300
##$TEG= 300
##$TL= (0..7)
0 120 120 120 120 120 120 120 
##$TP= (0..7)
150 150 150 150 150 150 150 150 
##$TP07= 0
##$TPNAME0= <>
##$TPNAME1= <>
##$TPNAME2= <>
##$TPNAME3= <>
##$TPNAME4= <>
##$TPNAME5= <>
##$TPNAME6= <>
##$TPNAME7= <>
##$TPOAL= (0..7)
0.5 0.5 0.5 0.5 0.5 0.5 0.5 0.5 
##$TPOFFS= (0..7)
0 0 0 0 0 0 0 0 
##$TUNHIN= 0
##$TUNHOUT= 0
##$TUNXOUT= 0
##$USERA1= <user>
##$USERA2= <user>
##$USERA3= <user>
##$USERA4= <user>
##$USERA5= <user>
##$V9= 5
##$VALIST= <valist>
##$VCLIST= <CCCCCCCCCCCCCCC>
##$VD= 0
##$VDLIST= <DDDDDDDDDDDDDDD>
##$VPLIST= <PPPPPPPPPPPPPPP>
##$VTLIST= <TTTTTTTTTTTTTTT>
##$WBST= 1024
##$WBSW= 4
##$XGAIN= (0..3)
0 0 0 0 
##$XL= 0
##$YL= 0
##$YMAX_a= 162083
##$YMIN_a= -138065
##$ZGOPTNS= <>
##$ZL1= 120
##$ZL2= 120
##$ZL3= 120
##$ZL4= 120
##$ABSF1= 15.53094
##$ABSF2= -2.520909
##$ABSG= 5
##$ABSL= 3
##$ALPHA= 0
##$AQORDER= 0
##$ASSFAC= 0
##$ASSFACI= 0
##$ASSFACX= 0
##$ASSWID= 0
##$AUNMP= <proc_1d>
##$AZFE= 0.1
##$AZFW= 0.1
##$BCFW= 0
##$BC_mod= 2
##$BYTORDP= 0
##$COROFFS= 0
##$CY= -3
##$DATMOD= 1
##$DC= 0
##$DFILT= <>
##$DTYPP= 0
##$F1P= 0
##$F2P= 0
##$FCOR= 1
##$FTSIZE= 16384
##$FT_mod= 6
##$GAMMA= 0
##$GB= 0
##$INTBC= 1
##$INTSCL= 3.70164e-10
##$ISEN= 128
##$LB= 0.24
##$LEV0= 0
##$LPBIN= 0
##$MAXI= 10000
##$MC2= 0
##$MEAN= 0
##$ME_mod= 0
##$MI= 1.114404
##$NCOEF= 0
##$NC_proc= -7
##$NLEV= 6
##$NOISF1= 3.799351
##$NOISF2= 2.8
##$NSP= 0
##$NTH_PI= 0
##$NZP= 0
##$OFFSET= 15.45932
##$PC= 1
##$PHC0= -24940.22
##$PHC1= 6.18731
##$PH_mod= 1
##$PKNL= yes
##$PPARMOD= 0
##$PSCAL= 0
##$PSIGN= 0
##$REVERSE= no
##$SF= 200.130012484459
##$SI= 16384
##$SIGF1= 3
##$SIGF2= 2
##$SINO= 5.538805
##$SIOLD= 16384
##$SREGLST= <1H.CDCl3>
##$SSB= 0
##$STSI= 16384
##$STSR= 0
##$SW_p= 3612.71676300578
##$SYMM= 0
##$S_DEV= 0
##$TDeff= 16384
##$TDoff= 0
##$TI= <>
##$TILT= no
##$TM1= 0
##$TM2= 0
##$TOPLEV= 0
##$USERP1= <user>
##$USERP2= <user>
##$USERP3= <user>
##$USERP4= <user>
##$USERP5= <user>
##$WDW= 1
##$XDIM= 16384
##$YMAX_p= 451304237
##$YMIN_p= -507639
$$ End of Bruker specific parameters
$$ ---------------------------------
##NTUPLES= NMR SPECTRUM
##VAR_NAME=  FREQUENCY,     SPECTRUM/REAL,   SPECTRUM/IMAG
##SYMBOL=    X,             R,               I
##VAR_TYPE=  INDEPENDENT,   DEPENDENT,       DEPENDENT
##VAR_FORM=  AFFN,          ASDF,            ASDF
##VAR_DIM=   16384,         16384,           16384
##UNITS=     HZ,            ARBITRARY UNITS, ARBITRARY UNITS
##FACTOR=    0.220516191357247, 1,           1
##FIRST=     3093.87391828201, 0,            0
##LAST=      -518.842844723771, 0,           0
##MIN=       -518.842844723771, -507639,     0
##MAX=       3093.87391828201, 451304237,    0
$$ Real data points
##PAGE= N=1
##DATA TABLE= (X++(R..R)), XYDATA
$$ [...]
$$ plain form
7735 -265153 -94274 -81631 -143971 -122829 -221248 -355853 -344243 -179121 -105176 -211076 -65952
7724 -65952 1690 -19058 -215681 -165126 10585 -9025 -24814 58851 -7196 -64709 -99837
7713 -99837 -6642 -207453 -152822 -81916 -111397 -119927 -54696 124354 -40894 -99188 46985
7702 46985 -22145 195647 -11428 -319777 25122 -194259 -390920 -335363 -154356 -319672
7692 -319672 -254055 -258340 -233348 -193128 -260958 -392042 -318028 -250881 -189153 -116201 -8253
7681 -8253 -111577 -163480 -104442 -158398 -63215 78734 4325 -169220 -57645 -129719 -110456
7670 -110456 -146581 -115347 47592 -92285 -178638 160208 51106 -29965 47368 -233153 -451887
7659 -451887 -415296 -282888 10881 -90408 -39293 -106960 -127727 -200660 -258976 -115054 -117060
$$ packed form
7735b65153J70879J2643o2340K1142r8419j34605J1610J65122P3945j05900J45124
7724f5952O7642k0748j96623N0555J75711j9610j5789Q3665o6047n7513l5128
7713i9837R3195k00811N4631P0906k9481q530O5231J79050j65248n8294J46173
7702D6985o9130K17792k07075l08349L44899k19381j96661N5557J81007j65316
7692c19672O5617m285K4992M0220o7830j31084P4014O7147O1728P2952J07948
7681h253j03324n1903N9038n3956R5183J41949p4409j73545J11575p2074J9263
7670a10456l6125L1234J62939j39877q6353L38846j09102q1071P7333k80521k18734
7659d51887L6591J32408K93769j01289N1115o7667k0767p2933n8316J43922k006
$$ plain form
7648 -117060 -263621 -272942 -213456 -279713 -67354 -116373 -302614 8836 -3031 -13798 47670
7637 47670 -22069 -111366 -275703 -172227 -139847 -44104 -17320 70622 -20668 -201905 -118783
7626 -118783 -201642 -177236 -219076 -293355 -229491 -127103 -250372 -311018 -309815 -284293 -244971
7615 -244971 -275686 -357601 -193133 -13023 -25221 -228305 -53504 -78122 -237122 -40659
7605 -40659 -156602 -84657 -98333 -213362 -202509 -40223 -71782 -100132 -84158 -106762 -58349
7594 -58349 -272652 -213555 -81341 -19583 -17990 -52765 89712 -34219 -80770 -146041 -116821
7583 -116821 6286 -228983 -247186 -50291 25474 68641 -84184 -174327 -45802 -85836 -271041
7572 -271041 -281951 -188203 -150196 -295417 -373667 -98076 135862 97052 -114027 -61058 -93645
$$ packed form
7648a17060j46561r321N9486o6257K12359m9019j86241L11450j1867j0767O1468
7637D7670o9739q9297j64337J03476L2380R5743K6784Q7942r1290j81237Q3122
7626a18783q2859K4406m1840p4279O3864J02388j23269o0646J203K5522L9322
7615b44971l0715q1915J64468J80110j2198k03084J74801k4618j59000J96463
7605d0659j15943P1945j3676j15029J0853J62286l1559k8350J5974k2604M8413
7594e8349k14303N9097J32214O1758J593l4775J42477j23931m6551o5271K9220
7583a16821J23107k35269j8203J96895P5765M3167j52825r0143J28525m0034j85205
7572b71041j0910R3748L8007j45221p8250K75591K33938l8810k11079N2969l2587
$$ plain form
7561 -93645 -36545 37649 -91845 -197173 -157694 -73965 -260555 -239751 -131012 58729 17832
7550 17832 -26706 -74715 -104953 -149734 -178112 -217592 -171234 -301232 -57355 -177566 -155282
7539 -155282 -50554 5961 -83937 -253382 -249897 -303566 -337164 -171020 -103467 -30427 -67032
7528 -67032 -187671 -190827 -197816 -224321 -189927 -49015 -169992 -364802 -342324 -102352 -88377
7517 -88377 -13987 -23583 11440 -106082 82619 145226 -129403 -78408 -38803 -19905 -139087
7506 -139087 -224586 7768 -8210 -42892 14421 35111 95829 125582 -29909 177160 -3518
7495 -3518 -271897 -108250 -83907 957 15431 19455 51370 120956 -52817 -175532 -233103
7484 -233103 -56093 39578 108712 156154 101051 -54289 -10006 100078 -26521 161249 -53227
$$ packed form
7561i3645N7100P4194j29494j05328L9479Q3729j86590K0804J08739J89741m0897
7550A7832m4538m8009l0238m4781k8378l9480M6358j29998K43877j20211K2284
7539a55282J04728N6515q9898j69445L485n3669l3598J66144O7553P3040l6605
7528f7032j20639l156o989k6505L4394J40912j20977j94810K2478K39972J3975
7517h8377P4390r596L5023j17522J88701O2607k74629N0995L9605J8898j19182
7506a39087q5499K32354j5978l4682N7313K0690O0718K9753j55491K07069j80678
7495c518k68379J63647K4343Q4864J4474M024L1915O9586j73773j22715n7571
7484b33103J77010R5671O9134M7442n5103j55340M4283J10084j26599J87770k14476
$$ plain form
7473 -53227 -239594 -368953 -197123 -284148 -275259 -245534 -343798 -330964 -366847 -242475 -181739
7462 -181739 -121509 -30005 -253853 -124143 -82282 -64979 -141414 -244937 -10169 46001 143700
7451 143700 22315 -264965 -380346 -212123 -133054 -7067 4028 -6517 76196 -95950
7441 -95950 -199213 -47203 -83910 -111174 -135636 -205423 -222286 -248544 43519 14451 -55869
7430 -55869 31431 -88684 -178794 -250249 -249991 -325009 -282934 -63399 -18881 -44972 -65483 -59604
7418 -59604 -114431 -367935 -179110 -203327 -89750 -248833 -190395 -197537 -97622 -8818 -180787
7407 -180787 -42514 -19371 -54132 -199324 -56251 -93693 -122704 -31798 -59687 -132682 -206312
7396 -206312 -154913 -38457 20675 279447 412350 92413 -239412 -132876 -101911 -78965
$$ packed form
7473e3227j86367j29359J71830q7025Q889K9725r8264J2834l5883J24372O0736
7462a81739O0230R1504k23848J29710M1861J7303p6435j03523K34768N6170R7699
7451A43700j21385k87280j15381J68223P9069J25987J1095j0545Q2713j72146
7441i5950j03263J52010l6707k7264k4462o9787j6863k6258K92063k9068p0320
7430e5869Q7300j20115r0110p1455K58p5018M2075K19535M4518k6091k0511N879
7418e9604n4827k53504J88825k4217J13577j59083N8438p142R9915Q8804j71969
7407a80787J38273K3143l4761j45192J43073l7442k9011R0906k7889p2995p3630
7396b06312N1399J16456N9132K58772J32903l19937l31825J06536L0965K2946
$$ plain form
7386 -78965 -151940 -76637 -81677 61377 83732 -31093 35524 15508 90807 108026 44634 -10930
7374 -10930 -63176 27783 7926 -185689 -104018 -134292 -103801 53207 -146187 -131978 -49353
7363 -49353 82800 96414 74661 -92568 -160713 -14179 148758 249896 42821 -91735
7353 -91735 -88235 85953 -162862 -88000 -51709 -102094 -230999 -218293 -175583 -151237 -114086
7342 -114086 4683 30789 43164 -187066 -119900 -170173 -189810 18248 129078 222056 -69829
7331 -69829 59049 -138340 -158965 -330816 -334859 -135606 -178975 -158693 -57273 -108135 -103178
7320 -103178 -28742 -259949 -156136 330 -98729 -182429 -258080 -156761 -45236 -20379 87397
7309 87397 103850 -70025 -231486 -130975 -200923 -193498 187138 147921 -30586 -7469 -68440
$$ packed form
7386g8965p2975P5303n040J43054K2355j14825O6617k0016P5299J7219o3392n5564
7374a0930n2246R0959j9857j93615Q1671l0274L0491J57008j99394J4209Q2625
7363d9353J32153J3614k1753j67229o8145J46534J62937J01138k07075j34556
7353i1735L500J74188k48815P4862L6291n0385j28905J2706M2710K4346L7151
7342a14086J18769K6106J2375k30230O7166n0273j9637K08058J10830R2978k91885
7331f9829J28878j97389k0625j71851m043J99253m3369K0282J01420n0862M957
7320a03178P4436k31207J03813J56466r9059q3700p5651J01319J11525K4857J07776
7309H7397J6453j73875j61461J00511o9948P425L80636l9217j78507K3117o0971
$$ plain form
7298 -68440 52373 -4015 -67043 12858 -65309 -168920 -123567 -144107 25127 267832 235113
7287 235113 -18011 -31363 65893 -271581 -474792 -190313 -106596 -229715 -16870 -31243
7277 -31243 -79273 128573 -59339 -80521 -4918 -89756 11821 72688 172549 115965 -109686
7266 -109686 -62703 -127481 -139230 -114195 -189302 -120590 -271036 -273583 -3081 -116927 -117735 101219
7254 101219 -64152 -52386 -180282 -103756 89017 -100461 -194084 -199754 -204280 -164797 -178508
7243 -178508 -83797 64430 52512 8578 100464 154394 130413 -119614 -172798 -66395 98815
7232 98815 275997 291531 -129763 -241617 -138185 -131387 -44195 100400 217555 246857 194096
7221 194096 94636 59123 55629 44881 -140237 -86272 56258 213169 414872 249523 103403
$$ packed form
7298f8440J20813n6388o3028P9901p8167j03611M5353k0540J69234K42705l2719
7287B35113k53124j3352R7256l37474k03211K84479Q3717j23119K12845j4373
7277c1243m8030K07846j87912k1182P5603q4838J01577O0867R9861n6584k25651
7266a09686M6983o4778j1749K5035p5107O8712j50446k547K70502j13846q08K18954
7254A01219j65371J1766j27896P6526J92773j89478r3623n670m526L9483j3711
7243a78508R4711J48227j1918m3934R1886N3930k3981k50027n3184J06403J65210
7232I8815J77182J5534m21294j11854J03432O798Q7192J44595J17155K9302n2761
7221A94096r9460l5513l494j0748j85118N3965J42530J56911K01703j65349j46120
$$ plain form
7210 103403 121559 84194 -118956 -169450 -14972 -133423 -64650 -19481 -69893 59135 74515
7199 74515 47808 145941 105637 159951 102608 123613 10808 -32319 -92131 -127271 -117557 -273353
7187 -273353 -371299 -218741 -164653 -222746 -136526 84694 119200 23940 64763 -35386 -166270
7176 -166270 -194423 -142210 -85179 -41658 -59262 48781 123073 86079 25513 74123 -8027
7165 -8027 -126554 -308996 -190914 -82065 -206824 -89333 -38978 -93552 -206190 -144836 -68551
7154 -68551 -293192 -165980 -116307 167666 260313 -168665 -10906 -62218 -230341 -40496
7144 -40496 -244946 -218952 -147530 -156470 -16346 39938 71209 -63496 -5379 82573 69538
7133 69538 -27031 23322 45016 179801 76125 82691 111935 143944 51975 64657 -52391
$$ packed form
7210A03403J8156l7365k03150n0494J54478j18451O8773M5169n0412J29028J5380
7199G4515k6707R8133m0304N4314n7343K1005j12805m3127n9812l5140R714j55796
7187b73353r7946J52558N4088n8093Q6220K21220L4506r5260M0823j00149j30884
7176a66270k8153N2213N7031M3521j7604J08043P4292l6994o0566M8610q2150
7165h027j18527j82442J18082J08849j24759J17491N0355n4574j12638O1354P6285
7154f8551k24641J27212M9673K83973R2647m28978J57759n1312j68123J89845
7144d0496k04450K5994P1422q940J40124N6284L1271j34705N8117Q7952j3035
7133F9538r6569N0353K1694J34785j03676O566K9244L2009r1969J2682j17048
$$ plain form
7122 -52391 -83831 79068 -66785 100704 158405 182420 118717 -51981 -183736 19429 96675
7111 96675 294042 306129 -28599 -107457 -27157 82437 89157 18268 -116648 -50205 56905
7100 56905 -126042 -62054 107953 -36959 -152173 -206597 -267683 -236107 17883 -70338 -106258
7089 -106258 35615 4190 -118111 -70684 -47444 -139833 13573 102264 44882 15163 -193061
7078 -193061 -130734 93972 2821 15160 123665 122279 105050 -46825 -168107 49680 34165
7067 34165 -52772 181933 281372 151786 -57513 -135869 -215345 -165633 -150033 -171528 -215599
7056 -215599 -97015 189935 178674 92858 258415 218961 242622 101661 -68592 -123128 38887
7045 38887 219638 199206 183725 60602 135142 164659 317099 135222 87932 214989 25531
$$ packed form
7122e2391l1440J62899j45853J67489N7701K4015o3703j70698j31755K03165P7246
7111I6675J97367J2087l34728p8858Q0300J09594O720p0889j34916O6443J07110
7100E6905j82947O3988J70007j44912j15214n4424o1086L1576K53990q8221l5920
7089a06258J41873l1425j22301M7427K3240r2389J53406Q8691n7382k9719k08224
7078a93061O2327K24706r1151J2339J08505j386j7229j51875j21282K17787j5515
7067C4165q6937K34705R9439j29586k09299p8356p9476M9712J5600k1495m4071
7056b15599J18584K86950j1261q5816J65557l9454K3661j40961j70253n4536J62015
7045C8887J80751k0432j5481j23123P4540K9517J52440j81877m7290J27057j89458
$$ plain form
7034 25531 -88417 158538 289243 512212 371363 160519 252642 527582 422854 452663
7024 452663 546118 547265 535911 565253 616813 593826 653795 770719 697212 422710 282386
7013 282386 300496 202705 302027 360632 271234 348778 403751 454986 339175 398757 355434
7002 355434 223415 245509 423305 446141 331091 201910 215145 220965 19337 161147 156678
6991 156678 288816 402873 163071 172473 302376 426753 244318 203778 208338 175936 107374
6980 107374 318969 433944 365766 565973 488129 348987 282815 251002 119107 151876 126251
6969 126251 79451 187103 158879 74404 134941 236710 165447 214637 138385 167274 76560
6958 76560 55858 58935 243108 145671 135010 187664 273831 321952 106091 42554 -588 -100394
$$ packed form
7034B5531j13948K46955J30705K22969j40849k10844R2123K74940j04728K9809
7024D52663R3455J147j1354K9342N1560k2987N9969J16924p3507k74502j40324
7013B82386J8110r7791R9322N8605q9398P7544N4973N1235j15811N9582m3323
7002C55434j32019K2094J77796K2836j15050j29181J3235N820k01628J41810m469
6991A56678J32138J14057k39802R402J29903J24377j82435m0540M560l2402o8562
6980A07374K11595J14975o8178K00207p7844j39142o6172l1813j31895L2769k5625
6969A26251m6800J07652k8224q4475O0537J01769p1263M9190p6252K8889r0714
6958G6560k0702L077J84173r7437j0661N2654Q6167M8121k15861o3537m3142r9806
$$ plain form
6946 -100394 -154111 31889 77448 -17228 55520 35483 373472 384628 147637 191304 264461
6935 264461 -4687 -66348 -8863 35707 16455 178498 187454 114206 94484 165843 167162 43554
6923 43554 56481 79960 77583 314298 282441 99231 65925 46286 -14563 -102234 -47943 112655
6911 112655 -360 -160461 112066 169123 124745 75022 60510 -190152 -209618 -109564 68612
6900 68612 12397 281808 157115 41559 -24657 47571 128069 315256 -43208 -130509 -123451
6889 -123451 -247444 -302611 -108723 -102173 -214237 -281839 -138412 252713 27132 63254 -76061
6878 -76061 38027 190343 354906 379845 19923 45532 48048 78219 106370 143932 257805
6867 257805 234057 75691 99612 176624 261588 59678 42369 10154 -60989 31450 106972
$$ packed form
6946a00394n3717J86000M5559r4676P2748k0037L37989J1156k36991M3667P3157
6935B64461k69148o1661N7485M4570j9252J62043Q956p3248j9722P1359J319j23608
6923D3554J2927K3479k377K36715l1857j83210l3306j9639o0849q7671N4291J60598
6911A12655j13015j60101K72527N7057m4378m9723j4512k50662j9466J00054J78176
6900F8612n6215K69411j24693j15556o6216P2228Q0498J87187l58464q7301P058
6889a23451j23993n5167J93888O550j12064o7602J43427L91125k25581L6122j39315
6878g6061J14088J52316J64563K4939l59922K5609K516L0171K8151L7562J13873
6867B57805k3748j58366K3921P7012Q4964k01910j7309l2215p1143R2439P5522
$$ plain form
6856 106972 90782 49536 -38743 -25756 -23753 4219 -107100 -148036 -149555 -256255 -50895
6845 -50895 -74407 -43137 71930 -213813 -118717 173657 147961 185959 -131378 -33698 122903
6834 122903 82897 -36301 122126 283057 124228 42379 8796 -37810 70590 126804 149205
6823 149205 38433 70274 12320 36963 42403 92884 -64160 52292 -84321 -142752 -169121
6812 -169121 -92226 46197 -130904 -146488 -87313 -109167 -80547 -113034 -249916 -98017 94789
6801 94789 93364 -118302 -37505 117571 183802 66018 1858 -146108 88128 175313 73743
6790 73743 174857 216443 189464 173861 183599 18092 -14029 41890 289367 323192 323364 339094
6778 339094 267282 59441 -292885 -317662 -111615 -23138 154686 105497 51365 -31008 -50853
$$ packed form
6856A06972j6190m1246q8279J2987K003K7972j11319m0936j519j06700K05360
6845e0895k3512L1270J15067k85743R5096K92374k5696L7998l17337R7680J56601
6834A22903m0006j19198J58427J60931j58829q1849l3583m6606J08400N6214K2401
6823A49205j10772L1841n7954K4643N440N0481j57044J16452j36613n8431k6369
6812a69121P6895J38423j77101j5584N9175k1854K8620l2487j36882J51899J92806
6801I4789j425k11666Q0797J55076O6231j17784o4160j47966K34236Q7185j01570
6790G3743J01114M1586k6979j5603R738j65507l2121N5919K47477L3825J72J5730
6778C39094p1812k07841l52326k4777K06047Q8477J77824m9189n4132q2373j9845
$$ plain form
6767 -50853 -22715 -97817 -109403 80661 44468 112567 166046 221890 133335 -16241 35213
6756 35213 -35661 -47019 -2415 92671 -29661 -17396 -111997 -23521 167310 268126 194879
6745 194879 208362 108779 -127839 -124121 -80296 94213 -101031 -83248 26803 -52452 -74251
6734 -74251 -135986 -110571 -258925 -104052 5469 117134 61501 111626 132629 25517 69816
6723 69816 -120745 52688 -190219 -189960 16972 182282 -15150 -215737 3239 -91433 -62914
6712 -62914 130454 129884 71093 54745 34936 60687 11721 96788 35425 145884 -9307 -67574
6700 -67574 -78264 2694 -211121 -83529 -28659 156229 130326 89514 166488 150280 66261
6689 66261 55774 11918 -208899 -79205 52161 -64592 -208076 -241598 -61534 55750
$$ packed form
6767e0853K8138p5102j1586J90064l6193O8099N3479N5844q8555j49576N1454
6756C5213p0874j1358M4604R5086j22332J2265r4601Q8476J90831J00816p3247
6745A94879J3483r9583k36618L718M3825J74509j95244J7783J10051p9255k1799
6734g4251o1735K5415j48354J54873J09521J11665n5633N0125K1003j07112M4299
6723F9816j90561J73433k42907K59K06932J65310j97432k00587K18976r4672K8519
6712f2914J93368n70n8791j6348j9809K5751m8966Q5067o1363J10459j55191n8267
6700f7574j0690Q0958k13815J27592N4870J84888k5903m0812P6974j6208q4019
6689F6261j0487m3856k20817J29694J31366j16753j43484l3522J80064J17284
$$ plain form
6679 55750 97332 129484 160717 173186 120769 6751 -32341 -84833 -189498 6732 144314
6668 144314 64622 -181023 -157826 -29150 -65464 -49817 127446 137186 117998 102139 -136302
6657 -136302 -125443 -59558 3106 -163131 132 -69474 -79911 -90573 49000 -100598 -210270
6646 -210270 24039 -42658 107121 74488 47904 -156939 -151816 -36392 20406 -64613 5729
6635 5729 -16173 50257 -75009 201129 178295 -41975 -165467 -14133 -14143 107187 103597 38380
6623 38380 51078 -39265 131190 187643 57221 -56197 43773 6782 -34066 70918 48358
6612 48358 76780 160641 189350 146269 284393 127362 9333 -48590 -45617 185471 98443
6601 98443 93681 251765 171434 197446 253167 62738 -39681 64148 4195 201381 163070
$$ packed form
6679E5750M1582L2152L1233J2469n2417j14018l9092n2492j04665J96230J37582
6668A44314p9692k45645K3197J28676l6314J5647J77263R740j9188j5859k38441
6657a36302J0859O5885O2664j66237J63263o9606j0437j0662J39573j49598j09672
6646b10270K34309o6697J49779l2633k6584k04843N123J15424N6798q5019P0342
6635E729k1902O6430j25266K76138k2834k20270j23492J51334j0J21330l590o5217
6623C8380J2698r0343J70455N6453j30422j13418R9970l6991m0848J04984k2560
6612D8358K8422Q3861K8709m3081J38124j57031j18029n7923K973K31088q7028
6601I8443m762J58084q0331K6012N5721j90429j02419J03829n9953J97186l8311
$$ plain form
6590 163070 -67571 -49063 -84359 51235 288199 99805 106058 163911 -14817 -149098 -192782
6579 -192782 -113758 -67897 -40167 -42869 58064 -93580 -178602 -199304 -73132 -35854 -202534
6568 -202534 -81604 -26146 97767 -28531 139276 77890 1459 115107 219751 363309
6558 363309 292715 219908 315280 250427 13607 11186 -37226 125061 244295 206839 -5052
6547 -5052 -3031 38880 -26177 60824 107789 57537 179158 203407 295305 279986 302146 59532
6535 59532 100503 -12564 -104677 -88504 -241597 -58368 203155 226412 407585 290398 280763
6524 280763 154089 75469 333251 238098 -41031 94367 234892 298580 473435 403290
6514 403290 273158 362385 239444 237047 115790 409553 463676 238149 318285 364179 345092
$$ packed form
6590A63070k30641J8508l5296J35594K36964j88394O253N7853j78728j34281m3684
6579a92782P9024M5861K7730k702J00933j51644q5022k0702J26172L7278j66680
6568b02534J20930N5458J23913j26298J67807o1386p6431J13648J04644J43558
6558C63309p0594p2807R5372o4853k36820k421m8412J62287J19234l7456k11891
6547e052K021M1911o5057Q7001M6965n0252J21621K4249R1898j5319K2160k42614
6535E9532M0971j13067r2113J6173j53093J83229K61523K3257J81173j17187r635
6524B80763j26674p8620K57782r5153k79129J35398J40525O3688J74855p0145
6514D03290j30132Q9227j22941k397j21257K93763N4123k25527Q0136M5894j9087
$$ plain form
6503 345092 332057 279251 353449 548180 426165 376335 315630 181953 301812 416766 526480
6492 526480 640830 476085 461706 408569 411079 282034 136449 229365 191209 124287 269227
6481 269227 271179 297580 282450 269126 148388 149955 148455 75364 -83452 915 93859 63950
6469 63950 89228 151263 328285 367556 234010 30990 24178 3011 -60960 -7671 20305
6458 20305 -36670 58594 99811 218491 128536 27929 151511 153243 134798 17145 68057
6447 68057 81378 46633 103260 208278 398045 347502 147014 196206 384944 179274 174347
6436 174347 415323 261014 83509 263736 56342 -82271 185975 257822 171232 17741
6426 17741 260707 73968 8861 148667 131830 65878 141341 161723 112593 199604 352749
$$ packed form
6503C45092j3035n2806P4198J94731j22015m9830o0705j33677J19859J14954J09714
6492E26480J14350j64745j4379n3137K510j29045j45585R2916l8156o6922J44940
6481B69227J952K6401j5130j3324j20738J567j500p3091j58816Q4367R2944k9909
6469F3950K5278O2035J77022L9271j33546k03020o812k1167o3971N3289K7976
6458B0305n6975R5264M1217J18680q9955j00607J23582J732j8445j17653N0912
6447F8057J3321l4745N6627J05018J89767n0543k00488M9192J88738k05670m927
6436A74347K40976j54309j77505J80227k07394j38613K68246P1847q6590j53491
6426A7741K42966j86739o5107J39806j6837o5952P5463K0382m9130Q7011J53145
$$ plain form
6415 352749 150453 129135 208924 239717 316775 319177 416893 418643 398212 492617 316842 126776
6403 126776 -47733 52896 238551 272499 144309 63605 61041 181861 214437 204981 168851
6392 168851 260086 73672 146516 255008 125966 185266 500970 553185 339739 348562 218293
6381 218293 229447 362815 199586 58899 132458 165364 255785 115411 152245 116305 168299
6370 168299 89676 76223 2789 24567 -46765 131573 308096 196584 245294 298302 254629
6359 254629 265250 277892 393329 356230 255235 283311 239848 184744 156181 169608 152604
6348 152604 210494 245868 244246 265493 282969 166737 79560 123669 196441 269070 202928 183625
6336 183625 37687 221600 157946 105158 74542 148711 154299 -36775 24307 146177 208652
$$ packed form
6415C52749k02296k1318P9789L0793P7058K402R7716J750k0431R4405j75775j90066
6403A26776j74509J00629J85655L3948j28190q0704k564J20820L2576r456l6130
6392A68851R1235j86414P2844J08492j29042N9300L15704N2215k13446Q823j30269
6381B18293J1154J33368j63229j40687P3559L2906R0421j40374L6834l5940N1994
6370A68299p8623j3453p3434K1778p1332J78338J76523j11512M8710N3008m3673
6359B54629J0621J2642J15437l7099j00995K8076m3463n5104k8563J3427j7004
6348A52604N7890L5374j622K1247J7476j16232q7177M4109P2772P2629o6142j9303
6336A83625j45938J83913o3654n2788l0616P4169N588j91074O1082J21870O2475
$$ plain form
6325 208652 19790 226340 274281 155040 211420 204690 294945 241375 278351 269703 148578
6314 148578 53157 124393 185715 151828 379513 503774 334476 251834 230932 372642 225137
6303 225137 -39737 187927 68123 27639 220448 90799 226146 228097 133157 181067 231092
6292 231092 373493 190096 134927 301243 221225 224022 278941 354890 457021 441352 483508
6281 483508 397678 573493 473473 440387 162139 76340 142229 285277 220383 168283 219976
6270 219976 150900 299859 110131 156713 128799 109008 400044 647364 506100 248307
6260 248307 302547 356447 255778 149905 16203 157648 141870 285453 172349 294907
6250 294907 126063 23598 131032 165149 335282 536665 325828 140981 285273 283356
$$ packed form
6325B08652j88862K06550M7941j19241N6380o730R0255n3570L6976q648j21125
6314A48578r5421P1236O1322l3887K27685J24261j69298q2642k0902J41710j47505
6303B25137k64874K27664j19804m0484J92809j29649J35347J951r4940M7910N0025
6292B31092J42401j83397n5169J66316q0018K797N4919P5949J02131j5669M2156
6281D83508q5830J75815j00020l3086k78248q5799O5889J43048o4894n2100N1693
6270B19976o9076J48959j89728M6582k7914j9791K91036K47320j41264k57793
6260B48307N4240N3900j00669j05873j33702J41445j5778J43583j13104J22558
6250B94907j68844j02465J07434L4117J70133K01383k10837j84847J44292j917
$$ plain form
6240 283356 184842 208120 163406 50723 53738 -49264 26786 105302 226020 123391 297218
6229 297218 367826 235455 295897 257578 179762 226743 324335 395939 157199 102383 77901
6218 77901 191008 130051 250411 275239 279889 252473 186173 220024 276963 246564 238764 352987
6206 352987 308302 226767 437263 550190 495823 384343 333286 319164 226199 240062 363913
6195 363913 309204 301930 213550 168862 223236 211926 210799 -12722 92722 96497 34288 219147
6183 219147 496174 499512 371008 408872 219455 329889 156012 8007 133492 387204
6173 387204 505145 463283 454972 436856 401496 348449 325470 90456 104391 164441 182425
6162 182425 182593 382569 269125 107672 105477 186782 322973 296870 78879 127753 331025
$$ packed form
6240B83356r8514K3278m4714j12683L015j03002P6050P8516J20718j02629J73827
6229B97218P0608j32371O0442l8319p7816M6981R7592P1604k38740n4816k4482
6218G7901J13107o0957J20360K4828M650k7416o6300L3851N6939l0399p800J14223
6206C52987m4685q1535K10496J12927n4367j11480n1057j4122r2965J3863J23851
6195C63913n4709p274q8380m4688N4374j1310j127k23521J05444L775o2209J84859
6183B19147K77027L338j28504L7864j89417J10434j73877j48005J25485K53712
6173C87204J17941m1862q311j8116l5360n3047k2979k35014J3935O0050J7984
6162A82425J68J99976j13444j61453k195Q1305J36191k6103k17991M8874K03272
$$ plain form
6151 331025 354323 323019 473405 379095 413560 371717 460919 667049 557478 456906 298863
6140 298863 328370 303530 329440 355493 436624 382162 409427 550161 308233 288868 459442
6129 459442 572529 530466 379908 584517 719123 344378 374120 538359 410488 280758
6119 280758 376826 445388 455415 540213 548176 337273 416514 599707 967198 882086 742579
6108 742579 683057 635538 493922 314302 420572 614396 679311 609491 606706 709878 634728
6097 634728 779214 858538 587250 560098 656385 677172 773269 721097 514772 676787 577649
6086 577649 534184 535853 616437 351139 242390 437466 541577 340986 390479 345928 421704
6075 421704 692760 723938 799574 705116 701805 798307 661403 706626 653730 714328 640117
$$ packed form
6151C31025K3298l1304J50386r4310L4465m1843Q9202K06130j09571j00572j58043
6140B98863K9507k4840K5910K6053Q1131n4462K7265J40734k41928j9365J70574
6129D59442J13087m2063j50558K04609J34606l74745K9742J64239j27871j29730
6119B80758R6068O8562J0027Q4798P963k10903P9241J83193L67491q5112j39507
6108G42579n9522m7519j41616j79620J06270J93824O4915o9820k785J03172p5150
6097F34728J44486P9324k71288k7152R6287K0787R6097n2172k06325J62015r9138
6086E77649m3465J669Q0584k65298j08749J95076J04111k00591M9493m4551P5776
6075D21704K71056L1178P5636r4458l311R6502j36904M5223n2896O0598p4211
$$ plain form
6064 640117 652685 531736 756701 879762 521566 560418 492413 424410 595591 625201 544083
6053 544083 546316 416534 404976 627392 657356 646427 690050 594467 635828 650058 752713
6042 752713 680034 673914 581535 670306 677836 735883 639870 601770 757299 674998 740175 707684
6030 707684 770180 691484 763097 799586 922891 971578 772771 675561 730728 813897 1019127
6019 1019127 932819 1081883 1014890 807592 806099 991744 1115457 1035100 1068943 1114835 1127585
6008 1127585 987862 1105613 1092181 1094997 1130064 1427841 1333291 1404102 1629045 1593587 1748741
5997 1748741 1780815 1817252 2019919 2001783 1966954 1947020 1992475 1746887 1706879 1741639 1826863
5986 1826863 1686486 1549856 1524686 1435636 1520661 1367874 1284397 1258309 1053050 974058 1020674
$$ packed form
6064F40117J2568j20949K24965J23061l58196L8852o8005o8003J71181K9610q1118
6053E44083K233j29782j1558K22416K9964j0929M3623r5583M1361J4230J02655
6042G52713p2679o120r2379Q8771P530N8047r6013l8100J55529q2301O5177l2491
6030G07684O2496p8696P1613L6489J23305M8687j98807r7210N5167Q3169K05230
6019A019127q6308J49064o6993k07298j493J85645J23713q0357L3843M5892J2750
6008A127585j39723J17751j3432K816L5067K97777r4550P0811K24943l5458J55154
5997A748741L2074L6437K02667j8136l4829j9934M5455k45588m0008L4760Q5224
5986A826863j40377j36630k5170q9050Q5025j52787q3477k6088k05259p8992M6616
$$ plain form
5975 1020674 1171534 1198808 1182985 1213577 1169624 1101722 1133083 1110389 1137250 1370111 1386490
5964 1386490 1315161 1079725 1058999 1186947 1277340 1260783 1148327 1322663 1335738 1345581 1429291
5953 1429291 1313508 1329672 1347621 1347272 1179200 1104771 983486 1033807 1226638 1143814 1072304
5942 1072304 1222822 1199081 995973 1033063 1129594 1156532 1325731 1218742 1119814 1202743 1262007
5931 1262007 1110630 1301525 1271365 1252563 1387799 1178728 1148367 1322918 1297426 1332666
5921 1332666 1452831 1605307 1659856 1367173 1294904 1416883 1470888 1542870 1597166 1501110 1646114
5910 1646114 1587390 1332111 1285535 1422525 1590629 1573575 1633227 1702749 1599533 1567579 1619167
5899 1619167 1790469 1630764 1785831 1797189 1816304 1907816 1884149 1787445 1854740 1987376 2129478
$$ packed form
5975A020674J50860K7274j5823L0592m3953o7902L1361k2694K6861K32861J6379
5964A386490p1329k35436k0726J27948R0393j6557j12456J74336J3075R843Q3710
5953A429291j15783J6164J7949l49j68072p4429j21285N0321J92831q2824p1510
5942A072304J50518k3741k03108L7090R6531K6938J69199j06989r8928Q2929N9264
5931A262007j51377J90895l0160j8802J35236k09071l0361J74551k5492L5240
5921A332666J20165J52476N4549k92683p2269J21979N4005P1982N4296r6056J45004
5910A646114n8724k55279m6576J36990J68104j7054N9652O9522j03216l1954N1588
5899A619167J71302j59705J55067J1358J9115R1512k3667r6704O7295J32636J42102
$$ plain form
5888 2129478 2140050 1964383 1940901 2034318 2133918 1928155 1922455 1847846 1818713 1989916 1988798
5877 1988798 1776042 1749129 2080159 2181691 2222184 2243514 2005703 2169736 2260743 2053220
5867 2053220 1972375 2030081 2385110 2414107 2444234 2348015 2151664 2208783 2427111 2579692 2385361
5856 2385361 2471141 2290728 2365872 2449145 2611772 2663472 2786176 2640565 2506394 2611783
5846 2611783 2531992 2691075 2911704 2781502 2867827 2854709 2809122 3165846 2934308 2913534
5836 2913534 2985182 2865741 2818562 2758772 3015594 3209928 3316498 3357148 3187128 3158247
5826 3158247 3269206 3159574 3303428 3297762 3351599 3571252 3536456 3412567 3553163 3849255
5816 3849255 3660353 3529507 3677181 3795829 3847563 3873081 3960389 4013556 3943038 4195393
$$ packed form
5888B129478J0572j75667k3482R3417R9600k05763n700p4609k9133J71203j118
5877A988798k12756k6913L31030J01532M0493K1330k37811J64033R1007k07523
5867B053220q0845N7706L55029K8997L0127r6219j96351N7119K18328J52581j94331
5856B385361Q5780j80413P5144Q3273J62627N1700J22704j45611j34171J05389
5846B611783p9791J59083K20629j30202Q6325j3118m5587L56724k31538k0774
5836B913534P1648j19441m7179n9790K56822J94334J06570M0650j70020k8881
5826C158247J10959j09632J43854n666N3837K19653l4796j23889J40596K96092
5816C849255j88902j30846J47674J18648N1734K5518Q7308N3167p0518K52355
$$ plain form
5806 4195393 4251421 4467706 4609003 4323472 4548845 4746244 4752174 5002201 5006395 4953217 5109488
5795 5109488 5321957 5561158 5559355 5573645 5647428 5905602 6237215 6423684 6429401 6558012 6801033
5784 6801033 6494654 6511514 6660374 7028102 6896233 7299982 7514090 7642269 7791016 7912435
5774 7912435 7905842 7858714 7993033 8117283 8425204 8578014 8834618 9090401 9136450 9138186 9319320
5763 9319320 9430548 9785555 10084869 10282984 10477403 10513826 10655024 10758404 10925725 11176887
5753 11176887 11309907 11587572 11939745 12303253 12524296 13001618 13560353 14003407 14241729
5744 14241729 14634394 15155610 15713791 16235790 16766806 17290460 17876095 18564100 19335419
5735 19335419 19949967 20769846 21583703 22335037 23119903 23878295 24724137 25293453 26161150
$$ packed form
5806D195393N6028K16285J41297k85531K25373J97399N930K50027M194n3178J56271
5795E109488K12469K39201j803J4290P3783K58174L31613J86469N717J28611K43021
5784F801033l06379J6860J48860L67728j31869M03749K14108J28179J48747J21419
5774G912435o593m7128J34319J24250L07921J52810K56604K55783M6049J736J81134
5763I319320J11228L55007K99314J98115J94419L6423J41198J03380J67321K51162
5753A1176887J33020K77665L52173L63508K21043M77322N58735M43054K38322
5744A4241729L92665N21216N58181N21999N31016N23654N85635O88005P71319
5735A9335419O14548Q19879Q13857P51334P84866P58392Q45842N69316Q67697
$$ plain form
5726 26161150 27344616 28379256 29335857 30362543 31307398 32509660 33766161 34938256
5718 34938256 36332496 37716357 39228715 41028496 42668958 44551199 46931422 49557302
5710 49557302 52809054 56219052 59988710 64244018 69611562 75710056 82794297 90797149
5702 90797149 99727955 109835424 120692315 131600650 141986811 151379611 159833455 167869985
5694 167869985 175869485 184678846 193392886 200099033 201856522 197746407 188606584 176754218
5686 176754218 165132910 154583972 144648758 134452247 123200870 110832805 98583850
5679 98583850 86894425 76639176 68063432 60919778 54754715 49625984 45490777 41720615
5671 41720615 38684468 36000457 33594310 31583156 29775339 28041250 26117083 24832953
$$ packed form
5726B6161150J183466J034640R56601J026686R44855J202262J256501J172095
5718C4938256J394240J383861J512358J799781J640462J882241K380223K625880
5710D9557302L251752L409998L769658M255308N367544O098494P084241Q002852
5702I0797149Q930806J0107469J0856891J0908335J0386161R392800Q453844Q036530
5694A67869985P999500Q809361Q714040O706147J757489m110115r139823j1852366
5686A76754218j1621308j0548938r935214j0196511j1251377j2368065j2248955
5679I8583850j1689425j0255249q575744p143654o165063n128731m135207l770162
5671D1720615l036147k684011k406147k011154j807817j734089j924167j284130
$$ plain form
5663 24832953 24008864 22862846 21552467 20817255 19933507 18929310 18169203 17463455 16928613
5654 16928613 16250034 15664525 15198729 14589318 14077881 13460778 13140763 12646181 12224135
5645 12224135 11984100 11393211 11250100 10875008 10381565 10053778 9636614 9076385 9215455
5636 9215455 9080039 8795392 8620370 8499700 8168394 7864654 7703994 7536488 7573204 7373976
5626 7373976 6884998 6884126 6634654 6330522 6212227 6147240 6184124 5833831 5682811 5695805 5444676
5615 5444676 5345508 5465207 5357075 5305766 5249917 5156172 5131699 4778783 4822119 4708556 4511910
5604 4511910 4378884 4376315 4309246 4103779 4228940 4166864 4022830 3908241 3929234 3827969
5594 3827969 3664533 3435348 3449583 3412802 3344157 3286181 3293885 3167239 3070460 2918614 2811580
$$ packed form
5663B4832953q24089j146018j310379p35212q83748j004197p60107p05748n34842
5654A6928613o78579n85509m65796o09411n11437o17103l20015m94582m22046
5645A2224135k40035n90889j43111l75092m93443l27787m17164n60229J39070
5636I215455j35416k84647j75022j20670l31306l03740j60660j67506L6716j99228
5626G373976m88978q72k49472l04132j18295o4987L6884l50293j51020J2994k51129
5615E444676r9168J19699j08132n1309n5849r3745k4473l52916M3336j13563j96646
5604D511910j33026k569o7069k05467J25161o2076j44034j14589K0993j01265
5594C827969j63436k29185J4235l6781o8645n7976P704j26646r6779j51846j07034
$$ plain form
5583 2811580 2875952 3067476 2697052 2868581 3113860 2960923 2804210 2746392 2830590 3038076
5573 3038076 2955153 2736724 2746687 2523913 2639560 2681016 2610906 2477006 2392399 2267565 2326634
5562 2326634 2306003 2174968 2059054 2042712 2195993 2212360 2267628 2282014 2122101 2063241 2002890
5551 2002890 1876448 1838040 2135077 2226811 2278316 2167640 2014766 1995157 2219514 2020516
5541 2020516 1974166 1920184 1643772 1735443 1769126 1959802 1926415 1891169 1937583 2029826 2019564
5530 2019564 1709165 1690515 1744871 1630229 1703140 1592397 1647050 1703340 1648914 1656711 1603830
5519 1603830 1848475 1708288 1650135 1714337 1592473 1768065 1785833 1749446 1740554 1622584 1599161
5508 1599161 1700729 1664894 1687697 1540404 1349040 1448264 1522476 1595679 1482182 1309467
$$ packed form
5583B811580O4372J91524l70424J71529K45279j52937j56713n7818Q4198K07486
5573C038076q2923k18429R963k22774J15647M1456p0110j33900q4607j24834N9069
5562B326634k0631j31035j15914j6342J53281J6367N5268J4386j59913n8860o0351
5551B002890j26442l8408K97037R1734N1505j10676j52874j9609K24357j98998
5541B020516m6350n3982k76412R1671L3683J90676l3387l5246M6414R2243j0262
5530B019564l10399j8650N4356j14642P2911j10743N4653N6290n4426P797n2881
5519A603830K44645j40187n8153O4202j21864J75592J7768l6387q892j17970k3423
5508A599161J01568l5835K2803j47293j91364R9224P4212P3203j13497j72715
$$ plain form
5498 1309467 1296881 1453764 1485793 1452799 1604240 1433049 1476221 1489390 1605094 1648278 1494967
5487 1494967 1564286 1379926 1247175 1398430 1312933 1337383 1498504 1480967 1314397 1327082
5477 1327082 1361393 1276560 1227468 1274525 1499819 1482254 1540288 1744916 1743420 1596030 1681709
5466 1681709 1747235 1818647 1871200 1578207 1332277 1511027 1654560 1592621 1434685 1354290
5456 1354290 1399505 1637857 1632288 1350163 1560130 1447907 1487350 1493468 1473849 1597528 1601328
5445 1601328 1441958 1597570 1592771 1501660 1401781 1225105 1152684 1225514 1465922 1514669 1487800
5434 1487800 1514887 1466473 1489825 1681273 1492065 1368845 1483678 1686008 1668054 1419201
5424 1419201 1470198 1514932 1536118 1541668 1559017 1662611 1582136 1411437 1577680 1698010 1675610
$$ packed form
5498A309467j2586J56883L2029l2994J51441j71191M3172J3169J15704M3184j53311
5487A494967O9319j84360j32751J51255q5497K4450J61121j7537j66570J2685
5477A327082L4311q4833m9092M7057K25294j7565N8034K04628j496j47390Q5679
5466A681709O5526P1412N2553k92993k45930J78750J43533o1939j57936q0395
5456A354290M5215K38352n569k82125K09967j12223L9443O118j9619J23679L800
5445A601328j59370J55612m799r1111r9879j76676p2421P2830K40408M8747k6869
5434A487800K7087m8414K3352J91448j89208j23220J14833K02330j7954k48853
5424A419201N0997M4734K1186N550J7349J03594q0475j70699J66243J20330k2400
$$ plain form
5413 1675610 1791815 1760421 1472256 1534580 1708631 1605420 1697500 1769565 1522090 1430220
5403 1430220 1746151 1793907 1698123 1807649 1984421 1852952 1889378 1986906 2048090 2090915 2196331
5392 2196331 2282727 2302886 2095111 2236006 2443905 2431669 2624637 2581729 2603362 2450311
5382 2450311 2261730 2337116 2227385 2267625 2181365 2149841 2020543 1941311 1833468 1801128 1898253
5371 1898253 1766486 1772725 1891189 1736831 1629297 1652420 1621334 1446528 1448047 1469225 1414150
5360 1414150 1359415 1411352 1559279 1577117 1639302 1687393 1660611 1591596 1456003 1527878 1569150
5349 1569150 1437169 1514878 1489355 1454927 1629021 1457700 1423079 1430269 1338292 1379945 1680131
5338 1680131 1554452 1583912 1662353 1610000 1464049 1387793 1550008 1494294 1601238 1729123
$$ packed form
5413A675610J16205l1394k88165O2324J74051j03211R2080P2065k47475r1870
5403A430220L15931M7756r5784J09526J76772j31469L6426R7528O1184M2825J05416
5392B196331Q6396K0159k07775J40895K07899j2236J92968m2908K1633j53051
5382B450311j88581P5386j09731M0240q6260l1524j29298p9232j07843l2340R7125
5371A898253j31767O239J18464j54358j07534K3123l1086j74806J519K1178n5075
5360A414150n4735N1937J47927J7838O2185M8091k6782o9015j35593P1875M1272
5349A569150j31981P7709k5523l4428J74094j71321l4621P190r1977M1653L00186
5338A680131j25679K9460P8441n2353j45951p6256J62215n5714J06944J27885
$$ plain form
5328 1729123 1657963 1414105 1536405 1485095 1558522 1627648 1535943 1667131 1683483 1708201 1721322
5317 1721322 1630404 1779327 1948017 1942115 1679679 1811991 1854909 2014487 1886478 1848237
5307 1848237 1844797 1868950 2010101 1986249 1947145 1897044 1848361 1922045 1990824 1988746 2022735 1934274
5295 1934274 2048892 2098806 2143674 1917330 1992840 1932072 1943586 1946991 2021134 2205789 1961759
5284 1961759 2052475 1992028 2120999 2221744 2148706 2178049 2365862 2475982 2639805 2839312
5274 2839312 2924468 2963740 3078855 3219679 3399581 3395231 3687539 3691866 3624682 3405673 3260677
5263 3260677 3260677 3316778 2871416 2664818 2630765 2471010 2531252 2485959 2444390 2299850 2265309
5252 2265309 2225786 2277534 2265606 2311177 1965138 1977622 2112321 2016649 2048810 2097709 2040336
$$ packed form
5328A729123p1160k43858J22300n1310P3427O9126r1705J31188J6352K4718J3121
5317A721322r0918J48923J68690n902k62436J32312M2918J59578j28009l8241
5307A848237l440K4153J41151k3852l9104n0101m8683P3684O8779k078L3989q8461
5295A934274J14618M9914M4868k26344P5510o0768J1514L405P4143J84655k44030
5284A961759R0716o0447J28971J00745p3038K9343J87813J10120J63823J99507
5274B839312Q5156L9272J15115J40824J79902m350K92308M327o7184k19009j44996
5263C260677%N6101m45362k06598l4053j59755O0242m5293m1569j44540l4541
5252B265309l9523N1748j1928M5571l46039J2484J34699r5672L2161M8899n7373
$$ plain form
5241 2040336 2011290 1974058 2018118 2082150 2102619 1995172 2304252 2331690 2078059 2119902 2294593
5230 2294593 2067867 1899854 1989018 2229909 2133744 2016168 1996957 2072833 2047422 2221278
5220 2221278 2067858 1907557 2100609 2165250 2145233 2220529 2378308 2237654 2307280 2352969
5210 2352969 2350745 2345915 2254685 2255546 2331169 2416634 2586672 2781473 2832016 2669799 2508692
5199 2508692 2458597 2583189 2527152 2706992 2638460 2549635 2635169 2512430 2579343 2744258 2660713
5188 2660713 2604194 2650460 2599030 2434341 2623503 2836714 2777556 2821396 2919102 2955027 3064186
5177 3064186 2953450 3004906 3084655 2976275 2871663 2739365 2755598 2720115 2639979 2746634
5167 2746634 2982386 2921497 2788177 2793928 2786261 2765186 2729414 2777285 2784239 2806987 2753083 2790069
$$ packed form
5241B040336k9046l7232M4060O4032K0469j07447L09080K7438k53631M1843J74691
5230B294593k26726j68013Q9164K40891r6165j17576j9211P5876k5411J73856
5220B221278j53420j60301J93052O4641k0017P5296J57779j40654O9626M5689
5210B352969k224m830r1230Q61P5623Q5465J70038J94801N0543j62217j61107
5199B508692n0095J24592n6037J79840o8532q8825Q5534j22739O6913J64915q3545
5188B660713n6519M6266n1430j64689J89162K13211n9158M3840R7706L5925J09159
5177C064186j10736N1456P9749j08380j04612j32298J6233l5483q0136J06655
5167B746634K35752o0889j33320N751p667k1075l5772M7871O954K2748n3904L6986
$$ plain form
5155 2790069 2886606 2752441 2741423 2918354 2959080 2845958 2791071 2945459 2636554 2452139
5145 2452139 2671754 2657181 2539765 2601388 2725546 2595756 2642442 2709206 2874359 2776762
5135 2776762 2665909 2637596 2571782 2785987 2975726 2807050 2771888 2882495 2945167 2789282
5125 2789282 2760703 2658233 2681528 2743287 2775755 2849022 2902745 2982685 3017909 3060618 3174049
5114 3174049 2981876 2984890 3171176 3293593 3309433 3213721 3260029 3280302 3321752 3216337 3240650
5103 3240650 3290952 3215024 3347759 3312847 3084618 3174646 3141709 3301722 3398316 3491922 3505420
5092 3505420 3383298 3420914 3426244 3573726 3548959 3560715 3667349 3737920 3665482 3866992 3853777
5081 3853777 3812036 3795743 3790816 3845259 3850244 3835245 3877254 3987112 4041161 3828037 3725240
$$ packed form
5155B790069R6537j34165j1018J76931M0726j13122n4887J54388l08905j84415
5145B452139K19615j4573j17416O1623J24158j29790M6686O6764J65153r7597
5135B776762j10853k8313o5814K14205J89739j68676l5162J10607O2672j55885
5125B789282k8579j02470K3295O1759L2468P3267N3723P9940L5224M2709J13431
5114C174049j92173L014J86286J22417J5840r5712M6308K0273M1450j05415K4313
5103C240650N0302p5928J32735l4912k28229R0028l2937J60013R6594R3606J3498
5092C505420j22122L7616N330J47482k4767J1756J06634P0571p2438K01510j3215
5081C853777m1741j6293m927N4443M985j4999M2009J09858N4049k13124j02797
$$ plain form
5070 3725240 3830808 3944512 4084410 4216252 4267256 4131436 4106884 4122170 4238112 4249411
5060 4249411 4248496 4260021 4364746 4202461 4200065 4180249 4220872 4069764 4251984 4380329 4468689
5049 4468689 4214409 4332389 4652909 4613391 4476891 4629421 4638587 4576237 4673956 4730906 4540786
5038 4540786 4629974 4678590 4694743 4906507 4910043 5091802 5308385 5324349 5202753 5303602 5391047
5027 5391047 5386197 5387466 5468103 5597185 5827859 5763845 5712583 5749425 5690880 5795827 6158867
5016 6158867 6144370 5903687 6064923 6265360 6417982 6614582 6523291 6557484 6620608 6777128
5006 6777128 6831386 6846738 7006803 7231718 7452369 7477939 7525193 7492681 7614601 7688488 7638028
4995 7638028 7770146 7993073 8190800 8221891 8516635 8620037 8478308 8798492 8947852 9186308
$$ packed form
5070C725240J05568J13704J39898J31842N1004j35820k4552J5286J15942J1299
5060D249411r15J1525J04725j62285k396j9816M0623j51108J82220J28345Q8360
5049D468689k54280J17980L20520l9518j36500J52530R166o2350R7719N6950j90120
5038D540786Q9188M8616J6153K11764L536J81759K16583J5964j21596J00849Q7445
5027E391047m850J269Q0637J29082K30674o4014n1262L6842n8545J04947L63040
5016F158867j4497k40683J61236K00437J52622J96600r1291L4193O3124J56520
5006F777128N4258J5352J60065K24915K20651K5570M7254l2512J21920P3887n0460
4995G638028J32118K22927J97727L1091K94744J03402j41729L20184J49360K38456
$$ plain form
4985 9186308 9484527 9718155 10128419 10460963 10772595 10967030 11262913 11653276 11774196 11455695
4975 11455695 11383370 11204704 10961652 11086340 10974011 10905618 11093368 11105940 11265725 11306421
4965 11306421 11628805 11812167 12116855 12183888 12321604 12436154 12658495 12933041 13236006 13431219
4955 13431219 13601856 13718325 14004263 14210001 14397687 14632462 14873759 15289442 15361289 15560846
4945 15560846 15944389 16431691 16550435 16737454 16985993 17285209 17476904 17808881 18179282
4936 18179282 18404871 19019598 19454315 19782145 20330632 20740471 21362304 22033498 22610162
4927 22610162 23168300 23686783 24159658 24727364 25819237 26902241 27587671 28740397 29888385
4918 29888385 30961733 32243372 33847560 35658150 37581601 39441934 41474384 43817396
$$ packed form
4985I186308K98219K33628M10264L32544L11632J94435K95883L90363J20920l18501
4975A1455695p2325j78666k43052J24688j12329o8393J87750J2572J59785M0696
4965A1306421L22384J83362L04688O7033J37716J14550K22341K74546L02965J95213
4955A3431219J70637J16469K85938K05738J87686K34775K41297M15683P1847J99557
4945A5560846L83543M87302J18744J87019K48539K99216J91695L31977L70401
4936A8179282K25589O14727M34717L27830N48487M09839O21833O71194N76664
4927B2610162N58138N18483M72875N67706J091873J083004O85430J152726J147988
4918B9888385J073348J281639J604188J810590J923451J860333K032450K343012
$$ plain form
4910 43817396 46017842 48027782 49690696 50937330 51912329 52617675 53611351 54967274 56618028
4901 56618028 58451878 60121441 61457879 62271026 62551404 62735644 63122676 63880510 64997629
4892 64997629 66471922 68321837 70420875 72939299 75650701 77988830 80536660 83279220
4884 83279220 85788062 88504858 92251605 96719177 102493919 109219113 116282919 123102558
4876 123102558 128717568 132113073 131610167 126993624 119359214 110448820 102195353 95872900
4868 95872900 91545658 88843678 87462578 87216732 88005954 90243531 93540568 97674120
4860 97674120 102869017 108897460 115647233 122336558 128061087 132372448 134219725 133681190
4852 133681190 131019336 126161248 119344228 111103295 102457787 94413153 87373513 81555847
$$ packed form
4910D3817396K200446K009940J662914J246634R74999P05346R93676J355923J650754
4901E6618028J833850J669563J336438Q13147K80378J84240L87032P57834J117119
4892F4997629J474293J849915K099038K518424K711402K338129K547830K742560
4884H3279220K508842K716796L746747M467572N774742O725194P063806O819639
4876A23102558N615010L395505n02906m616543p634410q910394q253467o322453
4868I5872900m327242k701980j381100k45846P89222K237577L297037M133552
4860I7674120N194897O028443O749773O689325N724529M311361J847277n38535
4852A33681190k661854m858088o817020q240933q645508q044634p039640n817666
$$ plain form
4844 81555847 76840527 73074948 70204996 67915984 66614217 65592974 64923755 64620176
4836 64620176 64533082 64758880 65250531 66227799 67589267 69699528 72086641 74788617 77886049
4827 77886049 81554278 85601835 89833311 93855521 97826801 101845227 105746795 109345040
4819 109345040 112303206 114694156 116201125 116656995 116800133 115961277 114370762 112448087
4811 112448087 110069632 107515999 105257925 103335102 101897934 100855622 100199478 99963900
4803 99963900 99966368 100086733 100093172 100101246 100537749 101796610 103068202 104530907 105519642 105584137
4793 105584137 104490464 102399535 99791461 97031247 94491391 92046401 89742653 87195302
4785 87195302 84591050 81839437 78987188 76047801 73293100 70847557 68648468 66666465
$$ packed form
4844H1555847m715320l765579k869952k289012j301767j021243o69219l03579
4836F4620176q7094K25798M91651R77268J361468K110261K387113K701976L097432
4827G7886049L668229M047557M231476M022210L971280M018426L901568L598245
4819A09345040K958166K390950J506969M55870J43138q38856j590515j922675
4811A12448087k378455k553633k258074j922823j437168j042312o56144k35578
4803I9963900K468J20365O439Q074M36503J258861J271592J462705R88735O4495
4793A05584137j093673k090929k608074k760214k539856k444990k303748k547351
4785H7195302k604252k751613k852249k939387k754701k445543k199089j982003
$$ plain form
4777 66666465 64898231 63154495 61643598 60404265 59129475 58085999 57369092 56594591
4769 56594591 55707125 54720564 53662933 52442437 51363402 50473582 49710245 49071942 47903753
4760 47903753 46948918 45659001 44190801 42771922 41479859 40193794 38867220 37723892
4752 37723892 36633946 35604532 34707261 33852599 33216888 32751201 32465550 32032868 31819730
4743 31819730 31519889 31217910 31090479 31249723 31359942 31306134 31449404 31522852 31708897 32055075
4733 32055075 32333725 32936031 33535781 33880273 34532559 35247315 35968164 36801229 37675546
4724 37675546 38481561 39514417 40597653 41678075 42432851 43246291 44164631 45193769 46385081
4715 46385081 47511896 48569868 49759879 51140593 52739196 54403030 55972518 57472092
$$ packed form
4777F6666465j768234j743736j510897j239333j274790j043476p16907p74501
4769E6594591q87466r86561j057631j220496j079035q89820p63337o38303j168189
4760D7903753r54835j289917j468200j418879j292063j286065j326574j143328
4752C7723892j089946j029414q97271q54662o35711m65687k85651m32682k13138
4743C1819730k99841l01979j27431J59244J10219n3808J43270P3448J86045L46178
4733C2055075K78650O02306N99750L44492O52286P14756P20849Q33065Q74317
4724C7675546Q06015J032856J083236J080422P54776Q13440R18340J029138J191312
4715D6385081J126815J057972J190011J380714J598603J663834J569488J499574
$$ plain form
4707 57472092 58976744 60484728 62229628 64107829 65872338 67846055 70079834 72703474
4699 72703474 75575423 79028141 82429630 86257699 90688675 95382728 101435116 108381949
4691 108381949 116612693 126025712 136903587 149513872 163687822 180400809 200563824
4684 200563824 225333556 255635121 292357655 335277532 382106908 425530408 451304237
4677 451304237 445770842 407237335 350157320 292544940 243735397 205396185 176189899
4670 176189899 153622043 136059345 122124354 111344803 102596670 95227481 88790085
4663 88790085 82904997 77266787 71672343 66720713 62166964 58018460 54420016 51387173
4655 51387173 48982852 46794227 44433761 42620186 40900648 39291446 37911980 36746648
$$ packed form
4707E7472092J504652J507984J744900J878201J764509J973717K233779K623640
4699G2703474K871949L452718L401489L828069M430976M694053O052388O946833
4691A08381949Q230744R413019J0877875J2610285J4173950J6712987K0163015
4684B00563824K4769732L0301565L6722534M2919877M6829376M3423500K5773829
4677D51304237n533395l8533507n7080015n7612380m8809543l8339212k9206286
4670A76189899k2567856j7562698j3934991j0779551q748133p369189o437396
4663H8790085n885088n638210n594444m951630m553749m148504l598444l032843
4655E1387173k404321k188625k360466j813575j719538j609202j379466j165332
$$ plain form
4647 36746648 35676967 34483254 33694781 32737356 31735884 30744160 29757124 28810178 27712271
4638 27712271 26792286 25870467 24888707 23993538 23306360 22603726 21949776 21488477 20925128
4629 20925128 20777535 20616474 20458092 20103244 19942284 19807781 19398324 18675233 18251291
4620 18251291 17743867 16986922 16637163 15856524 15239053 14996434 14806753 14562435 14305146
4611 14305146 14040357 13949104 13628580 13420092 13563831 13548214 13510009 13399778 13129505 13077076
4601 13077076 13039548 12935549 12693692 12772386 12626702 12298421 11952455 11638630 11428876 11252396
4591 11252396 11089176 10824358 10486357 10092106 9996125 9884818 9834825 9819208 9641653 9703771
4581 9703771 9653632 9626610 9549465 9354806 8965180 8879036 8833217 8716757 8584848 8601354 8445060
$$ packed form
4647C6746648j069681j193713p88473r57425j001472r91724r87036r46946j097907
4638B7712271r19985r21819r81760q95169o87178p02634o53950m61299n63349
4629B0925128j47593j61061j58382l54848j60960j34503m09457p23091m23942
4620A8251291n07424p56945l49759p80639o17471k42619j89681k44318k57289
4611A4305146k64789r1253l20524k08488J43739j5617l8205j10231k70273n2429
4601A3077076l7528j03999k41857P8694j45684l28281l45966l13825k09754j76480
4591A1252396j63220k64818l38001l94251r5981j11307m9993j5617j77555O2118
4581I703771n0139k7022p7145j94659l89626q6144m5819j16460j31909J6506j56294
$$ plain form
4570 8445060 8511350 8357289 8299484 8371733 8258662 8196361 8383909 8369654 8112058 8225805
4560 8225805 8108294 8170549 8128070 8055346 7912139 8210545 8407617 8389704 8650293 8713756
4550 8713756 8911055 9179781 9340886 9263541 9012248 8581026 8027434 7453816 7242665 7077818
4540 7077818 6958093 6633737 6572505 6423201 6138625 6167976 6022202 5940406 5781177 5937781
4530 5937781 5746920 5613626 5564586 5526143 5598494 5351128 5101047 5081704 5188160 5386210
4520 5386210 5360554 5170656 5004371 5026352 4870899 4961547 4980841 5114314 5234048 5281770
4510 5281770 5193006 5208797 5111398 5312790 5424443 5495237 5379863 5413588 5509942 5524588 5620708
4499 5620708 5786260 5806600 5809855 5858267 6060512 6280855 6445185 6550125 6429336 6942465
$$ packed form
4570H445060O6290j54061n7805P2249j13071o2301J87548j4255k57596J13747
4560H225805j17511O2255m2479p2724j43207K98406J97072j7913K60589O3463
4550H713756J97299K68726J61105p7345k51293m31222n53592n73618k11151j64847
4540G077818j19725l24356o1232j49304k84576K9351j45774q1796j59229J56604
4530E937781j90861j33294m9040l8443P2351k47366k50081j9343J06456J98050
4520E386210k5656j89898j66285K1981j55453R0648J9294J33473J19734M7722
4510E281770q8764J5791r7399K01392J11653P0794j15374L3725R6354J4646R6120
4499E620708J65552K0340L255M8412K02245K20343J64330J04940j20789N13129
$$ plain form
4489 6942465 7232660 7669369 7772176 8259873 8969242 9762856 10610970 11491746 12334046 12317742
4479 12317742 11750326 10525535 9282873 8306217 7533223 6963334 6451027 5979708 5699542
4470 5699542 5430925 5449618 5486553 5300092 5255698 4960913 4628340 4784738 5011659 4878517
4460 4878517 4964428 4996308 4765630 4576687 4268355 4136060 4127566 3925934 3802131 3659337
4450 3659337 3565257 3324578 3343126 3289071 3338741 3159979 3081141 3141263 3082437 3110352 3140315
4439 3140315 2999105 2607615 2565816 2848265 2863682 2739540 2729636 2920800 2801121 2556155
4429 2556155 2625368 2674854 2612327 2489319 2750982 2851094 2788670 2733430 2723358 2536372 2690203
4418 2690203 2704399 2535990 2687168 2506281 2591500 2672703 2466588 2458197 2334760 2245407 2557544
$$ packed form
4489F942465K90195M36709J02807M87697P09369P93614Q48114Q80776Q42300j6304
4479A2317742n67416j224791j242662r76656p72994n69889n12307m71319k80166
4470E699542k68617J8693L6935j86461m4394k94785l32573J56398K26921j33142
4460D878517Q5911L1880k30678j88943l08332j32295q494k01632j23803j42794
4450C659337r4080k40679J8548n4055M9670j78762p8838O0122n8826K7915K9963
4439C140315j41210l91490m1799K82449J5417j24142r904J91164j19679k44966
4429B556155O9213M9486o2527j23008K61663J00112o2424n5240j0072j86986J53831
4418B690203J4196j68409J51178j80887Q5219Q1203k06115q391j23437q9353L12137
$$ plain form
4407 2557544 2470252 2441062 2520556 2320340 2287678 2402985 2187963 1944638 2185209 2270506
4397 2270506 2451600 2561446 2406045 2487492 2449025 2358906 2447619 2382994 2199031 2313818
4387 2313818 2562922 2636386 2521838 2632435 2882490 3037049 3202514 3351699 3241539 3328237
4377 3328237 3363146 3532284 3909773 4083554 3976149 3996329 3870077 3562857 3435803 3226046
4367 3226046 3346463 3232878 3172699 3033424 3085301 3038879 2816993 2615466 2450222 2377238
4357 2377238 2243159 2188739 1969154 1797594 1797052 1682024 1669450 1646600 1675283 1518765 1520872
4346 1520872 1454198 1444589 1368096 1435771 1452652 1498281 1556479 1418527 1297300 1358567 1335376
4335 1335376 1049070 1157359 1151600 1289741 1272354 1170158 1197694 1118753 1156845 1193340 1248202
$$ packed form
4407B557544q7292k9190P9494k00216l2662J15307k15022k43325K40571Q5297
4397B270506J81094J09846j55401Q1447l8467r0119Q8713o4625j83963J14787
4387B313818K49104P3464j14548J10597K50055J54559J65465J49185j10160Q6698
4377C328237L4909J69138L77489J73781j07405K0180j26252l07220j27054k09757
4367C226046J20417j13585o0179j39275N1877m6422k21886k01527j65244p2984
4357B377238j34079n4420k19585j71560n42j15028j2574k2850K8683j56518K107
4346A520872o6674r609p6493O7675J6881M5629N8198j37952j21227O1267k3191
4335A335376k86306J08289n759J38141j7387j02196K7536p8941L8092L6495N4862
$$ plain form
4324 1248202 1322532 1170368 1223778 1293953 1208577 1133267 1069548 1162329 1280367 1148572 973256
4313 973256 787197 722551 715227 767448 762601 766743 812082 890713 761517 735213 727811 915359
4301 915359 809298 698976 578633 662638 703609 450236 574717 549824 590896 788952
4291 788952 891083 524743 565872 465629 377135 453938 608580 526117 615129 592242 608011
4280 608011 643605 628158 511752 448116 487127 602314 844308 780536 588260 440559 503489
4269 503489 366213 490428 466023 284701 387931 391172 342382 323772 294665 466419 334124
4258 334124 508140 456653 480987 427366 462604 647852 505440 360380 232906 420908
4248 420908 360129 478350 703127 596950 578359 381895 130137 263174 460072 549157
$$ packed form
4324A248202P4330j52164N3410P0175q5376p5310o3719R2781J18038j31795j75316
4313I73256j86059o4646p324N2221m847M142M5339P8631j29196k6304p402J87548
4301I15359j06061j10322j20343Q4005M0971k53373J24481k4893M1072J98056
4291G88952J02131l66340M1129j00243q8494P6803J54642q2463Q9012k2887J5769
4280F08011L5594j5447j16406o3636L9011J15187K41994o3772j92276j47701O2930
4269E03489j37276J24215k4405j81322J03230L241m8790j8610k9107J71754j32295
4258C34124J74016n1487K4334n3621L5238J85248j42412j45060j27474J88002
4248D20908o0779J18221K24777j06177j8591j96464k51758J33037J96898Q9085
$$ plain form
4238 549157 635745 590020 638155 463106 465821 471120 373056 224246 355232 472791 471089
4227 471089 608717 593792 474664 353564 237155 204424 292245 323277 355353 331504 127622
4216 127622 115250 207429 223747 191818 192469 314558 373793 324355 367079 219042 -1597
4205 -1597 -51143 87829 369783 371355 281535 138087 229863 311830 256059 217982 193444 314921
4193 314921 401386 158945 241806 117123 212372 401481 285623 104346 114431 199393 389358
4182 389358 345385 59564 16721 96917 112824 291182 240702 78249 4692 361680 491580
4171 491580 176680 251146 343224 194849 116340 -86174 -69123 79564 63407 244859 341946
4160 341946 444016 476204 302449 113617 51412 105494 192273 202439 171663 160547 71984
$$ packed form
4238E49157Q6588m5725M8135j75049K715N299r8064j48810J30986J17559j702
4227D71089J37628j4925j19128j21100j16409l2731Q7821L1032L2076k3849k03882
4216A27622j2372R2179J6318l1929O51J22089N9235m9438M2724j48037k20639
4205a597m9546J38972K81954J572q9820j43448R1776Q1967n5771l8077k4538J21477
4193C14921Q6465k42441Q2861j24683R5249J89109j15858j81277J0085Q4962J89965
4182C89358m3973k85821m2843Q0196J5907J78358n0480j62453p3557L56988J29900
4171D91580l14900P4466R2078j48375p8509k02514J7051J48687j6157J81452R7087
4160C41946J02070L2188j73755j88832o2205N4082Q6779J0166l0776j1116q8563
$$ plain form
4149 71984 307749 375177 228822 168225 238519 -47662 105024 320554 517967 414771
4139 414771 205140 317777 353267 390978 164947 334883 276353 16836 -91326 226825
4129 226825 173333 216002 276265 258570 223331 155672 195580 458878 467489 361329 293981
4118 293981 284413 272401 96525 132616 123642 85608 29491 40787 225999 308422 289526 310009
4106 310009 267449 274751 132099 187863 358386 508849 392251 103984 83619 273943 363886
4095 363886 277945 254069 136585 290514 431494 443671 393724 422125 318054 188432 108996
4084 108996 257359 356846 255162 71167 30678 -67078 220287 48464 120226 251708
4074 251708 184759 189843 114407 186322 305024 139236 135656 171201 118259 -775 300784
$$ packed form
4149G1984K35765O7428j46355o0597P0294k86181J52686K15530J97413j03196
4139D14771k09631J12637L5490L7711k26031J69936n8530k59517j08162L18151
4129B26825n3492M2669O0263j7695l5239o7659L9908K63298Q611j06160o7348
4118B93981r568j2012j75876L6091q974l8034n6117J1296J85212Q2423j8896K0483
4106C10009m2560P302j42652N5764J70523J50463j16598k88267k0365J90324Q9943
4095C63886q5941k3876j17484J53929J40980J2177m9947K8401j04071j29622p9436
4084A08996J48363R9487j01684j83995m0489r7756K87365j71823P1762J31482
4074B51708o6949N084p5436P1915J18702j65788l580L5545n2942j19034L01559
$$ plain form
4063 300784 182955 89621 244432 87840 277049 105362 101553 -89806 -107382 -225801
4053 -225801 -151847 -20169 229805 368205 234835 88670 50280 440996 367690 162323
4043 162323 190545 15390 36322 289822 109946 43327 89542 39106 -138017 -235142 23273
4032 23273 103388 77519 82513 143119 149665 200032 263136 392395 223623 158859 165714 224194
4020 224194 277640 -2926 38605 261820 241672 68987 -53837 198 -38380 1199 -46543
4009 -46543 139724 -1263 43065 -108718 -20061 -54956 -20457 23739 80137 9556 -137122
3998 -137122 125115 73918 -9220 214775 193713 31050 -114532 53940 91628 197665
3988 197665 -23130 -177178 22046 50429 147243 55612 23536 101707 157656 228408 190966
$$ packed form
4063C00784j17829r3334J54811j56592J89209j71687l809j91359j7576j18419
4053b25801P3954J31678K49974J38400j33370j46165l8390L90716p3306k05367
4043A62323K8222j75155K0932K53500j79876o6619M6215n0436j77123r7125K58415
4032B3273Q0115k5869M994O0606O546N0367O3104J29259j68772o4764O855N8480
4020B24194N3446k80566M1531K23215k0148j72685j22824N4035l8578L9579m7742
4009d6543J86267j40987M4328j51783Q8657l4895L4499M4196N6398p0581j46678
3998a37122K62237n1197q3138K23995k1062j62663j45582J68472L7688J06037
3988A97665k20795j54048J99224K8383R6814r1631l2076P8171N5949P0752l7442
$$ plain form
3977 190966 249692 91139 152007 -10725 -190747 -237403 -403537 -204789 -50523 -66229
3967 -66229 -192329 -61480 -145843 149877 190140 257911 155228 214335 180252 145295 110773
3956 110773 107318 114228 132355 128776 210317 57623 -141504 34856 216737 75353 85981
3945 85981 -6463 97332 142856 -77412 70673 182267 31168 135976 187060 18130
3935 18130 -38543 40848 148552 98394 164452 53019 -98906 -148862 -193349 -73591 -2068
3924 -2068 -64118 -122567 5625 80214 21506 -90234 150574 297754 169035 68010 81729
3913 81729 37186 -25360 121030 138447 310462 130624 11857 72015 55608 31712 37644
3902 37644 -81337 -86119 -46744 -95699 -98041 -81017 68200 -40013 -52544 105986 36686
$$ packed form
3977A90966N8726j58553O0868j62732j80022m6656j66134J98748J54266j5706
3967f6229j26100J30849q4363K95720M0263O7771j02683N9107l4083l4957l4522
3956A10773l455O910J8127l579Q1541j52694j99127J76360J81881j41384J0628
3945H5981r2444J03795M5524k20268J48085J11594j51099J04808N1084j68930
3935A8130n6673P9391J07704n0158O6058j11433j51925m9956m4487J19758P1523
3924b068o2050n8449J28192P4589n8708j11740K40808J47180j28719j01025J3719
3913H1729m4543o2546J46390J7417J72015j79838j18767O0158j6407k3896N932
3902C7644j18981m782L9375m8955k342J7024J49217j08213j2531J58530o9300
$$ plain form
3891 36686 -280632 -288831 -282236 -127689 -158077 -89409 -109290 -132428 64895 23881 17709 58562
3879 58562 80451 138591 182251 15559 -9463 140277 50191 -2815 126468 24228 -4663
3868 -4663 27754 46639 58888 27880 -147303 -90580 19906 78856 19254 58737 -187067
3857 -187067 -236740 -115532 -309 60134 215103 229623 198156 -41788 163976 354283
3847 354283 175047 227261 191892 311235 259258 316618 220674 101618 209843 118122 -28869
3836 -28869 104898 190601 207040 278596 88280 348911 299377 209217 161132 55683 138436
3825 138436 203121 395061 366999 243508 426568 335340 230597 427211 450798 443149 303012
3814 303012 363332 313531 411838 513163 558211 309525 201680 414341 506456 470181 411487
$$ packed form
3891C6686l17318q199O595J54547l0388O8668j9881k3138J97323m1014o172M0853
3879E8562K1889N8140M3660j66692k5022J49740r0086n3006J29283j02240k8891
3868d663L2417J8885J2249l1008j75183N6723J10486N8950n9602L9483k45804
3857a87067m9673J21208J15223O0443J54969J4520l1467k39944K05764J90307
3847C54283j79236N2214l5369J19343n1977N7360r5944j19056J08225r1721j46991
3836b8869J33767Q5703J6439P1556j90316K60631m9534r0160m8085j05449Q2753
3825A38436O4685J91940k8062j23491J83060r1228j04743J96614K3587p649j40137
3814C03012O0320m9801R8307J01325M5048k48686j07845K12661R2115l6275n8694
$$ plain form
3803 411487 397653 349007 262147 286224 248500 659349 709761 505532 472325 460808 343558
3792 343558 228920 339132 435008 320434 315435 461511 543782 536021 576369 512677 598297
3781 598297 648019 744976 637147 389263 528801 613328 499640 350960 423793 499951 521308
3770 521308 491640 397246 209921 207637 276942 427135 339513 335451 383536 356152 141579
3759 141579 41939 233148 255517 274939 276777 187160 180737 497001 521330 321889 423019
3748 423019 299391 300930 196302 427991 336141 308527 355867 418612 438669 336199 478476
3737 478476 319955 265081 244599 289598 152356 368240 432814 542371 644202 446224
3727 446224 462766 355631 174159 193553 140726 285579 489674 265912 256514 294175 398126
$$ packed form
3803D11487j3834m8646q6860K4077l7724M10849N0412k04229l3207j1517j17250
3792C43558j14638J10212R5876j14574m999J46076Q2271p761M0348o3692Q5620
3781E98297M9722R6957j07829k47884J39538Q4527j13688j48680P2833P6158K1357
3770E21308k9668r4394j87325k284O9305J50193q7622m062M8085k7384k14573
3759A41579r9640J91209K2369J9422J838q9617o423L16264K4329j99441J01130
3748D23019j23628J539j04628K31689r1850k7614M7340O2745K0057j02470J42277
3737D78476j58521n4874k0482M4999j37242K15884O4574J09557J01831j97978
3727D46224J6542j07135j81472J9394n2827J44853K04095k23762r398L7661J03951
$$ plain form
3716 398126 315679 174405 273071 270699 193226 119257 259242 274282 274987 210020 147144 364725
3704 364725 157244 -35385 90288 21866 -138515 -201664 -180608 170988 -114326 -142332
3694 -142332 -46353 37235 -105338 -96549 115134 104846 -58903 124595 20288 -139960 -88033
3683 -88033 -300678 -452284 -400364 -90367 -19442 125509 87946 -50279 39540 47003 -169989
3672 -169989 -98172 134173 286941 60056 -68447 -144214 -8777 54441 19451 -44907 156358
3661 156358 55740 -65898 -84147 58642 -4335 220396 340994 340671 273494 141944 104208
3650 104208 -5258 -8530 -127208 -369313 -280752 -161099 -101490 -196739 -189355 -13363 89045
3639 89045 24763 86732 56829 50816 -170820 -306357 -155064 -6920 71218 -22677 -2659
$$ packed form
3716C98126q2447j41274R8666k372p7473p3969J39985J5040P05o4967o2876K17581
3704C64725k07481j92629J25673o8422j60381o3149K1056L51596k85314k8006
3694a42332R5979Q3588j42573Q789K11683j0288j63749J83498j04307j60248N1927
3683h8033k12645j51606N1920L09997P0925J44951l7563j38225Q9819P463k16992
3672a69989P1817K32345J52768k26885j28503p5767J35437O3218l4990o4358K01265
3661A56358j00618j21638j8249J42789o2977K24731J20598l23o7177j31550l7736
3650A04208j09466l272j18678k42105Q8561J19653N9609r5249P384J75992J02408
3639H9045o4282O1969k9903o013k21636j35537J51293J48144P8138r3895K0018
$$ plain form
3628 -2659 -67984 13392 136679 160226 6682 -143181 -346706 -139396 -229953 -86672 45956
3617 45956 13760 -62620 -152093 -47591 12889 -39545 -117394 94717 15896 29933 70870
3606 70870 52876 -24099 -147275 -150359 -109830 -191797 -252998 -44652 -181746 13593 72171
3595 72171 149636 142925 2133 -83233 1301 -25266 8460 114563 251759 346237 284657
3584 284657 80196 -75545 78815 234815 227056 171748 114287 28919 236909 458324 260404
3573 260404 -13953 175522 44182 227549 277516 304909 295495 300617 393655 335208 286013
3562 286013 256537 165818 193795 387407 486377 236952 259038 186777 32886 224043 63679
3551 63679 -21330 -79671 110069 210236 88176 65513 -100841 2536 126392 -74059
$$ packed form
3628b659o5325Q1376J23287K3547j53544j49863k03525K07310r0557J43281J32628
3617D5956l2196p6380q9473J04502O0480n2434p7849K12111p8821J4037M0937
3606G0870j7994p6975j23176l084M0529q1967o1201K08346j37094J95339N8578
3595G2171P7465o711j40792q5366Q4534k6567L3726J06103J37196R4478o1580
3584B84657k04461j55741J54360J56000p759n5308n7461q5368K07990K21415j97920
3573B60404k74357J89475j31340J83367M9967K7393r414N122R3038n8447m9195
3562B86013k9476r0719K7977J93612R8970k49425K2086p2261j53891J91157j60364
3551F3679q5009n8341J89740J00167j22060k2663j66354J03377J23856k00451
$$ plain form
3541 -74059 260944 285450 213150 294174 401628 288879 401149 235959 171534 394734 329279
3530 329279 146853 -33952 1452 -2238 224306 333593 286357 232256 288846 268269 224330
3519 224330 266054 182754 208815 7840 163674 514905 479578 296336 172131 263993 357081
3508 357081 340367 299990 199786 226900 319963 553171 697181 581416 347253 315439 273143
3497 273143 343201 488230 690873 588165 487295 500031 733695 622826 410299 503644
3487 503644 560059 690112 591073 451702 658207 755046 651415 775187 773005 736896 772635
3476 772635 755127 692205 795054 1047166 1013158 1041641 1145839 760081 721392 717803 457021
3465 457021 459722 422260 323527 422901 424741 567240 473395 371228 249911 412983 364765
$$ packed form
3541g4059L35003K4506p2300Q1024J07454j12749J12270j65190o4425K23200o5455
3530C29279j82426j80805L5404l690K26544J09287m7236n4101N6590k0577m3939
3519B24330M1724q3300K6061k00975J55834L51231l5327j83242j24205R1862R3088
3508C57081j6714m0377j00204K7114R3063K33208J44010j15765k34163l1814m2296
3497B73143P0058J45029K02643j02708j00870J2736K33664j10869k12527R3345
3487E03644N6415J30053r9039j39371K06505R6839j03631J23772k182l6109L5739
3476G72635j7508o2922J02849K52112l4008K8483J04198l85758l8689l589k60782
3465D57021K701l7462r8733R9374J840J42499r3845j02167j21317J63072m8218
$$ plain form
3454 364765 307339 246905 436885 429896 435672 524066 539292 572547 459064 522274 805914
3443 805914 986228 1214564 1361554 1468701 1406395 1248030 1006613 837354 584779 548743
3433 548743 596934 423557 377516 425132 340988 523816 157046 -39022 49864 32465 36092
3422 36092 57788 202559 228454 256073 214601 317079 516669 530884 466366 325850 259567
3411 259567 401603 584173 276756 283996 514992 355288 452884 258277 390929 436225
3401 436225 115297 31635 250692 53075 -125794 -27327 42102 51808 98257 -79216 33885
3390 33885 45261 147160 196068 151509 238409 35133 -217494 -25568 23037 -75731 31734
3379 31734 196619 152673 -55692 -147730 -12563 -4852 10588 -131869 -88209 127015 100823
$$ packed form
3454C64765n7426o0434J89980o989N776Q8394J5226L3255j13483O3210K83640
3443H05914J80314K28336J46990J07147o2306j58365k41417j69259k52575l6036
3433E48743M8191j73377m6041M7616q4144J82828l66770j96068Q8886j7399L627
3422C6092K1696J44771K5895K7619m1472J02478J99590J4215o4518j40516o6283
3411B59567J42036J82570l07417P240K30996j59704R7596j94607J32652M5296
3401D36225l20928q3662K19057j97617j78869R8467O9429R706M6449j77473J13101
3390C3885J1376J01899M8908m4559Q6900k03276k52627J91926M8605r8768J07465
3379C1734J64885m3946k08365r2038J35167P711J5440j42457M3660K15224k6192
$$ plain form
3368 100823 116201 53855 -9250 -224054 -139281 97004 143860 170288 75403 161396 -107683
3357 -107683 -297123 -203709 76625 320219 241393 -71417 -73319 -11254 104267 225062 119141
3346 119141 97046 -165146 -80369 44934 113112 185553 175174 188031 136271 29963 17319
3335 17319 88956 50903 46349 -46958 28080 71061 160538 27068 -67956 -128174 54919 -1160
3323 -1160 -213335 -131182 -82962 90741 -133440 -121778 93 -63616 -65215 75950 191588
3312 191588 196421 119929 1469 41282 -43954 -270358 -157833 -29444 -30546 160965 105204
3301 105204 27325 -104188 -267033 -164605 -143025 -54082 171045 231844 -6236 -120160
3291 -120160 -101973 -48788 -176139 -171355 -129879 -236970 -277253 -304052 -211841 -200300 -229246
$$ packed form
3368A00823J5378o2346o3105k14804Q4773K36285M6856K6428r4885Q5993k69079
3357a07683j89440R3414K80334K43594p8826l12810j902O2065J15521J20795j05921
3346A19141k2095k62192Q4777J25303O8178P2441j0379J2857n1760j06308j2644
3335A7319P1637l8053m554r3307P5038M2981Q9477j33470r5024o0218J83093n6079
3323a160k12175Q2153M8220J73703k24181J1662J21871o3709j599J41165J15638
3312A91588M833p6492j18460L9813q5236k26404J12525J28389j102J91511n5761
3301A05204p7879j31513j62845J02428K1580Q8943K25127O0799k38080j13924
3291a20160J8187N3185j27351M784M1476j07091m0283k6799R2211J1541k8946
$$ plain form
3280 -229246 -24663 65873 36257 -192443 -95256 -225997 -55683 -77772 -384572 -327767 -247211
3269 -247211 -110439 -175114 -55817 -109860 -86567 15727 -161173 -213334 -58873 -8591 98547
3258 98547 -30224 -85249 -78725 -59400 -230274 -366890 -336400 -296701 -274435 -273715 -260981 -175869
3246 -175869 -138810 -27196 -125704 -388570 -205600 -145923 41795 93082 155981 34242 79655
3235 79655 114364 22530 -54310 -78437 -119063 2097 -21391 -88019 -200510 -108113 -66409
3224 -66409 24585 55810 40117 -52701 -170337 -55747 42961 134857 -109050 -182420 -43049
3213 -43049 75388 -190112 -113803 36123 -52418 -230332 -247354 -345341 -94055 -51596 -99755
3202 -99755 -87388 -158909 144404 118679 71695 -36731 -68797 -99284 67066 93295 -167017
$$ packed form
3280b29246K04583R0536k9616k28700R7187j30741J70314k2089l06800N6805Q0556
3269b47211J36772o4675J19297n4043K3293J02294j76900n2161J54461N0282J07138
3258I8547j28771n5025O524J9325j70874j36616L0490L9699K2266P20J2734Q5112
3246a75869L7059J11614r8508k62866J82970N9677J87718N1287O2899j21739M5413
3235G9655L4709r1834p6840k4127m0626J21160k3488o6628j12491R2397M1704
3224f6409R0994L1225j5693r2818j17636J14590R8708R1896k43907p3370J39371
3213d3049J18437k65500P6309J49926q8541j77914j7022r7987K51286M2459m8159
3202i9755J2367p1521L03313k5725m6984j08426l2066l0487J66350K6229k60312
$$ plain form
3191 -167017 -94923 -72516 -279088 -83975 -29311 -166162 -138587 -14926 -30456 -31199 -97917
3180 -97917 -82402 4671 95342 -4340 80206 146640 56776 25544 -25757 139863 -78707
3169 -78707 217260 205932 -81022 -203124 -104897 67971 145666 78132 -74757 -142828 -117492
3158 -117492 -30825 174800 28589 -87846 54082 147778 89964 -44418 148952 107492
3148 107492 322130 173575 -81079 -174238 25911 164239 127337 135838 98710 -52977 -125943
3137 -125943 -101535 127022 121497 63565 -68734 -135354 -135976 -261974 -202278 -106804 -58657 -221599
3125 -221599 -114704 -18866 113702 58724 232716 138294 27128 -150448 -177209 -186137 -142933
3114 -142933 -254139 -336375 -347634 -57392 -47694 19054 21785 105619 -221152 -280870 -137999
$$ packed form
3191a67017P2094K2407k06572J95113N4664j36851K7575J23661j5530p43o6718
3180i7917J5515Q7073R0671r9682Q4546O6434q9864l1232n1301J65620k18570
3169g8707K95967j1328k86954j22102R8227J72868P7695o7534j52889o8071K5336
3158a17492Q6667K05625j46211j16435J41928R3696n7814j34382J93370m1460
3148A07492K14638j48555k54654r3159K00149J38328l6902Q501l7128j51687p2966
3137a25943K4408K28557n525n7932j32299o6620o22j25998N9696R5474M8147j62942
3125b21599J06895R5838J32568n4978J73992r4422j11166j77576k6761q928M3204
3114a42933j11206q2236j1259K90242R698O6748K731Q3834l26771n9718J42871
$$ plain form
3103 -137999 -82149 127723 -202863 54977 38812 -134532 -111635 -161196 -58810 -17301 -5284
3092 -5284 -91754 -22388 -33642 -60578 84373 97876 -303856 -221122 -164972 -189387 -36741
3081 -36741 -52265 241859 222744 112271 -16748 290 34 -147068 -184359 -280643 -371783
3070 -371783 -267080 -192049 -237243 -443835 -392139 -380947 -500621 -360874 -101659 -124375 -258595
3059 -258595 -273745 -226290 -213469 -236407 -167582 98178 110231 206882 283015 154288 14102
3048 14102 188555 229141 50199 85775 81869 -36983 -83769 -53411 47481 178343 62521
3037 62521 -42101 -85824 -299181 -179383 -228686 -399152 -382401 -113925 33017 86452 -99184
3026 -99184 -88646 -23070 40601 -216218 -460689 -305862 -180025 -233580 -92199 -76510 -176619
$$ packed form
3103a37999N5850K09872l30586K57840j6165j73344K2897m9561J02386M1509J2017
3092e284q6470O9366j1254k6936J44951J3503m01732Q2734N6150k4415J52646
3081c6741j5524K94124j9115j10473j29019J7038k56j47102l7291r6284r1140
3070c71783J04703P5031m5194k06592N1696J1192j19674J39747K59215k2716j34220
3059b58595j5150M7455J2821k2938O8825K65760J2053R6651P6133j28727j40186
3048A4102J74453M0586j78942L5576l906j18852m6786L0358J00892J30862j15822
3037F2521j04622m3723k13357J19798m9303j70466J6751K68476J46942N3435j85636
3026i9184J0538O5576O3671k56819k44471J54827J25837n3555J41381J5689j00109
$$ plain form
3015 -176619 -208872 -84608 -19819 -32 -190529 -336075 -282653 -279529 -250973 -27897 48194
3004 48194 106976 73691 -123069 -283244 -303435 -151104 -348827 -312669 -261330 -208893 -13559
2993 -13559 -53266 -93669 -165527 -141516 -167817 -309582 -428292 -421764 -387627 -189433 -235523
2982 -235523 -267576 -271077 -297038 99900 74524 4879 55284 -37159 -337609 -335054 -418192 -154684
2970 -154684 -4627 -153051 -193742 -119368 -216350 -295271 -230315 -166967 61729 205428 80874
2959 80874 -48841 -62710 -74153 -38385 -41477 -78272 -106142 -74297 -17270 -205479 -180127 -209622
2947 -209622 -358608 -456042 -345096 -294143 -86350 -120320 -178870 -110680 -137279 -333553 -144485
2936 -144485 -369282 -283813 -58418 38614 -83947 4658 -80454 -170298 -61627 -148194 -122643
$$ packed form
3015a76619l2253J24264O4789J9787j90497j45546N3422L124K8556K23076P6091
3004D8194N8782l3285j96760j60175k0191J52331j97723L6158N1339N2437J95334
2993a3559l9707m0403p1858K4011k6301j41765j18710O528L4137J98194m6090
2982b35523l2053l501k5961L96938k5376o9645N0405r2443l00450K555q3138K63508
2970a54684J50057j48424m0691P4374r6982p8921O4956O3348K28696J43699j24554
2959H0874j29715j3869j1443L5768l092l6795k7870L1845N7027j88209K5352k9495
2947b09622j48986r7434J10946N0953K07793l3970n8550O8190k6599j96274J89068
2936a44485k24797Q5469K25395R7032j22561Q8605q5112q9844J08671q6567K5551
$$ plain form
2925 -122643 -22118 70205 -159443 -253189 -107227 -153133 -253953 -17192 45165 -82563
2915 -82563 -49016 91859 62677 100633 -129771 77449 49366 86800 60180 4849 -72614
2904 -72614 -112291 79606 41520 22498 -94817 -20594 8689 16147 16598 -134165 33776 81862
2892 81862 59620 219063 158782 -61183 -14793 204083 71239 -201149 -98444 -156142 -137454
2881 -137454 -209804 -174164 -264469 -168030 -251963 -206991 4655 158926 23450 -153403 -74414
2870 -74414 -4175 44677 -146672 -258569 -248940 -213180 -222495 -149675 -260634 -328943 -373347 -347089
2858 -347089 -166295 -132534 -34505 111592 -38667 36650 -120863 30748 -52228 59686
2848 59686 29116 28175 92733 -96849 -176697 -179207 -97094 -38506 90666 74484 58952 -364584
$$ packed form
2925a22643J00525R2323k29648r3746J45962m5906j00820K36761O2357j27728
2915h2563L3547J40875k9182L7956k30404K07220k8083L7434k6620n5331p7463
2904g2614l9677J91897l8086j9022j17315P4223K9283P458M51j50763J67941M8086
2892H1862k2242J59443o0281k19965M6390K18876j32844k72388J02705n7698J8688
2881a37454p2350L5640r0305R6439q3933M4972K11646J54271j35476j76853P8989
2870g4414P0239M8852j91349j11897R629L5760r315P2820j10959o8309m4404K6258
2858c47089J80794L3761R8029J46097j50259P5317j57513J51611q2976J11914
2848E9686l0570r41O4558j89582p9848k510Q2113N8588J29172j6182j5532m23536
$$ plain form
2836 -364584 -259781 -347306 -134757 85329 -210102 -384531 -125391 -88970 -64477 -86055
2826 -86055 -173497 -192648 -345026 -452609 -172535 -199918 -353605 69194 -71692 -269107
2816 -269107 -107408 -77181 -110135 -118682 -118636 -285889 -247114 -209853 -186723 -7883 40658 -116142
2804 -116142 -19263 175727 138612 133074 52447 21232 102343 175630 56859 130401 52150
2793 52150 -28689 -343613 -408846 -208366 -176969 -156779 -59729 6711 105988 67114 5358
2782 5358 -109660 -16160 -30440 -49721 -59550 -266300 -114286 -27777 -93797 -223597 -309921
2771 -309921 -188095 -215777 -182599 -162405 -113818 -31380 -151624 -357891 -339040 40802 197402
2760 197402 186640 -43140 -170317 -124906 -49053 -64177 -230623 -280104 -299928 -396169 -400830
$$ packed form
2836c64584J04803q7525K12549K20086k95431j74429K59140L6421K4493k1578
2826h6055q7442j9151j52378j07583K80074k7383j53687M22799j40886j97415
2816b69107J61699L0227l2954q547M6j67253L8775L7261K3130J78840M8541j56800
2804a16142R6879J94990l7115n538q0627l1215Q1111P3287j18771P3542p8251
2793E2150q0839l14924o5233K00480L1397K0190R7050O6440R9277l8874o1756
2782E358j15018R3500j4280j9281r829k06750J52014Q6509o6020j29800q6324
2771c09921J21826k7682L3178K0194M8587Q2438j20244k06267J8851L79842J56600
2760A97402j0762k29780j27177M5411P5853j5124j66446m9481j9824r6241m661
$$ plain form
2749 -400830 -244157 -34892 -16526 -62162 99742 149922 -227378 -67461 -8256 14367 -105852
2738 -105852 -97289 -76524 -47322 197170 30969 -117657 -63821 -60884 -41028 -167770 -139121
2727 -139121 -228075 -475990 -303503 -322528 -222731 -168298 36693 1821 -103809 -157659 -52858
2716 -52858 -64492 -266208 -31105 21558 21501 198723 131530 175995 122130 25971 -49756 132723
2704 132723 155945 143546 81892 6899 3777 -32156 -118046 -170156 -13980 157575 12297
2693 12297 -11649 -161416 -220751 -82350 -65281 -135264 -307773 -315798 -48395 57255 36060
2682 36060 54824 73356 85757 11838 6573 -63902 25221 -62899 26488 59375 -1841 -38169
2670 -38169 180900 158165 64285 263214 181324 245888 286810 176543 21605 20294 96299
$$ packed form
2749d00830J56673K09265J8366m5636J61904N0180l77300J59917N9205K2623j20219
2738a05852Q563K0765K9202K44492j66201j48626N3836K937J9856j26742K8649
2727a39121q8954k47915J72487j9025R9797N4433K04991l4872j05630n3850J04801
2716e2858j1634k01716K35103N2663n7J77222o7193M4465n3865r6159p5727J82479
2704A32723K3222j2399o1654p4993l122l5933q5890n2110J56176J71555j45278
2693A2297k3946j49767n9335J38401J7069o9983j72509q025K67403J05650k1195
2682C6060J8764J8532J2401p3919n265p0475Q9123q8120Q9387L2887o1216l6328
2670c8169K19069k2735r3880J98929q1890O4564M0922j10267j54938j311P6005
$$ plain form
2659 96299 -41118 -89645 -166514 -74766 99926 -84597 74632 37181 28342 202851 149820
2648 149820 110570 -8745 -50154 -135306 -134056 -54158 -8765 233570 136801 -116853 -139454
2637 -139454 -76641 133620 118824 59862 163734 125214 -89921 216640 333377 196113
2627 196113 76601 219583 349640 339044 63580 79040 346966 540101 337083 417277
2617 417277 469648 190364 117145 163465 215890 169578 69254 124262 130176 -35689 -58361
2606 -58361 -112769 90105 384578 372310 210269 223153 283802 72031 -29113 -203285 -141398
2595 -141398 142811 301547 210124 -75670 -30814 -51480 -181503 96723 177687 114418 247504
2584 247504 166668 115365 185081 183259 120488 29550 88426 38883 -92588 168493 186568
$$ packed form
2659I6299j37417m8527p6869R1748J74692j84523J59229l7451q839J74509n3031
2648A49820l9250j19315m1409q5152J250P9898M5393K42335r6769k53654k2601
2637a39454O2813K10261j4796n8962J03872l8520k15135L06561J16737j37264
2627A96113j19512J42982J30057j0596k75464J5460K67926J93135k03018Q0194
2617D17277N2371k79284p3219M6320N2425m6312j00324N5008N914j65865k2672
2606e8361n4408K02874K94473j2268j62041J2884O0649k11771j01144j74172O1887
2595a41398K84209J58736r1423k85794M4856k0666j30023K78226Q0964o3269J33086
2584B47504q0836n1303O9716j822o2771r0938N8876m9543j31471K61081J8075
$$ plain form
2573 186568 133681 -26318 163258 239548 122123 119475 186666 272212 440929 364252 173950
2562 173950 91770 226075 288206 180537 403156 362973 178725 201296 255938 229688 159243
2551 159243 31893 -30543 171017 268774 130556 108636 176831 298169 305598 154201 280907
2540 280907 159445 252459 258238 351802 265782 345144 256430 180106 389829 276231 242274
2529 242274 230826 318213 340622 453151 417581 402097 530618 525017 455266 369991 451490
2518 451490 472431 442909 317125 273721 512453 353991 242358 314951 488820 398080 227924
2507 227924 317287 445563 288699 180514 182866 188858 270504 417543 384603 499400 634257
2496 634257 615598 476911 476680 715651 613187 553373 541013 471618 652362 737716 741733
$$ packed form
2573A86568n2887j59999J89576P6290j17425k648O7191Q5546J68717p6677j90302
2562A73950q2180J34305O2131j07669K22619m0183j84248K2571N4642k6250p0445
2551A59243j27350o2436K01560R7757j38218k1920O8195J21338P429j51397J26706
2540B80907j21462R3014N779R3564q6020P9362q8714p6324K09723j13598l3957
2529B42274j1448Q7387K2409J12529l5570j5484J28521n601o9751q5275Q1499
2518D51490K0941k9522j25784m3404K38732j58462j11633P2593J73869r0740j70156
2507B27924Q9363J28276j56864j08185K352N992Q1646J47039l2940J14797J34857
2496F34257j8659j38687k31K38971j02464n9814j2360o9395J80744Q5354M017
$$ plain form
2485 741733 582839 375039 541128 789738 679373 686334 814772 578393 504539 483432
2475 483432 441216 601893 799280 817054 729373 717099 782376 849077 727051 720510 826859
2464 826859 875089 835877 846815 988508 939917 936157 818019 985515 1170408 957205 930941
2453 930941 1013623 996692 1182488 1076448 1014014 1192118 1272504 1337488 1271927 1370633 1526046
2442 1526046 1638359 1655203 1661807 1601624 1349009 1431611 1934301 2030718 1808106 1806669 1727172
2431 1727172 1650698 1615673 1584293 1666082 1642097 1794996 1925156 1885243 2016633 1913303 2026771
2420 2026771 2195338 2271350 2554268 2360790 2412131 2432548 2313365 2374689 2675280 2550662
2410 2550662 2641281 2718524 2684408 2771087 2960196 3114185 3115259 3279733 3362862 3641421 3911673
$$ packed form
2485G41733j58894k07800J66089K48610j10365O961J28438k36379p3854k1107
2475D83432m2216J60677J97387J7774q7681j2274O5277O6701j22026o541J06349
2464H26859M8230l9212J0938J41693m8591l760j18138J67496J84893k13203k6264
2453I30941Q2682j6931J85796j06040o2434J78104Q0386O4984o5561R8706J55413
2442A526046J12313J6844O604o0183k52615Q2602N02690R6417k22612j437p9497
2431A727172p6474l5025l1380Q1789k3985J52899J30160l9913J31390j03330J13468
2420B026771J68567P6012K82918j93478N1341K0417j19183O1324L00591j24618
2410B550662R0619P7243l4116Q6679J89109J53989J074J64474Q3129K78559K70252
$$ plain form
2399 3911673 4100673 4043711 4209420 4602184 4800351 4888166 5118955 5287171 5342732 5574610
2389 5574610 5475273 5804469 5958015 6361226 6572276 6787241 7119433 7251197 7270168 7519886
2379 7519886 7866476 8282361 8635315 8912691 9133622 9512125 10429956 10877700 11643833 12414491
2369 12414491 13352575 14266124 14992828 15925836 17160084 18383205 20280691 22367742 25038584
2360 25038584 28354724 32590156 37917364 44948818 53516684 63620652 73059444 76952667
2352 76952667 70432224 57340075 44316820 34514912 27879028 23024999 19496989 16666861
2344 16666861 14585767 12973603 11937947 11267946 10938707 10460568 9825773 9111130 8142836
2335 8142836 7337111 6805624 6334149 5685359 5366424 5069275 4879474 4570175 4280342 4118149
$$ packed form
2399C911673J89000n6962J65709L92764J98167Q7815K30789J68216N5561K31878
2389E574610r9337L29196J53546M03211K11050K14965L32192J31764J8971K49718
2379G519886L46590M15885L52954K77376K20931L78503R17831M47744P66133P70658
2369A2414491R38084R13549P26704R33008J234248J223121J897486K087051K670842
2360B5038584L316140M235432N327208P031454Q567866J0103968R438792L893223
2352G6952667o520443j3092149j3023255r801908o635884m854029l528010k830128
2344A6666861k081094j612164j035656o70001l29239m78139o34795p14643r68294
2335H142836q05725n31487m71475o48790l18935k97149j89801l09299k89833j62193
$$ plain form
2325 4118149 3875267 3815497 3497284 3265863 3167574 3070565 2760460 2936996 2593106 2680945
2315 2680945 2611218 2553388 2380522 2383366 2204044 1954051 1985630 1846657 1752879 1568984 1682096
2304 1682096 1663765 1754400 1811699 1641818 1390499 1390038 1511550 1525933 1432036 1187717 992959
2293 992959 954090 1004400 1040128 974921 990492 967181 1123587 1107993 928114 771869 933312
2282 933312 1060722 989160 995379 1051485 914153 823828 704505 485027 570238 759792 773207
2271 773207 637316 600532 764747 935887 688755 611270 599330 355081 265059 360983 439467
2260 439467 505996 541408 559938 336120 498778 387778 253517 294161 176694 269441 488754
2249 488754 431759 161606 144920 95747 172282 108773 54577 285192 179464 261691 333738
$$ packed form
2325D118149k42882n9770l18213k31421r8289r7009l10105J76536l43890Q7839
2315B680945o9727n7830j72866K844j79322k49993L1579j38973r3778j83895J13112
2304A682096j8331R0635N7299j69881k51319m61J21512J4383r3897k44319j94758
2293I92959l8869N0310L5728o5207J5571k3311J56406j5594j79879j56245J61443
2282I33312J27410p1562O219N6106j37332r0325j19323k19478Q5211J89554J3415
2271G73207j35891l6784J64215J71140k47132p7485j1940k44249r0022R5924P8484
2260D39467O6529L5412J8530k23818J62658j11000j34261M0644j17467R2747K19313
2249D88754n6995k70153j6686m9173P6535o3509n4196K30615j05728Q2227P2047
$$ plain form
2238 333738 530819 518252 296546 117614 133759 227218 257355 396741 290055 75056
2228 75056 221596 107206 -35752 195034 128533 13679 -3699 -58080 -628 204491 130706
2217 130706 53140 14798 32940 71145 32821 -21855 4989 83730 77493 -221118 -230571 -87786
2205 -87786 -48331 -254173 -199058 -62395 60362 129247 64545 157234 114747 180261 354319
2194 354319 -16378 -175557 -121199 14901 79310 62380 -204300 -118587 -24190 -194281 61593
2183 61593 -92113 -121621 -14070 -119103 -81438 -21648 2960 28783 14262 187553 308704
2172 308704 85854 307593 308572 219547 224558 80517 73329 -75544 -164896 -238109 386
2161 386 -3601 18045 151526 70501 -22910 -79006 -80490 -111336 67143 83830 -66004 -42053
$$ packed form
2238C33738J97081j2567k21706j78932J6145R3459L0137J39386j06686k14999
2228G5056J46540j14390j42958K30786o6501j14854j7378n4381N7452K05119p3785
2217A30706p7566l8342J8142L8205l8324n4676K6844P8741o237k98611r453J42785
2205h7786L9455k05842N5115J36663J22757O8885o4702R2689m2487O5514J74058
2194C54319l70697j59179N4358J36100O4409j6930k66680Q5713R4397j70091K55874
2183F1593j53706k9508J07551j05033L7665N9790K4608K5823j4521J73291J21151
2172C08704k22850K21739R79q9025N011j44041p188j48873q9352p3213K38495
2161C86l987K1646J33481q1025r3411n6096j484l0846J78479J6687j49834K3951
$$ plain form
2149 -42053 -90762 -122719 -114460 10118 126172 165357 15594 44099 62746 168945 204989
2138 204989 98039 20829 -19391 -16145 -13388 -46013 -91424 23861 -75643 101554 -9105
2127 -9105 -78306 -208011 -202038 -140940 -177549 -96664 28181 151298 149811 62999 3700 8409
2115 8409 1079 -89782 -34654 1807 -7618 -25013 39957 -64204 -317294 -179315 97461 118266
2103 118266 5325 36917 -11250 -41601 128257 75267 34037 8803 -389143 -169309 -52256
2092 -52256 107076 247619 197178 163150 268816 212972 203130 151911 140443 196837 154838
2081 154838 152571 227491 175904 -15955 -26054 8610 165531 50686 -165623 -201705 -129964
2070 -129964 -181429 -297545 -224442 -336308 -235066 -37507 125430 104328 83780 -188050
$$ packed form
2149d2053m8709l1957Q259J24578J16054L9185j49763K8505J8647J06199L6044
2138B04989j06950p7210m0220L246K757l2625m5411J15285r9504J77197j10659
2127i105o9201j29705N973O1098l6609Q0885J24845J23117j487q6812n9299M709
2115H409p330r0861N5128L6461r425j7395O4970j04161k53090J37979K76776K0805
2103A18266j12941L1592m8167l0351J69858n2990m1230k5234l97946K19834J17053
2092e2256J59332J40543n0441l4028J05666n5844r842n1219j1468N6394m1999
2081A54838k267P4920n1587j91859j0099L4664J56921j14845k16309l6082P1741
2070a29964n1465j16116P3103j11866J01242J97559J62937k1102k0548k71830
$$ plain form
2060 -188050 -178523 -141916 -285751 -120918 -78765 -88383 35787 -10659 -34862 -35580 -36344 -5622
2048 -5622 -28329 -84860 -112648 -86474 -87099 -131484 33194 143017 108035 175128 -81194 -83624
2036 -83624 -99246 -3984 -185986 -214871 -89188 -112531 -110857 35679 -75181 1476 -34938
2025 -34938 -140715 -117166 -187359 117514 150694 -308047 -396035 -314473 -349863 -333626 -282423
2014 -282423 -114404 -56033 -9131 -145923 -132029 -100063 -39196 -184593 -206855 -25079 -194705
2003 -194705 -239928 -102424 -50883 64309 -71279 -196815 -25354 -57699 6302 35990 -154766
1992 -154766 -342139 -341462 -186772 -148775 -97071 -147021 -146688 -200904 -118200 64285 154141 162472
1980 162472 194819 257984 75251 -23332 -52139 34546 -131009 -473216 -335591 -693 -140254
$$ packed form
2060a88050R527L6607j43835J64833M2153r618J24170m6446k4203p18p64L0722
2048e622k2707n6531k7788K6174o25m4385J64678J09823l4982O7093k56322k430
2036h3624j5622R5262j82002k8885J25683k3343J674J46536j10860P6657l6414
2025c4938j05777K3549p0193L04873L3180m58741q7988Q1562l5390J6237N1203
2014b82423J68019N8371M6902j36792J3894L1966O0867j45397k2262J81776j69626
2003a94705m5223J37504N1541J15192j35588j25536J71461l2345O4001K9688j90756
1992a54766j87373O77J54690L7997N1704m9950L33n4216Q2704J82485Q9856Q331
1980A62472L2347O3165j82733r8583k8807Q6685j65555l42207J37625L34898j39561
$$ plain form
1969 -140254 -265425 -321097 -139138 -9071 -113123 -45427 -192790 -229082 -348985 -168197
1959 -168197 -124651 -193897 -202019 -269759 -193022 -86778 -61491 -23973 -133203 -286367 -107151
1948 -107151 -246145 -284176 -160680 -210154 -188508 -63303 -50976 -208757 -421022 -202302
1938 -202302 -158737 91142 236451 149293 133030 123320 13107 -22669 -17657 -76337 -88605
1927 -88605 56486 51167 9625 -232373 -200024 -282301 -249405 -149511 -169779 -265602 -210995 -264391
1915 -264391 -150100 -291689 -330908 -25700 -226527 -106421 30224 -2862 -309423 -303887
1905 -303887 -197197 -198220 -167595 -160459 -340029 -227153 -143726 -44119 -151112 -206556 -48696
1894 -48696 -203180 -358682 -400778 -357352 -155604 -339657 -262471 -245048 -129319 -181951 -64322
$$ packed form
1969a40254j25171n5672J81959J30067j04052O7696j47363l6292j19903J80788
1959a68197M3546o9246q122o7740P6737J06244K5287L7518j09230j53164J79216
1948a07151j38994l8031J23496m9474K1646J25205J2327j57781k12265K18720
1938b02302M3565K49879J45309q7158j6263r710j10213l5776N012n8680j2268
1927h8605J45091n319m1542k41998L2349q2277L2896R9894k0268r5823N4607n3396
1915b64391J14291j41589l9219L05208k00827J20106J36645l3086l06561N536
1905c03887J06690j023L0625P136j79570J12876Q3427R9607j06993n5444J57860
1894d8696j54484j55502m2096M3426K01748j84053P7186J7423J15729n2632J17629
$$ plain form
1883 -64322 -100964 -129051 -7335 -26446 -27846 -114593 -150816 -328923 -289212 16119 -64214
1872 -64214 -93324 -70867 48037 3690 -47016 -97469 -284395 -170052 91455 132294 203134
1861 203134 216864 239278 69254 13998 17477 -130310 -238915 -15798 134711 196452 -115186
1850 -115186 -173202 -39384 -306626 -418296 -325753 -203384 -348636 -257195 -298213 -227322 -227196
1839 -227196 -111612 -57598 77280 -33331 -66286 -79129 51487 104494 113332 -100846 -123153
1828 -123153 -179221 -54290 -125808 -48425 -48141 8757 30725 -63527 -2741 -145645 71551
1817 71551 13803 78064 -84271 -96580 318213 -51443 109830 190430 -90899 -90666 -140633
1806 -140633 -51284 -103348 -146904 19633 57242 36267 -26946 -212608 -194336 -152967 -139344
$$ packed form
1883f4322l6642k8087J21716j9111j400q6747l6223j78107L9711L05331q0333
1872f4214k9110K2457J18904m4347n0706n0453j86926J14343K61507M0839P0840
1861B03134J3730K2414j70024n5256L479j47787j08605K23117J50509O1741l11638
1850a15186n8016J33818k67242j11670R2543J22369j45252R1441m1018P0891J26
1839b27196J15584N4014J34878j10611l2955j2843J30616N3007Q838k14178k2307
1828a23153n6068J24931p1518P7383K84N6898K1968r4252O0786j42904K17196
1817G1551n7748O4261j62335j2309M14793l69656J61273Q0600k81329K33m9967
1806a40633Q9349n2064m3556J66537L7609k0975o3213j85662J8272M1369J3623
$$ plain form
1795 -139344 -277129 -182300 -126091 -199661 -331065 -321158 -63031 -70967 -78360 20211 -55430 -16472
1783 -16472 -109597 -282192 -239439 -51424 -56491 41087 62324 12474 58974 -95432 -250913
1772 -250913 -148727 -66373 -15514 -85118 -46567 -171951 -153115 -332971 -216568 -175630 -331897
1761 -331897 -206292 -39599 -62607 -99990 -119169 -16885 174727 65463 92406 -37021
1751 -37021 -138689 -158648 109531 23210 41211 -19142 -210416 -317322 -266168 -168447 24720
1740 24720 -41386 -223946 -205677 -132368 29852 10677 -1272 -14588 -40209 -24357 237877
1729 237877 67593 -57921 85004 70079 -46377 -136873 -171456 -207774 -36890 -26382 46130
1718 46130 263486 15980 -258098 -233053 -187810 -171170 -56720 -170355 -84193 -181279 -139080
$$ packed form
1795a39344j37785R4829N6209p3570j31404R907K58127p936p393R8571p5641L8958
1783a6472r3125j72595M2753J88015n067R7578K1237m9850M6500j54406j55481
1772b50913J02186Q2354N0859o9604L8551j25384J8836j79856J16403M0938j56267
1761c31897J25605J66693k3008l7383j9179J02284J91612j09264K6943j29427
1751c7021j01668j9959K68179q6321J8001o0353j91274j06906N1154R7721J93167
1740B4720o6106j82560J8269P3309J62220j9175j1949j3316k5621J5852K62234
1729B37877j70284j25514J42925j4925j16456r0496l4583l6318J70884J0508P2512
1718D6130K17356k47506k74078K5045M5243J6640J14450j13635Q6162r7086M2199
$$ plain form
1707 -139080 9503 9004 76801 -3547 25203 -37164 15717 -63103 37734 147169 -16492
1696 -16492 -468538 -270642 -50086 -73724 59245 -34605 -165983 -208538 -113250 95219 -81792
1685 -81792 32317 -34003 -55781 41912 -28110 -281849 -95171 116808 -47736 -129446 -469796
1674 -469796 -431919 -451090 -375359 -112905 -374903 -303014 -61070 31768 -11896 -77727 4226
1663 4226 -46525 -63374 5564 144313 130800 217514 65552 -13338 124665 44282 -48392
1652 -48392 -76762 -149516 -172501 -227945 20526 -70716 -184864 -202035 11401 11585 -103905
1641 -103905 -17344 117194 -80363 -200846 -32229 90715 -30259 -27656 25645 -24145 -17424
1630 -17424 -66881 -219057 -168653 156992 17383 -144488 -54860 -72103 -34535 22777 140360
$$ packed form
1707a39080J48583m99O7797q0348K8750o2367N2881p8820J00837J09435j63661
1696a6492m52046J97896K20556k3638J32969r3850j31378m2555R5288K08469j77011
1685h1792J14109o6320k1778R7693p0022k53739J86678K11979j64544q1710l40350
1674d69796L7877j9171P5731K62454k61998P1889K41944R2838m3664o5831Q1953
1663D226n0751j6849O8938J38749j3513Q6714j51962p8890J38003q0383r2674
1652d8392k8370p2754k2985n5444K48471r1242j14148j7171K13436J84j15490
1641a03905Q6561J34538j97557j20483J68617J22944j20974K603N3301m9790O721
1630a7424m9457j52176N0404L25645j39609j61871Q9628j7243L7568N7312J17583
$$ plain form
1619 140360 75841 8582 -149612 -168702 -204010 -275019 -153949 37346 -24666 -25114 -77440
1608 -77440 -145092 92931 97588 -116970 -77453 41796 82668 47561 -62637 -87400 -151532
1597 -151532 -161940 -21213 -57098 -89185 51936 -86060 48765 -97671 -53998 -7867 -51931
1586 -51931 -187857 -56305 -193776 -80358 48898 -121997 -92449 -244432 -355150 -249856
1576 -249856 -257616 -50939 93263 -226214 -328876 -165742 -43824 15849 64764 -202178
1566 -202178 -263612 -363194 -99528 8999 -109600 -236260 -229347 -238641 -185042 -252382 -303809
1555 -303809 -80043 -144736 -45103 115898 -79980 -99763 -18385 173466 183855 114148 13666
1544 13666 52476 62097 -15388 -44274 -264063 -133538 -54059 -91249 11896 107855 95351
$$ packed form
1619A40360o4519o7259j58194j9090l5308p1009J21070J91295o2012m48n2326
1608g7440o7652K38023M657k14558L9517J19249M0872l5107j10198k4763o4132
1597a51532j0408J40727l5885l2087J41121j37996J34825j46436M3673M6131m4064
1586e1931j35926J31552j37471J13418J29256j70895K9548j51983j10718J05294
1576b49856p760K06677J44202l19477j02662J63134J21918N9673M8915k66942
1566b02178o1434r9582K63666J08527j18599j26660O913r294N3599o7340n1427
1555c03809K23766o4693R9633J61001j95878j9783Q1378J91851J0389o9707j00482
1544A3666L8810R621p7485k8886k19789J30525P9479l7190J03145R5959j2504
$$ plain form
1533 95351 28962 -46150 27827 -106527 -34564 -311 -64756 -158081 -94298 -57802 24447 -28884
1521 -28884 135199 -7038 -48694 -194896 -45710 188029 79262 41364 -91251 25936
$$ packed form
1533I5351o6389p5112P3977j34354P1963L4253o4445r3325O3783L6496Q2249n3331
1521b8884J64083j42237m1656j46202J49186K33739j08767l7898j32615J17187
$$ [...]
##END NTUPLES=NMR SPECTRUM
##END=
