##TITLE=1H_CA-9249-4x
 DMSO-d6
 8 sc, 
 5.3.2024
##JCAMPDX= 6.0         $$ Bruker NMR JCAMP-DX V2.0
##DATA TYPE= NMR SPECTRUM
##DATA CLASS= NTUPLES
##ORIGIN= UXNMR, Bruker Analytische Messtechnik GmbH
##OWNER= root
$$ XWIN-NMR		Version 3.5
$$ Tue Mar  5 13:59:29 2024 Russian Standard Time (UT+4h)  she@DPX200
##.OBSERVE FREQUENCY= 200.1313
##.OBSERVE NUCLEUS= ^1H
##.ACQUISITION MODE= SIMULTANEOUS
##.ACQUISITION SCHEME= undefined
##.AVERAGES= 8
##.DIGITISER RES= 18
##SPECTROMETER/DATA SYSTEM= spect
##.PULSE SEQUENCE= zg30
##.SOLVENT NAME= CDCl3
##.SHIFT REFERENCE= (INTERNAL, CDCl3, 0, 15.4064)
##AUDIT TRAIL= $$ (NUMBER, WHEN, WHO, WHERE, WHAT)
$$ ##TITLE= Audit trail, XWIN-NMR		Version 3.5
$$ ##JCAMPDX= 5.01
$$ ##ORIGIN= Bruker BioSpin GmbH
$$ ##OWNER= she
$$ F:/spectra/data/she/nmr/H-F/1/pdata/1/auditp.txt
$$ ##AUDIT TRAIL=  $$ (NUMBER, WHEN, WHO, WHERE, WHAT)
(   1,<2024-03-05 13:58:26.09 +0400>,<she>,<DPX200>,
      <created by zg, POWCHK disabled, PULCHK disabled
       configuration hash MD5:
       00 E9 B6 7A A2 85 ED C7 34 08 36 98 17 FE 4E 26
       data hash MD5: 16K
       19 8F 7E 7F 69 E1 33 C6 75 EC AD C6 35 F2 86 EC>)
(   2,<2024-03-05 13:58:28.20 +0400>,<she>,<DPX200>,
      <Start of raw data processing
       efp BC_mod = 2 LB = 0.24 FT_mod = 6 PKNL = 1 PHC0 = -24944.76 PHC1 = 12.65264 SI = 16K 
       data hash MD5: 16K
       6E EB 57 4A 05 BF 53 F6 98 10 AA E9 B1 66 51 E3>)
(   3,<2024-03-05 13:58:42.70 +0400>,<she>,<DPX200>,
      <pk PHC0 = -0.5506715 PHC1 = -5 
       data hash MD5: 16K
       45 AA CB E5 2E F9 F4 9D B8 98 EF A1 A2 DB 1A 16>)
(   4,<2024-03-05 13:58:45.98 +0400>,<she>,<DPX200>,
      <abs ABSG = 5 
       data hash MD5: 16K
       EF 65 9F 9A 11 FE 57 6D 71 AE 21 50 A5 95 B0 41>)
$$ ##END=
$$ 
$$ hash MD5
$$ A2 65 DC E1 F5 6A 88 92 BC A2 F1 40 0E F5 DF 82
##$RELAX= 
##$RELAX= 
##$RELAX= 
##$RELAX= 
##$RELAX= 
##$RELAX= 
$$ Bruker specific parameters
$$ --------------------------
##$DU= <F:/spectra>
##$EXPNO= 1
##$NAME= <H-F>
##$PROCNO= 1
##$TYPE= <nmr>
##$USER= <she>
##$AMP= (0..31)
100 100 100 100 100 100 100 100 100 100 100 100 100 100 100 100 100 100 
100 100 100 100 100 100 100 100 100 100 100 100 100 100 
##$AQSEQ= 0
##$AQ_mod= 1
##$AUNM= <au_zg>
##$AUTOPOS= <>
##$BF1= 200.13
##$BF2= 200.13
##$BF3= 200.13
##$BF4= 200.13
##$BF5= 200.13
##$BF6= 200.13
##$BF7= 200.13
##$BF8= 200.13
##$BYTORDA= 1
##$CFDGTYP= 0
##$CFRGTYP= 5
##$CHEMSTR= <none>
##$CNST= (0..31)
1 1 145 1 1 1 1 1 1 1 1 1 1 1 1 1 1 1 1 1 1 1 1 1 1 1 1 1 1 1 1 1 
##$CPDPRG= <>
##$CPDPRG1= <>
##$CPDPRG2= <>
##$CPDPRG3= <>
##$CPDPRG4= <mlev>
##$CPDPRG5= <mlev>
##$CPDPRG6= <mlev>
##$CPDPRG7= <mlev>
##$CPDPRG8= <mlev>
##$CPDPRGB= <>
##$CPDPRGT= <>
##$D= (0..31)
0 1.2 0 0 0 0 0 0 0 0.06 0 0.03 0 0 0 0 0.0002 0 0 0 0 0 0 0 0 0 0 0 0 
0 0 0 
##$DATE= 1709632705
##$DBL= (0..7)
120 120 120 120 120 120 120 120 
##$DBP= (0..7)
150 150 150 150 150 150 150 150 
##$DBP07= 0
##$DBPNAM0= <>
##$DBPNAM1= <>
##$DBPNAM2= <>
##$DBPNAM3= <>
##$DBPNAM4= <>
$$ [...]
##$SUBNAM3= <"">
##$SUBNAM4= <"">
##$SUBNAM5= <"">
##$SUBNAM6= <"">
##$SUBNAM7= <"">
##$SUBNAM8= <"">
##$SUBNAM9= <"">
##$SW= 18.0517328524113
##$SWIBOX= (0..15)
0 0 2 0 0 0 0 0 0 0 0 0 0 0 0 0 
##$SW_h= 3612.71676300578
##$TD= 16384
##$TD0= 1
##$TE= 0
##$TE2= 300
##$TE3= 300
##$TEG= 300
##$TL= (0..7)
0 120 120 120 120 120 120 120 
##$TP= (0..7)
150 150 150 150 150 150 150 150 
##$TP07= 0
##$TPNAME0= <>
##$TPNAME1= <>
##$TPNAME2= <>
##$TPNAME3= <>
##$TPNAME4= <>
##$TPNAME5= <>
##$TPNAME6= <>
##$TPNAME7= <>
##$TPOAL= (0..7)
0.5 0.5 0.5 0.5 0.5 0.5 0.5 0.5 
##$TPOFFS= (0..7)
0 0 0 0 0 0 0 0 
##$TUNHIN= 0
##$TUNHOUT= 0
##$TUNXOUT= 0
##$USERA1= <user>
##$USERA2= <user>
##$USERA3= <user>
##$USERA4= <user>
##$USERA5= <user>
##$V9= 5
##$VALIST= <valist>
##$VCLIST= <CCCCCCCCCCCCCCC>
##$VD= 0
##$VDLIST= <DDDDDDDDDDDDDDD>
##$VPLIST= <PPPPPPPPPPPPPPP>
##$VTLIST= <TTTTTTTTTTTTTTT>
##$WBST= 1024
##$WBSW= 4
##$XGAIN= (0..3)
0 0 0 0 
##$XL= 0
##$YL= 0
##$YMAX_a= 159623
##$YMIN_a= -182892
##$ZGOPTNS= <>
##$ZL1= 120
##$ZL2= 120
##$ZL3= 120
##$ZL4= 120
##$ABSF1= 15.40643
##$ABSF2= -2.645417
##$ABSG= 5
##$ABSL= 3
##$ALPHA= 0
##$AQORDER= 0
##$ASSFAC= 0
##$ASSFACI= 0
##$ASSFACX= 0
##$ASSWID= 0
##$AUNMP= <proc_1d>
##$AZFE= 0.1
##$AZFW= 0.1
##$BCFW= 0
##$BC_mod= 2
##$BYTORDP= 0
##$COROFFS= 0
##$CY= -3
##$DATMOD= 1
##$DC= 0
##$DFILT= <>
##$DTYPP= 0
##$F1P= 0
##$F2P= 0
##$FCOR= 1
##$FTSIZE= 16384
##$FT_mod= 6
##$GAMMA= 0
##$GB= 0
##$INTBC= 1
##$INTSCL= 3.70164e-10
##$ISEN= 128
##$LB= 0.24
##$LEV0= 0
##$LPBIN= 0
##$MAXI= 10000
##$MC2= 0
##$MEAN= 0
##$ME_mod= 0
##$MI= 1.114404
##$NCOEF= 0
##$NC_proc= -7
##$NLEV= 6
##$NOISF1= 3.799351
##$NOISF2= 2.8
##$NSP= 0
##$NTH_PI= 0
##$NZP= 0
##$OFFSET= 15.40643
##$PC= 1
##$PHC0= -24945.31
##$PHC1= 7.65264
##$PH_mod= 1
##$PKNL= yes
##$PPARMOD= 0
##$PSCAL= 0
##$PSIGN= 0
##$REVERSE= no
##$SF= 200.130023068741
##$SI= 16384
##$SIGF1= 3
##$SIGF2= 2
##$SINO= 5.538805
##$SIOLD= 16384
##$SREGLST= <1H.CDCl3>
##$SSB= 0
##$STSI= 16384
##$STSR= 0
##$SW_p= 3612.71676300578
##$SYMM= 0
##$S_DEV= 0
##$TDeff= 16384
##$TDoff= 0
##$TI= <>
##$TILT= no
##$TM1= 0
##$TM2= 0
##$TOPLEV= 0
##$USERP1= <user>
##$USERP2= <user>
##$USERP3= <user>
##$USERP4= <user>
##$USERP5= <user>
##$WDW= 1
##$XDIM= 16384
##$YMAX_p= 275390411
##$YMIN_p= -782360
$$ End of Bruker specific parameters
$$ ---------------------------------
##NTUPLES= NMR SPECTRUM
##VAR_NAME=  FREQUENCY,     SPECTRUM/REAL,   SPECTRUM/IMAG
##SYMBOL=    X,             R,               I
##VAR_TYPE=  INDEPENDENT,   DEPENDENT,       DEPENDENT
##VAR_FORM=  AFFN,          ASDF,            ASDF
##VAR_DIM=   16384,         16384,           16384
##UNITS=     HZ,            ARBITRARY UNITS, ARBITRARY UNITS
##FACTOR=    0.220516191357247, 1,           1
##FIRST=     3083.28924022789, 0,            0
##LAST=      -529.427522777893, 0,           0
##MIN=       -529.427522777893, -782360,     0
##MAX=       3083.28924022789, 275390411,    0
$$ Real data points
##PAGE= N=1
##DATA TABLE= (X++(R..R)), XYDATA
$$ [...]
8594A2202498j02747O0584n67004k13576k78005k54127n46353m23823l48986k07162
8584I321299k23140q03843n72978l17003l25826l43088l36293r4459m50172l00394
8574E554103j46842m92713k42273l26276K4400j52396L1389q2281j44041l09890
8564C713180l61260L5800J20225j68239k48840k15991J89450j87775j38241o0820
8554B677489K34608m6882k07906l0268k88720M1766o1285j9949j91316j52348
8544A955189J47278j64921k9767r145j53827k1170L6337l0663J54525o2720j39799
8533A681317k16671J67965j3842k50K8912j34435q9707l1109n0438j17011P8002
8522A302733J40483J26751k95750r6928K6459j54432k31068J36121j3754k94342
$$ y = [12202498, 12099751, 12160335, 11593331, 11379755, 11101750, 10847623, 10301270, 9877447, 9528461, 9321299, 9098159, 8294316, 7721338, 7404335, 7078509, 6735421, 6399128, 6304669, 5854497, 5554103, 5407261, 4914548, 4672275, 4345999, 4370399, 4218003, 4249392, 4167111, 4023070, 3713180, 3351920, 3387720, 3507945, 3339706, 3090866, 2874875, 3064325, 2876550, 2738309, 2677489, 2912097, 2865215, 2657309, 2627041, 2338321, 2380087, 2318802, 2298853, 2107537, 1955189, 2102467, 1937546, 1907779, 1898634, 1744807, 1723637, 1759974, 1729311, 1883836, 1821116, 1681317, 1464646, 1632611, 1618769, 1618519, 1647431, 1512996, 1423289, 1392180, 1341742, 1224731, 1302733, 1443216, 1569967, 1274217, 1177289, 1203748, 1049316, 818248, 954369, 940615, 646273]
8512F46273j39235J78109O7005q7903J56319k0775j31220L38822Q172j56333l10892
8501E48342K52486j29916O11k07269J41034J11813j46965P2287K88574j15162
8491H15835j99244L8174j46450M5234r5874Q3195J9222J4028k32405n9862J2268
8480B94121L6960J2496R9003n388m9003L3070j07890L8891j05155k41451N3292
8469E8946J76940L01668k2895l32653R5473k29593K27911J33394K0986l1452o2213
8458C36512p0346k77422P2006J06697j20575L7426L1129J82740j54868J08580
8448B51879J80948j64434m3903R5784j1092N7818k38136j2194j14496J69526J78120
8437C49820l09443J14575k15781l599L66587l7835l27560k01111L46408N1062
$$ y = [646273, 507038, 685147, 752152, 664249, 820568, 799793, 668573, 1007395, 1015567, 859234, 548342, 800828, 670912, 671523, 464254, 605288, 717101, 570136, 642423, 930997, 815835, 616591, 654765, 508315, 553549, 457675, 540870, 560092, 574120, 341715, 281853, 294121, 331081, 343577, 442580, 437192, 388189, 421259, 313369, 352260, 247105, 5654, 58946, 235886, 537554, 514659, 182006, 277479, 47886, 275797, 409191, 430177, 398725, 336512, 266166, -11256, 60750, 167447, 46872, 84298, 115427, 298167, 143299, 251879, 432827, 268393, 224490, 320274, 309182, 367000, 128864, 116670, 2174, 171700, 349820, 40377, 154952, -60829, -64428, 302159, 264324, -63236, -264347, 82061, 133123]
8427A33123o5463j38634p545N7280l6768K99477k39708j29658k67923L82075K3438
8416I694l07822J602K26430j0438K39004k80268K07483J80894q229j44277k24262
8405a10189J11341J13937l3836k22197m3686J85850L6566M626j36017r371K85078
8394A82102k07226j36716J03451j79812j74767J45039M1967K01011k8281O411
8384d6821k19251J54235J45635q0947K49270L0642J03765q7679k85324J49933
8374A13458R6663j8708N0660k85617L2742K53331j24437K2249j93937j40600Q9920
8363a04276P5332J3938l21596J2754M6625K40719J3973j14379J17900N7077j77616
8352a39549N286j08408K20424j63137J33247J34155M7682P9455l24421m9418n8767
$$ y = [133123, 67660, -70974, -78519, -21239, -58007, 241470, 1762, -127896, -395819, -13744, 9694, -298128, -296526, -70096, -80534, 158470, -121798, 85685, 266579, 258350, 114073, -110189, 1152, 115089, 81253, -140944, -184630, 1220, 37786, 42412, -93605, -102976, 182102, -25124, -161840, -58389, -238201, -412968, -267929, -225962, -24951, -53232, -46821, -266072, -111837, 33798, -47149, 202121, 232763, 336528, 248849, -36475, 113458, 210121, 191413, 242073, -43544, -10802, 242529, 118092, 140341, -53596, -194196, -104276, -28944, -15006, -336602, -323848, -277223, -36504, -22531, -136910, -19010, 38067, -139549, -134263, -242671, -22247, -185384, -52137, 82018, 129700, 209155, -115266, -164684, -223451]
8341b23451l4695L6325J01076j883o9380J93481J7165j33260j33667j3281K32475
8330b9095j13326Q9111J273M4808n8686l1220N9798K41761o1540j78275j15457
8319a50848J96687j66609Q020Q8106K36492m19026K6883o4259n3530q2887K77473
8308a03498K14821k3867k66966m5301J09936N4069J43598l03523K99478j35699
8298e6952J77445j8553j80692l1609J99260L00520k82550j80214j85721J43146
8288a15920J10279p0321K05476J16357J9237l77610p0950J27881O535m0644n122
8277i4802k50912L8248j2987K58456Q6921j92538j04635K39593Q7974O7907m96082
8266c72857k19160K35742K08548j11624j52841O0187L26144K77120j91576l22573
$$ y = [-223451, -258146, -221821, -120745, -122628, -192008, 1473, 18638, -114622, -248289, -261570, -29095, -142421, -53310, -52037, -7229, -65915, -97135, -37337, 204424, 142884, -35391, -150848, 45839, -120770, -112750, -24644, 211848, -207178, -180295, -244554, -298084, -380971, -103498, 111323, 87456, -179510, -224811, -114875, -60806, 82792, -220731, 78747, -56952, 120493, 101940, -78752, -110361, 88899, 389419, 106869, -73345, -259066, -115920, -5641, -75962, 129514, 245871, 265108, -112502, -183452, -55571, -49036, -89680, -94802, -345714, -307466, -320453, -61997, 24924, -167614, -272249, -32656, 55318, 123225, -372857, -592017, -356275, -147727, -259351, -412192, -352005, -25861, 251259, 59683, -262890]
8256b62890m8509K75720O6288j6490r1749j74539m4760N1693n6780R7802K29658
8245B5444Q8729j34267K60461j93615j51412j30660j91400p2085K47112J67993
8235h3700r2545j24184J99267j04108q9748K37743J17235p0128k8245J27756N4345
8224A43688p1666n0089n88L1805J9928k26854r9894k65968J41193K63403j82187
8213b97229J3897J82563j2064L7462k81930p9099K82844K1402O3760P0145J12468
8202A14219q0389k9031J24817K38550M9881J1912j38046J33536j27578M35174
8192G33045l60827j112791K24475o5379R7569n5760N7870J88359L6040r1968K17400
8181a31967j11908n5295L0966K31290k9639q6298P0317L5579K37984j34940l7952
$$ y = [-262890, -311399, -35679, 30609, 14119, -77630, -252169, -296929, -245236, -302016, -204214, 25444, 114173, -20094, 240367, 46752, -104660, -235320, -426720, -498805, -251693, -83700, -176245, -300429, -101162, -205270, -295018, -57275, 59960, -10168, -38413, 89343, 143688, 72022, 21933, 21345, 53150, 73078, -153776, -253670, -519638, -378445, -115042, -297229, -283332, -100769, -112833, -75371, -357301, -436400, -153556, -132154, -68394, 1751, 114219, 33830, 4799, 129616, 368166, 418047, 429959, 291913, 425449, 297871, 733045, 372218, -740573, -516098, -581477, -483908, -539668, -481798, -293439, -257399, -349367, -131967, -243875, -299170, -268204, -36914, -66553, -152851, -82534, -46955, 191029, 56089, 18137]
8170A8137j15435j68111k6039J34687J10699K09706M5812j37209m19131n4590
8160d01474J50382k4456j81696r1394K35866K6145J6969N9146M2837L9609n6290
8149a84356R846L0261Q0613N1627J59758J51362k49074j41340p0212j84123j37679
8138d83317J66419M1212J3170P747K12560l7861o90j66076P7979o7057l1356L68118
8126A00848j46878m114k67956k83394K17229L93975K2957r9506j08818j02873
8116b78530P2341L8096n51J16277p872r3422o7157K06255j16908k0023r7248q4652
8104c33394J69092J21925M2605j87245J80210J22653j37643j46448J14470Q8083
8094C4308k12196n1734K04140O7714j86647L24773r3071l01252j81619L066J61122
$$ y = [18137, -97298, -265409, -291448, -156761, -46062, 163644, 209456, 72247, -346884, -401474, -251092, -275548, -457244, -548638, -312772, -286627, -269658, -210512, -167675, -128066, -184356, -174510, -144249, -63636, -12009, 147749, 299111, 50037, -91303, -161515, -345638, -483317, -316898, -275686, -262516, -254769, -42209, -80070, -80760, -246836, -168857, -235914, -267270, 100848, -46030, -50144, -318100, -601494, -384265, 9710, 32667, -66839, -175657, -278530, -206189, -168093, -168644, -52367, -60239, -153661, -220818, -14563, -131471, -151494, -248742, -333394, -164302, -42377, 228, -187017, -6807, 115846, -21797, -168245, -53775, 34308, -177888, -229622, -25482, 42232, -144415, 180358, 87287, -213965, -395584, -392518, -231396]
8083b31396N6956J2794n6007J4684J69433l86829l826P5070K5045J61877L6691
8072a25508o622q1470J9205K08219l2311k23563k7385l81K12312m4513r1840j50738
8060c44595j2228m5069k2478J02237K77858j38285j10412K10966M0323j38865
8050a80548J12810L7459k11941J7291J04667J19057j50983K19865J166l31822
8040b62979J61727K94741j06842j54652J37106j01386Q1648j7770j06792m21896
8030d97095k85265M07005M73764l10023J1029K14516n4573n4065K05864p2799
8020C8358k32386p1787K37365p8315j75109N7157R3244J09801j1272j07536j39151
8009b79631j0395k35541K06443L3626M4711K80389J28965l59721p7687K39621
$$ y = [-231396, -174440, -161646, -217653, -202969, -33536, -420365, -424191, -349121, -324076, -162199, -125508, -132130, -213600, -194395, 13824, -18487, -242050, -269435, -269816, -57504, -102017, -193857, -344595, -356823, -401892, -424370, -322133, -44275, -182560, -292972, -82006, -41683, -180548, -67738, -30279, -242220, -224929, -120262, -1205, -152188, 67677, 68843, -262979, -101252, 193489, 86647, -68005, 69101, -32285, 49363, 31593, -75199, -497095, -782360, -375355, 98409, -211614, -200585, 13931, -40642, -94707, 111157, 38358, -194028, -265815, -28450, -106765, -281874, -224717, -131473, -21672, -32944, -140480, -279631, -290026, -525567, -319124, -285498, -240787, 39602, 168567, -191154, -268841, -29220]
7999b9220k13813k26583J03563R227j01504J13020J36270J45390N8338N1670M0188
7988H6546r7742J34170k25700l5185j05432j95244K91242j31705k6114J92250
7978a12914j66191Q0262M424J68703J86389k92169q5399M7904J7698J15527j63406
7967a99172k7993n83K13684M6388j99271j1010O7925M44826k8796k95300q7417
7956g6719K50706M6038p551M0377L2489j84973j96303J80282P775l91322J16704
7945a82497O2920j44825p5277K4003J49526L8599Q2877J0167K15247k59595m4032
7934a22887J84313O2489J46336k4645j32579j00951l5672O3217k00997J788K11635
7923E2047l23864q7180R6192K79932K40317J29850L2862K4349j7221M6297k64617
$$ y = [-29220, -243033, -469616, -366053, -356826, -458330, -345310, -209040, -63650, -5312, 46358, 86546, -11196, 122974, -102726, -137911, -243343, -438587, -147345, -279050, -305164, -112914, -279105, -198843, -194419, -25716, 160673, -131496, -216895, -168991, -151293, -35766, -199172, -227165, -227748, -14064, 32324, -166947, -177957, -110032, 334794, 305998, 10698, -76719, 173987, 220025, 212474, 252851, 285340, 100367, -95936, 84346, 92121, -299201, -182497, -119577, -264402, -339679, -315676, -166150, -127551, -44674, -34507, 180740, -78855, -122887, 61426, 123915, 270251, 245606, 113027, 12076, -23596, 39621, -161376, -159588, 52047, -271817, -358997, -262805, 17127, 257444, 387294, 420156, 444505, 427284, 473581, 208964]
7912B08964j83179j1462J89165O0220j41494Q7097J4024K17248J15468j78108
7902C77943j76146L95094K86595K40364l3945j07907J59660k7174K865Q3706J68615
7891A369670n5086k04692J49492k6857J19904Q7446k1378m6039n5048P8573p342
7880A388643k90584K2341k86679m6489r3798k26618q034k45909Q4139J10042M7275
7869D54329M9075j48049j04819M9489R5695l26918k7631J8561K6084r3698q4915
7858i2797O6286j05040J26458n0423J13111k8562n6392J9022J59943l2705n7132
7847F1769j90450O5621P5280K16j94027K83604j15308k76854K28396O6458k13411
7836b08706N0092J39494q505k92915q7163l3168l6461K87347J47870m0385l7956
$$ y = [208964, 25785, 14323, 203488, 263708, 122214, 209311, 223335, 440583, 556051, 377943, 201797, 596891, 883486, 1123850, 1089905, 981998, 1141658, 1114484, 1117349, 1201055, 1369670, 1314584, 1109892, 1259384, 1232527, 1352431, 1439877, 1418499, 1372460, 1317412, 1395985, 1388643, 1098059, 1120400, 833721, 787232, 693434, 466816, 458782, 212873, 297012, 407054, 454329, 503404, 355355, 250536, 300025, 395720, 68802, 41171, 59732, 85816, -7882, -92797, -26511, -131551, -5093, -55516, 57595, 29033, -27359, -8337, 151606, 118901, 61769, -128681, -63060, 12220, 12436, -181591, 102013, -13295, -290149, -61753, 4705, -208706, -158614, -19120, -27625, -320540, -407703, -440871, -477332, -189985, -42115, -82500, -120456]
7825a20456j9905l7461o3685L28559o8653l1587L6244O3660J56378m2939q1374
7814A18781j2395R1569m3182j04543J19864r5924q4666j2897J24997K23564p28
7803C24440M53577p16561j49315k7560k21961p662K83864j27370O0841O9791R75
7792e6941j17448j35627l574J46209O5349J08600l94677j3302L02870j95043M7055
7781b46529J20214R7724P8810j09691J5497J35976j24552j54366O5814K55654
7771A34551j37019m0747J09258j16981M586J59095k00438m2933j69786j39801
7761d40215J46760J18708j57031k8576l4318J67221K07412J47379k46862O1837
7751e7685J57661N582L03873j99149j70779P5890O3179j37898l0440J785P5445
$$ y = [-120456, -140361, -177822, -241507, 87052, 18399, -13188, 23056, 86716, 243094, 200155, 118781, 106386, 197955, 154773, 50230, 170094, 74170, -10496, -23393, 101604, 325168, 324440, 778017, 61456, -87859, -115419, -337380, -345042, -61178, -188548, -127707, -57916, -56941, -174389, -310016, -313590, -167381, -102032, 6568, -388109, -401411, -98541, -293584, -246529, -126315, -28591, 50219, -59472, -43975, 92001, -32551, -186917, -121103, 134551, -2468, -43215, 66043, -50938, -46352, 112743, -87695, -130628, -300414, -440215, -293455, -174747, -331778, -360354, -394672, -227451, -20039, 127340, -119522, -57685, 99976, 105558, 409431, 210282, 39503, 115393, 178572, 40674, 10234, 12019, 87464]
7740H7464J47205k08728m29624R6359L82674j82439q187m5917J94758k01115j83940
7729c51490m7272R1679J81600N5320j91962J35198J44505m7823j23510P0543J08537
7718B5325J09989N8058j84740k4351n2707K58992R4180j30270J92127l5462k60700
7707E0441r7607k09648P4394J6278N2756q3628R3085J35059j07164J94864j9920
7696I8910l6843q4693J30011k7614J06352K6202J58704l5273l03562J39084J43277
7685C14555L3047j81925m0203l8149j58264J23931j39196l4147Q9225J27008L2016
7674A27898j16349r1922r1453J64920P1556q5765q979J22114j11719M8248l6017
7663g468J80361k38513J57088K01147q7482j18802J75018J25961j17593k26956
$$ y = [87464, 234669, 25941, -403683, -307324, 75350, -107089, -115276, -161193, 33565, -167550, -351490, -398762, -307083, -125483, -70163, -262125, -126927, 17578, -30245, -153755, -83212, 25325, 135314, 193372, 8632, -15719, -68426, 190566, 284746, 154476, 346603, 311141, 50441, -47166, -256814, -182420, -166142, -113386, -197014, -103929, 31130, -76034, 118830, 98910, 62067, -22626, 107385, 79771, 186123, 212325, 371029, 335756, 32194, 171278, 314555, 347602, 165677, 125474, 87325, -70939, 52992, -86204, -120351, -31126, 95882, 127898, 11549, -80373, -171826, -6906, 64650, -21115, -30094, 92020, -19699, 28549, -7468, 172893, -65620, 91468, 292615, 205133, 86331, 261349, 387310, 269717, 42761]
7653D2761p8620K5636J50449q4507N1682j71710J4868J97821j37995k02940m4073
7642b36628R3741J73861O0885K72399K13967k47569k82456O2789J93986q1556
7632B23419K90304J92312k44360j81946j0178o3017P0662j22808J06972J01105
7622C62465o1008Q8211J83208k05188j71052O0685n1285j51134k27079J05269
7612f6908Q6045L45338k08257o0786N4722j24705K0686p8417O0995J75992Q6127
7601B90832l55073j77255J08338J77560J31612j45801j97956K99058k1112k35200
7591a24997N4685o8136K55317l8553j50022L4766J15155M1547j47564k86822j02996
7580d17620L28320L17817j46072k98347J43723j17020J15690Q3467p0827J34290
$$ y = [42761, -35859, -10223, 140226, 55719, 107401, -64309, -49441, 148380, 10385, -192555, -236628, -142887, 30974, 91859, 364258, 578225, 330656, 48200, 110989, 304975, 223419, 513723, 706035, 461675, 279729, 269551, 206534, 277196, 154388, 261360, 362465, 301457, 389668, 572876, 367688, 196636, 257321, 206036, 54902, -172177, -66908, 19137, 364475, 156218, 95432, 150154, 25449, 46135, -32282, 28713, 204705, 290832, -64241, -241496, -133158, 44402, 176014, 30213, -167743, 131315, 110203, -124997, -70312, -138448, 116869, 78316, -71706, -36940, 78215, 119762, -27802, -314624, -417620, -89300, 228517, 82445, -215902, -72179, -189199, -73509, 9958, -60869, 73421]
7570G3421j84906j7015J03323K2747K72518j02323N6741p428j42933j087O3795
7559A36853m7824J5027L2493o7099j30018L6070n6933J94228r2550J11555j67024
7548c5222J10951J58691K45193M4567j88205n4424J03305o5366L9966J00105O9359
7537E28920l41550M0500N8778R1114j87439j5635n4373k24863K08061p7581J55436
7526A81368r3150j88304j86112L71481l9580j31945J60574p4604p3257J91430
7516A17901j83537J06095k16727k67893J86266M03644j2624J07056L0009j89816
7506H0374L8546P222M1496J03626J61188p9608J17637J92844j97837k74737n5204
7495A35547J15223k6891P552j23431O6715j33904L00681K4768L8148j41382K35590
$$ y = [73421, -111485, -128500, -25177, -2430, 270088, 167765, 224506, 217078, 74145, 73058, 136853, 89029, 104056, 136549, 69450, -60568, -24498, -81431, 112797, 20247, 131802, -35222, 75729, 234420, 479613, 524180, 335975, 281551, 384856, 319490, 359456, 459561, 528920, 187370, 227870, 286648, 377762, 190323, 174688, 120315, -104548, 103513, 25932, 181368, 88218, -100086, -286198, 85283, 45703, -86242, 74332, -272, -73529, 117901, -65636, 40459, -176268, -444161, -257895, 145749, 133125, 240181, 270190, 80374, 118920, 126142, 167638, 271264, 432452, 352844, 470481, 663325, 465488, 190751, 135547, 250770, 223879, 231431, 108000, 174715, 40811, 341492, 366260, 404408, 263026, 498616]
7484D98616M5093J09763j64238l3329j1285N116j1439j58361K48183k35601K34955
7473E27473l15172j42424J13416j49122p3134J53605l2173Q6944k28033j38516
7463a97136K27823L0546j12039m8193m5382J84689J42650o8522k02692J54873
7453F6617K52748R1704O3205n3920o5693k00821k0236m4075Q5290j35086O0246
7442I9979Q208J86831K51033l09677j66809K46441P5248j92761l8359k55433J36868
7431D1569J28769r31P2227j2900O9879J02023p653l8078m9414j20100l8995k2987
7419A23409j74017J5859J07248j21230p4693n4296m3040O0900J16184J56857J13307
7408B26488m6801j04652n5831J53698J83760k00018j21388j76063l3230K57899
$$ y = [498616, 543709, 653472, 489234, 455905, 444620, 449736, 438297, 279936, 528119, 292518, 527473, 212301, 69877, 183293, 34171, -38963, 114642, 82469, 169413, -58620, -197136, 30687, 61233, -50806, -98999, -144381, 40308, 182958, 114436, -88256, 66617, 319365, 411069, 474274, 420354, 354661, 153840, 133604, 89529, 174819, 39733, 99979, 108187, 295018, 546051, 236374, 69565, 316006, 391254, 198493, 160134, -95299, 41569, 170338, 169407, 241634, 228734, 298613, 400636, 392983, 354905, 305491, 185391, 146396, 123409, -50608, -34749, 72499, -48731, -123424, -177720, -220760, -159860, -43676, 113181, 226488, 179687, 75035, 19204, 172902, 356662, 156644, 35256, -140807, -174037, 83862]
7398H3862q2226o2489n230r5990o6023J00037j92915K72613J99779l01415N217
7387a44780j20995J25362N8308l9206J27855J11090j48393J53975R1231l62423
7377a47976J29861J29811P0460n491J26640k0635k40875J8799q265J68610k03968
7366A6971j80649J23316n5313J10789k60346P3426L01359J04532n0590k38362
7356e4867o061Q5365n5220j41966L901k1102J3357K95083P5717j57199L8002N4016
7344A29026J24405o1724j87692j67596J26218K30689P3325k54266L3736L89985
7334D36106j21025j13540k11703k86327K64661L0785j26801N1747J74090R4194
7324A92187j57350O0547J48380l6122q2961N8158j09131L3978K9470j33307p7689
$$ y = [83862, 1636, -60853, -66083, -162073, -228096, -128059, -320974, -48361, 151418, -149997, -144780, -265775, -140413, -82105, -121311, 6544, 117634, -30759, 123216, 214447, -147976, -18115, 111696, 182156, 176665, 303305, 282670, 41795, 60594, 52329, 220939, 16971, -163678, -40362, -95675, 15114, -245232, -171806, 129553, 234085, 183495, -54867, -60928, 24437, -30783, -172749, -168848, -189950, -176593, 118490, 194207, 37008, 75010, 129026, 253431, 191707, 4015, -163581, -37363, 193326, 266651, 12385, 46121, 436106, 315081, 201541, -10162, -296489, -31828, -1043, -127844, -76097, 97993, 192187, 34837, 95384, 243764, 207642, 124681, 182839, 73708, 107686, 137156, 3849, -73840]
7313g3840o0169K00906j6837j83045J79788o1197j81991K48127J43487k49723
7303e4494r8263N0402J60510L65335k14268K34170j80444j08672J90867j47320
7293A97823k33023K28248R1028j19980J1498p375k7179l11716k9913j19958K16100
7282a04447J93108k82361J75216j48773m7218J74125Q1409j39311P4579K5409
7272A736L3419J43904k0050j12054J30259J5869Q2496L98031l90786j52892M29216
7261E59148k24609l59183P0328K5202O1967r7457K6479p0262o9461K32389J88912
7250C43453o9761r0911J4513k74282J24049K26679l19555j11265j15049K88482
7240A6353J56991K230j64801J56874N8467j80024N7310L384k26871M39337k82113
$$ y = [-73840, -134009, 66897, 50060, -132985, 46803, -14394, -196385, 51742, 195229, -54494, -152757, -102355, 58155, 423490, 209222, 443392, 262948, 154276, 345143, 197823, -35200, 193048, 284076, 164096, 175594, 168219, 141040, -170676, -200589, -320547, -104447, 88661, -193700, -18484, -167257, -214475, -40350, 41059, -98252, -23673, 1736, 35155, 179059, 159009, 46955, 177214, 193083, 275579, 673610, 282824, 129932, 559148, 334539, -24644, 45684, 70886, 132853, 35396, 61875, -8387, -77848, 154541, 343453, 273692, 182781, 197294, -76988, 47061, 273740, -45815, -157080, -272129, 16353, 173344, 175574, 10773, 167647, 226114, 46090, 103400, 106784, -120087, 319250, 37137]
7229C7137R516J64654l0235n9728K3147q4394K4264k697j40820P7620K00516o6403
7217A52577r0585J20035N8653l8970K5876P0916R8592j59645M9178n0672k14052
7206B1903m7606j85285j4602J62019P1273j95053R7987j16898j40954J70933M71846
7195B95563k261q0392J39014Q7575j75732m7425q5053J85541j06044j51305L7762
7184I7243l1142J08786j76942j82105J14140j06227J05928K20434J80626k53269
7174G7472j43778K14452J96527n3678r0206K06222j45790k1800j5707K396M4965
7163B71075k58041N2807j89269Q4842R6509O006o4924N5948N521m9726n2478q1416
7151a23146P5763m9389K80074k02975N0667R3625j51390J07472K15437M5723o0547
$$ y = [37137, 46653, 211307, 181072, 121344, 144491, 60097, 84361, 81664, -59156, 18464, 218980, 152577, 61992, 182027, 240680, 201710, 227586, 298502, 397094, 237449, 286627, 235955, 21903, -25703, -210988, -225590, -63571, 7702, -187351, -89364, -206262, -347216, -176283, 295563, 293302, 212910, 351924, 439499, 263767, 216342, 131289, 316830, 210786, 59481, 97243, 66101, 174887, -2055, -184160, -70020, -176247, -70319, 150115, 330741, 77472, -66306, 148146, 344673, 290995, 200789, 407011, 261221, 239421, 223714, 226110, 271075, 13034, 65841, -123428, -38586, 57923, 63929, -995, 54953, 60474, 10748, -41730, -123146, -47383, -96772, 183302, -19673, 30994, 124619, -26771, 80701, 296138, 341861, 281314]
7140B81314j88892j6364O1384P4257j2026L5177j03812k2153J01960j44604J81974
7129B48215J56543k14695m3700J12597K01483j70327j90654j9549l1718L66813
7119D15008k3538j75489j65629J59588L011k45689r892J69538j28944K27453j23908
7108A01509J7209L568Q3467J32690r1924j82308o9170j11970P0258R1236O1554
7097A06119j16122m9029K70687q2589J47000k76762k81176J07990J24023J17016
7087F7157j15728n5470K45571J04720j5352N6015L8580j45466o6734N7801J07578
7076B78672l9483j82930j10859L51400P749l4971J5321j54773k48161j785R6322
7065b3498J05244P0837m2030J23966p3447m0107r9564J05449J06234p5563J48616
$$ y = [281314, 92422, 76058, 137442, 211699, 199673, 234850, 131038, 108885, 210845, 66241, 248215, 404758, 190063, 146363, 258960, 460443, 290116, 99462, 79913, 48195, 415008, 391470, 215981, 50352, 209940, 212951, -32738, -42630, 126908, -2036, 225417, 101509, 118718, 122286, 205753, 338443, 246519, 64211, -4959, -116929, -46671, 44565, 106119, -10003, -59032, 211655, 129066, 276066, -696, -281872, -173882, -49859, 67157, -48571, -104041, 141530, 246250, 230898, 286913, 325493, 180027, 113293, 171094, 278672, 239189, 56259, -54600, 296800, 304549, 269578, 284899, 130126, -118035, -119820, -23498, 81746, 152583, 110553, 234519, 161072, 120965, 21401, 126850, 233084, 157521, 306137]
7054C06137j4495j392j38991j37613R2357p9613Q5799k1723l6878m532N0890p9671
7042B0275j45493Q0447J5567o2863j27604K5843J63750J9512M3268K56187J09028
7031C97917j66317k62958J80517P7837r8752m0048L0949j81427J9592m9239K04131
7020A12202J51758j24909n475l1300Q7724K05452N2807q5829j1305J14980l68058
7009I8047j30946K01803R6564j13500m632J86431j08501N3670m1616m882q9658
6998A42780J72942k6003j16390K97990p4707k46718K3011J77171n4663j57784
6988A37629K5098J75724K50767j81316k70474L0295J69242o8860k53413L8660
6978E3352j46649J9601R096J37725Q4768l06265J87187J87695j3649k4588J15590
$$ y = [306137, 291642, 290250, 151259, 13646, 106003, 26390, 112189, 90466, 53588, 49056, 99946, 20275, -125218, -44771, -29204, -92067, -219671, -193828, -30078, -10566, 32702, 288889, 397917, 231600, -31358, 149159, 226996, 128244, 88196, 119145, -62282, -42690, -91929, 112202, 263960, 139051, 133576, 102276, 190000, 395452, 448259, 362430, 351125, 466105, 98047, -32899, 168904, 265468, 151968, 147336, 333767, 225266, 278936, 237320, 232438, 142780, 315722, 289719, 173329, 471319, 396612, 149894, 172905, 350076, 295413, 137629, 162727, 338451, 589218, 407902, 137428, 167723, 336965, 268105, 14692, 53352, -93297, -73696, -64600, 73125, 157893, -148372, 38815, 226510, 212861, 188273, 303863]
6967C03863q2693K3815j999k16140O7122K1380J42360k54658N1483J06027j25994
6956C4566R8982L16999l72311j2381N3308q3141K94990j04704j59181l0401J58657
6945A95383K3301j09475J06354N7852k15767j86219J72275K21771p6093K76018
6935D65400P2492K6024k76558j45721K2822J82964K12225j29019j03747K65274
6925E92156M8535k42320m6918R1112M143k79302o8064K85885K8790n4893j07934
6914B51190k40859k2532k2129j7071m0718L30287j27292m5886K48076l57031L59674
6903C15709j26932J56026K00373j82259K1773L5104p15m664k4273K06057O278
6892F02477m5248j93968j57381j02457J92579m4695q6823N7289P4070l7227J39114
$$ y = [303863, 221170, 244985, 242986, 26846, 93968, 115348, 257708, 3050, 54533, 160560, 34566, 133548, 450547, 78236, 65855, 119163, 36022, 331012, 226308, 67127, 36726, 195383, 218684, 109209, 215563, 273415, 57648, -128571, 43704, 265475, 189382, 465400, 537892, 563916, 287358, 141637, 164459, 347423, 559648, 430629, 326882, 592156, 640691, 398371, 351453, 442565, 446708, 167406, 99342, 385227, 414017, 359124, 251190, 10331, -12201, -34330, -51401, -92119, 238168, 110876, 64990, 313066, -43965, 315709, 188777, 344803, 545176, 362917, 384690, 419794, 419079, 414415, 390142, 596199, 602477, 557229, 363261, 205880, 103423, 296002, 251307, 164484, 221773, 295843, 258616, 397730]
6881C97730L9861k33881l0468J24718j09935j96595O8945L43447p9721J6961J37132
6870D78194P9287p9676n2074J90229j65886L2561o9296q9310O0975K87384j86912
6859D85476l04851P2166j08306k24572K35883J59205q9596l1717n8866J32234
6849B67056K28465o2065p8842r1603P9859M2031l7162Q1485J86823j16002J7966
6838E18011o670J45276J8456r2885l53935l555J54512k22931r4530J63681N3376
6827B78806J71563j79619k8901J85944N3135m0194q561j64253K58902r6773j79160
6816B50889J05787N3178k07703N183K31481P9252J90349j99936k66211Q1876j15427
6805B08718j04767k1018J61626k5168J23818K57693J75002j45501j58918O8773
$$ y = [397730, 437591, 203710, 173242, 297960, 188025, -8570, 60375, 403822, 324101, 341062, 478194, 557481, 477805, 425731, 615960, 450074, 482635, 413339, 324029, 385004, 672388, 485476, 180625, 252791, 144485, -80087, 155796, 315001, 225405, 193688, 134822, 267056, 495521, 433456, 354614, 263011, 342870, 384901, 347739, 429224, 616047, 500045, 518011, 511341, 656617, 675073, 582188, 228253, 224698, 379210, 156279, 61749, 225430, 278806, 450369, 270750, 241849, 427793, 480928, 440734, 432173, 267920, 526822, 430049, 250889, 356676, 409854, 202151, 207334, 438815, 518067, 708416, 508480, 242269, 324145, 208718, 103951, 82933, 244559, 219391, 343209, 600902, 775904, 630403, 471485, 540258]
6795E40258j15836j97597K69956n462l17737J4568M6692K81501k11778O168R4192
6784D04925n5064L35716j6969k04574N0583K3450J96549J34875k7169k68551Q6324
6773F60095k51105j74898K49326l6740k7201R2452o2781j84230r631J0545r8764
6762A67068n9659J25718J5897J58940J30287R8118J1864j51500K47247J631r4498
6751F51113J84808R0493q8070k10017k82825L47318k4201k77804j78422P0928
6741B83321k07586N2154n812J71301K64879J79482j44481j37500J68076n312p9223
6730E39299L1188K44989m9960j42331n145j63424L96050R3148k39382q9620j89826
6719D24986J72306j21308j14440J030J94176J86486O8294m0421j92507K79504
$$ y = [540258, 424422, 226825, 496781, 491319, 173582, 188150, 234842, 516343, 304565, 310733, 404925, 349861, 685577, 668608, 464034, 514617, 538067, 734616, 869491, 842322, 573771, 660095, 408990, 234092, 483418, 446678, 419477, 511929, 449148, 264918, 255287, 265832, 167068, 107409, 233127, 249024, 407964, 538251, 636369, 648233, 496733, 743980, 745611, 651113, 835921, 926414, 838344, 628327, 345502, 692820, 668619, 390815, 212393, 283321, 75735, 127889, 122077, 293378, 558257, 737739, 593258, 455758, 623834, 618522, 539299, 570487, 815476, 765516, 623185, 618040, 454616, 850666, 943814, 704432, 614812, 424986, 597292, 475984, 361544, 362574, 556750, 743236, 811530, 771109, 578602, 858106]
6709H58106J59445j5880k6452J36958J05974k30348l44955N2738M2604J50243
6699H88433o7949l8872J33904j47549Q7116j0197j88421j14682J04707O0824N5465
6688G62779L2609n7565L2764l4261J70704J44702j33574j04141k2123M7605r1972
6677G47527J49540m4229l308R5602r5239j14470k8607M0562K7759j13659Q2987
6666G44465j70601m8003Q3986J57708J08285l1888m7897J90528J55383L3474o9194
6655A106246k3675J32949k8543m69611P6943O9736J09424j71807J40340P9905
6645A021907N2941Q0892l94926k11526n3853J95984J43525q6227R2228K46919
6635A087864J34279k01886J61304K54024j33608m7026k36179J19496j1258L8650
$$ y = [858106, 1017551, 1001671, 975219, 1112177, 1218151, 987803, 642848, 695586, 738190, 888433, 820484, 781612, 915516, 767967, 855083, 844886, 656465, 541783, 646490, 707314, 762779, 795388, 737823, 770587, 736326, 907030, 1051732, 918158, 814017, 791894, 839499, 747527, 897067, 852838, 849530, 945132, 849893, 735423, 706816, 747378, 775137, 661478, 744465, 573864, 525861, 609847, 767555, 875840, 843952, 796055, 986583, 1141966, 1175440, 1106246, 1082571, 1215520, 1186977, 717366, 794309, 864045, 973469, 801662, 942002, 1021907, 1074848, 1155740, 760814, 549288, 495435, 691419, 834944, 748717, 840945, 1087864, 1222143, 1020257, 1181561, 1435585, 1301977, 1254951, 1018772, 1138268, 1127010, 1165660]
6625A165660l18792l5846k0303m3089p306P6168K40921j57003j50615M8842J10915
6614I09552R4561r7795r0709r9670K12352N1057O0550J46352j22507J94549N0280
6603A308572j02581j22364K59769j848l35170J92528M058M2091j54871k155M1832
6592A129861q5222J41008n3460j64498L9189N1970l5326J9227r2127k1191N7197
6581I86628J91331K28000j15646q5044L25273J86173K4018J5805k30698L9709
6571A565549O4147j76059J02205J364q3908P7810j7008L28473k36920j40792J19799
6560A604660J04529n2756q2918P0335q5696K0782K12393K11879o9252j26781j52283
6549A654892J06557N0565o3372J80056J29622j62041K0512j68201J35638j56992
$$ y = [1165660, 846868, 811022, 790719, 747630, 740324, 816492, 1057413, 900410, 749795, 798637, 909552, 1004113, 906318, 815609, 715939, 928291, 979348, 1039898, 1186250, 1063743, 1258292, 1308572, 1205991, 1083627, 1343396, 1341548, 1006378, 1198906, 1202964, 1245055, 1090184, 1088029, 1129861, 1044639, 1185647, 1132187, 967689, 1006878, 1058848, 1023522, 1042749, 950622, 929431, 986628, 1177959, 1405959, 1290313, 1205269, 1530542, 1716715, 1740733, 1756538, 1525840, 1565549, 1629696, 1453637, 1555842, 1557206, 1473298, 1551108, 1534100, 1862573, 1625653, 1484861, 1604660, 1709189, 1656433, 1573515, 1643850, 1558154, 1578936, 1791329, 2003208, 1933956, 1807175, 1654892, 1761449, 1812014, 1748642, 1928698, 2058320, 1896279, 1916791, 1748590, 1884228, 1727236]
6539A727236J22810j21136K3001l2162R3522J32004K01629K29074j24118J66109
6529B417969P9416p0063J66048j8737l4627L3345M1805J36119m1157J03089J80701
6518B993908q5697j62075J46623Q3394j61559k6479Q2336N4629K3906J63912R4373
6507C207271p0928o0662R3950K27828J06523K58995K04134k45017M4505J79231
6497C945830L756O4862p0480J76224k2203M9592r6921M83436J17441L8468P7834
6486D767839K99704J42387o7892N6709K75421j2925L34884K18036J77898J29806
6476F321867j10361K81484J89998K21044K91434K85470L92081J94748J48724K82930
6466H499419K72120J87939M26963K98308J90333N08347L12678L80062K86593N92982
$$ y = [1727236, 1850046, 1728910, 1751911, 1719749, 1813271, 1945275, 2146904, 2375978, 2251860, 2417969, 2497385, 2427322, 2593370, 2574633, 2540006, 2573351, 2615156, 2751275, 2710118, 2813207, 2993908, 2908211, 2746136, 2892759, 2976153, 2814594, 2788115, 2870451, 2925080, 2948986, 3112898, 3207271, 3136343, 3075681, 3169631, 3397459, 3503982, 3762977, 3967111, 3722094, 3766599, 3945830, 3949586, 4014448, 3943968, 4120192, 4097989, 4147581, 4050660, 4534096, 4651537, 4690005, 4767839, 5067543, 5209930, 5142038, 5198747, 5474168, 5461243, 5796127, 6014163, 6192061, 6321867, 6211506, 6492990, 6682988, 6904032, 7195466, 7480936, 7873017, 8067765, 8216489, 8499419, 8771539, 8959478, 9386441, 9684749, 9875082, 10383429, 10696107, 11076169, 11362762, 11955744]
6456A1955744L2839M27998K37896K55675J07144J64141M11150K84039L01834K11031
6446A4389491K47805K15796R9977k1289J34186L26317j1629j60286K70237j65121
6436A5325484K8359j5079j3078M6364l23371l98488j5841j93720p6589p4506o1179
6425A4228356k02798j60268m4126j04135j9841j74217R1770j78033l7327Q0639
6415A3480020k22109j45339r2673O6454l6659M701K32995k37050o0750K32020
6405A3221610K89715K57191K66095J28508K59034P29875K65065J36557K88199
6396A5841849L30136M36193O05152L04415M04023M13034K66781K09112J84282
6387A8994977J83311J29391L57271L08924N0443L74919K84206j39173O0965R7947
$$ y = [11955744, 11988583, 12416581, 12654477, 12910152, 13017296, 13181437, 13592587, 13876626, 14178460, 14389491, 14637296, 14853092, 14953069, 14931780, 15065966, 15392283, 15380654, 15220368, 15490605, 15325484, 15353843, 15338764, 15325686, 15372050, 15048679, 14650191, 14634350, 14440630, 14364041, 14289535, 14228356, 14025558, 13865290, 13821164, 13717029, 13697188, 13522971, 13614741, 13436708, 13399381, 13480020, 13257911, 13112572, 13019899, 13086353, 13049694, 13054395, 13287390, 13050340, 12989590, 13221610, 13511325, 13768516, 14034611, 14163119, 14422153, 15152028, 15417093, 15553650, 15841849, 16171985, 16608178, 17213330, 17517745, 17921768, 18334802, 18601583, 18810695, 18994977, 19178288, 19307679, 19664950, 19973874, 20024317, 20399236, 20683442, 20544269, 20605234, 20703181]
6377B0703181L38114n8967n2808o5843j28732J1473k77413l85341k57646l95898
6367A9430120j24936n56805k94686k44991n82583m15621o13294n02672k99769
6358A5794763k15459m85108q0000n37448n33006m72109m79683j11440n08684m23757
6348A1948069m08319k90114m39939m19683k78416q7564m99257k97248k14952n7452
6338H955125l70973l00992k31355P0425r6952k07197r4341j44459l41371j44323
6328G093587k89424k40170K20060j05344N2741j65925J85577R5450l50034O6440
6318F562958n9639N5862p7369k35498J03398q9483j0463M7430k55347P5633J1642
6307F129124j94924K59659N1504n5635q2744O2249j58865J53162J10111P1975
$$ y = [20703181, 21041295, 20982328, 20929520, 20863677, 20734945, 20746418, 20469005, 20083664, 19826018, 19430120, 19305184, 18748379, 18453693, 18208702, 17626119, 17210498, 16597204, 16094532, 15794763, 15579304, 15094196, 15014196, 14476748, 13943742, 13471633, 12991950, 12880510, 12371826, 11948069, 11539750, 11249636, 10809697, 10390014, 10111598, 10024034, 9524777, 9227529, 9012577, 8955125, 8584152, 8283160, 8051805, 8122230, 8025278, 7818081, 7723740, 7579281, 7237910, 7093587, 6804163, 6563993, 6784053, 6678709, 6731450, 6565525, 6751102, 6846552, 6496518, 6562958, 6503319, 6559181, 6481812, 6246314, 6349712, 6260229, 6249766, 6297196, 6041849, 6117482, 6129124, 5934200, 6193859, 6245363, 6189728, 6106984, 6169233, 6010368, 6163530, 6273641, 6345616]
6297F345616K81359K8851j95102k36155p6052J98290J06224P7818R9476J69243
6287F799568N801L3983R5685J57454M3150O2594p4246N4187q589J26922Q2616
6276G379125K1671K24136K01241k30801J62454L03440J13864o5881p5313N2410
6266H086346l7953r7357M64508L24388Q1799J91865K2573J35852P0240J4998K26913
6255I484172N5310P1018N6305J47338K38000Q8839K47846J12958p1089J13626
6245A0544323K3222K76410L61852K36067Q2462J61525J88557M2998J52363K03253
6235A2273032M67194L17306j00515J70028K54368K18982P8925L05977K34286Q3390
6225A4302973L16389J37459P6192J34970L57427K45653l5945M27092K73293K70917
$$ y = [6345616, 6626975, 6655826, 6460724, 6224569, 6148517, 6346807, 6453031, 6530849, 6630325, 6799568, 6805369, 6839352, 6935037, 7092491, 7135641, 7198235, 7123989, 7178176, 7169587, 7296509, 7379125, 7400796, 7624932, 7826173, 7595372, 7757826, 8061266, 8175130, 8109249, 8033936, 8086346, 8048393, 7951036, 8415544, 8739932, 8821731, 9013596, 9036169, 9172021, 9242261, 9257259, 9484172, 9539482, 9610500, 9666805, 9814143, 10052143, 10140982, 10388828, 10501786, 10430697, 10544323, 10567545, 10843955, 11205807, 11441874, 11524336, 11685861, 11874418, 11917416, 12069779, 12273032, 12740226, 13057532, 12957017, 13127045, 13381413, 13600395, 13679320, 13985297, 14219583, 14302973, 14619362, 14756821, 14833013, 14967983, 15325410, 15571063, 15535118, 15962210, 16235503, 16506420]
6215A6506420N53757J94241J49156L60063K76407J65149M48627K30235L91813
6206A9275868L84851M56842K71175M62284M35749K97038K51970O38576L09356
6197B2783709L80461O56228O65816N68569N64572K01141O27856O12269O17783
6188B7678404P39294O38296O25455O49112P00692R36882O42988O75139O54528
6179C3940790M46183O16212P27263O60260R95475O71492M80627J057100J114132
6170D0709534P08547P97396P60970P69310P35889P19712O11390P59620O57821
6161D7230189P36038M54835M76680Q40444P04991M82284N10974Q28583Q42480
6152E3107498R91983O20242L71327O49023J84468r762J22427J1015j09594j22462
$$ y = [16506420, 17060177, 17254418, 17403574, 17763637, 18040044, 18205193, 18653820, 18884055, 19275868, 19660719, 20117561, 20388736, 20851020, 21286769, 21583807, 21835777, 22474353, 22783709, 23164170, 23820398, 24486214, 25054783, 25619355, 25820496, 26448352, 27060621, 27678404, 28417698, 29055994, 29681449, 30330561, 31031253, 31968135, 32611123, 33286262, 33940790, 34386973, 35003185, 35730448, 36390708, 37386183, 38057675, 38538302, 39595402, 40709534, 41418081, 42215477, 42976447, 43745757, 44481646, 45201358, 45812748, 46572368, 47230189, 47966227, 48421062, 48897742, 49738186, 50443177, 50925461, 51436435, 52265018, 53107498, 54099481, 54719723, 55091050, 55740073, 55924541, 55914779, 56037206, 56048221, 55938627, 55816165]
6142E5816165m15520o63163n77347q40045m53870q35122q58083r21929p59562
6133D9491524p06702m86828m61981m21379o81610m00556k47947k04361l51432
6124D5528728p64606q03499q12546p19217o50296q33313p67074j373723j064959
6115C7739495j062566r95140q87322q48194j009378j142459r14880q81314r53487
6106B9044755q46273n36130k54030q03108q01885n87778n00442l89093k64080
6097B4061936n80522m47573l91642l44400l08449o80298j99279k42736n81532
6088B0285505o18538k83421l46188k59207l92835l30976l96113n04449j70729
6079A6983049n30166m79901n1596j36414j49154k85728l10686n95439k72310l11964
$$ y = [55816165, 55400645, 54737482, 54160135, 53320090, 52866220, 52031098, 51173015, 50251086, 49491524, 48784822, 48297994, 47836013, 47414634, 46733024, 46332468, 46084521, 45880160, 45528728, 44764122, 43960623, 43148077, 42428860, 41778564, 40945251, 40178177, 38804454, 37739495, 36676929, 35681789, 34794467, 33946273, 32936895, 31794436, 30879556, 29998242, 29044755, 28198482, 27662352, 27408322, 26605214, 25803329, 25215551, 24715109, 24326016, 24061936, 23481414, 23033841, 22642199, 22297799, 21989350, 21309052, 21109773, 20867037, 20285505, 19666967, 19383546, 19037358, 18778151, 18385316, 18054340, 17658227, 17153778, 16983049, 16452883, 15972982, 15921386, 15784972, 15635818, 15350090, 15039404, 14443965, 14171655, 13859691]
6069A3859691k54432m14535k87083o5344j92755k58169l34065j14963l64500k85260
6059A1288585p7774o1512m00342j92027j84424k25024j61774k03954j93098k28096
6049I360560k26393l11485l70302k11769K4142l63762j30307k35594k35772P171
6039G306489l7905m81691j80198O5368l38773k24586j43935q6278j30760j58441
6029E589290j08712o967m4099k23951k23778J14345j81165l87780Q7346L9703
6019D654232m2135j43731J24462p1793j16840K19462J3850m68366j44052J99678
6009D224767L9504j20697L0890k18951o5841j6620k35067J99865j4110j55544
5999C668196J07523m0751K6122p4782k20135J17377q0571r3970l2756K1294J00780
$$ y = [13859691, 13605259, 13190724, 12903641, 12838297, 12645542, 12387373, 12053308, 11938345, 11573845, 11288585, 11210811, 11149299, 10748957, 10556930, 10372506, 10147482, 9985708, 9781754, 9588656, 9360560, 9134167, 8822682, 8452380, 8240611, 8264753, 7900991, 7770684, 7535090, 7299318, 7306489, 7268584, 6786893, 6606695, 6672063, 6333290, 6108704, 5964769, 5878491, 5747731, 5589290, 5480578, 5473611, 5429512, 5205561, 4981783, 5096128, 4914963, 4527183, 4614529, 4654232, 4612097, 4468366, 4592828, 4521035, 4404195, 4623657, 4637507, 4169141, 4025089, 4224767, 4264271, 4143574, 4174464, 3955513, 3889672, 3873052, 3637985, 3837850, 3823740, 3668196, 3775719, 3734968, 3761090, 3686308, 3466173, 3583550, 3502979, 3409009, 3376253, 3397547, 3498327]
5988C498327j6406j42526P2717k9004n7018J8520J2115k29208K5097K85774k30826
5977C207562k6718J18373J4760K74966k27211J76133L6573L7804n4420k61438
5967C296384j44467j67139Q4066j11793L44788P0813K4191l3264L313k25138K5394
5956C167148l2422k95707J28432p2007P3301j78112o0817K24918l5042j6040r4790
5945B808862K01995P0180L5504j58376J51007J94519q4777k2289n9129j90889
5935B946607L23559j58672l05097K19940L75969n0083k52584p4711R6671j01109
5925C020490k19869J36775J53019K0233r4276j7169p8448L56638k31417M6603
5915C092579j75235L5446o6942p6652O6034N2673J88806J4527O7132J16466q3304
$$ y = [3498327, 3481921, 3339395, 3412112, 3383108, 3326090, 3344610, 3356725, 3127517, 3152614, 3438388, 3207562, 3180844, 3299217, 3313977, 3588943, 3361732, 3537865, 3574438, 3612242, 3557822, 3296384, 3151917, 2984778, 3068844, 2957051, 3301839, 3372652, 3396843, 3363579, 3366892, 3141754, 3167148, 3134726, 2839019, 2967451, 2895444, 2968745, 2790633, 2729816, 2954734, 2919692, 2903652, 2808862, 3010857, 3081037, 3116541, 2958165, 3109172, 3303691, 3218914, 3196625, 3137496, 2946607, 3270166, 3111494, 2806397, 3026337, 3402306, 3352223, 3099639, 3024928, 3121599, 3020490, 2800621, 2937396, 3090415, 3110648, 3016372, 2999203, 2920755, 3277393, 3045976, 3092579, 2917344, 2952790, 2885848, 2809196, 2875230, 2927903, 3116709, 3131236, 3198368, 3314834, 3231530]
5904C231530j74670J1735p6068j67874K2381l4028J11002L39814J2183M2933O9408
5893C388346Q6012k96338J37206J07023o393J03150k91736J72297J20675J78925
5883C699167m7241q8395Q244L7328J55312L4164j14979J82466k52218n4440l9300
5872C520108M5692J43136N4116O5028R654L8229k40459K44445J54942j56858J17714
5861C995747J07270q0807J6993j51907k547P0012r112P5506K16493L18837p8685
5850D477800j19586m3330j20759J85954K7224J2355k3069P4281p8540O9016Q8245
5839D549591P1315K1236k20886j73020K67053O6646J31827J97922k9916J72007
5829E053775N8567j18252l0391j8276J01102R8459k87786k52894K40347J78375
$$ y = [3231530, 3056860, 3068595, 2992527, 2824653, 2847034, 2813006, 2924008, 3263822, 3276005, 3318938, 3388346, 3474358, 3178020, 3315226, 3422249, 3415856, 3519006, 3227270, 3399567, 3520242, 3699167, 3651926, 3563531, 3571775, 3609103, 3764415, 3798579, 3683600, 3866066, 3613848, 3559408, 3520108, 3565800, 3708936, 3763052, 3828080, 3837734, 3875963, 3635504, 3879949, 4034891, 3878033, 3995747, 4103017, 4022210, 4039203, 3887296, 3884749, 3954761, 3945649, 4021155, 4237648, 4556485, 4477800, 4358214, 4314884, 4194125, 4380079, 4407303, 4419658, 4396589, 4470870, 4392330, 4461346, 4549591, 4620906, 4642142, 4421256, 4248236, 4515289, 4581935, 4713762, 4911684, 4881768, 5053775, 5112342, 4994090, 4963699, 4945423, 5046525, 5144984, 4857198, 4604304, 4844651, 5023026]
5819E023026K78066N6995k07453m876R8988J70503n3689R0199J65503p4349Q1533
5808E624446J04112K7026J25558o8334j32088K8225K84494R5469r459O2259K4057
5797F165765r0209J22211k37680Q4605R4263L9490J52768L10564j17886j18635
5787F405256K35019O7643q0979Q3205J99596L73460K63530j49941K3117J09447
5777G529353n8117J89963j37243J54262n7336k77035M04148l5549J83495J56110
5767H052051K99307r487o8722n7130K50856n790K87108N650J72169R2453K2333
5756I040798P4478N7238J56179L5802J28126J93476J67329K64482K08303N6527
5746A0382738P4544K27581P1314k63828R6317N44513L79688j16881J70037K28164
$$ y = [5023026, 5301092, 5358087, 5150634, 5145758, 5244746, 5415249, 5361560, 5451759, 5617262, 5542913, 5624446, 5728558, 5755584, 5881142, 5812808, 5680720, 5708945, 5993439, 6088908, 6079449, 6141708, 6165765, 6075556, 6197767, 5960087, 6044692, 6138955, 6178445, 6331213, 6641777, 6523891, 6405256, 6640275, 6707918, 6626939, 6710144, 6909740, 7283200, 7546730, 7396789, 7419906, 7529353, 7471236, 7661199, 7523956, 7678218, 7620882, 7343847, 7747995, 7712446, 7895941, 8052051, 8351358, 8341871, 8273149, 8216019, 8466875, 8461085, 8748193, 8753843, 8926012, 9018465, 9040798, 9115276, 9172514, 9328693, 9364495, 9492621, 9686097, 9853426, 10117908, 10326211, 10382738, 10457282, 10684863, 10756177, 10492349, 10588666, 11133179, 11512867, 11395986, 11566023, 11794187]
5736A1794187K18952R4802J18483J0481L01796L25833P6679L33586R0533J97811
5726A3563143K51899R8853J78918K14914J45074L84215j4430K70677L80643K8173
5716A5502079K11181K87659L68860L06930L33904K59999l622K501M26326O7262
5706A7763079M38473K38490J77990K33598L69797K61371M70293L10604O04790
5697B0868485L60230K00096L45531J50151L68547K48497N77144N20015L52684
5688B3991380L03763M83406M11610N15375K99021M33411M80124J66910N72933
5679B7657933O81099L99651M61865O16122M27510Q86343Q00554P39673N10187
5670C3180937O35290P02560O00595N97519P93880O00705N71185O78713M78107
$$ y = [11794187, 12013139, 12107941, 12226424, 12236905, 12538701, 12864534, 12941213, 13274799, 13365332, 13563143, 13815042, 13913895, 14092813, 14307727, 14452801, 14837016, 14822586, 15093263, 15473906, 15502079, 15713260, 16000919, 16369779, 16676709, 17010613, 17270612, 17266990, 17269491, 17695817, 17763079, 18201552, 18440042, 18618032, 18851630, 19221427, 19482798, 19953091, 20263695, 20868485, 21228715, 21428811, 21774342, 21924493, 22293040, 22541537, 23118681, 23638696, 23991380, 24295143, 24778549, 25190159, 25705534, 26004555, 26437966, 26918090, 27085000, 27657933, 28339032, 28738683, 29200548, 29816670, 30244180, 31130523, 31931077, 32670750, 33180937, 33816227, 34518787, 35119382, 35716901, 36510781, 37111486, 37682671, 38361384, 38839491]
5661C8839491Q63275O90847O31686M84102O93052Q61553J036176P00095O78948
5652D5479225P82658N57985R87915Q14821R18181O86954J141456R72682P82144
5643E3124021R77904P82223Q69098R50529J011738P66267Q95034J170407R81139
5634F1528360R37759J172069J182469J248825J126368J391871J191891J426002
5626G1205614J449581J421883J661388J706735J423759J803268J690328J675893
5618H4038449J752880J881751J874382J834542K146675K270976K207089K370120
5610A00376864K514914K520339K479827K934281L099479L049156L094113L523711
5602A23592684L761564M001372L943783M178886M899761M784071N264115N894476
$$ y = [38839491, 39702766, 40393613, 41025299, 41509401, 42202453, 43064006, 44100182, 44800277, 45479225, 46261883, 46819868, 47807783, 48622604, 49540785, 50227739, 51369195, 52341877, 53124021, 54101925, 54884148, 55753246, 56703775, 57715513, 58481780, 59376814, 60547221, 61528360, 62466119, 63638188, 64820657, 66069482, 67195850, 68587721, 69779612, 71205614, 72655195, 74077078, 75738466, 77445201, 78868960, 80672228, 82362556, 84038449, 85791329, 87673080, 89547462, 91382004, 93528679, 95799655, 98006744, 100376864, 102891778, 105412117, 107891944, 110826225, 113925704, 116974860, 120068973, 123592684, 127354248, 131355620, 135299403, 139478289, 144378050, 149162121, 154426236, 160320712]
5594A60320712O290688O254548O423871O717366P443806P476781Q055188Q388434
5586B17371394P931594Q289547P913806P574205P280606O290668N081649L803731
5578B71537200K731787J121424p88804k529252l640158n057517o354181o950840
5570B50069659p805004q203132q413735q220300q034828p966320p575426p586955
5562A86263959p118398o678691o081716n787086n379173m845562m666678m347277
5554A41359378l938280l880987l503429l008321k890981l008579k524563k409290
5546A16194948k613577k367587k441363k442957k948949k614459k756508k947276
5538I5062272k818183k492810k779901k709849k447364k516640k511300k139108
$$ y = [160320712, 166611400, 172865948, 179289819, 186007185, 193450991, 200927772, 208982960, 217371394, 225302988, 233592535, 241506341, 249080546, 256361152, 262651820, 267733469, 271537200, 274268987, 275390411, 274601607, 272072355, 268432197, 263374680, 257020499, 250069659, 242264655, 234061523, 225647788, 217427488, 209392660, 201426340, 193850914, 186263959, 179145561, 172466870, 166385154, 160598068, 155218895, 150373333, 145706655, 141359378, 137421098, 133540111, 130036682, 127028361, 124137380, 121128801, 118604238, 116194948, 113581371, 111213784, 108772421, 106329464, 103380515, 100766056, 98009548, 95062272, 92244089, 89751279, 86971378, 84261529, 81814165, 79297525, 76786225, 74647117]
5530G4647117j915338j884482k018157j705277j580547j580743j614439j440403
5522F0907731j530325j623141j432395j496961j217296j366134j332488j491336
5514D9417655j384039j440058j238315j614069j454599j189111j212830j368909
5506C8515725j054247j163501j014658q89019p16118q14573p13275p74815n70258
5497C0805261o44361n38168m88712p49095m51900p10712p83904o35776l97452
5488B5405181n16898o87862n87593k47229m33983l32071l56111j90622m01035
5479B1651777l24933l66492k45930l50978k84342k83481l23302L0335l44193J56165
5469A9314626j89723n15873J00165r3437o6500K2261j07692j82164l27863j89039
$$ y = [74647117, 72731779, 70847297, 68829140, 67123863, 65543316, 63962573, 62348134, 60907731, 59377406, 57754265, 56321870, 54824909, 53607613, 52241479, 50908991, 49417655, 48033616, 46593558, 45355243, 43741174, 42286575, 41097464, 39884634, 38515725, 37461478, 36297977, 35283319, 34394300, 33678182, 32863609, 32150334, 31375519, 30805261, 30160900, 29622732, 29134020, 28384925, 27933025, 27222313, 26438409, 25802633, 25405181, 24888283, 24200421, 23612828, 23365599, 22931616, 22599545, 22243434, 22052812, 21651777, 21326844, 20960352, 20714422, 20363444, 20079102, 19795621, 19472319, 19502654, 19158461, 19314626, 19124903, 18609030, 18709195, 18615758, 18549258, 18571519, 18463827, 18281663, 17953800, 17764761]
5459A7764761j59506p3213O3459j45697k11001L3469k8860l22635o7113o601p1538
5448A6775525K3281j37314j73994L7558K57171j54221k04281J0529J77591L11487
5438A6923332j04951k1503j00409K49562P6679J0786P563J57459K35893q5964
5428A7348447k66307P7312j9142p0959J58460P3459K73864K51904J08044p4912
5418A7860170J15850O5139N0952k05280K02080J78382j04542L150j0841P5804
5408A8230864q37L2164O0083m2555k11707Q6034J77923j69308K34955J22430K79784
5397A8799830p3258K206k0917k15143J18862K22149J58060k78697n3832m2841
5387A8616419L3084k87569k47427r4988Q2857k01000K64083K13257j94361l67133
$$ y = [17764761, 17605255, 17532042, 17595501, 17449804, 17238803, 17272272, 17243412, 16920777, 16853664, 16847063, 16775525, 16798806, 16661492, 16487498, 16525056, 16782227, 16628006, 16423725, 16434254, 16611845, 16923332, 16818381, 16796878, 16696469, 16946031, 17022710, 17033496, 17041059, 17198518, 17434411, 17348447, 17082140, 17159452, 17140310, 17069351, 17227811, 17301270, 17575134, 17827038, 17935082, 17860170, 17976020, 18041159, 18092111, 17886831, 18088911, 18267293, 18162751, 18165901, 18155060, 18230864, 18230027, 18262191, 18322274, 18279719, 18068012, 18154046, 18331969, 18162661, 18397616, 18520046, 18799830, 18726572, 18728778, 18707861, 18492718, 18611580, 18833729, 18991789, 18713092, 18659260, 18616419, 18649503, 18361934, 18114507, 18019519, 18102376, 17901376, 18165459, 18378716, 18184355, 17817222]
5377A7817222R2644n9627k68953J40779r7843Q0223N3790K18069j86051j23908
5367A7666345J42791k66045j7283J12674r7389K29093k52714K49035J90503k13391
5357A7743619P0005j05594n3844M09319K44055j4434Q3062J42880K88547N7370
5347A8864985k53985p2722N833j45433k29030j14092N2346n0058p2323j15169
5337A7870352j93135k02703j09348r0945q8922k773q403M8144P879N0504O0686
5326A7341336n8698l04667J286q9407o3975J18834j78376j55830j59092j41248
5316A6310163l0449j32807L2876j14267j25278l08803R4441J29791p4324j5288
5306A5766055k64721j87723j90695k7814m07244J96594o8574P2004r3520L4501
$$ y = [17817222, 17909866, 17850239, 17581286, 17722065, 17624222, 17704445, 17758235, 17976304, 17790253, 17666345, 17809136, 17543091, 17525808, 17638482, 17541093, 17770186, 17517472, 17766507, 17957010, 17743619, 17813624, 17708030, 17654186, 18063505, 18307560, 18293126, 18376188, 18519068, 18807615, 18864985, 18611000, 18538278, 18544111, 18398678, 18169648, 18055556, 18107902, 18057844, 17985521, 17870352, 17677217, 17474514, 17365166, 17274221, 17185299, 17182526, 17174123, 17222267, 17230146, 17280650, 17341336, 17282638, 16977971, 16979257, 16889850, 16825875, 16944709, 16766333, 16610503, 16451411, 16310163, 16279714, 16146907, 16179783, 16065516, 15940238, 15631435, 15725876, 15855667, 15781343, 15766055, 15501334, 15313611, 15122916, 15095102, 14687858, 14884452, 14815878, 14887882, 14794362, 14828863]
5296A4828863j90187N2593J18699r7698k56563j50913R5731m8990l15556j69163
5286A3866816L75150q8522p6012j7861l8121R6344j93846j65166K35216J68068
5276A4162066J6745j09335p477j11593K62120J99524K26442J07870l5248J38018
5266A4849132j5287J62723K96044J14982J54891M2306N6300J61621K30677J6285
5256A6069674L01894J58385J8443q6662j70291P7422j84208J31537K63209J2181
5246A6591584l33241J13266o1179J95888n5198n1108K00152j73477P6197M2852
5236A6545736k029K28462k01869k56396K01349r3985J2375j79638k61589K11653
5226A6204069K2980l17505q2123o2523R6705o8605N6756j91202R2271j98082L2808
$$ y = [14828863, 14638676, 14691269, 14809968, 14712270, 14455707, 14304794, 14400525, 14351535, 14035979, 13866816, 14241966, 14153444, 14077432, 14059571, 14021450, 14117794, 13923948, 13758782, 13993998, 14162066, 14178811, 14069476, 14061999, 13950406, 14212526, 14412050, 14638492, 14746362, 14711114, 14849132, 14833845, 14996568, 15292612, 15407594, 15562485, 15604791, 15661091, 15822712, 16053389, 16069674, 16371568, 16529953, 16548396, 16461734, 16291443, 16368865, 16184657, 16316194, 16579403, 16591584, 16258343, 16371609, 16310430, 16506318, 16451120, 16400012, 16600164, 16426687, 16502884, 16545736, 16543707, 16772169, 16570300, 16313904, 16515253, 16421268, 16433643, 16254005, 15992416, 16204069, 16227049, 15909544, 15827421, 15764898, 15861603, 15792998, 15849754, 15658552, 15750823, 15552741, 15585549]
5215A5585549k4278K0345K21582j95910L66730j55499k87153K9580M6604p4871
5205A5532679j17286Q6700J12271O5724J15638K57106k18434p79R8684p2543l8661
5194A5821099L92024R67J14950M15677m3046j09848K02408J91306j29595K52401
5184A7108343m2188J6324l6755P791J75426J07862K49125j73481k23926m9279
5174A7139242L3953k6330r9161J80098j8934k919J51852K1060k57608r3103j3405
5163A7014745P8747j1461J30961j71387J03702L5031j89400n5445P7270j14756
5153A6898007l41032o7481M4115J20945J03017J31091J53280M5752j09694Q1322
5143A7059322J34435m1395L5059Q484j09967j34200K44613j50232K18589k6894
$$ y = [15585549, 15561271, 15581616, 15803198, 15607288, 15974018, 15818519, 15531366, 15560946, 15607550, 15532679, 15415393, 15502093, 15614364, 15680088, 15795726, 16052832, 15834398, 15833619, 15932303, 15859760, 15821099, 16213123, 16214090, 16329040, 16744717, 16701671, 16591823, 16794231, 16985537, 16855942, 17108343, 17066155, 17082479, 17045724, 17053515, 17228941, 17336803, 17585928, 17412447, 17188521, 17139242, 17173195, 17146865, 17047704, 17227802, 17208868, 17205949, 17357801, 17378861, 17121253, 17028150, 17014745, 17093492, 17082031, 17212992, 17041605, 17145307, 17180338, 16990938, 16935493, 17012763, 16898007, 16556975, 16489494, 16533609, 16654554, 16757571, 16888662, 17041942, 17087694, 16978000, 17059322, 17193757, 17152362, 17187421, 17195905, 17085938, 16951738, 17196351, 17046119, 17264708, 17237814]
5133A7237814R3944K12571k09074k89953k35518k77993j31922j46567m87733j89139
5123A5576430k86805p8976j57798M8722j20684j8591m8471J8930k287j93861l11118
5112A4425491k03152r5259n1465q3768j51765j93411j90451K06854J9122q009
5102A3674187m2724k55938J19133k04763j57655k10917o7210P1987J1642l89953
5092A2547789J48112j79585K00531J58382j47960Q7835j10576O3796J87251J86688
5082A3142263p5250J40561J06034K2262J47613j16992K04557N39432O4283J67011
5072A4341774k56878o1833O6446M48362K23907j06229M15862L32696Q4370M18944
5062A5907421J96948M35729M35834J44225O76676L16705J32068L40039N88237
$$ y = [17237814, 17331758, 17544329, 17335255, 17045302, 16809784, 16531791, 16399869, 16253302, 15765569, 15576430, 15289625, 15210649, 15052851, 15101573, 14980889, 14962298, 14913827, 14932757, 14930470, 14736609, 14425491, 14222339, 14127080, 14075615, 13991847, 13840082, 13646671, 13456220, 13663074, 13682196, 13674187, 13631463, 13375525, 13494658, 13289895, 13132240, 12921323, 12854113, 12926100, 12937742, 12547789, 12695901, 12516316, 12716847, 12875229, 12727269, 12815104, 12704528, 12768324, 12955575, 13142263, 13067013, 13207574, 13313608, 13335870, 13483483, 13366491, 13571048, 14110480, 14174763, 14341774, 14084896, 14023063, 14089509, 14537871, 14761778, 14655549, 15071411, 15404107, 15488477, 15907421, 16104369, 16540098, 16975932, 17120157, 17796833, 18113538, 18245606, 18585645, 19173882]
5053A9173882M78750K36054K63375K61819Q29724M97446M01339L27232K61778
5044B2731399K96102L55038O47221P06198K42794K49774K87984L89908M20462
5035B6326880K60288J49700M9515L29433J44146K82156K06183L50063J42285K8083
5025B8268732J74725N0832N2807N9453K22974K43909K51484K3315p7168J63393
5015B9434456P114J62844L25991J82632J13341K2900L07641M06878J37534L68299
5005C1469630M90154K78423J98059L61039M14069P31458L71495L05182Q91111
4996C5510620P05167P85575P69509J015980R84280J269056J339005J455504J425591
4987D5260287J199419J163444J523979K080679J540332J649119J987387J831594
$$ y = [19173882, 19652632, 19888686, 20152061, 20413880, 21243604, 21741050, 22142389, 22469621, 22731399, 23027501, 23382539, 24029760, 24735958, 24978752, 25228526, 25516510, 25906418, 26326880, 26587168, 26736868, 26786383, 27115816, 27259962, 27542118, 27748301, 28098364, 28240649, 28268732, 28443457, 28494289, 28547096, 28606549, 28829523, 29073432, 29324916, 29348231, 29271063, 29434456, 29441570, 29604414, 29930405, 30113037, 30226378, 30249278, 30556919, 30963797, 31101331, 31469630, 31959784, 32238207, 32436266, 32797305, 33211374, 33942832, 34314327, 34619509, 35510620, 36215787, 37001362, 37770871, 38786851, 39771131, 41040187, 42379192, 43834696, 45260287, 46459706, 47623150, 49147129, 51227808, 52768140, 54417259, 56404646, 58236240]
4979E8236240K011142J921594K006399K026073K115517K329135K461655K562474
4971G5670229K897648L300016K833538L022850K928569K459638K268064J955814
4963I7336366J138324R64742N01779n5976m68665q83812r14715r43066j019445
4954I5655532j173371j234811j094183p44285n95613k09015o58218o50116m88692
4945H8807228j014397j067883j292538j630482k273238k757944k576183l148643
4937G3045920l004479l203477l318664l193719l361048l112920k976590k677006
4929D8198017k619326k050894k087909k113221j791285j861564j947321j367503
4921C2358994j392195j222421j139073j180122j084259j088788r38547o92611
$$ y = [58236240, 60247382, 62168976, 64175375, 66201448, 68316965, 70646100, 73107755, 75670229, 78567877, 81867893, 84701431, 87724281, 90652850, 93112488, 95380552, 97336366, 98474690, 99439432, 99941211, 99885235, 99416570, 98532758, 97618043, 96674977, 95655532, 94482161, 93247350, 92153167, 91408882, 90813269, 90604254, 89946036, 89295920, 88807228, 87792831, 86724948, 85432410, 83801928, 81528690, 78770746, 76194563, 73045920, 70041441, 66837964, 63519300, 60325581, 56964533, 53851613, 50875023, 48198017, 45578691, 43527797, 41439888, 39326667, 37535382, 35673818, 33726497, 32358994, 30966799, 29744378, 28605305, 27425183, 26340924, 25252136, 24313589, 23620978]
4913B3620978r25770q45621q99010o49945o93780n21347n59714m02752o81226
4904A7441813n81528m41454m38868l68027m67641n4092m73652l53038j92972k30711
4894A3839830m13589l28553o87970k75445l0061k49606k69773k96975l77662j27430
4884A0782766n01729l3902j22064l40189p3314j06077j23301j42908J9966j5281
4874I343967k67176j48230k23016M0263N2173j83387k87963M5250j49574j38896
4864H083411j09600J5091j25964j08607J3723j68630K4352l42697j32943r6676
4854G051460k73033N5878j740J71307K9906n76032p661K25339J56508j11443n2757
4843F667732l8606j53364J48004o2415L5j64999k03026J98242J16192Q6641k19329
$$ y = [23620978, 22695208, 21849587, 20950577, 20300632, 19606852, 19085505, 18525791, 18123039, 17441813, 16860285, 16418831, 15979963, 15611936, 15144295, 15090203, 14616551, 14263513, 14070541, 13839830, 13426241, 13097688, 12409718, 12134273, 12104212, 11854606, 11584833, 11287858, 10910196, 10782766, 10281037, 10247135, 10125071, 9784882, 9711568, 9605491, 9482190, 9339282, 9359248, 9343967, 9076791, 8928561, 8705545, 8745808, 8797981, 8614594, 8326631, 8371881, 8222307, 8083411, 7973811, 7988902, 7862938, 7754331, 7768054, 7599424, 7623776, 7281079, 7148136, 7051460, 6778427, 6834305, 6832565, 7003872, 7033778, 6457746, 6450085, 6675424, 6831932, 6720489, 6667732, 6629126, 6475762, 6623766, 6561351, 6561386, 6396387, 6193361, 6391603, 6507795, 6594436, 6375107]
4832F375107j96342j24614K71l02752K58360j89576j47590J29083q793k00425
4822E592729k0468M9847M7562k9808O3947K0590K7081K63251J28154j42379k16448
4811E784058L37676J57991k17108K243K31193k32497k6078k09368m1487j27652
4801E658971J25639r0074J10856j8511R7993j82650M7676K27778p0620K5568P9048
4790F011674J30146j2258K14233P0801k9827J01290j24418J25720m500j43171
4780F339690J61434k34252n601K31738j0178J21246J46935k79794R2657l4719
4770F529156j400k1982K6619L4609K49864N1525k4634N6763P1716j59006K91711
4759G104941K57316M6153j37345J86525k27099n3051k27790j7030J88099J42095
$$ y = [6375107, 6178765, 6054151, 6054422, 5751670, 6010030, 5820454, 5672864, 5801947, 5793154, 5592729, 5572261, 5622108, 5669670, 5639862, 5703809, 5724399, 5751480, 6014731, 6142885, 6000506, 5784058, 6121734, 6279725, 6062617, 6064860, 6296053, 6063556, 6037478, 5828110, 5786623, 5658971, 5784610, 5694536, 5805392, 5786881, 5884874, 5702224, 5749900, 5977678, 5907058, 5932626, 6011674, 6141820, 6129562, 6343795, 6414596, 6384769, 6486059, 6361641, 6487361, 6482861, 6339690, 6501124, 6266872, 6261271, 6493009, 6482831, 6604077, 6751012, 6471218, 6563875, 6529156, 6527756, 6505774, 6532393, 6567002, 6816866, 6868391, 6843757, 6900520, 6972236, 6813230, 7104941, 7362257, 7408410, 7271065, 7457590, 7230491, 7177440, 6949650, 6932620, 7120719, 7262814]
4749G262814K1556l77482O9482k52669M8507P3928m5481N8424j45319O9648K00908
4738F984316K48079J46168j12904o5270p6825N3495l6620J20549Q2116k4622K03314
4727G521796M5269N4477K3325j18442K89299J5914q6933k85904J87371k07748
4717G438424k64530M0581l8933l3379J59865M2961M8136m3334j10734K128K08813
4706G449998J93750K77951M237L1640K19591l2952J51187j32168j69801k4733
4696G968700m9245m6225J52475o2064L7282J0690k7104J76915J5077k90444o1171
4685G824886J06819L30757O7391l36917L55675J01878L4794k5341K50440J25187
4675H835569K78375J65268K12442n7523o9369L64738M25555K13233R7965Q3860
$$ y = [7262814, 7284370, 6906888, 6976370, 6723701, 6772208, 6846136, 6800655, 6859079, 6713760, 6783408, 6984316, 7232395, 7378563, 7265659, 7200389, 7123564, 7177059, 7140439, 7260988, 7343104, 7318482, 7521796, 7567065, 7621542, 7644867, 7526425, 7815724, 7831638, 7744705, 7458801, 7646172, 7438424, 7173894, 7214475, 7175542, 7142163, 7302028, 7344989, 7393125, 7349791, 7239057, 7241185, 7449998, 7643748, 7921699, 7925936, 7957576, 8177167, 8144215, 8295402, 8163234, 7993433, 7968700, 7919455, 7873230, 8025705, 7963641, 8000923, 8011613, 7984509, 8161424, 8176501, 7886057, 7824886, 7931705, 8262462, 8329853, 7992936, 8348611, 8450489, 8485283, 8459942, 8710382, 8835569, 9113944, 9279212, 9491654, 9434131, 9364762, 9729500, 10155055, 10368288, 10466253, 10550113]
4665A0550113J22361L18196O9419L45121K69554O5140J81397r3324N3405M14169
4655A2295551K80529K80406k2473L35281L51766M69564N54604M28407L07431N07418
4645A5788484O3277M22281M99439M67767O49475K89033L84528O24560P17917O77704
4635B0584465P20661Q54587P95450N77494Q84464R59657N57699Q80023N65258
4626B7379758P91163R48995P42597R83490P83546J118176J336211J428775J636703
4617C7149414J947305K186850J945431K352586K964907L199079L526636M054279
4609E9326487M438567M399015M424925M065987M032186L859667L528887M445751
4601I2521472M891181M732279N197445M479240L254963K470256K075165J968357
$$ y = [10550113, 10672474, 10990670, 11060089, 11405210, 11674764, 11739904, 11921301, 11827977, 11881382, 12295551, 12576080, 12856486, 12834013, 13169294, 13521060, 13990624, 14545228, 14973635, 15281066, 15788484, 15851761, 16274042, 16773481, 17241248, 17890723, 18179756, 18564284, 19188844, 19906761, 20584465, 21305126, 22159713, 22955163, 23532657, 24417121, 25376778, 25934477, 26814500, 27379758, 28170921, 29119916, 29862513, 30846003, 31629549, 32747725, 34083936, 35512711, 37149414, 39096719, 41283569, 43229000, 45581586, 48546493, 51745572, 55272208, 59326487, 63765054, 68164069, 72588994, 76654981, 80687167, 84546834, 88075721, 92521472, 97412653, 102144932, 107342377, 111821617, 115076580, 117546836, 119622001, 121590358]
4593A21590358K053906K793747K508945J523356Q8818j449315k936993l606203
4585A22566619l578653l319312k808276k814374l508994m350606n179263n597365
4577I1409776n558543n436054m830738m233332m205740m238347m453248m520350
4569E3933424m527655m407187m026970l421807k975632k624009k313819k213081
4561B7423264j731613j594243j201192j410550j027883j385826r59950p61224
4553A7350783q48347n95755p50889q57051o33076p53819p04098m99145m90619
4544A1217984l04736o48950l51376k70212l70059k69031m50586l91942j87151
4535G973941l2211m95412k68978p7984l65906M3304n05676k59169j77350J38765
$$ y = [121590358, 123644264, 126438011, 128946956, 130470312, 130559130, 129109815, 126172822, 122566619, 118987966, 115668654, 112860378, 110046004, 106537010, 102186404, 97007141, 91409776, 85851233, 80415179, 75584441, 71351109, 67145369, 62907022, 58453774, 53933424, 49405769, 44998582, 40971612, 37549805, 34574173, 31950164, 29636345, 27423264, 25691651, 24097408, 22896216, 21485666, 20457783, 19071957, 18112007, 17350783, 16502436, 15906681, 15155792, 14298741, 13665665, 12911846, 12207748, 11708603, 11217984, 10913248, 10264298, 9912922, 9642710, 9272651, 9003620, 8553034, 8161092, 7973941, 7941730, 7446318, 7177340, 7099356, 6733450, 6776754, 6271078, 6011909, 5834559, 5973324]
4525E973324q3412j66197j43829k40289r1335j61647j60500k03357n75856j9068
4515D127834n6867j65280K7909l12369q0294n6876l44425K5516L12677j01151
4505C376674Q8273k153j22188r2971L8926J18190n142q1096j18999j35540k26320
4494B837654o5646P7770M1635K1468k24422N1294l45958m6718N4123M4866k67388
4483B178678j49302J51412J34222l03553q6703K98104l1460m2045K35036M9454
4473B433843k27651n3921r3138n1163K65518l2113j07327r9928l2725n2890n0530
4462A897975q7583j64030j33064p3850M3316K7107n3702j14K23165n6049O2177
4451A685348j88437k6045J81901P5214k74243R7921r8954M7996K94658j88455
$$ y = [5973324, 5889912, 5723715, 5579886, 5339597, 5248262, 5086615, 4926115, 4722758, 4146902, 4127834, 4070967, 3905687, 3933596, 3621227, 3540933, 3484057, 3139632, 3165148, 3477825, 3376674, 3464947, 3462794, 3340606, 3247635, 3286561, 3404751, 3399609, 3318513, 3199514, 3063974, 2837654, 2772008, 2849778, 2891413, 2912881, 2688459, 2739753, 2393795, 2347077, 2401200, 2446066, 2178678, 2029376, 2180788, 2315010, 2011457, 1924754, 2222858, 2191398, 2149353, 2384389, 2433843, 2206192, 2152271, 2059133, 2007970, 2273488, 2241375, 2134048, 2034120, 2001395, 1948505, 1897975, 1810392, 1646362, 1513298, 1439448, 1482764, 1509871, 1456169, 1456055, 1679220, 1623171, 1685348, 1496911, 1470866, 1652767, 1727981, 1453738, 1551659, 1452705, 1500701, 1795359, 1606904]
4441A606904N2554J01416j12194n0782j00677K97498R276o5458q4505k13436j50168
4430A290428p6893L39957K88432K8661J37819J48572l0518q1288k14027L7895
4420A869038o5056j70752j46786j50987k8155M9361K44239j33330j8119k32837
4410A216616l29165K65200l8629j49457J59308J24475M9864j53167r5910R8407
4400A147542K64656Q6828k65557j48298J47718n9697o1536l88794P9998M5142
4390H48002M7533j63554j04999K58718J0521n9200J01787j21437k51406K78214
4380H44179k0196m6904j97115o9257K31369J05200r7393M0481n6275j67236r811
4369E57042K16490k12058N7102N6170j04761J76115k3739n6449K2724Q1495J30980
$$ y = [1606904, 1659458, 1760874, 1648680, 1597898, 1497221, 1794719, 1803995, 1738537, 1654032, 1440596, 1290428, 1213535, 1553492, 1841924, 1870585, 2008404, 2156976, 2126458, 2045170, 1831143, 1869038, 1803982, 1633230, 1486444, 1335457, 1307302, 1356663, 1600902, 1467572, 1449453, 1216616, 887451, 1152651, 1114022, 964565, 1123873, 1248348, 1298212, 1145045, 1049135, 1147542, 1412198, 1499026, 1233469, 1085171, 1232889, 1173192, 1111656, 722862, 802860, 848002, 895535, 731981, 626982, 885700, 896221, 837021, 938808, 817371, 565965, 844179, 823983, 777079, 579964, 510707, 742076, 847276, 749883, 790364, 734089, 566853, 557042, 773532, 561474, 618576, 674746, 569985, 746100, 722361, 665912, 688636, 770131, 901111]
4358I01111j94406n0989Q5829M6846k2208n2288Q0931m7536J87512Q8959J36497
4347A160258Q7981k12517j76087J40939R5639j42205K85007l4117J5482k53058
4337I67322j80276K37503J44042J46922q3508P5215j49178Q422K20959j73833
4327A213590K21302K85757m9093P2423L23215j09406O6038j16016k0043M2835
4317A930602l5037R9931Q2277j09708j05295R447j13960m5222k0867O0848p5287
4306A677729o4275L3001J80273J6499K28992J69424J26763J98489m2976r9485
4296B424434Q2652N9755J20284P685P1782J6032j48280j19511J20705J76926K7536
4285B840000J80251q9001l8579o3354o6432L30860L85143J04777N766q5880K29780
$$ y = [901111, 706705, 655716, 741545, 788391, 766183, 713895, 794826, 747290, 934802, 1023761, 1160258, 1248239, 1035722, 859635, 1000574, 1096213, 954008, 1239015, 1204898, 1220380, 967322, 787046, 1024549, 1168591, 1315513, 1232005, 1307220, 1158042, 1166464, 1387423, 1213590, 1434892, 1720649, 1671556, 1743979, 2067194, 1957788, 2023826, 1907810, 1887767, 1930602, 1895565, 1995496, 2077773, 1968065, 1862770, 1872217, 1758257, 1713035, 1692168, 1753016, 1677729, 1613454, 1646455, 1826728, 1843227, 2072219, 2241643, 2368406, 2566895, 2523919, 2424434, 2507086, 2566841, 2687125, 2694810, 2766592, 2782624, 2634344, 2514833, 2635538, 2812464, 2840000, 3020251, 2931250, 2892671, 2829317, 2762885, 3093745, 3478888, 3583665, 3589431, 3503551, 3733331]
4274C733331J09787j54648J5175J74948J10313O3026j7824j13847L5980N1377
4264D007618m3344J13735L11903N0415l27121K55635j3016J13981J42045Q5352
4254D697203J8018n9367J37552K51063K76443L86651K77556M9563J39684J98446
4244F372812N35524n1697J61142J6035J54482J09485K30122K22599J17502K29609
4234H097615K84114K3282L39718N51730K28438K49348P27853P70126P50124P10475
4224A2732823J529900J394776J592756J583064J179247J019840Q94645O83853
4216B2610904J189307J793532K466717L684924M627344N353295M922688J608277
4208D8256988k150641l790983o383123o402015m848735l973390l042471k020593
$$ y = [3733331, 3843118, 3688470, 3703645, 3878593, 3988906, 4051932, 4034108, 3920261, 3956241, 4007618, 3964274, 4078009, 4389912, 4440327, 4113206, 4368841, 4355825, 4469806, 4611851, 4697203, 4715221, 4655854, 4793406, 5044469, 5320912, 5707563, 5985119, 6034682, 6174366, 6372812, 6908336, 6856639, 7017781, 7033816, 7188298, 7297783, 7527905, 7750504, 7868006, 8097615, 8381729, 8405011, 8744729, 9296459, 9524897, 9774245, 10502098, 11272224, 12022348, 12732823, 14262723, 15657499, 17250255, 18833319, 20012566, 21032406, 21927051, 22610904, 23800211, 25593743, 28060460, 31745384, 36372728, 41726023, 46648711, 48256988, 46106347, 42315364, 35932241, 29530226, 24681491, 20708101, 17665630, 15645037]
4200A5645037j738514j485205j084306j135230r03994m55458o28724o23180m37840
4191G152586l19089l9407K3007k86900l55694J36789k60723j05315J92095l9484
4181F097865M6757N06051O1076J05155K55091L57844N01989J57960J22320o3282
4171H148826q6810l87568k34544k48648l01722q61829p69396n10683l74959j04417
4161D268250l85344o10296l87030k51753j29968J26537m2451l73828l4060q4522
4151B095535j50219j29602J5763q272m5520k08287j26331J29804N2096l4056l03999
4140A286912j38272j3117j69236l7293l9798N4905J62785o2442r2192r381L9193
4129I82064J18938k46463j26048O4041O7941l16706j664j81884J0423J68691k08151
$$ y = [15645037, 13906523, 12421318, 11337012, 10201782, 9297788, 8842330, 8213606, 7590426, 7152586, 6833497, 6794090, 6817097, 6530197, 6174503, 6311292, 6050569, 5945254, 6137349, 6097865, 6144622, 6650673, 6711749, 6816904, 7071995, 7429839, 7931828, 8089788, 8212108, 8148826, 8062016, 7674448, 7439904, 7191256, 6889534, 6027705, 5258309, 4747626, 4372667, 4268250, 3882906, 3272610, 2885580, 2633827, 2503859, 2630396, 2587945, 2214117, 2180057, 2095535, 1945316, 1815714, 1831477, 1823205, 1777685, 1569398, 1443067, 1572871, 1624967, 1590911, 1286912, 1148640, 1135523, 966287, 928994, 889196, 944101, 1106886, 1044444, 952252, 942871, 982064, 1101002, 854539, 728491, 792532, 860473, 543767, 542103, 360219, 370642, 539333, 331182]
4118C31182Q1570Q8871p2646K7464m3249j70326M77051r6337j74542j1818J33575
4107E70795L04777k60540J7319M539j57892j6063j01008P6648j20145n2279J63605
4096D29756J61414l3850j42804o4834J04317J76674j14243O8374j20142N2742
4086E17404l8355o6259J63049O4867N7259q8708j08391J69587k6857j70379m5494
4075D27723l8047R233j92208k55204K91204K04412k13583j32922m086L86006N8366
4064E40894K19495p3930o960j04210j89872R9267K95953j60774J34122J91475
4054I45460j49386J89894O5426P370p2564L5492j211m80392j13821J83328J231
4043F10827R6730k03196J7154n4942M6173J95595r6672L5032K3116Q5795m11423
$$ y = [331182, 412752, 501623, 428977, 456441, 413192, 242866, 719917, 623580, 449038, 437220, 570795, 875572, 615032, 632351, 636890, 478998, 462935, 361927, 438575, 318430, 266151, 429756, 591170, 557320, 414516, 349682, 453999, 630673, 516430, 584804, 464662, 517404, 479049, 412790, 575839, 640706, 697965, 609257, 500866, 670453, 643596, 473217, 427723, 389676, 398909, 206701, -48503, 242701, 447113, 233530, 100608, 96522, 482528, 540894, 760389, 686459, 679499, 575289, 385417, 484684, 780637, 619863, 753985, 945460, 796074, 985968, 1051394, 1058764, 986200, 1021692, 1020481, 540089, 426268, 609596, 610827, 707557, 504361, 521515, 466573, 512746, 708341, 611669, 646701, 669817, 755612, 344189]
4032C44189J50134l8552k2037L87053q9648k38033J68026m5774J06099j48686
4022E72771L27428L41775r3951K9407j6561J40633j14038k02989K3611J43464
4012A151550j68931K93839M5436L47886K01313l19894P9345J61000J85487L12538
4002B289569J63147K11707M62925N65924O59495N52954M28126K37663K20519L23450
3992F115479M5192j29927k39209k59736k73964n32553l08133n78604q73221m22974
3982B542350l26214l17756l28373R2138j66083K8783j61862j97815k31854L5903
3972I69217J75887K09297q2617p8403L2532j26612j76497J7843j53584K0239k6565
3961G80737K3323j9803k54335j26512N3022q1224l0239J12386L7068J59777p9660
$$ y = [344189, 494323, 455771, 433734, 820787, 731139, 493106, 661132, 615358, 721457, 572771, 900199, 1241974, 1148023, 1177430, 1160869, 1301502, 1187464, 984475, 1008086, 1151550, 982619, 1276458, 1321894, 1669780, 1871093, 1551199, 1630544, 1791544, 1977031, 2289569, 2452716, 2664423, 3127348, 3693272, 4352767, 4905721, 5333847, 5571510, 5792029, 6115479, 6160671, 6030744, 5791535, 5531799, 5257835, 4725282, 4417149, 3838545, 2965324, 2542350, 2216136, 1898380, 1570007, 1662145, 1496062, 1524845, 1362983, 1165168, 933314, 969217, 1145104, 1354401, 1271784, 1193381, 1225913, 1099301, 922804, 940647, 787063, 807302, 780737, 804060, 784257, 529922, 403410, 456432, 375208, 344969, 457355, 494423, 654200, 574540]
3950E74540k13620q3999P6228j5021N4848J1101K153J12096R9697j74561j94721
3939B48741o8584j2860J64189k3999P8692m3847j93697L70008j76738k83407J16372
3928A74870L30665N8853r5095j60563K07557k1281P2809O4541l9082o3694j5510
3917E14070n7260p5477M8943K1091j94819j89066J86386O2758q8204J48114J54750
3906E31286k29849n9029J41369k1643l63764P2277J78338o3060j18081r3440J70967
3895A45371n7316j25888O1173J38096j35702j28431O8467K01084J81266J38909
3885D87029k59454j09820J84806p6119n6666R9904K88389j99708j21690j21292
3875A15379l15659R5625J42614k04372J07647K3980K28394N0866k09470P8026
$$ y = [574540, 360920, 276921, 353149, 338128, 392976, 404077, 406230, 518326, 618023, 443462, 248741, 180157, 167297, 331486, 307487, 386179, 342332, 148635, 518643, 341905, 58498, 174870, 505535, 564388, 469293, 308730, 516287, 495006, 567815, 632356, 593274, 529580, 514070, 456810, 381333, 430276, 451367, 256548, 67482, 253868, 316626, 228422, 376536, 531286, 301437, 242408, 383777, 362134, -1630, 70647, 248985, 185925, 67844, -25596, 145371, 88055, -37833, 23340, 161436, 25734, -102697, -34230, 166854, 348120, 487029, 227575, 117755, 302561, 226442, 169776, 269680, 558069, 358361, 236671, 115379, -200280, -104655, 37959, -166413, -58766, -34786, 193608, 244474, 35004, 113030]
3865A13030M7651j68640p3478J72640q9362J11987O2044k57255L2866K02769k201
3854A52051o1429N4477n2363R652o754j129J06677Q0922J45301l21216R2735K8232
3842B27156n9396O4364o2283L8978Q1563q727P3876J45044r396N1329n8436k00809
3830B83263r3093M8639J62989J90440l45725m4768L42570q7475m48871K60496
3820B68465J88873J72772Q7778N6133J34547p3519O5986n1256K33641K27866K63897
3809A575183J28444j49702K85474J33690j72107Q9123N5234k15885l86962j56731
3799A185761l9366r0584n8216P1229j44762j15699j98396K10269l4445q0604j64300
3788E40887J05785q5500j96257j651L8728L0823j04544j6016J24810O496k42667
$$ y = [113030, 160681, -7959, -81437, 91203, 1841, 113828, 175872, -81383, -48517, 154252, 152051, 90622, 145099, 92736, 102388, 95634, 94505, 201182, 282104, 427405, 106189, 198924, 227156, 167760, 232124, 169841, 208819, 290382, 281655, 355531, 500575, 491179, 542508, 484072, 283263, 190170, 238809, 401798, 592238, 246513, 201745, 544315, 456840, 7969, 268465, 457338, 630110, 717888, 774021, 908568, 835049, 901035, 849779, 1083420, 1311286, 1575183, 1703627, 1553925, 1839399, 1973089, 1800982, 1890105, 1945339, 1729454, 1342492, 1185761, 1146395, 1055811, 997595, 1068824, 924062, 808363, 609967, 820236, 785791, 705187, 540887, 646672, 561172, 364915, 363264, 401992, 432815, 328271, 312255, 437065, 443561, 200894]
3777B00894J76384J94586M7594j70750l9690Q6102j10817J45047K93553l47712
3767D75191J7999J6083P8712m1998l79874Q1362J46114j34526j7546M1308p4820
3756B08005k3976K47579K7510l18388r9337K93427R8373L2868L1055M9037j94360
3745C51793L890q8653J82433m8626j2275K5306p5782l8993l0542O5001m0991J83084
3733D75645o3030K630j49773q73L4615K9938q5675J39079L25465j292l25439K3221
3721D04511j02196l1688r9212q6435m4114l09266K42411K13142Q5880M4341m3988
3710B73386K58220k55665P717J92877j87024R0651j18292J85062J31565n1393
3700E27104j300j79489m4643K9387p5801l715j43680J03141K2096j83234j04499
$$ y = [200894, 377278, 571864, 619458, 448708, 409018, 495120, 384303, 529350, 822903, 475191, 493190, 509273, 587985, 545987, 166113, 247475, 393589, 259063, 241517, 282825, 208005, 184029, 431608, 459118, 140730, 41393, 334820, 433193, 466061, 497116, 546153, 351793, 355683, 267030, 449463, 400837, 388562, 413868, 338086, 299093, 268551, 333552, 292561, 475645, 412615, 415245, 265472, 264599, 299214, 329152, 243477, 382556, 708021, 706729, 381290, 404511, 302315, 270627, 171415, 84980, 40866, -268400, -25989, 187153, 273033, 317374, 273386, 531606, 275941, 283658, 476535, 289511, 380162, 261870, 446932, 578497, 527104, 525804, 346315, 301672, 331059, 255258, 251543, 107863, 211004, 233100, 49866, -54633]
3689e4633M0767O219k46205K22713J08349K17557j43711J50424J98207o684k11239
3678B81764q2584J99618O9339N6446k66926q4461K88094J85058k63329j0537j04316
3667B68166o3367J18062j680K7047R1111K43293r3555j01239j92526J9653J15884
3656D30849K53293L1309k51786N4502p8012Q7476o9934j55320O2697M6242L0423
3645D41739j0324p9087J32537j14551J8433l06383K52150J19415o6009J03984
3635D91904k38558j206O3800O8185R0692Q4077j10924k04628J733N8164n1640
3624B51599n7860J05093j47691k17705J13503K39459J29220J13104M1016k20867
3614C48871N3258j65215L2826J89698N7510j41441j70533r3511J65566P6815j1012
$$ y = [-54633, -13866, -7647, -253852, -31139, 77210, 294767, 151056, 301480, 499687, 493003, 281764, 199180, 398798, 468137, 524583, 257657, 173196, 461290, 646348, 383019, 372482, 268166, 204799, 322861, 321181, 348228, 439339, 682632, 589077, 487838, 295312, 314965, 430849, 684142, 715451, 463665, 518167, 440155, 527631, 457697, 302377, 365074, 411316, 441739, 431415, 352328, 484865, 370314, 388747, 82364, 334514, 453929, 387920, 491904, 253346, 252140, 315940, 384125, 474817, 558894, 447970, 243342, 245075, 303239, 251599, 193739, 298832, 151141, -66564, 46939, 286398, 415618, 528722, 569738, 348871, 402129, 236914, 269740, 459438, 516948, 375507, 204974, 111463, 277029, 353844, 342832]
3603C42832K44533j03156k21984j60524N3191M4706J04904J42502q4373J25046
3593D87677Q9316p158L0474k35977J9068J26146p7763O4695k1923j38467L2884
3582C68972K76086k76186q5987J598j30673M1019R6800K28022j77175J84069j28812
3571C97733j77930j5249O7890j03912L8464K09760j24070K84669O13J55766L8535
3560G72269k6216j85259N6402K44254o8422j12153k43871J68645j42268n523K33794
3549F91652m8232j04987k28170p9759K67896R5158j52028K02247L5157l5708l17805
3538C25421r2435J99256J50367o7078j71362J61886J21304J81367R116j25377
3528F92465O0439J91325k96999L7927K44529J03305N4884R4417j42839l39535
$$ y = [342832, 587365, 484209, 262225, 101701, 154892, 199598, 304502, 447004, 362631, 487677, 576993, 569835, 600309, 364332, 383400, 509546, 431783, 496478, 474555, 336088, 368972, 645058, 368872, 282885, 284483, 153810, 194829, 291629, 519651, 342476, 526545, 397733, 219803, 204554, 272444, 168532, 206996, 416756, 292686, 577355, 577968, 733734, 772269, 746053, 560794, 617196, 861450, 793028, 680875, 437004, 605649, 463381, 457858, 691652, 643420, 538433, 310263, 230504, 498400, 593558, 441530, 643777, 678934, 643226, 325421, 232986, 432242, 582609, 515531, 344169, 506055, 627359, 808726, 817842, 692465, 752904, 944229, 647230, 685157, 929686, 1032991, 1087875, 1182292, 1039453, 699918]
3518F99918J33799J62014k0029r3928j38075O826J71855M3609q0613J52796r6608
3507I41564j86965K05317L2128J66964P5745j73657K06348r6238k71477M10407
3497A310136J75211l7699k922l6546M4661Q0051k30107l1559k5803M0628j51891
3486A134160j36510M71185n1541n0078J81327R084N8245J30726R6388K6894R2134
3475A962014k5140J32495j05097j85862L604J55291L49103J41062q98N3476j15343
3464B364705m5254K4319j18568j07621k06579L9962R1235K45925m2702J43647
3454B389069K13900o633o811K98628j42324o2992J05437o0112j08583J26041K80621
3443C026241K28857J83499j31869K22085J53261K2765L06513K77041P6271j8648
$$ y = [699918, 833717, 995731, 975702, 881774, 743699, 750525, 922380, 965989, 885376, 1038172, 941564, 754599, 959916, 992044, 1159008, 1234753, 1061096, 1267444, 1171206, 899729, 1310136, 1485347, 1447648, 1444726, 1408180, 1452841, 1532892, 1302785, 1271226, 1245423, 1286051, 1134160, 997650, 1468835, 1417294, 1367216, 1548543, 1557627, 1615872, 1746598, 1842986, 1869880, 1962014, 1936874, 2069369, 1964272, 1778410, 1782014, 1937305, 2286408, 2427470, 2426572, 2480048, 2364705, 2319451, 2343770, 2225202, 2117581, 1911002, 1950964, 2042199, 2288124, 2245422, 2389069, 2602969, 2596336, 2589525, 2888153, 2745829, 2682837, 2788274, 2728162, 2619579, 2745620, 3026241, 3255098, 3438597, 3306728, 3528813, 3682074, 3704839, 4011352, 4288393, 4364664, 4346016]
3433D346016K353M6348l33310p5717j58960K2817n72695l54441J76137j52905
3423B945643k25662j29962m4182j41932r6938k31631j83539K25066j22385N1391
3413B045869J85427q2030j12106n9842O9291j61088K24781n04Q4532j65932k4060
3402B004338j392k03678p6434j79688J71941Q9517p4238j98013j3522N9480N1563
3391A629874o8469j70638Q110J3241J51730j07911R1734j38735k1350n0015P33
3380A338304l5259J74352K05499j592j04114J9440k62349k93936J49480K95424
3370A485249K01448j99564n0358J61652O0819j22433R304J80808K65973k6076
3360A966822K32189K07469K07451j46644R1424Q8061J44340L45788J67083l53037
$$ y = [4346016, 4348369, 4394717, 4061407, 3985690, 3826730, 3849547, 3276852, 2922411, 3098548, 2945643, 2719981, 2590019, 2545837, 2403905, 2306967, 2075336, 1891797, 2116863, 1994478, 2045869, 2231296, 2149266, 2037160, 1977318, 2046609, 1885521, 2110302, 2109798, 2194330, 2028398, 2004338, 2002946, 1799268, 1722834, 1543146, 1715087, 1804604, 1730366, 1532353, 1518831, 1578311, 1629874, 1561405, 1390767, 1398877, 1412118, 1563848, 1455937, 1547671, 1408936, 1387586, 1337571, 1338304, 1303045, 1477397, 1682896, 1681304, 1577190, 1596630, 1334281, 1040345, 1189825, 1485249, 1686697, 1487133, 1436775, 1598427, 1659246, 1536813, 1546117, 1726925, 1992898, 1966822, 2199011, 2406480, 2613931, 2467287, 2558711, 2646772, 2791112, 3136900, 3303983, 2950946]
3350B950946j54178Q4443l35915j24026m6747l42942n44966O8663J31672q7825
3340A599125n9337k20326j86153J48633J01662L3360K2532k20276j80839o2393
3330I75988j57029K04768k05965J12596L16341k82916M3526L5218j2618j35657
3320H94252K67j72522l5933L9979j39396L49992o3456o3256J95553l33353J9555
3309F91682R9930k76298n451K633L1355K90385l6405k04056j67608n012p6062
3298C45093K39924J05662K41378k05129K2635K34499l94807J645j3283J3838l39505
3287B51950r2174K7774L30068r948p620K17809k65258l5704j96842J69761J93995
3276E83811j57994k57523R1743J13045r207q6673k369k8725K7275J36549m3216
$$ y = [2950946, 2796768, 2881211, 2545296, 2421270, 2374523, 2031581, 1486615, 1555278, 1686950, 1599125, 1539788, 1319462, 1133309, 1281942, 1383604, 1416964, 1439496, 1219220, 1038381, 975988, 818959, 1023727, 817762, 930358, 1246699, 963783, 1007309, 1042527, 1029909, 894252, 894519, 721997, 686064, 726043, 586647, 936639, 873183, 809927, 1005480, 672127, 691682, 791612, 515314, 509863, 512496, 543851, 834236, 797831, 593775, 426167, 421155, 345093, 585017, 690679, 932057, 726928, 749563, 984062, 589255, 590900, 577617, 591455, 251950, 159776, 187550, 517618, 507670, 500050, 717859, 452601, 416897, 220055, 389816, 583811, 425817, 168294, 260037, 373082, 363875, 277202, 274833, 246108, 273383, 409932, 366716]
3265C66716J15588N1167q8711n6040k7413p9787j02628M752n387j72859J45547
3254A50945L8200o2479L30218K29892k9349k41399P3819j08621j42681L0833N1229
3243C20607J98611k29596L9118n286K5865J2644j63336j5781N529K52332J17481
3232E58188j56160J03430O026J13513J15492k54148p9246N4173j95238J00049
3222C66079L0443r6979j03464j35352M9366k1181J3941Q2602J14252k22136N3393
3211A30964j97631j9014K53164r542P7372j56226m6820J29084K08121p6130J05692
3200C99034o1044j70423N3180j3849J01296Q5635j23688q7660J093J0537p8117
3189A15994J19716r7096N523n1085r1302m8694J12615k6951O7989j5139k37234
$$ y = [366716, 482304, 533471, 444760, 388720, 361307, 281520, 178892, 183644, 178257, 5398, 150945, 189145, 126666, 456884, 686776, 657427, 416028, 489847, 381226, 238545, 269378, 320607, 519218, 289622, 328740, 323454, 349319, 361963, 198627, 182846, 188375, 440707, 558188, 402028, 505458, 511484, 624997, 740489, 486341, 407095, 461268, 266030, 366079, 396522, 299543, 196079, 60727, 110093, 88912, 102853, 185455, 299707, 77571, 130964, -66667, -85681, 167483, 157941, 235313, 79087, 32267, 161351, 369472, 293342, 399034, 337990, 167567, 220747, 206898, 308194, 393829, 270141, 182481, 183574, 194111, 115994, 235710, 138614, 144137, 93052, 1750, -46944, 65671, 38720, 106709, 91570, -145664]
3178a45664N6193Q8636J39741K04739o0215j46447M18532j53361m7938K9666O527
3167C90409J15815K244K2073k12765j73122l08M5790m4583J45912J28289p8472
3156C41282p5597j98057L18709j50918j91835K22316J18186J6033Q3942L7794
3146E21855l82283j9551J69589L22910J2296r3109p3593J03458M9215j76130o6819
3135C67838J42268L0960Q2775J14409j73952M5031P769j16209r1120j14346K50266
3124E45689J88725j12798J33217M1824J02360L612q1456K07086j43246j46025
3114G38988K21973L3785K81211N9217m07579n5226p218L52674q2081M4309p229
3103A172824n7070k11028q7021M16012j25338j53832j65152L46113L10926J4809
$$ y = [-145664, -89471, -835, 138906, 343645, 283430, 136983, 555515, 402154, 354216, 383882, 390409, 506224, 508468, 530541, 317776, 144654, 144346, 190136, 145553, 291465, 419754, 341282, 265685, 67628, 386337, 235419, 43584, 265900, 384086, 400119, 484061, 521855, 139572, 120021, 289610, 612520, 624816, 531707, 458114, 561572, 610787, 434657, 367838, 510106, 541066, 623841, 738250, 564298, 609329, 617098, 500889, 409769, 295423, 545689, 734414, 621616, 754833, 796657, 899017, 902629, 821173, 1028259, 885013, 738988, 960961, 994746, 1275957, 1335174, 927595, 872369, 865151, 1217825, 1135744, 1180053, 1172824, 1115754, 904726, 817705, 1233717, 1108379, 954547, 789395, 1135508, 1446434, 1461243]
3093A461243k6671J5867k47930j46570k78925M2373K67029k32061j98605J97361
3083H53111j30516J05203Q4956j7724Q2368J36018J06026j30670m5723K4686n6536
3072A011199p5896j95068p8996K30340k05257m32947K19825Q1353m6626J74089
3062F82016l6057m5216n3332J34542L0950l21237k3043K82976K25904L285J16916
3051I97704o582j48983n8080O3092J52510L5340j69936R2907j7347j54949j2204
3040G73472q8249m7567K7517k44153n9189K10997j45944k96310j27543K19926
3030B22957j68895J08993L9521L48970k24938k29910M44986m6377L588n842o0730
3019D32323M9205j0248m8427p7484R9940l1194j79156m0684n0513k305j06559
$$ y = [1461243, 1434572, 1450439, 1202509, 1055939, 777014, 819387, 1086416, 854355, 655750, 853111, 722595, 827798, 912754, 895030, 977398, 1113416, 1219442, 1088772, 1043049, 1067735, 1011199, 935303, 740235, 661239, 891579, 686322, 253375, 473200, 554553, 507927, 682016, 645959, 600743, 547411, 681953, 712903, 391666, 368623, 651599, 877503, 880788, 997704, 991122, 842139, 784059, 847151, 999661, 1035001, 865065, 957972, 940625, 785676, 773472, 685223, 637656, 665173, 421020, 361831, 572828, 426884, 130574, 3031, 222957, 54062, 163055, 202576, 551546, 326608, 96698, 541684, 495307, 498895, 493053, 432323, 481528, 471280, 422853, 345369, 445309, 414115, 234959, 194275, 143762, 141457, 34898]
3008C4898K19833k08942r3789L6832K7857K26930o6518L0258j67173n4423J4534
2997B97J17774N8866N5429o2479M4170N7438j58628J2763j62798k5759K59877
2986A96950K52597M5214j94865J6312R160k40001j0954O2554p4459O3859j23306
2975C061k284k9824j37555l3966J18855M2421j57686j99742K94465K35712q9880
2964D3577j24153j473k8229K10771R1146M6319j43493j7724R3407J13030k25015
2953E8163J7513Q627j78400o6396M3031J40019k69507j59260Q8998K69845O4724
2942A7357j50896P0967k09483K51084L16366p7939j06471j67194j76486J04080
2932a28615m4783j03347O8335p4568J04633K26618r4498m7517K6803l01966J16312
$$ y = [34898, 254731, 45789, -48000, -11168, 16689, 243619, 177101, 207359, 40186, -14237, 297, 118071, 176937, 232366, 169887, 214057, 271495, 112867, 125630, -37168, -62927, 196950, 449547, 494761, 299896, 316208, 325368, 85367, 74413, 136967, 62508, 126367, 3061, 777, -29047, -166602, -200568, -81713, -39292, -196978, -396720, -102255, 133457, 43577, -80576, -82049, -110278, 100493, 191639, 237958, 94465, 76741, 170148, 283178, 58163, 75676, 84303, -94097, -160493, -117462, 22557, -246950, -406210, -317212, -47367, 17357, -133539, -62572, -272055, -20971, 295395, 217456, 110985, -56209, -232695, -128615, -173398, -276745, -208410, -282978, -178345, 48273, -46225, -93742, -66939, -368905, -252593]
2921b52593J61887K43133k89919J10639O7793J83316l66111j29358q4138O8664
2911b86687K50461Q7118p760L7323n9774j56934m9053J7272R6477j12062q0133
2900b63752K30900N2878J6630J00485J65783M797k56498q3437J3463K20536J9198
2889B20983k16567k19990j68133K67395J64774j85717l20533k7506J49750J04651
2879b30893M1590n9785o4609j75999J40472J92670J30243m0070p521J6258p038
2868f4682J13486J75283j58403k0360K1762M0392J5391k31700j30860j54763q9929
2857d84383L24052K24198k39480k9988Q9563J6420q1870l9807l8057P0607J36071
2846e2674J65828j20815k31529J97470J92977k68966J48583K71872m2014k98560
$$ y = [-252593, -90706, 152427, -137492, -26853, 40940, 224256, -141855, -271213, -355351, -286687, -36226, 50892, 43132, 80455, 20681, -136253, -185306, -168034, -71557, -183619, -263752, -32852, 20026, 36656, 137141, 302924, 307721, 51223, -32214, -18751, 201785, 220983, 4416, -215574, -383707, -116312, 48462, -137255, -457788, -485294, -335544, -230893, -189303, -249088, -313697, -489696, -349224, -156554, -26311, -66381, -73902, -57644, -64682, 48804, 224087, 65684, 45324, 67086, 107478, 122869, -108831, -239691, -394454, -484383, -160331, 63867, -175613, -205601, -116038, -99618, -181488, -221295, -259352, -188745, -52674, 113154, -7661, -239190, -41720, 151257, -117709, 30874, 302746, 260732, -37828]
2836c7828j30587j69783m0504R2755L1296J19543j67869j00769M7194J94347q1178
2825b43383J05995J26253K75047k06787l10577q1089j7716J03850J15791j43917
2815b76533j2520J36081j66429J8443o714j8290J59973J55989j68308k94052J87267
2804b85093Q7124P9729J59876k83366n351L37685l40437K30141l3073j75748K96258
2793F7745j27455j76712J09372m6576k01825j2553R6757J31799j05199Q5984O5926
2782a12737N1769L33154p3478k43587k1067m5330k0194J2873K59030j83143n0048
2771i2758r7654k46923Q3653L3478N1893J8514m5115J06921J21493J684J16603
2760E1789l4382j80730j96681K66706J9168k51530K27811o5904l5970l8724p3580
$$ y = [-37828, -168415, -338198, -378702, -285947, -254651, -135108, -302977, -403746, -356552, -162205, -243383, -137388, -11135, 263912, 57125, -253452, -334541, -352257, -248407, -132616, -276533, -289053, -152972, -319401, -300958, -307672, -325962, -165989, -10000, -178308, -472360, -285093, -197969, -118240, 41636, -241730, -247081, 90604, -249833, -19692, -52765, -228513, 67745, -59710, -236422, -127050, -173626, -375451, -388004, -291247, -159448, -264647, -178663, -112737, -60968, 272186, 198708, -44879, -65946, -111276, -131470, -118597, 140433, -42710, -92758, -190412, -437335, -353682, -320204, -268311, -249797, -294912, -187991, -66498, -64814, 51789, 17407, -163323, -360004, -93298, -74130, -325660, -97849, -163753, -199723, -238447, -312027]
2749c12027p1487M7018K79818J20952j18545m4596k51115l49818M09987J60621
2739a29192k42417J2699K17053p6843P0995J88207j88802Q0967J46963j28273
2729d8643M2196p5040J46347k15294j91042L4138N5253j48441R4409J92992l03732
2718d16857P3185K8984j80741L36483M1829l01337p3651J85340l0510j7610l4008
2707c88893j07673L83674n4379n3095j13296j34804K3722J80725J4920n5698J31704
2696a73093j05231j4349J25945K54864j6439j50546j42843j83437j52085J95400
2686c61814K690l615n5492j88996K48680L2520P7658p338J17429m6775j5515n0258
2674b50826j34299q1815K20410p4120K93955L12991J3107k91501r8336N4352m3154
$$ y = [-312027, -383514, -336496, -56678, 64274, -54271, -98867, -349982, -699800, -289813, -129192, -371609, -358910, -141857, -218700, -147705, 40502, -148300, -67333, 79630, -48643, -6447, -81487, 64860, -150434, -341476, -307338, -252085, -400526, -306117, -113125, -416857, -343672, -314688, -495429, -158946, -117117, -418454, -492105, -306765, -337275, -354885, -388893, -496566, -112892, -167271, -220366, -333662, -468466, -444744, -264019, -249099, -304797, -173093, -278324, -292673, -166728, 88136, 71697, -78849, -221692, -405129, -557214, -361814, -359124, -362739, -418231, -607227, -358547, -326027, -248369, -255707, -138278, -185053, -200568, -250826, -385125, -466940, -246530, -320650, -26695, 286296, 299403, 7902, -90434, -36082, -79236]
2663g9236j6895K81079l17774k19277O7719j53114K5553J82937k21090J09209
2653c40889O2693j51446k0048K1759L04767J09822j70565j48234P9851R649R8463
2642a44178o5673J90463r8149K14220j40421n1925k51357j19280M89946q313k58768
2631b43435k2902R1265q5666Q3952k63144K39643O249j34454J00274p7952J59927
2620a46243O2326L5926J6763O9331j46675j57889m2863J37335K17706j77203J77938
$$ y = [-79236, -96131, 184948, -132826, -352103, -284384, -437498, -411945, -229008, -450098, -340889, -278196, -429642, -449690, -427931, -123164, -13342, -183907, -332141, -252290, -242641, -144178, -209851, -19388, -117537, 96683, -43738, -95663, -347020, -466300, 23646, 15333, -243435, -266337, -175072, -260738, -176786, -439930, -200287, -194038, -328492, -228218, -306170, -146243, -83917, -47991, -31228, 38103, -108572, -266461, -309324, -171989, 45717, -131486, 46452]
$$ [...]
##END NTUPLES=NMR SPECTRUM
##END=
