##TITLE=1H_CA-9249-4
 CDCl3
 8 sc, 
 4.3.2024
##JCAMPDX= 6.0         $$ Bruker NMR JCAMP-DX V2.0
##DATA TYPE= NMR SPECTRUM
##DATA CLASS= NTUPLES
##ORIGIN= UXNMR, Bruker Analytische Messtechnik GmbH
##OWNER= root
$$ XWIN-NMR		Version 3.5
$$ Mon Mar  4 14:10:58 2024 Russian Standard Time (UT+4h)  she@DPX200
##.OBSERVE FREQUENCY= 200.1313
##.OBSERVE NUCLEUS= ^1H
##.ACQUISITION MODE= SIMULTANEOUS
##.ACQUISITION SCHEME= undefined
##.AVERAGES= 8
##.DIGITISER RES= 18
##SPECTROMETER/DATA SYSTEM= spect
##.PULSE SEQUENCE= zg30
##.SOLVENT NAME= CDCl3
##.SHIFT REFERENCE= (INTERNAL, CDCl3, 0, 15.456)
##AUDIT TRAIL= $$ (NUMBER, WHEN, WHO, WHERE, WHAT)
$$ ##TITLE= Audit trail, XWIN-NMR		Version 3.5
$$ ##JCAMPDX= 5.01
$$ ##ORIGIN= Bruker BioSpin GmbH
$$ ##OWNER= she
$$ F:/spectra/data/she/nmr/H-F/1/pdata/1/auditp.txt
$$ ##AUDIT TRAIL=  $$ (NUMBER, WHEN, WHO, WHERE, WHAT)
(   1,<2024-03-04 14:09:31.09 +0400>,<she>,<DPX200>,
      <created by zg, POWCHK disabled, PULCHK disabled
       configuration hash MD5:
       00 E9 B6 7A A2 85 ED C7 34 08 36 98 17 FE 4E 26
       data hash MD5: 16K
       C4 5B D7 F0 DB 4A B7 A2 9C 67 32 BF 47 D3 12 D3>)
(   2,<2024-03-04 14:09:33.50 +0400>,<she>,<DPX200>,
      <Start of raw data processing
       efp BC_mod = 2 LB = 0.24 FT_mod = 6 PKNL = 1 PHC0 = -24963.77 PHC1 = 17.65264 SI = 16K 
       data hash MD5: 16K
       76 94 9D 99 86 33 FD 03 64 45 3E 89 1F C9 26 3E>)
(   3,<2024-03-04 14:10:05.62 +0400>,<she>,<DPX200>,
      <pk PHC0 = 22.64161 PHC1 = -4.8 
       data hash MD5: 16K
       E0 18 FF 5E D9 37 B1 9E 23 3F F3 9D E3 21 E3 7F>)
(   4,<2024-03-04 14:10:08.98 +0400>,<she>,<DPX200>,
      <abs ABSG = 5 
       data hash MD5: 16K
       8C 4D B3 B7 C7 44 B6 25 AD DD 8A 02 21 82 57 09>)
$$ ##END=
$$ 
$$ hash MD5
$$ 2C 97 0C 48 87 FD 3B CC 35 E8 2E 8C 87 02 12 55
##$RELAX= 
##$RELAX= 
##$RELAX= 
##$RELAX= 
##$RELAX= 
##$RELAX= 
$$ Bruker specific parameters
$$ --------------------------
##$DU= <F:/spectra>
##$EXPNO= 1
##$NAME= <H-F>
##$PROCNO= 1
##$TYPE= <nmr>
##$USER= <she>
##$AMP= (0..31)
100 100 100 100 100 100 100 100 100 100 100 100 100 100 100 100 100 100 
100 100 100 100 100 100 100 100 100 100 100 100 100 100 
##$AQSEQ= 0
##$AQ_mod= 1
##$AUNM= <au_zg>
##$AUTOPOS= <>
##$BF1= 200.13
##$BF2= 200.13
##$BF3= 200.13
##$BF4= 200.13
##$BF5= 200.13
##$BF6= 200.13
##$BF7= 200.13
##$BF8= 200.13
##$BYTORDA= 1
##$CFDGTYP= 0
##$CFRGTYP= 5
##$CHEMSTR= <none>
##$CNST= (0..31)
1 1 145 1 1 1 1 1 1 1 1 1 1 1 1 1 1 1 1 1 1 1 1 1 1 1 1 1 1 1 1 1 
##$CPDPRG= <>
##$CPDPRG1= <>
##$CPDPRG2= <>
##$CPDPRG3= <>
##$CPDPRG4= <mlev>
##$CPDPRG5= <mlev>
##$CPDPRG6= <mlev>
##$CPDPRG7= <mlev>
##$CPDPRG8= <mlev>
##$CPDPRGB= <>
##$CPDPRGT= <>
##$D= (0..31)
0 1.2 0 0 0 0 0 0 0 0.06 0 0.03 0 0 0 0 0.0002 0 0 0 0 0 0 0 0 0 0 0 0 
0 0 0 
##$DATE= 1709546970
##$DBL= (0..7)
120 120 120 120 120 120 120 120 
##$DBP= (0..7)
150 150 150 150 150 150 150 150 
##$DBP07= 0
##$DBPNAM0= <>
##$DBPNAM1= <>
##$DBPNAM2= <>
##$DBPNAM3= <>
##$DBPNAM4= <>
##$DBPNAM5= <>
$$ [...]
##$SUBNAM3= <"">
##$SUBNAM4= <"">
##$SUBNAM5= <"">
##$SUBNAM6= <"">
##$SUBNAM7= <"">
##$SUBNAM8= <"">
##$SUBNAM9= <"">
##$SW= 18.0517328524113
##$SWIBOX= (0..15)
0 0 2 0 0 0 0 0 0 0 0 0 0 0 0 0 
##$SW_h= 3612.71676300578
##$TD= 16384
##$TD0= 1
##$TE= 0
##$TE2= 300
##$TE3= 300
##$TEG= 300
##$TL= (0..7)
0 120 120 120 120 120 120 120 
##$TP= (0..7)
150 150 150 150 150 150 150 150 
##$TP07= 0
##$TPNAME0= <>
##$TPNAME1= <>
##$TPNAME2= <>
##$TPNAME3= <>
##$TPNAME4= <>
##$TPNAME5= <>
##$TPNAME6= <>
##$TPNAME7= <>
##$TPOAL= (0..7)
0.5 0.5 0.5 0.5 0.5 0.5 0.5 0.5 
##$TPOFFS= (0..7)
0 0 0 0 0 0 0 0 
##$TUNHIN= 0
##$TUNHOUT= 0
##$TUNXOUT= 0
##$USERA1= <user>
##$USERA2= <user>
##$USERA3= <user>
##$USERA4= <user>
##$USERA5= <user>
##$V9= 5
##$VALIST= <valist>
##$VCLIST= <CCCCCCCCCCCCCCC>
##$VD= 0
##$VDLIST= <DDDDDDDDDDDDDDD>
##$VPLIST= <PPPPPPPPPPPPPPP>
##$VTLIST= <TTTTTTTTTTTTTTT>
##$WBST= 1024
##$WBSW= 4
##$XGAIN= (0..3)
0 0 0 0 
##$XL= 0
##$YL= 0
##$YMAX_a= 777230
##$YMIN_a= -790334
##$ZGOPTNS= <>
##$ZL1= 120
##$ZL2= 120
##$ZL3= 120
##$ZL4= 120
##$ABSF1= 15.50009
##$ABSF2= -2.55176
##$ABSG= 5
##$ABSL= 3
##$ALPHA= 0
##$AQORDER= 0
##$ASSFAC= 0
##$ASSFACI= 0
##$ASSFACX= 0
##$ASSWID= 0
##$AUNMP= <proc_1d>
##$AZFE= 0.1
##$AZFW= 0.1
##$BCFW= 0
##$BC_mod= 2
##$BYTORDP= 0
##$COROFFS= 0
##$CY= -3
##$DATMOD= 1
##$DC= 0
##$DFILT= <>
##$DTYPP= 0
##$F1P= 0
##$F2P= 0
##$FCOR= 1
##$FTSIZE= 16384
##$FT_mod= 6
##$GAMMA= 0
##$GB= 0
##$INTBC= 1
##$INTSCL= 3.70164e-10
##$ISEN= 128
##$LB= 0.24
##$LEV0= 0
##$LPBIN= 0
##$MAXI= 10000
##$MC2= 0
##$MEAN= 0
##$ME_mod= 0
##$MI= 1.114404
##$NCOEF= 0
##$NC_proc= -5
##$NLEV= 6
##$NOISF1= 3.799351
##$NOISF2= 2.8
##$NSP= 0
##$NTH_PI= 0
##$NZP= 0
##$OFFSET= 15.45601
##$PC= 1
##$PHC0= -24941.13
##$PHC1= 12.85264
##$PH_mod= 1
##$PKNL= yes
##$PPARMOD= 0
##$PSCAL= 0
##$PSIGN= 0
##$REVERSE= no
##$SF= 200.130013145698
##$SI= 16384
##$SIGF1= 3
##$SIGF2= 2
##$SINO= 5.538805
##$SIOLD= 16384
##$SREGLST= <1H.CDCl3>
##$SSB= 0
##$STSI= 16384
##$STSR= 0
##$SW_p= 3612.71676300578
##$SYMM= 0
##$S_DEV= 0
##$TDeff= 16384
##$TDoff= 0
##$TI= <>
##$TILT= no
##$TM1= 0
##$TM2= 0
##$TOPLEV= 0
##$USERP1= <user>
##$USERP2= <user>
##$USERP3= <user>
##$USERP4= <user>
##$USERP5= <user>
##$WDW= 1
##$XDIM= 16384
##$YMAX_p= 386880362
##$YMIN_p= -354658
$$ End of Bruker specific parameters
$$ ---------------------------------
##NTUPLES= NMR SPECTRUM
##VAR_NAME=  FREQUENCY,     SPECTRUM/REAL,   SPECTRUM/IMAG
##SYMBOL=    X,             R,               I
##VAR_TYPE=  INDEPENDENT,   DEPENDENT,       DEPENDENT
##VAR_FORM=  AFFN,          ASDF,            ASDF
##VAR_DIM=   16384,         16384,           16384
##UNITS=     HZ,            ARBITRARY UNITS, ARBITRARY UNITS
##FACTOR=    0.220516191357247, 1,           1
##FIRST=     3093.21145742389, 0,            0
##LAST=      -519.505305581892, 0,           0
##MIN=       -519.505305581892, -354658,     0
##MAX=       3093.21145742389, 386880362,    0
$$ Real data points
##PAGE= N=1
##DATA TABLE= (X++(R..R)), XYDATA
$$ [...]
7656D32081k3900j16818n2198k8758k5134k8836K3502N0219L165j4206J9645J0882
7644B49644J3500k9170K9978k112P3280M545m0418j319m936r347M6554J6849K7243
7631C74291K932M2279N7325O3385O88N0903m3475m4951J5016L839k9660n2435
7619D40137J9530N3046j611k9006p4052n5456m7336o1899o7527p5960N5307m1514
7607A13659o3611k2012r0J9861j6015K4405k9566N0312L5021k9023j7799j4701
7595E0441N5566N4540R7958K9234J2695o382J9256r5181J366r543J2970J4984
7583B37904Q518m7459n9670p220l6612m0201l5485o3746N0918j9161k036k8761
7571d3011n3123L392L5296n3953k0941M5385l1419j8950J9315n177L5699M8720
$$ y = [432081, 408181, 291363, 239165, 210407, 185273, 156437, 179939, 230158, 233323, 219117, 238762, 249644, 263144, 233974, 263952, 261840, 335120, 339665, 299247, 297928, 292992, 283645, 330199, 347048, 374291, 377223, 419502, 476827, 540212, 540900, 591803, 548328, 503377, 518393, 522232, 492572, 440137, 459667, 512713, 511102, 482096, 408044, 352588, 305252, 243353, 175826, 99866, 155173, 113659, 50048, 28036, 27946, 47807, 31792, 56197, 26631, 76943, 111964, 82941, 65142, 50441, 106007, 160547, 258505, 287739, 300434, 294052, 313308, 218127, 219493, 209950, 222920, 237904, 246422, 198963, 139293, 132073, 95461, 55260, 19775, -43971, 6947, -12214, -14250, -43011, -96134, -92742, -57446, -111399, -132340, -86955, -118374, -137324, -118009, -123186, -87487, -38767]
7559c8767q1744n736j2897j8934N8166J062k6608k3428L1481N726m1064j5722
7547a68465m1056M9703J4352k1164n299J5920k4840M212R805R297j2687l3248
7535b03470K0177K8111k6085m467L4369M253k4005P603l3204N028K8981L5226
7523a27483k0828k0615O7982o3896J4388K3061n4471J3620Q404K7745O3829l4197
7511a02461J4843L0289j9816M0401l9014k6521K9588K0393p209L0875m3650m6673
7499a18955J863N4174k0512j4743m483l4941K0237k8607L0242N3498J4141L662
7487d4424P933j9918l2731M44Q105P211M4111M7435K902j7140M044m1397l6236
7474f9661O5930L0949l787P654R4266m9094k9517Q9538M690L5398O9098L7154
$$ y = [-38767, -120511, -126247, -139144, -158078, -99912, -98850, -125458, -148886, -117405, -111679, -152743, -168465, -209521, -159818, -145466, -166630, -171929, -156009, -180849, -176637, -166832, -157535, -170222, -203470, -183293, -155182, -181267, -185734, -151365, -147112, -171117, -163514, -196718, -191690, -162709, -127483, -148311, -168926, -100944, -164840, -150452, -127391, -181862, -168242, -159838, -132093, -68264, -102461, -87618, -57329, -77145, -36744, -75758, -102279, -72691, -52298, -59507, -28632, -72282, -118955, -117092, -62918, -83430, -98173, -102656, -137597, -117360, -145967, -115725, -62227, -48086, -44424, -36491, -56409, -89140, -88696, -80591, -73380, -29269, 18166, 21068, 3928, 7972, -33425, -69661, -3731, 27218, 23431, 31085, 125351, 76257, 46740, 136278, 140968, 176366, 245464, 282618]
7462B82618j5490l7429j7301J5639L1170q597N2536n342J1891M0087K7548J6830
7450C94160m3064m736l4938j886m520j870M5705j068N6356N1150K2372o900J9681
7437D90442O5686m9870O028m8660L9166L3017M4439l421n3619l0736j6600l125
7425D72747J9545O1627l0464j7336P2107P4678j6097O5733Q6859N1752P4773J8716
7413I34640J52419J57942J06620N7156M5519L442L0699j5015j9406R4940L4827
7402A583783M463m8750j6890l4349k0008l0126l0342k0381o0066p7320n2824J2648
7390A209838n9514j22096k5616M3275J3408k0205K2032l7662J3154K6143k1406
7379A041351l820m5022m4448m5808J8218p9170l7276L5673K0298k3102n1295k1861
$$ y = [282618, 267128, 229699, 212398, 228037, 259207, 250610, 303146, 297804, 309695, 349782, 377330, 394160, 351096, 346360, 311422, 309536, 305016, 303146, 348851, 347783, 404139, 455289, 477661, 470761, 490442, 556128, 506258, 512286, 463626, 502792, 535809, 580248, 576827, 523208, 492472, 475872, 472747, 492292, 553919, 523455, 506119, 578226, 652904, 636807, 702540, 789399, 841151, 915924, 934640, 1087059, 1245001, 1351621, 1408777, 1454296, 1457738, 1488437, 1473422, 1454016, 1548956, 1583783, 1588246, 1539496, 1522606, 1488257, 1468249, 1438123, 1407781, 1387400, 1327334, 1250014, 1197190, 1209838, 1150324, 1028228, 1002612, 1045887, 1059295, 1039090, 1061122, 1023460, 1036614, 1062757, 1041351, 1037531, 992509, 948061, 902253, 920471, 841301, 804025, 839698, 859996, 836894, 785599, 763738]
7367G63738J6182j5087P4639N1874J1602P5813K3922N9127J06665J44501O2495
7356A375471N3342J5754j4979n3215l3217J8769L9824j7592r6155o3738n6922
7345A167342r2920j30696j19710p2040o5432m1730K273q5884k9292N467j07513
7334D29865K3394O626r356m34O2629L135q154J2302j9887r784l6506J2078N5717
7321E21625J0662K18m0074M546P2738p278J07834o5209J0635N9662n0369k0871
7309F04119k8032j2759k3740l7720j591R6606M383j3662k8551r7n1952q651j2164
7296D86189j8013L1944k9488n568n1072q1005o4473l2692n021Q757l9101P308
7284B07765o0986n7058P140J2549L1125P237L7019k1075K4869N4276k8612n4152
$$ y = [763738, 779920, 764833, 839472, 891346, 902948, 978761, 1002683, 1061810, 1168475, 1312976, 1375471, 1428813, 1444567, 1429588, 1376373, 1343156, 1361925, 1401749, 1384157, 1288002, 1224264, 1167342, 1074422, 943726, 824016, 751976, 686544, 644814, 647087, 561203, 531911, 537378, 429865, 453259, 459885, 450529, 450095, 512724, 515859, 507705, 520007, 500120, 490336, 453830, 465908, 521625, 532287, 532505, 492431, 496977, 569715, 562437, 670271, 605062, 615697, 675359, 624990, 604119, 576087, 563328, 539588, 501868, 500277, 596883, 601266, 587604, 559053, 558956, 507004, 498353, 486189, 468176, 500120, 470632, 465064, 413992, 332987, 268514, 235822, 230801, 239558, 200457, 207765, 146779, 89721, 96861, 109410, 140535, 147772, 184791, 163716, 188585, 242861, 214249, 160097]
7272A60097o6046O6452K0788l9756O3792q3016j43224J1476O4327j9152j8698
7261A7040l8758m3953K6731L9393M0939k8550o2932N889n051k0551q817j1800
7249i0420R555k2298K6691R885j5326O561R426K6915k5580M582j785K2698q826
7236d7922m9168o3662R747o302L91N3367q595m6641j4502L2093P315J6184k534
7223a20229K662r930j8355J9730O6616J8281L2000o4148l5908J2467j1551m835
7211a13200J0055L2232O216n7892M7197L802K9279j853R565M544K0517N1096o852
7198C4706J9741k793j4431L0123q02K5957j8927o9020o998O6293L6331q3473J2573
7185B9280k089L33m1884l441K3828P8675l4797J3702M0618K7853K5037o6545L5231
$$ y = [160097, 94051, 160503, 181291, 141535, 205327, 122311, -20913, -9437, 54890, 35738, 17040, -21718, -65671, -38940, 453, 41392, 12842, -50090, -44201, -49252, -69803, -78620, -90420, -80865, -103163, -76472, -66587, -81913, -75352, -65926, -39011, -64591, -60009, -61794, -39096, -47922, -97090, -160752, -151005, -157307, -156916, -103549, -112144, -158785, -173287, -141194, -133879, -117695, -120229, -117567, -127497, -145852, -126122, -59506, -41225, -9225, -73373, -109281, -96814, -108365, -113200, -103145, -70913, -64697, -122589, -75392, -71590, -42311, -44164, -34599, -30055, -9538, 41558, 34706, 54447, 51654, 37223, 67346, 66544, 92501, 73574, 4554, -2444, 63849, 100180, 16707, 29280, 27191, 27524, -14360, -17801, 6027, 84702, 49905, 63607, 104225, 132078, 157115, 90570, 125801]
7172A25801R8687k3555Q742N300N1298k0126k6694J6637n2045k5645m1803k4085
7160I2512R17K710k2985j7363N944j2622O1038K9008m5242J9420N8854j6357L8199
7147A94033M7348l1040N7279j3468J2374R1307M4609N1981O7870l527N7624O5938
7135F42328p081k030j8019n1848J773k1403r8801l1511J4606J4628Q791K35M4265
7122D95933M5528m035M7654j1305J4449R5271O865Q5945J7603N547n632o2514
7110G31309j26281q5485j13553m520n876r6922k7021k4228M5993o9901M195p7715
7098A49995m7833J5220k4172J7282m209J0026N2900k2682j8395O301m654l8751
7086I1028n073M0630r952n2547L1184J1205p387K3955L1569K4731k5433K670Q263
$$ y = [125801, 224488, 200933, 209675, 214975, 266273, 246147, 219453, 236090, 184045, 158400, 116597, 92512, 93429, 96139, 73154, 55791, 61735, 49113, 110151, 139159, 93917, 113337, 172191, 155834, 194033, 241381, 210341, 267620, 254152, 266526, 357833, 402442, 454423, 522293, 518766, 576390, 642328, 635247, 633217, 615198, 563350, 565123, 543720, 444919, 413408, 428014, 442642, 451433, 451668, 495933, 541461, 537426, 585080, 573775, 588224, 683495, 690360, 776305, 793908, 799455, 793823, 731309, 605028, 519543, 405990, 401470, 395594, 298672, 271651, 247423, 293416, 223515, 227710, 149995, 102162, 117382, 93210, 110492, 106283, 116309, 169209, 146527, 128132, 134433, 129779, 91028, 85955, 126585, 116633, 64086, 95270, 106475, 99088, 123043, 154612, 179343, 153910, 156580, 164843]
7073A64843O4501M1744O1557K7176N2122R2126J22086M5627K4687J2917Q454J4359
7061G32199j0388k3925k1647j40211p0439k2201o7473p645k4538n9300M8729n3053
7049B80108J085L8165j325o148N7546K9433M3990J25870L0968L1497N0397Q1821
7037G63407n2503O300J8801j00226n7997q5383r4488l7253k8420p9974m6295n4744
7025A51225J0207O412q2961k8030m7372m5853K4160J4710j6413O209k1695j010
7013c0411k8119J4384l6006N9388j9955m1662n7446j1637L3863M0441j3647k54
7001i1061j7077k7479l292J00986q341m4701M5691j826j6769q0229o88k8897k7192
6988b00875Q2046N0731l8831n3780m984M9088k9484M8470J3900N5126O667R562
$$ y = [164843, 229344, 271088, 332645, 359821, 411943, 504069, 626155, 671782, 696469, 709386, 717840, 732199, 721811, 697886, 676239, 536028, 465589, 443388, 375915, 368270, 343732, 284432, 333161, 280108, 281193, 319358, 318033, 311885, 369431, 398864, 442854, 568724, 599692, 631189, 681586, 763407, 710904, 717204, 736005, 635779, 577782, 492399, 397911, 360658, 332238, 252264, 205969, 151225, 161432, 167844, 84883, 56853, 9481, -36372, -12212, 2498, -13915, -7706, -29401, -30411, -58530, -44146, -80152, -20764, -40719, -82381, -139827, -151464, -117601, -77160, -90807, -91061, -108138, -135617, -138909, -37923, -46264, -90965, -45274, -47100, -63869, -144098, -144786, -173683, -200875, -118829, -68098, -106929, -160709, -165693, -116605, -146089, -97619, -83719, -28593, -21926, -12364]
6976a2364K2835j8616K6319n3312M570n5131n4012k8074J2042J7537K817q626
6964a44015Q064J1464J8480p4658L4289k0218n1655N1137j693l2599m947M5230
6952a61121K2913k9694k0026J1776k9979O0027k7596L4808K8k2200k8841M1674
6940a48231j2183k9175N8047K4302l4382o4005J3523J7911p051M9317j8110M316
6928a45721l8315l6272O0345n341M8877j9683m9582j7991k5168P5445l6841l5174
6916b25421M710J7909J8378l1078K5370Q483k195P382l8651Q426L8543k3n2390
6903b20557k7050L0987M4368k9000k4459L5392K1528k256j1258q868K884M9237
6891a39052J645m0322l7565k8513L0503l3493k7962L1608N0728L3494p167J4288
$$ y = [-12364, 10471, -8145, 18174, -35138, -30568, -85699, -139711, -167785, -155743, -138206, -135389, -144015, -135951, -124487, -106007, -180665, -146376, -166594, -218249, -167112, -168805, -201404, -206351, -161121, -138208, -167902, -187928, -176152, -206131, -146104, -173700, -138892, -138864, -161064, -189905, -148231, -160414, -189589, -131542, -107240, -141622, -205627, -192104, -174193, -181244, -131927, -150037, -145721, -184036, -220308, -159963, -165304, -116427, -136110, -185692, -203683, -228851, -153406, -190247, -225421, -220711, -202802, -184424, -215502, -190132, -181649, -183844, -176462, -215113, -206687, -168144, -168167, -220557, -247607, -216620, -172252, -201252, -225711, -190319, -168791, -171047, -182305, -191173, -188289, -139052, -137407, -177729, -215294, -243807, -213304, -246797, -274759, -243151, -192423, -158929, -166096, -151808]
6879a51808N720l7502m8833K3016o333j5363P879N2073K7848o6546L6677M7703
6867a25469n7875l9300O162m3286l4293K1788J9885L0161j4627P0964l1463n5156
6855b52509K8994M5216j4613k894L3687L7642L0737o0471p2977L5905K5838K2576
6843a42869j0356m8893q843l0007L0819M8251l0159l4118K6735P672j8305N8446
6831a51627j1913j2912L2999j4337J1025O98n2677M5913q551k2519k1060M0609
6819a64352k53o7803M5026K3750P649j0040m5481l1349M0180k6015L1697j7569
6807b14560k12L7832N588K429O584R171L4564l7643J6877L4307k9991k6676l6312
6794a98042k4610L4020J6928j0488J3118Q881j4523j0709J8137L7022K5706m4960
$$ y = [-151808, -146088, -183590, -232423, -209407, -215740, -231103, -223224, -171151, -143303, -209849, -173172, -125469, -183344, -222644, -216482, -259768, -294061, -272273, -252388, -222227, -236854, -165890, -197353, -252509, -223515, -178299, -192912, -195806, -162119, -124477, -93740, -154211, -227188, -191283, -165445, -142869, -153225, -202118, -210961, -240968, -210149, -161898, -192057, -226175, -199440, -191768, -210073, -151627, -163540, -176452, -143453, -157790, -146765, -146067, -198744, -152831, -161382, -183901, -204961, -164352, -164605, -232408, -187382, -163632, -155983, -166023, -211504, -242853, -202673, -228688, -196991, -214560, -214772, -176940, -171352, -168923, -162339, -153168, -118604, -156247, -139370, -105063, -135054, -161730, -198042, -222652, -188632, -171704, -182192, -169074, -160193, -174716, -185425, -167288, -130266, -104560, -149520]
6782a49520m9783K6637J2926l4396L8283K1162N5688K696n6309l0786l7924k8088
6770b29414M2917L2341L4376j6772k447K52l435j278p6976J8166K6061M0719K0124
6757a15366n0168k4480J9128K5496K0775m2201m8988N8393n793k0213j999L158
6745a82258K9833J5184J3686m968m6977k9400K7262j6972J027j3847P62M0864
6733a65804Q804J8604L0054J019n1069O828N0869l2864m0910L3132M1453Q556
6721i1328j4240q705k3189l3291k4969L4404M2097k7235J0391J6877j1223K6986
6709a03425L5768j5105q3226L1868L7226k9535M7973K2377m0854m926l3473j9982
6697a55314l4460l586L5988p327J5487k41k1878j3810Q977Q124O1044j6607n9127
$$ y = [-149520, -199303, -172666, -159740, -194136, -155853, -134691, -79003, -76307, -132616, -163402, -201326, -229414, -186497, -154156, -119780, -136552, -138999, -138747, -142182, -143460, -220436, -202270, -176209, -135490, -115366, -165534, -190014, -170886, -145390, -124615, -166816, -215804, -157411, -163204, -183417, -185416, -182258, -152425, -137241, -123555, -128523, -175500, -204900, -177638, -194610, -193583, -207430, -206668, -165804, -157000, -138396, -108342, -107323, -158392, -151564, -100695, -133559, -174469, -141337, -99884, -91328, -105568, -114273, -137462, -170753, -195722, -161318, -119221, -146456, -136065, -119188, -130411, -103425, -67657, -82762, -165988, -134120, -96894, -126429, -78456, -56079, -96933, -101859, -135332, -155314, -189774, -193360, -157372, -164699, -149212, -149453, -171331, -185141, -176164, -168040, -106996, -123603, -182730]
6684a82730J6765N3918k0088J8301l4074j3159J5889O839k0242R514j3623q207
6672a70897N30K0365L2629O213J5514r37l972m6911K9069J6740M2228M088l8118
6659i3459L4173K8182o9743o3607M9329M0158k1356R591K0251J0915k7019l6547
6647a19132j8556o72O7532k7953K2857J674j3781L2919o0216J8254j5145O798
6635a05421n592N776n176n233O4034k0117l2230L6037j3315J6390N9246j4185
6623a9786m5199l4073L1415J4072L9441K4603k4967n9067p299k2206m8847O6238
6611h5675O7036o022k2914J9133P546j7146K6121J5972n4728k393l416O5090k8408
6598a9804j277J2253r662k4967N987j707K0287J8985L82m535K8160Q731n0533
$$ y = [-182730, -165965, -112047, -132135, -113834, -147908, -161067, -145178, -138339, -158581, -149067, -162690, -170897, -170367, -150002, -117373, -111160, -95646, -96583, -100555, -147466, -118397, -101657, -59429, -55341, -93459, -59286, -31104, -100847, -164454, -115125, -74967, -96323, -86732, -66481, -55566, -82585, -119132, -137688, -138360, -70828, -98781, -75924, -74250, -88031, -55112, -115328, -97074, -112219, -105421, -111013, -105237, -110413, -115646, -51612, -71729, -103959, -67922, -81237, -64847, -5601, -19786, -64985, -99058, -67643, -53571, -14130, 10473, -14494, -73561, -80860, -103066, -151913, -85675, -18639, -24661, -47575, -28442, -20896, -38042, -11921, 4051, -50677, -53070, -56486, 8604, -19804, -21081, -8828, -18490, -43457, -37470, -39177, -18890, 95, 477, -4058, 24102, 32833, -17700]
6585a7700o422l282M6298l7969K4979L3419l3882J1939J7493n5322k356O7465
6573D4660j6945j2004K4610j9868m3390M1834p689N9712K1768j4314L2699j8347
6561I2726k519m0050j3559m3965L6094j7234P345J2403K5158K0081L0482j0601
6549I6361k9525L1731L5825J4901O5518Nn700R262P338L1470J7154N2340O3053
6536C89733O3206q574L0402L8284m189m6907m0874p9878j945j9753n9578m1125
6524B18802m3804K1375N3782j9082k6402L8368K3811k5866P562M5858j4209J1334
6512B91529L7574K5704K9104K4128O076j5670l2331k7496q5100O102Q816n2439
6500B15997l877n1769L0519k9701n03J8876j2489m242n7846k6595O733N1092j7637
$$ y = [-17700, -24122, -27404, 18894, -19075, 5904, 39323, 5441, 17380, 34873, -20449, -22805, 44660, 27715, 15711, 40321, 20453, -22937, 18897, 11208, 70920, 92688, 78374, 111073, 92726, 90207, 50157, 36598, -7367, 28727, 11493, 18838, 31241, 56399, 76480, 106962, 96361, 66836, 98567, 134392, 149293, 214811, 214816, 209116, 218378, 225716, 257186, 274340, 326680, 389733, 452939, 444365, 474767, 513051, 508862, 461955, 421081, 341203, 339258, 319505, 259927, 218802, 174998, 196373, 250155, 231073, 204671, 243039, 266850, 240984, 248546, 294404, 280195, 291529, 329103, 354807, 383911, 408039, 414115, 398445, 366114, 338618, 253518, 259620, 268436, 215997, 212120, 160351, 190870, 161169, 160666, 179542, 167053, 162811, 104965, 78370, 85103, 136195, 118558]
6487A18558L805n64K8455k7397j3527J2258K3421N9025j9512r1166J7271Q37m798
6474A06666j230K5718o496R888M3193r800n579L243L732K6462j007k9754r665
6461A55371o5335j1120J1617Q2567l1556j7072K5909j4210m644P4369L295j0051
6449A99140J4800j7223L4334m0494m6167M893N6827q479n2018l116N984J9126
6437A67607J2935L6343J1713j4618P275l679k3502J6797l3667J5258L9263M513
6425B36238j1495L4121J6252J0012J6511m9691k4537J2995P339K1555m0100L9385
6413B68585M9940l1910k6381k6420J5996o0186p416N6633J2837L8219P427j3223
6401B84101N806j9240k4898O9210K4907n533K4728J3045k828n774L3980j0026
$$ y = [118558, 122363, 121799, 150254, 122857, 109330, 121588, 145009, 204034, 184522, 93356, 110627, 111464, 106666, 105436, 131154, 124658, 134546, 177739, 167939, 162360, 165603, 169335, 195797, 194790, 165036, 155371, 90036, 78916, 90533, 173100, 141544, 124472, 150381, 136171, 131527, 205896, 209191, 199140, 213940, 196717, 231051, 190557, 144390, 149283, 206110, 197631, 145613, 142497, 148481, 167607, 180542, 216885, 228598, 213980, 221255, 217576, 194074, 210871, 177204, 192462, 231725, 236238, 224743, 258864, 275116, 285128, 301639, 251948, 227411, 240406, 247745, 269300, 229200, 268585, 318525, 286615, 260234, 233814, 249810, 189624, 182208, 238841, 251678, 289897, 297324, 284101, 289907, 270667, 245769, 314979, 339886, 334353, 359081, 372126, 369298, 363524, 397504, 387478]
6389C87478J3117j3886k2663j6078K9897L7806n8431k6956j385M1120k1543n2089
6377B96387J7697K2077K5807l5961k8704M3876J2123J8633j4284j9640J77P029
6365C45217L4101l1813L6591M4735k2872k5519K3438l8903K8166N6729j0563k0162
6353D19145Q950j7440O2843K6592K1509Q673j1363M252q909K4637j4235j3148
6341E11506j7338l9050M3235K5899M0308K5478L3961n4937K4402R0126K6888k9669
6329F80809j5780K3988J889j2284K6236M7262q252L437k7911M302n154P7326N978
6316H01846P895K5773P0885m282M3665j9671K3380Q003n653K5831N5353O3812
6304A096837m3628J2250j0197J2165J0800p99L2571M8357k648N5052m5855k213
$$ y = [387478, 400595, 386709, 364046, 347968, 377865, 415671, 357240, 330284, 328899, 370019, 348476, 296387, 314084, 336161, 361968, 326007, 297303, 341179, 353302, 371935, 357651, 338011, 338188, 345217, 379318, 347505, 384096, 428831, 405959, 380440, 403878, 364975, 393141, 449870, 439307, 419145, 428095, 410655, 473498, 500090, 521599, 530272, 518909, 523161, 514252, 538889, 524654, 511506, 494168, 455118, 498353, 524252, 564560, 590038, 623999, 569062, 593464, 683590, 710478, 680809, 665029, 689017, 690906, 678622, 704858, 752120, 743868, 747305, 719394, 723696, 718542, 795868, 801846, 809741, 835514, 906399, 902117, 945782, 926111, 949491, 957494, 951841, 977672, 1033025, 1096837, 1053209, 1065459, 1055262, 1067427, 1078227, 1077428, 1109999, 1158356, 1155708, 1210760, 1164905, 1162692]
6292A162692N7045J6787K1263M0356Q5625o720J6834O3664N8236l579P1827Q944
6280A592974L5041N3394K4701M4370K6220K6245l9693K2201k096j9246L3841k2662
6268A775290k4587K7540M8977K6993P198J4022k062N6395K0354m9974Q7701K4161
6256B012008l8260N2203N5195M9795L588k1228O458M8357N8895Q7382l4108Q481
6244B288766J11632O228k7008n4438m7041N4928k0897J768O7622M7598M8774N130
6232B483062K7363l6487J4708J8926n7839K3613R264p911n3267K360J3837r08
6220B436721L8188K3539K3992j812j8743k2259N3983K5579R515L4015o994L8111
6208B633835Q5321J1706M6454Q5249K387J2733O703J6819K2698j5842L9981L4029
$$ y = [1162692, 1219737, 1236524, 1257787, 1298143, 1383768, 1377048, 1393882, 1457546, 1515782, 1512203, 1584030, 1592974, 1628015, 1681409, 1706110, 1750480, 1776700, 1802945, 1763252, 1785453, 1783357, 1764111, 1797952, 1775290, 1750703, 1778243, 1827220, 1854213, 1861411, 1875433, 1873371, 1929766, 1950120, 1900146, 1987847, 2012008, 1973748, 2025951, 2081146, 2130941, 2134529, 2113301, 2119759, 2168116, 2227011, 2314393, 2280285, 2288766, 2400398, 2406626, 2379618, 2325180, 2278139, 2333067, 2312170, 2313938, 2381560, 2429158, 2477932, 2483062, 2510425, 2473938, 2488646, 2507572, 2449733, 2473346, 2482610, 2474699, 2421432, 2423792, 2437629, 2436721, 2474909, 2498448, 2522440, 2520628, 2501885, 2479626, 2533609, 2559188, 2568703, 2602718, 2595724, 2633835, 2719156, 2730862, 2777316, 2862565, 2864952, 2877685, 2884388, 2901207, 2923905, 2908063, 2948044, 2982073]
6196B982073m1948l083L8386M615j3914j1234M7483J3578q770M4355O5553L7972
6184C155066J1342M2262K7081K3498J05992P0335J6718M5860j1068R1749R0316
6173C669151M9947O8483N0050P0290P2275J2050O6031M8210R1707J13992P7642
6162D389828O4584R3787J80129J83614J41001J47396J24974J08375J47049J78848
6152E759585K16544K93933K89741L18748L13466K76347L68657L85992M04721M97072
6142I124806N78578N11222M25897K28959P9534n9245j29769j40837m8833j42581
6132A0427731j26562j01252k2208O693J0657J66820J46259J53454K17169L08110
6122A1186871M04224M99657N45450O68069P66166R47178J003041J094357J135213
$$ y = [2982073, 2940125, 2937042, 2975428, 2980043, 2966129, 2954895, 3002378, 3015956, 3007186, 3051541, 3117094, 3155066, 3166408, 3208670, 3235751, 3259249, 3365241, 3435576, 3452294, 3498154, 3487086, 3578835, 3669151, 3719098, 3787581, 3837631, 3907921, 3980196, 3992246, 4058277, 4106487, 4198194, 4312186, 4389828, 4454412, 4548199, 4728328, 4911942, 5052943, 5200339, 5325313, 5433688, 5580737, 5759585, 5976129, 6270062, 6559803, 6878551, 7192017, 7468364, 7837021, 8223013, 8627734, 9124806, 9703384, 10214606, 10640503, 10869462, 10948996, 10889751, 10759982, 10619145, 10570312, 10427731, 10301169, 10199917, 10177709, 10184402, 10195059, 10361879, 10508138, 10661592, 10878761, 11186871, 11591095, 12090752, 12636202, 13304271, 14070437, 15017615, 16020656, 17115013, 18250226]
6113A8250226R93954O59195J28861l63517o50388p49879q19290p71299o53247
6104A6024616n47980n32115m46263l42988j95547j19576j20981k0439R1264J56717
6094A3946708K37118L21969L77217M64711M41454M50575N60983M93451M41207
6085A7735393K50060n4403l02853m22664m80169n09978n27385n00283m27871l72560
6075A4387287l42930l14204k68955j59046q3176O083P0745P3064R2139J37219
6065A3598226J18029L0538p2432j84510k74146j69700j01446j45904n5227n8187
6055A2685241k7373K9471l1533P965o530O982P3677R2221R5036J62015K16569
6044A3303741J73414K96922L16293L06365J98919K35173K32564J33327J52734
$$ y = [18250226, 19244180, 19903375, 20032236, 19668719, 19018331, 18268452, 17449162, 16677863, 16024616, 15476636, 14944521, 14498258, 14155270, 13959723, 13840147, 13719166, 13698727, 13789991, 13946708, 14183826, 14505795, 14883012, 15347723, 15789177, 16239752, 16800735, 17294186, 17735393, 17985453, 17931050, 17628197, 17205533, 16725364, 16215386, 15688001, 15187718, 14759847, 14387287, 14044357, 13730153, 13461198, 13302152, 13218976, 13225059, 13295804, 13368868, 13461007, 13598226, 13716255, 13746793, 13674361, 13489851, 13215705, 13046005, 12944559, 12798655, 12743428, 12685241, 12657868, 12687339, 12655806, 12663771, 12657241, 12664223, 12737900, 12830121, 12925157, 13087172, 13303741, 13477155, 13774077, 14090370, 14396735, 14595654, 14830827, 15063391, 15196718, 15349452]
6035A5349452J63804J10930J79306K05484K74975K79369K55638L37907L56490
6026A7513355L19412M04933L53492M89537N20012N22417N90797N43627O76181
6017B1933763P20216Q10406Q73853R60518J066393J138215J268085J445900J501729
6008C1719078J749782J942436K251458K506805K765313L176548L441284L864910
6000E3417614L948525L836332L290634K383849J151457j75637j177582j925995
5992F4749197k173207k172608j854073j394489r61876m58534p2333M20376R04044
5983E6986497J440936J966861K624096L228670L846674M673111N490572O324528
5975H6581945P075359P644199P589350O767640M647393J488649k385593n816229
$$ y = [15349452, 15513256, 15624186, 15803492, 16008976, 16283951, 16563320, 16818958, 17156865, 17513355, 17832767, 18237700, 18591192, 19080729, 19600741, 20123158, 20713955, 21257582, 21933763, 22653979, 23464385, 24338238, 25298756, 26365149, 27503364, 28771449, 30217349, 31719078, 33468860, 35411296, 37662754, 40169559, 42934872, 46111420, 49552704, 53417614, 57366139, 61202471, 64493105, 66876954, 68028411, 67852774, 66675192, 64749197, 62575990, 60403382, 58549309, 57154820, 56192944, 55734410, 55662077, 56082453, 56986497, 58427433, 60394294, 63018390, 66247060, 70093734, 74766845, 80257417, 86581945, 93657304, 101301503, 108890853, 115658493, 120305886, 121794535, 119408942, 113592713]
5967A13592713q028828q712843q264140p268248o102593n118551m175867l460537
5959F2461106k833943k192506j590753r88087m19950J49487O59420J241572J720430
5950E8206776K162246K560870K757450K600586K016634P51266q41133k549023
5942F7665672l919551m670961m965931m772606m405713l933658l433476l070668
5934C4493108k681418k271879k075512j817957j624204j438055j277580j157982
5926B0148521j084268j018361q79100p62284p54320p12996o01470n00365n34041
5917A3301316n26710m93706m16207m17264l23323l63169l60554k73046k67975
5908I859362k91451k73190k41731k43318k25640j80333j70670j72895j83397j49668
$$ y = [113592713, 105563885, 96851042, 88586902, 81318654, 75216061, 70097510, 65921643, 62461106, 59627163, 57434657, 55843904, 54855817, 54435867, 54585354, 55244774, 56486346, 58206776, 60369022, 62929892, 65687342, 68287928, 70304562, 71055828, 70214695, 67665672, 63746121, 59075160, 54109229, 49336623, 44930910, 40997252, 37563776, 34493108, 31811690, 29539811, 27464299, 25646342, 24022138, 22584083, 21306503, 20148521, 19064253, 18045892, 17166792, 16404508, 15650188, 14937192, 14335722, 13835357, 13301316, 12774606, 12280900, 11864693, 11447429, 11124106, 10760937, 10400383, 10127337, 9859362, 9567911, 9294721, 9052990, 8809672, 8584032, 8403699, 8233029, 8060134, 7876737, 7727069]
5898G727069j15989j40831q2623j24760j10177p7133j08748p9107q1837j09354
5888F696510q6919j28374l2416n6085j52730j33942j15137j18789q1858j58885
5878E631375j36055o8841r4997n8616j22395j52163o9498r6863l8913p9192m4626
5867D669216o4736o6082n3303o0767k7117r9639L6572K096q3359k983k0314j9320
5855D210264l4900k7052P132r7367j689M8962q1071n3955l4k1526P4347j9208
5843D003903j2066k4119M1729m387q1266p508j1915j6641k9542k592p931k5584
5831C822081j616J7051k2381J4923M1501K6941m4058k0231M6882K1126j1748n120
5819C885351N6412J7161j9937k3963j8746p19L512k961l0655j4889l4069L008
$$ y = [7727069, 7611080, 7470249, 7387626, 7262866, 7152689, 7075556, 6966808, 6887701, 6805864, 6696510, 6609591, 6481217, 6448801, 6392716, 6239986, 6106044, 5990907, 5872118, 5790260, 5631375, 5495320, 5426479, 5331482, 5272866, 5150471, 4998308, 4928810, 4831947, 4793034, 4713842, 4669216, 4604480, 4538398, 4485095, 4424328, 4397211, 4297572, 4334144, 4336240, 4252881, 4249898, 4229584, 4210264, 4175364, 4148312, 4155444, 4058077, 4056388, 4105350, 4024279, 3970324, 3970290, 3948764, 4023111, 4003903, 3991837, 3967718, 4009447, 4005060, 3923794, 3916286, 3904371, 3887730, 3858188, 3855596, 3847665, 3822081, 3820465, 3837516, 3815135, 3830058, 3871559, 3898500, 3854442, 3834211, 3881093, 3902219, 3890471, 3885351, 3941763, 3958924, 3938987, 3915024, 3896278, 3895559, 3899071, 3896110, 3865455, 3850566, 3816497, 3819505]
5807C819505n8928K0451N0093j9212q155m5198M8797J0896o5891k2572P4560M823
5795C809169j0707M7369J6168J713R824R579Q1309m222J1723L2059J3266L3433
5783D050683J4224q457j3742N1397p269M5487N3293L7837N6904R4922O4131J1001
5771D450411J2956M5147K1038N0901R6046J8679L0372N0500N7117O0357M7532
5760D941056K3547L8670K0823N0958O1479K7159P6064O597R6315O6974K7184K5715
5748E462541P9979M0222J04699P806Q7742J46955m1372M5660J30006R6797P2241
5737F233276N7969L737P3470O9508J14244J15145J01461J14333J15871J41901
5727G140915J24230J20903J34061J31309J27384J14613Q3276J53181K19080J69814
$$ y = [3819505, 3760577, 3781028, 3831121, 3811909, 3803754, 3758556, 3807353, 3818249, 3752358, 3729786, 3804346, 3809169, 3798462, 3845831, 3861999, 3863712, 3873536, 3883115, 3964424, 3960202, 3971925, 4003984, 4017250, 4050683, 4064907, 4056450, 4042708, 4094105, 4086836, 4132323, 4185616, 4223453, 4280357, 4375279, 4439410, 4450411, 4463367, 4508514, 4529552, 4580453, 4676499, 4695178, 4725550, 4776050, 4833167, 4893524, 4941056, 4964603, 5003273, 5024096, 5075054, 5136533, 5163692, 5239756, 5246353, 5342668, 5409642, 5436826, 5462541, 5542520, 5582742, 5687441, 5695247, 5782989, 5929944, 5888572, 5934232, 6064238, 6161035, 6233276, 6291245, 6294982, 6368452, 6437960, 6552204, 6667349, 6768810, 6883143, 6999014, 7140915, 7265145, 7386048, 7520109, 7651418, 7778802, 7893415, 7976691, 8129872, 8348952, 8518766]
5717H518766J91438K18364J98220K50336K17829K44884K15957K32145J12399O2160
5707A0462498J33133J00045J33012J19076J14452J15435J39660K03161K12220
5698A1732692K70905J84656J41206K09833K53353K97440K84016M30550L91643
5689A4196294M45762M53917N05180M44359L79416K80583K21513K15778K07438
5680A7350240K24705L20256L75690M71570N75970O43834P20738P69676O98482
5671B2151161M56042J58069m7337j75893j84360k00810j49661j0313J64518K63765
5661B2425181K35771K84068L13446L19900L68402L86681M11278M39963N74667
5652B5759357O54593P18053R38219J064864J217036J385703J484700J343864Q77272
$$ y = [8518766, 8710204, 8928568, 9126788, 9377124, 9594953, 9839837, 10055794, 10287939, 10400338, 10462498, 10595631, 10695676, 10828688, 10947764, 11062216, 11177651, 11317311, 11520472, 11732692, 12003597, 12188253, 12329459, 12539292, 12792645, 13090085, 13374101, 13804651, 14196294, 14642056, 15095973, 15601153, 16045512, 16424928, 16705511, 16927024, 17142802, 17350240, 17574945, 17895201, 18270891, 18742461, 19318431, 19962265, 20683003, 21452679, 22151161, 22607203, 22765272, 22717935, 22542042, 22357682, 22156872, 22007211, 21996898, 22161416, 22425181, 22660952, 22945020, 23258466, 23578366, 23946768, 24333449, 24744727, 25184690, 25759357, 26413950, 27132003, 28070222, 29135086, 30352122, 31737825, 33222525, 34566389, 35443661]
5643C5443661J52134m81733q03473p19831n48016l28760j24266P8741J94295L96656
5633C3259408N34067O11054P94703Q92870R35905R56200J018757J001862J108116
5624D1112942J134128J175682J358231J558886J695112J787045J859127J878598
5616E3559751J831602J703391J745820J735686J861254K112550K317407K465114
5608F9332575K624808K791238K989492L064371L034676K882489K707703K623853
5600I2051205K734671L114296L636945M303321N045916N934639O742041P542856
5592A31105890Q211511Q777817R117768R098993Q941016Q457802P704395O157916
5584A97573108L841482Q03693k656775n867054q452202j0013150j0928836j1248195
$$ y = [35443661, 35595795, 35114062, 34310589, 33590758, 33042742, 32713982, 32589716, 32668457, 32862752, 33259408, 33793475, 34404529, 35199232, 36092102, 37028007, 37984207, 39002964, 40004826, 41112942, 42247070, 43422752, 44780983, 46339869, 48034981, 49822026, 51681153, 53559751, 55391353, 57094744, 58840564, 60576250, 62437504, 64550054, 66867461, 69332575, 71957383, 74748621, 77738113, 80802484, 83837160, 86719649, 89427352, 92051205, 94785876, 97900172, 101537117, 105840438, 110886354, 116820993, 123563034, 131105890, 139317401, 148095218, 157212986, 166311979, 175252995, 183710797, 191415192, 197573108, 201414590, 202218283, 199561508, 193694454, 185242252, 175229102, 164300266, 153052071]
5576A53052071j1107923j0638102j0032250r279632q314142p478861o576307n787131
5568H3837723m977197m271256l698052l092912k711361k351387k030437j665775
5560E9039346j518249j319561j069435j016063r14297p62488n66802n55270l67560
5551E0949621k32692j39172j17496j76317n0244O4049J99018K71591L83013N43929
5541E1695300N73331O24652P48177Q10001J004924J152075J251060J482780J637221
5532F0979521J929643K329081K858358L375608L873666M384745M704983M777031
5524H9212636M337164L207096J567368m31270k261225l483595l960858l943355
5516H4243961l519561k816339k118207j409105q61538j48942M44385R46745J473212
$$ y = [153052071, 141944148, 131306046, 121273796, 111994164, 103680022, 96201161, 89624854, 83837723, 78860526, 74589270, 70891218, 67798306, 65086945, 62735558, 60705121, 59039346, 57521097, 56201536, 55132101, 54116038, 53201741, 52439253, 51872451, 51317181, 50949621, 50716929, 50577757, 50460261, 50283944, 50233700, 50297749, 50496767, 50768358, 51151371, 51695300, 52268631, 52893283, 53641460, 54451461, 55456385, 56608460, 57859520, 59342300, 60979521, 62909164, 65238245, 68096603, 71472211, 75345877, 79730622, 84435605, 89212636, 93549800, 96756896, 98324264, 97892994, 95631769, 92148174, 88187316, 84243961, 80724400, 77908061, 75789854, 74380749, 73519211, 73370269, 73814654, 74761399, 76234611]
5507G6234611K012563K709866L478737M508252N632896O863659Q088770R004379
5499A18533733R226426P991069M882665L3914m916660q368532r905088r885236
5491A07592291r010840p908782o698626n726334m726532l880032l167042k528254
5483F3945849j854786j320916q14790k07805L19336P53292J130071J661749K056204
5474F5668204K267582K220910J697488O75458p63025k268732l545907m282711
5466F1669267m506013m250764l831243l335832k797488k250553j863380j373110
5458C7460884j023603q90283p87011j091449j485121j603597j420187j255126
5450B7904507r27204q03776q14072q79351q15040p56508p30997o42769o15425
$$ y = [76234611, 78247174, 80957040, 84435777, 88944029, 94576925, 101440584, 109529354, 118533733, 127760159, 135751228, 140633893, 140667807, 135751147, 127382615, 117477527, 107592291, 98581451, 90672669, 83974043, 78247709, 73521177, 69641145, 66474103, 63945849, 62091063, 60770147, 59955357, 59747552, 60066888, 60820180, 61950251, 63612000, 65668204, 67935786, 70156696, 71854184, 72529642, 71766617, 69497885, 65951978, 61669267, 57163254, 52912490, 49081247, 45745415, 42947927, 40697374, 38833994, 37460884, 36437281, 35546998, 34759987, 33668538, 32183417, 30579820, 29159633, 27904507, 26977303, 26173527, 25359455, 24480104, 23665064, 22908556, 22177559, 21534790, 20919365]
5441B0919365l99222k55234j98060j1494J40711L28631N39698Q22410J059149
5432B2945954J224296R77415K22747q24462j604017j954649j647832j338591j056170
5423A6944691q48102p28878o49160o00431n13375m77029l66057l52556k66829
5414A2142274j65532j78876k3032K9271K05038K98914L92442N49419M97652L93456
5404A4141026j10353o94649r51184r81131q32286p12624n47114m22778m08534
5395H480373l25178k74342j95619k02132j49000j80907k79009k02225j13466j20367
5385F438128r7878j83107r9606q1542q4032q5397j18825o0014j6478j11272r6593
5374E403384j37635l9118n1065n0986q5175l8729m1633o3231k0256j5455p0976
$$ y = [20919365, 20520143, 20264909, 20066849, 20055355, 20196066, 20524697, 21064395, 21886805, 22945954, 24170250, 25147665, 25370412, 24545950, 22941933, 20987284, 19339452, 18000861, 16944691, 16096589, 15367711, 14718551, 14118120, 13604745, 13127716, 12761659, 12409103, 12142274, 11976742, 11797866, 11774834, 11804105, 12009143, 12308057, 12700499, 13249918, 13747570, 14141026, 14030673, 13336024, 12384840, 11403709, 10571423, 9858799, 9311685, 8888907, 8480373, 8155195, 7880853, 7685234, 7483102, 7334102, 7153195, 6874186, 6671961, 6558495, 6438128, 6340250, 6157143, 6057537, 5975995, 5891963, 5806566, 5687741, 5627727, 5611249, 5499977, 5403384, 5265749, 5226631, 5175566, 5124580, 5039405, 5000676, 4959043, 4895812, 4875556, 4860101, 4789125]
5363D789125j01763k2130J0925m1593m9044m8426n3922m380k4207R315j02774
5352D361126l7407J5808j6993K6594N0947J0847K0833O6249P0413R1017J32770
5341D792204J46625J31425J13110M0594o0412j23449j59966j91178r7607n3246
5331D538100l6239q0072q4378J1686N423P0326P1794M3294Q4905K6024J1048P4261
5319D736172O2742N2239K7143L9669p6178j60045j60922j93108j93773j26441
5309D007498j05275r7217k3142O0134n776K1220M1242O9851j346o7748J055K4979
5297C925475o6010o2984p5670q4752p3025j50303n3121j00586j24613N209J003
5286C140623O827m2518q385j35M9483j3482m3415J0966M3923J8213m3873j1156
$$ y = [4789125, 4687362, 4665232, 4676157, 4634564, 4585520, 4537094, 4483172, 4478792, 4454585, 4463900, 4361126, 4323719, 4339527, 4322534, 4349128, 4400075, 4410922, 4431755, 4498004, 4568417, 4659434, 4792204, 4938829, 5070254, 5183364, 5223958, 5163546, 5040097, 4880131, 4688953, 4591346, 4538100, 4501861, 4421789, 4337411, 4349097, 4354520, 4424846, 4496640, 4539934, 4624839, 4650863, 4661911, 4736172, 4798914, 4851153, 4878296, 4917965, 4841787, 4681742, 4520820, 4327712, 4133939, 4007498, 3902223, 3805006, 3781864, 3841998, 3836222, 3857442, 3898684, 3968535, 3967189, 3899441, 3900496, 3925475, 3859465, 3796481, 3720811, 3636059, 3563034, 3412731, 3359610, 3259024, 3134411, 3139620, 3140623, 3147450, 3104932, 3096547, 3096412, 3145895, 3132413, 3088998, 3099964, 3143887, 3162100, 3118227, 3107071]
5274C107071o6083r1174k9819o9804p1258n1175j02504k9214m4126m2950o5863
5263B443101p5221o6382P945K8059o4593r7883o750m3408N957k9656K3982j5802
5251B109349k1677N885N3569K9986o7851o354J9172l9062k2635k8203k7101k1091
5239A983987q925k5536n5461l2039N1484N7836K9663j7940K1508p0481k5554M4343
5227A952885l3602M981l4801M2596J5088o4496L8313J6814m9893L2387p6719K1365
5215A864918J2893P8122k6377K498L3557k20j4012O1696O2342P4052O9281j276
5203B217474J7291J007N0097M8924n802k2253k9211j5123q592J0035J6615K1268
5191B301730K1264k2537l1047P2645K5493K9076k667r022P4963o014N2211J2801
$$ y = [3107071, 3040988, 2949814, 2919995, 2850191, 2778933, 2727758, 2625254, 2596040, 2551914, 2508964, 2443101, 2367880, 2301498, 2309443, 2337502, 2272909, 2175026, 2168276, 2124868, 2130825, 2101169, 2125151, 2109349, 2087672, 2093557, 2147126, 2177112, 2109261, 2102907, 2122079, 2083017, 2060382, 2032179, 2005078, 1983987, 1975062, 1949526, 1894065, 1862026, 1913510, 1971346, 2001009, 1983069, 2004577, 1934096, 1908542, 1952885, 1919283, 1924264, 1889463, 1932059, 1947147, 1882651, 1920964, 1937778, 1887885, 1920272, 1843553, 1864918, 1877811, 1955933, 1929556, 1932054, 1965611, 1965391, 1951379, 2013075, 2075417, 2149469, 2218750, 2217474, 2234765, 2235772, 2285869, 2334793, 2328991, 2306738, 2277527, 2262404, 2253812, 2263847, 2280462, 2301730, 2322994, 2300457, 2269410, 2342055, 2367548, 2396624, 2393957, 2384935, 2459898, 2453884, 2506095, 2518896]
5179B518896M1545O7787J881N9939Q1760K5218P1112n124o424J2825J9521l0288
5167B858648O758P458k3628j2831l0517R859J5991l7728J6439N0862J4884M1682
5155B917877j7015k7786O0222J6841o442N2063J68386J8610J3609J408R9910m10
5143C297273J9801J16316Q1728N9625l155M4974L2162J20576R9204M7971O2565
5132C979040j1463j10200n8304q1582l9733J8411j5705O3389M4650M6882N2375
5121C887760o870J852J20254J70018J28953J16571J62487J71980K22995K93013
5111E269013L02704J96625j968j36273l28376l10446l19369j70837j95507j37724
5101D167842j00720l9907k0646o098n7950r1552q3212l028n0419n0630q3371n095
$$ y = [2518896, 2560441, 2628228, 2630109, 2690048, 2771808, 2797026, 2868138, 2863014, 2856590, 2869415, 2888936, 2858648, 2865406, 2872864, 2849236, 2836405, 2805888, 2815747, 2831738, 2794010, 2810449, 2861311, 2876195, 2917877, 2900862, 2873076, 2933298, 2950139, 2943697, 2995760, 3164146, 3182756, 3196365, 3197773, 3297683, 3297273, 3317074, 3433390, 3515118, 3574743, 3571588, 3616562, 3648724, 3769300, 3868504, 3916475, 3979040, 3967577, 3857377, 3799073, 3717491, 3677758, 3696169, 3680464, 3743853, 3788503, 3835385, 3887760, 3880890, 3882742, 4002996, 4173014, 4301967, 4418538, 4581025, 4753005, 4976000, 5269013, 5571717, 5768342, 5766374, 5630101, 5301725, 4991279, 4671910, 4501073, 4305566, 4167842, 4067122, 4027215, 4006569, 4000471, 3942521, 3850969, 3767757, 3764729, 3714310, 3663680, 3580309, 3575214]
5089C575214J825J474K7951l1300K0273K583k4683o0456k9294j4447p5984L760
5077C396916L7313r480k0532k269N3302m3682k5970j4345k517l0999j5303m5702
5065C276732O9819N8983r531k6903J0283J336q209J2748L6435K9306L3720K6381
5053C511100M6640N4210m054P1033j2079K4954Q5340K4931M5887K2625K1055J09365
5041D001007K9919l2053Q9728K9636M3308O1779R2751j1392m495N7988M5641O062
5029D409879K8538P218M1036P266P2737N2224M3340Q5875P1427N3655R6984Q7391
5017E057570M1095R8848Q7939J05228J35500J77301N3483P9788J00199J18920
5007F055871J16282J47855K4760N2776J20990J04355J32569O1653O1085J37155
$$ y = [3575214, 3577039, 3578513, 3606464, 3575164, 3595437, 3598020, 3573337, 3512881, 3483587, 3469140, 3393156, 3396916, 3434229, 3424749, 3404217, 3401948, 3455250, 3411568, 3385598, 3371253, 3368736, 3337737, 3322434, 3276732, 3346551, 3405534, 3396003, 3369100, 3379383, 3380719, 3372510, 3385258, 3421693, 3450999, 3484719, 3511100, 3557740, 3611950, 3607896, 3678929, 3666850, 3691804, 3777144, 3802075, 3847962, 3870587, 3891642, 4001007, 4030926, 3998873, 4088601, 4118237, 4161545, 4223324, 4316075, 4304683, 4300188, 4358176, 4403817, 4409879, 4438417, 4445635, 4486671, 4493937, 4566674, 4618898, 4662238, 4748113, 4819540, 4873195, 4970179, 5057570, 5098665, 5197513, 5285452, 5390680, 5526180, 5703481, 5756964, 5836752, 5936951, 6055871, 6172153, 6320008, 6344768, 6397544, 6518534, 6622889, 6755458, 6817111, 6878196, 7015351]
4997G015351Q7417J47286R1669Q8132J50322J40235J54751J11981J25362J83848
4987H296354J65336J79753J75107J97271J63383J93475J97495K24885J95789K13112
4977A0201960K80881K84165L51688L38623K10340J25762R4350J34416K22346J63684
4967A2408215J89826K56559K33579K67375K71746K41795K53673K58002L86854
4958A4767624L48594M44489M49331M92103N41078N90930N54792N96899O29961
4949A9415801O00804N63301N91982N58107O22415O62476O61628O88478O05071
4940B4970063N50085M40386M14722L80526L50941M19701M41164N11475N57124
4931B9036187O10088O71411O41445O06230P07239O59770O22888N73904M57438
$$ y = [7015351, 7102768, 7250054, 7341723, 7429855, 7580177, 7720412, 7875163, 7987144, 8112506, 8296354, 8461690, 8641443, 8816550, 9013821, 9177204, 9370679, 9568174, 9793059, 9988848, 10201960, 10482841, 10767006, 11118694, 11457317, 11667657, 11793419, 11887769, 12022185, 12244531, 12408215, 12598041, 12854600, 13088179, 13355554, 13627300, 13869095, 14122768, 14380770, 14767624, 15116218, 15560707, 16010038, 16502141, 17043219, 17634149, 18188941, 18785840, 19415801, 20016605, 20579906, 21171888, 21729995, 22352410, 23014886, 23676514, 24364992, 24970063, 25520148, 25960534, 26375256, 26755782, 27106723, 27526424, 27967588, 28479063, 29036187, 29646275, 30317686, 30959131, 31565361, 32272600, 32932370, 33555258, 34129162, 34586600]
4922C4586600N55540O09491N89009N73119P04191P10192O06054N74780N18240
4913D0027216L62620K76446N9870n0752j91745k89757k64604k53381j45423k5428
4903C9505062Q0236J89324L11180M43521M64188N17571N69974L77265K5849k64347
4893D2219823n17639o46385o84198n92853l75652j92075j3475J34557L23007M60932
4883D0116042N86353P58247Q36755R31709R62800R97191R92542R50042R14087
4874D8045768J007757J038892J111327J152475J083685Q33795O15001O43289Q92499
4865E6424488J053172J230745J510385J597943J715989J851996J877488J892947
4857F9155153J804898J849195J799416J820287J833755J926108K222787K430165
$$ y = [34586600, 35142140, 35751631, 36340640, 36913759, 37617950, 38328142, 38934196, 39508976, 40027216, 40389836, 40666282, 40726152, 40675400, 40483655, 40193898, 39929294, 39675913, 39530490, 39505062, 39585298, 39774622, 40085802, 40529323, 40993511, 41511082, 42081056, 42458321, 42484170, 42219823, 41702184, 41055799, 40371601, 39778748, 39403096, 39211021, 39197546, 39332103, 39655110, 40116042, 40702395, 41460642, 42297397, 43229106, 44191906, 45189097, 46181639, 47131681, 48045768, 49053525, 50092417, 51203744, 52356219, 53439904, 54273699, 54888700, 55531989, 56424488, 57477660, 58708405, 60218790, 61816733, 63532722, 65384718, 67262206, 69155153, 70960051, 72809246, 74608662, 76428949, 78262704, 80188812, 82411599, 84841764]
4849H4841764K739953L092771L558932L857663M430540N035468N704610O486769
4841A19748470P378765Q464245R628108J0729310J1622870J2277160J2496750
4834A92345678J2119688J1463769J0852303J0642429J0924325J1350952J1392606
4827B71091750J0369544Q269323N040245J031593l278850p366917j0595138j2886127
4819B61675423j3914286j4203746j3964591j3397309j2716635j2025143j1385234
4812A70068479j0621560r940101r238914q496751p903091p367046o910125o336559
4804A03254332n969867n704496n244688m766282m416504l971194l557575l230412
4796F6393314k856596k587503k379558k115874j930452j798750j619683j536211
$$ y = [84841764, 87581717, 90674488, 94233420, 98091083, 102521623, 107557091, 113261701, 119748470, 127127235, 135591480, 145219588, 155948898, 167571768, 179848928, 192345678, 204465366, 215929135, 226781438, 237423867, 248348192, 259699144, 271091750, 281461294, 289730617, 294770862, 295802455, 292523605, 285156688, 274561550, 261675423, 247761137, 233557391, 219592800, 206195491, 193478856, 181453713, 170068479, 159446919, 149506818, 140267904, 131771153, 123868062, 116501016, 109590891, 103254332, 97284465, 91579969, 86335281, 81568999, 77152495, 73181301, 69623726, 66393314, 63536718, 60949215, 58569657, 56453783, 54523331, 52724581, 51104898, 49568687]
4788D9568687j440277j425466j355521j211669j194396j179114j008976r30027
4780C9823241q87160q06715q11193q29351p00952p39748o96202p23633p01385
4771C2926902o44479o73140n97006n97212n84042n83098o12458n47108o03325
4762B7485034n61979n27995n51796n58245n40651n40634n36114m58707m01604
4753B2807309l88769m22365l28626k83634l09307j93297j64908k17755j56566
4744B0342082j34386j53512l8527m2867q9463m6424o2819j18683m9181L1455N9010
4733A9696685J4672m1352K4977K0112Q6929L5045J13044R2898J05376J12369O7941
4722B0328696J37335R7958J10581J77840J33566J77096J33896K31340K54954K77729
$$ y = [49568687, 48128410, 46702944, 45347423, 44135754, 42941358, 41762244, 40753268, 39823241, 38936081, 38129366, 37318173, 36488822, 35787870, 35048122, 34351920, 33628287, 32926902, 32282423, 31609283, 31012277, 30415065, 29831023, 29247925, 28635467, 28088359, 27485034, 26923055, 26395060, 25843264, 25285019, 24744368, 24203734, 23667620, 23208913, 22807309, 22418540, 21996175, 21667549, 21383915, 21074608, 20881311, 20716403, 20498648, 20342082, 20207696, 20054184, 20015657, 19972790, 19883327, 19836903, 19774084, 19655401, 19606220, 19637675, 19696685, 19711357, 19670005, 19694982, 19715094, 19802023, 19837068, 19950112, 20043010, 20148386, 20260755, 20328696, 20466031, 20563989, 20674570, 20852410, 20985976, 21163072, 21296968, 21528308, 21783262, 22060991]
4712B2060991K99043K87746K67464L37839K66914K52011K06567J68497J79995
4703B4327067L02459J86742L00407M08755M09995M77326M76911M81820M53176
4694B7824658N16307O05002O71160P07120Q68561Q57268R13695R28551J055119
4685C4947441J043434J131527J218834J207515J356204J484678J392291J461220
4677D5243144J510751J506358J442892J525232J596099J648316J826394J968310
4669E8267496J945343K100347K229479K376763K548997K852364L147069L466628
4661G8934486L742848M104794M296421M385506M986017N943710P097915Q301055
4653A21792752R459875J0386542J0972607J0910956J0127128R548466J0291649
$$ y = [22060991, 22360034, 22647780, 22915244, 23253083, 23519997, 23772008, 23978575, 24147072, 24327067, 24629526, 24816268, 25116675, 25525430, 25935425, 26412751, 26889662, 27371482, 27824658, 28340965, 28945967, 29617127, 30324247, 31192808, 32050076, 32963771, 33892322, 34947441, 35990875, 37122402, 38341236, 39548751, 40904955, 42389633, 43781924, 45243144, 46753895, 48260253, 49703145, 51228377, 52824476, 54472792, 56299186, 58267496, 60212839, 62313186, 64542665, 66919428, 69468425, 72320789, 75467858, 78934486, 82677334, 86782128, 91078549, 95464055, 100450072, 106393782, 113491697, 121792752, 131252627, 141639169, 152611776, 163522732, 173649860, 183198326, 193489975]
4646A93489975J2943885J6856102K1669702K6698260L1186640L3416209L0497457
4639C66758230J9470292O51840k0188969l4528170l9142080l6782130l1496935
4632B24742078k6158106k1629213j7929519j5048481j2701011j0691633r222096
4625A11362019p972036o950952o145016n497027m937914m555827m282548l886336
4617F7134363l466759l113316k852433k562068k344372k232091j956706j583050
4609D7023568j296312j135258q40299q60910r29202j189342j425055j796125j909125
4600C5641940j814823j657811j426277j298942j222367j047354r88449r19975
4592B5265942q96101q43832p52058o98131o43017o62617o04680m85503n87625
$$ y = [193489975, 206433860, 223289962, 244959664, 271657924, 302844564, 336260773, 366758230, 386228522, 386880362, 366691393, 332163223, 293021143, 256239013, 224742078, 198583972, 176954759, 159025240, 143976759, 131275748, 120584115, 111362019, 103389983, 96439031, 90294015, 84796988, 79859074, 75303247, 71020699, 67134363, 63667604, 60554288, 57701855, 55139787, 52795415, 50563324, 48606618, 47023568, 45727256, 44591998, 43751699, 42890789, 41961587, 40772245, 39347190, 37551065, 35641940, 33827117, 32169306, 30743029, 29444087, 28221720, 27174366, 26185917, 25265942, 24369841, 23526009, 22773951, 22075820, 21432803, 20770186, 20165506, 19680003, 19092378]
4583A9092378n07697m66822n10756m98012m22637l70887l34949l30695m02747
4574A5247176m64948l37236l02759l22149k96022k37914j66143j21654p8100l8613
4564A2881638m6554o4716l498m3067j21019q0688m1689r2055l6104M442M0662
4553A2397352O4875Q4136J94602K14870K31693L31981L48906M86832N81094O06764
4543A5543105O00807M84704J68773k68160n02795p26206p48510n87390m24240
4534A3540088k62580k35050j03489K7965M3462J14624J54602J84268L21652L28009
4524A4113551L77357M43246O04478O53109Q68995R85856J073526R40374N26901
4515B0587393j79420r09214j416263j421782j336572j123209p90111n92677m31388
$$ y = [19092378, 18584681, 18117859, 17607103, 17109091, 16686454, 16315567, 15980618, 15649923, 15247176, 14782228, 14444992, 14142233, 13820084, 13524062, 13286148, 13120005, 12998351, 12920251, 12881638, 12835084, 12770368, 12766870, 12723803, 12602784, 12522096, 12480407, 12388352, 12352248, 12356690, 12397352, 12462227, 12546363, 12740965, 12955835, 13187528, 13519509, 13868415, 14355247, 14936341, 15543105, 16143912, 16628616, 16797389, 16529229, 16026434, 15300228, 14551718, 13964328, 13540088, 13277508, 13042458, 12938969, 12966934, 13010396, 13125020, 13279622, 13463890, 13785542, 14113551, 14490908, 14934154, 15538632, 16191741, 17060736, 18046592, 19120118, 20060492, 20587393, 20407973, 19498759, 18082496, 16660714, 15324142, 14200933, 13410822, 12818145, 12386757]
4506A2386757l15276k55255j50070q7078m9871l1706Q4475J91784J98301L55766
4496A2327827L50467M60355N82912O74201P37002N55935J25043l96905j022746
4487A4394091j171491j028335q99482o53268n34183l60319j50159j69544q5800
4478I341510k3475q1822j72543l03885m26622m47143m00838l48068k39861k37945
4468F659308k04782j73971j50029k5304o3880m2935k9873j04388j1482L7415K377
4457E892456j0791N0608M1538q868j5721k7031M1987L882m837N714K4128N6554
4445F049619L6854j5680M5992N5778n6112N479O231N2626Q233L5394P4781O3167
4433F362362N0797M7577N4414O3044N0077Q812J7883J28406J56235Q8543J47292
$$ y = [12386757, 12071481, 11816226, 11666156, 11579078, 11529207, 11497501, 11581976, 11773760, 11972061, 12327827, 12678294, 13138649, 13721561, 14395762, 15132764, 15688699, 15813742, 15416837, 14394091, 13222600, 12194265, 11294783, 10641515, 10107332, 9747013, 9596854, 9427310, 9341510, 9318035, 9236213, 9063670, 8759785, 8333163, 7886020, 7485182, 7137114, 6897253, 6659308, 6454526, 6280555, 6130526, 6105222, 6041342, 5998407, 5968534, 5864146, 5852664, 5890079, 5892456, 5881665, 5932273, 5973811, 5964943, 5949222, 5922191, 5964178, 5968060, 5963223, 5968937, 5993065, 6049619, 6086473, 6070793, 6116785, 6172563, 6116451, 6121930, 6128161, 6180787, 6189020, 6224414, 6299195, 6362362, 6413159, 6460736, 6515150, 6578194, 6628271, 6637083, 6654966, 6783372, 6939607, 7028150, 7175442]
4422G175442J53910J76068J94141K17938K95372K93685L04746M19480M70871M23176
4412A0124829K90553J98140p0565j09003j12020m3332P9822J34573K36071K63071
4402A0992139K17739J36062R6627P5513J90467L65564N08837O13232P24227P02960
4392A4623367O96159M76822J34793j08760j89300j56353p6852n986K06279L70646
4382A5970815N10877O89193Q34929R27784R60440R16720O30071J72072k97183
4373B1315718n84825o01061m80824l42562k05694j0404J74192K70046M14721N72329
4363B0521636P76037R31481J165955J235656J170483R73455O35783O01729P85920
4354B8798135J250210J676634K193153K840026L848136N123671O702512Q650935
$$ y = [7175442, 7329352, 7505420, 7699561, 7917499, 8212871, 8506556, 8811302, 9230782, 9701653, 10124829, 10415382, 10613522, 10542957, 10433954, 10321934, 10278602, 10358424, 10492997, 10729068, 10992139, 11209878, 11345940, 11442567, 11518080, 11708547, 12074111, 12582948, 13196180, 13920407, 14623367, 15319526, 15796348, 15931141, 15822381, 15633081, 15476728, 15399876, 15393890, 15600169, 15970815, 16481692, 17170885, 18005814, 18933598, 19894038, 20810758, 21440829, 21612901, 21315718, 20730893, 20129832, 19649008, 19306446, 19100752, 19090348, 19264540, 19534586, 19949307, 20521636, 21297673, 22229154, 23395109, 24630765, 25801248, 26774703, 27410486, 28012215, 28798135, 30048345, 31724979, 33918132, 36758158, 40606294, 45729965, 52432477, 61083412]
4346F1083412J0310012J0120000O430581p34212q085625j1121446j0527808q367711
4338D9107203o280747m847829l926267l530255l089365k601193k187404j918325
4330B0725818j656585j496956j325190j102479r46252p76399p99388o56125n97854
4321A1368590m35498l87520l48897k78102k51264j60951j72623l10187l32887
4312H690661l16379l92993k97032k29677k06092k11798j79458m4688o2128l9369
4302F711047L3098l0720k058Q8801l6219o6368q5612j07689j19601k19776j61463
4291F003440j49038j54868q2350n041M5097j0676O89O2651O6027J10032J88418
4280F074381J05144Q2930m9366j67286k02325k81695l01629l40280l27091k85381
$$ y = [61083412, 71393424, 81513424, 87944005, 87209793, 79124168, 68002722, 57474914, 49107203, 42826456, 37978627, 34052360, 30522105, 27432740, 24831547, 22644143, 20725818, 19069233, 17572277, 16247087, 15144608, 14198356, 13421957, 12622569, 11966444, 11368590, 10933092, 10545572, 10196675, 9918573, 9667309, 9506358, 9333735, 9023548, 8690661, 8374282, 7981289, 7684257, 7454580, 7248488, 7036690, 6857232, 6812544, 6750416, 6711047, 6744145, 6713425, 6711367, 6800168, 6763949, 6697581, 6611969, 6504280, 6384679, 6164903, 6003440, 5854402, 5699534, 5617184, 5612143, 5657240, 5646564, 5647253, 5709904, 5775931, 5885963, 6074381, 6179525, 6262455, 6213089, 6045803, 5843478, 5561783, 5260154, 4919874, 4592783, 4307402]
4270D307402k20805j15741j61598k54911j41331j13406o4946j05083m5230n3990
4260C030361l9337o6480q4948n5466r769p2465p2774o0372k7176n7054l2131K2153
4248B474542q4402j05887o229m6111k9315l3581q7953o2734j2349l16M9372m8358
4236B006679m4981k6503o9494m7328J51j0128n1847K3439M3810m286n2590r5277
4224A671645o2672j0251k6764p1396k5627l7757K0045O413m4282k8339J1220j0879
4212A391356p1939r14L8813p6098K1499K4624n5423J1207J6545P5851K1420m4726
4200A352215Q785j6282r2557r497K5131j3100K7208J6022o0013q554M170k0481
4188A213047K560o6786n5117P002l3419j190m5249l6864j2263l7214N1444j213
$$ y = [4307402, 4086597, 3970856, 3809258, 3554347, 3413016, 3299610, 3234664, 3129581, 3084351, 3030361, 2991024, 2924544, 2839596, 2784130, 2774361, 2701896, 2629122, 2568750, 2541574, 2484520, 2452389, 2474542, 2390140, 2284253, 2278024, 2231913, 2202598, 2169017, 2081064, 2018330, 2005981, 2005665, 2055037, 2006679, 1961698, 1935195, 1865701, 1818373, 1818524, 1808396, 1756549, 1779988, 1823798, 1819512, 1766922, 1671645, 1608973, 1598722, 1571958, 1500562, 1474935, 1437178, 1457223, 1463636, 1419354, 1391015, 1402235, 1391356, 1319417, 1318503, 1357316, 1281218, 1302717, 1327341, 1271918, 1283125, 1299670, 1375521, 1396941, 1352215, 1361000, 1344718, 1252161, 1242664, 1267795, 1254695, 1281903, 1297925, 1237912, 1229358, 1233528, 1213047, 1215607, 1148821, 1093704, 1100706, 1067287, 1066097, 1020848, 983984, 971721, 934507, 985951, 984738]
4176I84738l6038m277j9186q153j2289K4528L142m1346k2506K0682k0788J2308
4164H80815k2475k4616J0582J0423l2298Q8007K0540J059j7100m7728l8411M5796
4152H74594j9400n946l2352O701J6199m364n5228l7016L7796j0242Q537J6320
4140G95599M2582K3817J3835L9993j6849n794L8022P6658l2836m5264N6265L2409
4128A018437l3134J0262k5257l5872j8076m9090Q438K087n4490k5621J8473k0513
4116G95644k0196m7908p8955l678K9302M5231k2245n9443M5315J9547J1395k3839
4104F90170J7121J1714K593J6192L9831m7209j5086J5639k9219J912J6426K0203
4092G40287j8194n135k1089p6825J5423L4959k4083o251l9244o732L3280l5516
$$ y = [984738, 948700, 944423, 925237, 917084, 904795, 929323, 932465, 891119, 868613, 889295, 868507, 880815, 858340, 833724, 844306, 854729, 822431, 910438, 930978, 932037, 914937, 867209, 828798, 874594, 855194, 849248, 816896, 823597, 839796, 835432, 780204, 743188, 780984, 770742, 779279, 795599, 838181, 861998, 875833, 915826, 898977, 893183, 931205, 1007863, 975027, 929763, 986028, 1018437, 985303, 995565, 970308, 934436, 916360, 867270, 875708, 877795, 823305, 797684, 816157, 795644, 775448, 727540, 648585, 644907, 674209, 719440, 697195, 637752, 683067, 702614, 714009, 690170, 707291, 719005, 721598, 737790, 777621, 730412, 715326, 730965, 701746, 703658, 720084, 740287, 722093, 716958, 695869, 619044, 634467, 669426, 645343, 639092, 599848, 593116, 626396, 590880]
4080E90880k2508n27K6644L134l843P817L9446l172k4135m252M2795o0367l7286
4067E54626l9134o145L5365J0498k2711o7119Q331q15L557j558l3449n5590k0479
4054C65377N8149Q569l4089l8761O0803J421k0013L071L2648N1428K754J2748
4042E04105M7291L3264m956J6284j9469J8875p125q4809l7216r360K9901k2762
4030D64023n8859m9090N7795M9002n3920m2143L4275l4710q177k005j0156m869
4018C41166n4993l7420J4575k3449N5348l257n4604J5105l493r003l2855K3064
4006B30184l1466m784j0547j7269J7649k8149p3792K9424M4338l6940m928J6403
3994A30123k4211K4912L5873J6767n4122m5600r682L8487J6129J1069q927j1165
$$ y = [590880, 568372, 567845, 594489, 597623, 593780, 601597, 641043, 637871, 613736, 609484, 652279, 591912, 554626, 515492, 509347, 544712, 555210, 532499, 465380, 473711, 472896, 476453, 474895, 441446, 385856, 365377, 423526, 432095, 398006, 359245, 420048, 421469, 401456, 404527, 437175, 488603, 491357, 504105, 551396, 584660, 579704, 595988, 576519, 595394, 588269, 503460, 466244, 456884, 486785, 464023, 405164, 356074, 413869, 462871, 408951, 366808, 401083, 366373, 358196, 356191, 346035, 341166, 286173, 248753, 263328, 239879, 295227, 291970, 237366, 252471, 248978, 239975, 207120, 230184, 198718, 193934, 183387, 166118, 183767, 155618, 81826, 111250, 155588, 118648, 113720, 130123, 105912, 130824, 166697, 183464, 129342, 83742, 74060, 112547, 128676, 139745, 130818, 119653]
3982A19653k3718K887k981k5563k7254O5312K747J4821n1790M9026j8544K3768
3970A28364r278n3080K402R712K4390j1714K5207j1924L1834j4124m2393K7390
3958A06786Q067l6540K8338R275l0954n73J6428m209N323n5052N9508l1111L2650
3945A07936j615k7337j617l3702j2679J9524K4151J9510j7848L3521J6573j8048
3933A08369n437M17J8840K258k1304k1256P64j5761M6892k4356m5120R951M8304
3920A02561o181j3121j7007j6935O457N9394j5919k5873p737M004J0400k2326
3908E7717J9823r228K1534J4612J1675n432m3719o1419L723O6225P004k3187k0326
3895C9002m404K4112Q3296k0217j4177k9009P790L6384J5526K1634n2726p924
$$ y = [119653, 95935, 98822, 95841, 70278, 43024, 108336, 111083, 125904, 74114, 123140, 104596, 128364, 119086, 66006, 68408, 78120, 102510, 90796, 116003, 104079, 135913, 121789, 79396, 106786, 114853, 78313, 106651, 115926, 84972, 84399, 100827, 96618, 101941, 46889, 106397, 75286, 107936, 106321, 78984, 77367, 43665, 30986, 50510, 74661, 94171, 76323, 109844, 126417, 108369, 102932, 103349, 122189, 124447, 103143, 81887, 82651, 66890, 113782, 89426, 44306, 54257, 102561, 96380, 83259, 66252, 49317, 55774, 115168, 99249, 73376, 65639, 69643, 80043, 57717, 77540, 68312, 89846, 104458, 116133, 110701, 66982, 5563, 9286, 75511, 82515, 59328, 39002, 34598, 58710, 142006, 121789, 107612, 78603, 86393, 122777, 138303, 159937, 107211, 99287]
3883I9287p168J0676L6174j4571J8579l504L6567m6206l8502L0687p569N878n9806
3870F0522k457Q7911j5957m0671r962K2078p662j244r898O819J9687j5524J5372
3857A09014j1823L3763o4840K8154M8403O541k2432l990J7737R915k5222n1938
3845G3282K5651N9261j2225n8164K5172L7534K9342K4391m0351o6875L2191n431
3833A23778P111j3562j3766M9909m5978K8321l4662J0001K8307m1425k26J2382
3821A10190O835N2197L414m7290J9160M139K1875m5130J3387Q794n3271M9405
3809A43705K2975m160j7909j7071p0755K4702P4909Q762M549J9018n3101J9093
3797A54717j3000j1590r107k2563K9506M7558L3932R329J1070m613n3797m5682
$$ y = [99287, 92119, 102795, 138969, 124398, 142977, 139473, 176040, 129834, 91332, 122019, 114450, 120328, 60522, 58065, 145976, 130019, 89348, 79386, 101464, 93802, 92558, 82660, 89479, 109166, 93642, 109014, 97191, 130954, 66114, 94268, 142671, 149212, 126780, 122790, 140527, 150442, 125220, 73282, 98933, 158194, 145969, 87805, 112977, 150511, 179853, 204244, 163893, 97018, 129209, 123778, 130889, 117327, 103561, 153470, 107492, 135813, 101151, 111152, 139459, 98034, 97808, 110190, 117025, 169222, 172636, 125346, 144506, 148645, 170520, 125390, 138777, 147571, 94300, 143705, 166680, 162520, 144611, 127540, 56785, 81487, 156396, 165158, 169707, 188725, 135624, 154717, 141717, 130127, 121020, 98457, 127963, 175521, 209453, 218782, 229852, 225239, 171442, 125760]
3785A25760K0358q569L5486L176l313L0192o456p474k4854J5095j2035l0910n0122
3772H6334n3557j6622L9948J253K7180K6868M3731J3298n9949M2527k394l0454
3760A18163l2260N1662R234J3301j7209K6133p4282J6913J4077L9754J6272m2709
3748A39049L6079k858k5810n9356M8274M571j5338N0237n0529l8653L7546K4864
3736A48076k1352M542J7643J2692J0051o730m1489n9872O1204m5792p163J9600
3724I1410k8521J7015O7234o292p0412k3339L6866J1025j4625K3182J4125l168
3712A14500J6485J817j1312o946j5170k2681o7630Q2867J8985k3530J3576K2737
3700A23698K5744K7063J3066k4446M773k0945n0210M9815n9499k4379q356R619
$$ y = [125760, 146118, 137549, 173035, 176211, 172898, 203090, 196634, 189160, 164306, 179401, 167366, 136456, 86334, 32777, 16155, 56103, 57356, 84536, 111404, 155135, 168433, 108484, 151011, 148617, 118163, 85903, 137565, 146799, 160100, 142891, 169024, 94742, 111655, 125732, 165486, 181758, 139049, 175128, 172270, 146460, 87104, 135378, 139949, 124611, 174848, 124319, 85666, 123212, 148076, 126724, 131266, 148909, 161601, 171652, 164922, 123433, 63561, 124765, 78973, 71810, 91410, 62889, 79904, 147138, 140846, 70434, 47095, 83961, 94986, 80361, 103543, 117668, 114500, 130985, 132802, 121490, 114544, 99374, 76693, 9063, 91930, 110915, 87385, 100961, 123698, 149442, 176505, 189571, 165125, 169898, 148953, 98743, 148558, 89059, 64680, 56324, 65943]
3688F5943n1801L0948K6679j0075l9230J6058L1202K0297K876n7946O1058k2348
3676G3661K7134J4962L2300N294j2731k9319O8130N1728m9965K9542n558o7322
3664A37856k2915R728M3603N0557j0216k6896N4153k6658r6070P2044k8371l7923
3652A18892j1490J2538O3522o969J3529J9303q7793k2298J18796J7840K3154M873
3640B63897l2389k1032K1961j6779N8691P724J7905l4515l7117j7865K2445J6487
3628B49413k9241M621L9027L4401L5028N425m9699J3135L7365p4492K5118j6298
3616B73803n8449j7331L9906K9433M1313l611j2810M2139m5562j3374L7863k2497
3604B90823K5412M6899j3055M1714M3726o328K573o7542m7574N3298M424L2513
$$ y = [65943, 14142, 45090, 71769, 61694, 22464, 38522, 69724, 90021, 92897, 34951, 96009, 73661, 100795, 115757, 148057, 153351, 140620, 111301, 179431, 231159, 181194, 210736, 205178, 137856, 114941, 124669, 168272, 218829, 208613, 181717, 235870, 209212, 113142, 185186, 156815, 118892, 107402, 119940, 183462, 176493, 190022, 209325, 121532, 99234, 218030, 235870, 259024, 263897, 231508, 210476, 232437, 215658, 274349, 282073, 299978, 265463, 228346, 210481, 232926, 249413, 220172, 224793, 263820, 298221, 333249, 338674, 288975, 302110, 339475, 264983, 290101, 273803, 215354, 198023, 237929, 267362, 308675, 305064, 292254, 334393, 288831, 275457, 313320, 290823, 316235, 363134, 350079, 391793, 435519, 429191, 431764, 364222, 316648, 369946, 374370, 406883]
3592D06883m843M499M01L6581K5780J1662J9356M8277n837K1026K4194j5969J6689
3579E88699N3291k9407j4406j0225K861M4345L8102k9896k7753L2451L3754O2437
3567G44253Q198L4345M0067m9908J0309o681K482M3586J0688M7474M1202N5664
3555I81679J3237M2237P971k1285M1179K6297L2575L447L0765K4317m4998L4972
3543A172393j0233J7459N1128R6046M4221k72M8629P2522O1761N1202J02877P7523
3531A785256J05187O9562J9432m7378n7984n0213n2240O284M6020r489M7000j0187
3519A851250N063K7729L9338J0144M8863N6520J09221R8852Q4248O4130Q9405
3508B484763J23283J00025J37244J84526K15572K19908L21301K47367K96570L38887
$$ y = [406883, 402040, 406539, 406940, 443521, 469301, 480963, 500319, 548596, 542759, 563785, 587979, 572010, 588699, 641990, 612583, 598177, 587952, 590813, 635158, 673260, 643364, 615611, 648062, 681816, 744253, 752451, 786796, 826863, 776955, 787264, 780583, 783065, 826651, 837339, 884813, 926015, 981679, 994916, 1037153, 1045124, 1023839, 1065018, 1091315, 1123890, 1127337, 1158102, 1182419, 1137421, 1172393, 1162160, 1179619, 1230747, 1326793, 1371014, 1370742, 1419371, 1491893, 1553654, 1604856, 1707733, 1785256, 1890443, 1960005, 1979437, 1932059, 1874075, 1823862, 1771622, 1777906, 1823926, 1814437, 1861437, 1851250, 1856313, 1884042, 1923380, 1933524, 1982387, 2038907, 2148128, 2246980, 2331228, 2395358, 2484763, 2608046, 2708071, 2845315, 3029841, 3245413, 3465321, 3786622, 4033989, 4330559, 4669446]
3498D669446L44078K82257J03460p0565j23021j59142k54800l21252l03263k17290
3488C949908k66605k81590k33712j58454j75716j50014j14969j42730j18465k4716
3478B282937p4917o8490m2473n3945j9385q0552l9559j5392O4096k6257K4510
3467A950573K8673K8700J4410o7812r2966o6646p5378j07376j13526j11372n7420
3456A329860n8488J975j4729j01753o6246L425o602n3457r540k382o4310j14982
3444H42771R847N9844n1875L6741k7653p7873J9159l3425j7516K2878o3944J2904
3432G31858j9759o1942P70j770j8426k9871J8135M7594k524n1843j9751O994m6982
3419E52483n7278M4101m422J3675j3202J4567J5259N4106k2569l5651l2338m0268
$$ y = [4669446, 5013524, 5295781, 5399241, 5328676, 5205655, 5046513, 4791713, 4470461, 4167198, 3949908, 3683303, 3401713, 3168001, 3009547, 2833831, 2683817, 2568848, 2426118, 2307653, 2282937, 2208020, 2139530, 2097057, 2043112, 2023727, 1943175, 1903616, 1888224, 1952320, 1926063, 1950573, 1979246, 2007946, 2022356, 1954544, 1861578, 1794932, 1719554, 1612178, 1498652, 1387280, 1329860, 1271372, 1273347, 1258618, 1156865, 1090619, 1094044, 1087442, 1033985, 1024445, 1022063, 957753, 842771, 852618, 912462, 860587, 897328, 869675, 791802, 810961, 777536, 760020, 782898, 718954, 731858, 712099, 650157, 650927, 649157, 630731, 600860, 618995, 666589, 664065, 612222, 592471, 599465, 552483, 495205, 539306, 534884, 548559, 535357, 549924, 565183, 619289, 596720, 561069, 528731, 488463]
3407D88463M8857q715k0035R600j4874l0889l43P0558j208l3463j543r825K6602
3394E23185p942M5301r978k838n4087Q1415P8534J07405L2892L001N4934q9817
3382G62005p8835m3564o3314n5265l5031o0697L5151j8065L431K735l3340l1839
3370C83372K7022J7599k4544J7390l1509L6505n240k1665K5924N0684N3989j1582
3358E17945J8770J59469O8180J03376J20716O898j41104j11358q8462o0542k7047
3347E66841p0434o2406K3483K3111o8187m6750k4176M2090K8914l1763m1612M9273
3335C88384l1783k6440J0134j5550J0991K4351m698r514M1031J6004L5566K6378
3323D64854O5502Q8294k4061n6706o8534l6944o7626j9521o0669Q930K8583N0939
$$ y = [488463, 537320, 528605, 508570, 518170, 503296, 472407, 472064, 542622, 541414, 507951, 506408, 496583, 523185, 515243, 560544, 550566, 547728, 493641, 575056, 653590, 760995, 793887, 796888, 851822, 762005, 683170, 639606, 576292, 521027, 485996, 425299, 460450, 442385, 445816, 448551, 415211, 383372, 410394, 427993, 403449, 420839, 389330, 425835, 420595, 398930, 424854, 475538, 529527, 517945, 536715, 696184, 764364, 867740, 988456, 995354, 854250, 742892, 654430, 593888, 566841, 496407, 434001, 457484, 480595, 412408, 365658, 341482, 383572, 412486, 380723, 339111, 388384, 356601, 330161, 340295, 324745, 335736, 360087, 355389, 345875, 386906, 402910, 438476, 464854, 530356, 618650, 594589, 537883, 469349, 432405, 364779, 345258, 284589, 293519, 322102, 373041]
3311C73041p7880N696M1513l9051p4821l8118J5961j4220l8921l0070N608M8050
3299A76788L4193j0027L4254l6947l2954K065l0608j6652N8480o178k2851n932
3287A43631p757j1873r098j7129K0772O0202j3508m6245Q217L5543J5793p243
3275A71305k0770j5266J332l1182p864J6055O616R07K2471J6550k8714L0318L5501
3262A97259l4533L7102k8522q44L2482o765l3039j4732J3125M9261j3637M492
3250B01649M268J3788P464l1020M1354l6288k4626j1875p853j1781K5538P2955
3238B43573J1555N296l1507O666J6421k9668j7596M6545J1763n802Q3450n2414
3226B88282J0299L627J0195L5253m1438J960p482L8545N092j8957n114J622m775
$$ y = [373041, 295161, 300857, 342370, 303319, 228498, 190380, 206341, 192121, 153200, 123130, 128738, 176788, 210981, 200954, 235208, 198261, 165307, 167372, 136764, 120112, 178592, 172414, 149563, 143631, 135874, 124001, 114903, 97774, 118546, 178748, 165240, 118995, 127212, 162755, 178548, 171305, 150535, 135269, 136601, 105419, 97555, 113610, 120226, 121133, 143604, 160154, 131440, 161758, 197259, 162726, 199828, 171306, 170462, 202944, 196179, 163140, 148408, 161533, 210794, 197157, 201649, 205917, 219705, 227169, 196149, 237503, 201215, 176589, 164714, 156861, 145080, 170618, 243573, 255128, 260424, 228917, 235583, 252004, 222336, 204740, 251285, 263048, 257246, 340696, 288282, 298581, 302208, 312403, 347656, 306218, 308178, 300696, 339241, 344333, 325376, 320262, 321884, 317109]
3213C17109k8838N877M9254J9717k1777p4175K7315K912L6386K9000J7831k073
3201C78538k6796K8577M3947k3011r230K7808J0004J3590L7494K4570K3759K7379
3189E56629k176J3307J2923K2402K0659j7746j6755M82K100j3334j5120K952K496
3176E68819Q062k086O396k944M8046j8033J5628J8778M8935l898Q099J5829L5949
3163G47580j5474R486N7992l993L5822L0692K5128k7102L6802M7420K4361j9274
3151I49440j3473o719k0449p8812l6699n2412l2840O6331J3051O261P013q712
3139G91980J4159m154l7713n887K4086L4334M1463M9098l2949j7074n5550N3218
3127H55011k7284m4220j3002j4322j1885k8115L0260j9140p158j3209q2455N4464
$$ y = [317109, 288271, 294148, 343402, 363119, 341342, 267167, 294482, 297394, 333780, 362780, 380611, 378538, 351742, 380319, 424266, 401255, 392025, 419833, 429837, 443427, 480921, 505491, 529250, 556629, 554453, 567760, 580683, 603085, 623744, 605998, 589243, 589725, 591825, 578491, 563371, 566323, 568819, 576881, 574795, 581191, 578247, 626293, 608260, 623888, 642666, 691601, 687703, 695802, 711631, 747580, 732106, 741592, 799584, 795591, 831413, 862105, 887233, 860131, 896933, 944353, 968714, 949440, 935967, 929248, 908799, 829987, 793288, 740876, 708036, 774367, 787418, 793679, 800692, 791980, 806139, 801985, 764272, 758385, 782471, 816805, 858268, 907366, 874417, 857343, 801793, 855011, 827727, 783507, 770505, 756183, 744298, 716183, 746443, 727303, 720145, 706936, 624481, 678945]
3115F78945o419J472m3902m3949K9314l3883j5923O0857n0085l1140O789k0263
3103E31813j4813M051k5042k0259p427o2489j8564J4892o980l7510N1783n3891
3091C55564q1745k7003J1842l2628j4288K0712n4983k9212P0386L6882n1049l9328
3079A65150K0296k9828M3985j3777L738J726m7878J874M6299k913m6623K422K8069
3066A72540l4518m2708k6367l8141j8708J2706L5695J0043K4705j8337o8700J6627
3054B4837L9150q268m8893l8807n2613N1711N034l7952P241L8576L8222M8236
3042F6474l4392k0926r016J1784m8577j2702M9891j1087n1110J7517j8087n394
3030f5625M1082K8849O454q3354k9959O727M962K2780q1919Q318Q6872L469R370
$$ y = [678945, 672526, 673998, 630096, 586147, 615461, 581578, 565655, 626512, 576427, 545287, 552076, 531813, 517000, 521051, 496009, 475750, 468323, 405834, 387270, 402162, 395182, 357672, 409455, 355564, 273819, 246816, 258658, 226030, 211742, 232454, 177471, 148259, 218645, 255527, 204478, 165150, 185446, 155618, 199603, 185826, 189564, 191290, 143412, 145286, 191585, 188672, 142049, 144471, 172540, 138022, 95314, 68947, 30806, 12098, 24804, 60499, 70542, 95247, 76910, 8210, 24837, 63987, 55719, 6826, -31981, -84594, -32883, -27849, -65801, -58560, -19984, 18238, 66474, 32082, 11156, 2140, 13924, -34653, -47355, 2536, -8551, -59661, -42144, -60231, -65625, -24543, 4306, 10760, -72594, -102553, -95826, -90864, -68084, -150003, -141685, -54813, -51344, -41974]
3017d1974L735L8147m9316k8123k4836J0400J534J8383J4556K976j3302J0853
3005e6967K6334k1792k0305m024O7831k1183l3370p628l8721K128k839J2528M7245
2992e0763J8802m9923K3888J6757j5270R610J2190j3439J1802k6935n317K0288
2980d8310J6720n5845K3674m1846k5721j1257J3953m73K7197M1213K6048o1990
2968i6637k6486K5290N5330k8131n9709J0269M1510K5503M845k6176L2154k760
2956d4998j7708P737j8448K710m0362M1735j9626J7589l8426K0747J0866k9540
2944a07724N636M9146l4136n9825r186N8734L2551R648m9851l8092k0427N5273
2932a08253O0748J2884j7358P442m5816N910R2476m6234p1353L213j9939j9984
$$ y = [-41974, -38239, -92, -49408, -77531, -102367, -91967, -90433, -72050, -57494, -54518, -67820, -56967, -30633, -52425, -72730, -76754, -8923, -30106, -63476, -71104, -109825, -107697, -110536, -98008, -50763, -31961, -81884, -57996, -41239, -56509, -46899, -34709, -48148, -36346, -63281, -68598, -48310, -31590, -87435, -63761, -105607, -131328, -142585, -128632, -129105, -101908, -60695, -34647, -96637, -123123, -97833, -42503, -70634, -130343, -120074, -78564, -53061, -48216, -74392, -42238, -44998, -62706, -54969, -73417, -70707, -111069, -69334, -88960, -71371, -109797, -89050, -78184, -107724, -102088, -52942, -87078, -146903, -156089, -97355, -64804, -55156, -105007, -143099, -163526, -108253, -47505, -34621, -51979, -44537, -90353, -84443, 8033, -38201, -109554, -106341, -126280, -146264]
2920a46264L4609J6764l8870K8910k6871j4013N2062L221k2388R721k9972M296
2908a28795L363j8087N120J1174j9835l3336K0233J3980k305O998N5190J7607
2896f8693k631o8614l3435j2412P3023p864K0806J2819L598Q921j2420l5487P7236
2883d5153k2751o8960m8848P6759M9965k2428L7691j8170m9971k6426O5078K4356
2871d8858j4067m9415n506j7391N404K2849n597J5393l8367k4590L7631M853l0642
2858a48303J5288K8345K5971L5921j2341L0360m8336O2964j1728m621k9674j1806
2846f7960m0700k8163j0897M1284N2144m0124j52k6072J3937k6154J2144L9707
2834h1006J3942k4241J1989k3155J8021L3452k1145K0076l0142K1650o481k5409
$$ y = [-146264, -111655, -94891, -133761, -104851, -131722, -145735, -93673, -90452, -112840, -103119, -133091, -128795, -125432, -143519, -138399, -127225, -147060, -180396, -160163, -146183, -148488, -141490, -86300, -68693, -71324, -139938, -173373, -185785, -112762, -120626, -99820, -87001, -83403, -74482, -86902, -122389, -45153, -67904, -136864, -185712, -108953, -58988, -81416, -43725, -61895, -111866, -138292, -73214, -48858, -62925, -112340, -117846, -135237, -129833, -106984, -112581, -97188, -135555, -160145, -122514, -117661, -148303, -133015, -104670, -78699, -42778, -55119, -24759, -73095, -10131, -21859, -26480, -56154, -67960, -108660, -136823, -147720, -106436, -54292, -94416, -94568, -120640, -106703, -132857, -120713, -81006, -67064, -91305, -79316, -102471, -84450, -50998, -72143, -52067, -82209, -60559, -67040, -92449]
2822i2449m12l1383N877M4203j6441j4618o000j9067N8021j9148K6340j5908j8478
2809i9463j9562J6558q054N1967j0741q5920K9396m5355M1949j5450M3551l0652
2797a31776J0758M010l5199L2444L514N2161Q309k7778J1129j227m7874R661N1069
2784f0799j3832l0924l9448l5920L7104j1700K0671l2363K7090N1146m536m6188
2772a39699K0931J4471j8683l3734k6930K9410M2877n097j531n5329J3708P79
2760a58827J2757P741j5409K3407R105J3169j4752o7644N34Q0364l4185K3047
2748a20693j3255k2438k2107M6982M1622q326j005j169K2306m3275m2835K9406
2736a34787q485M8363M4537k2130o6645n0738j9871L8444K1220j4399r769K4334
$$ y = [-92449, -92861, -124244, -118367, -74164, -90605, -105223, -111223, -130290, -72269, -91417, -65077, -80985, -99463, -119025, -102467, -110521, -58554, -69295, -155215, -125819, -171174, -129225, -144675, -101124, -131776, -121018, -117008, -152207, -119763, -116249, -64088, -55779, -83557, -72428, -73655, -121529, -111868, -60799, -74631, -105555, -145003, -180923, -143819, -155519, -134848, -167211, -140121, -88975, -93511, -139699, -118768, -104297, -122980, -156714, -183644, -154234, -111357, -116454, -117985, -173314, -159606, -158827, -146070, -138329, -153738, -130331, -121226, -108057, -122809, -190453, -189919, -109555, -143740, -120693, -133948, -156386, -178493, -131511, -89889, -98215, -99220, -100389, -78083, -121358, -164193, -134787, -143272, -94909, -50372, -72502, -139147, -189885, -209756, -171312, -150092, -164491, -174260, -149926]
2724a49926j0835L6258L2783j963m0956l0378K1844M5140r315J92J5248l5152
2712a27060Q720J3796k2509j643N043K2811j8462m982K560K805n642q3208P5335
2699a32436K8537K0674K1203l5519J8257J7651n2952K7119n8075M3009K8773j2886
2687h6645j575M254k8544j4937O6706J5101k3900l8660p885j4862n2101K0305
2675a62743K0677O431j723K386K0138K3284q252J0416n602j6162L7990o5821L1232
2662a07749n349k5867L2178L1325n5067K70p892r670J6178L63J7823L1464k2037
2649a04030j8880J4274L7587R704p58o0156k6035J9603k4105J2646K197N084q533
2636a41402L3467J7365J5543M8983n6357J9906K3238n5510o7802M5066P6714l1263
$$ y = [-149926, -160761, -124503, -91720, -93683, -134639, -165017, -143173, -98033, -107348, -107156, -91908, -127060, -118340, -104544, -127053, -128696, -123653, -100842, -119304, -124286, -121726, -118921, -124563, -207771, -132436, -103899, -83225, -62022, -97541, -79284, -61633, -114585, -87466, -145541, -102532, -73759, -86645, -88220, -83966, -112510, -127447, -60741, -45640, -69540, -108200, -116085, -130947, -183048, -162743, -142066, -135635, -137358, -134972, -114834, -91550, -99802, -89386, -94988, -111150, -73160, -138981, -107749, -113098, -138965, -106787, -75462, -130529, -130259, -138151, -147821, -131643, -131280, -113457, -81993, -104030, -122910, -108636, -71049, -61345, -62103, -122259, -148294, -128691, -152796, -140150, -137953, -132869, -141402, -107935, -90570, -75027, -26044, -82401, -62495, -39257, -94767, -162569, -117503, -40789, -72052]
2624g2052M5006L6701J6146m9514k9641J8418j3635k8517l8768l9739K9760R124
2612a16711Q036k8990Q481J5088o058L5041J023l6056j8188N2451R34n5376J6592
2599a23733K0203K0203m3000P283L2811l0015k4165m536n070L2121J8772J163
2587i7963M3386m4301j3005N32J5058k8309M838J1123O681k1846j188J105m403
2574a28292N2894l4753l8190L9743K3667q233L4752j8774j5600l2352J3765L2174
2562g9199l4401k8262N2611J2782J1414m5482O661J407M967M4855q1709K69N7645
2549g6442J3948l60J3619p3987n3422N7655M715j1011J4053m501k2566J0663L7814
2536h9822l3202j1644J7015P1373L3941p7281J8221K7931l376K9086j4474K3262
$$ y = [-72052, -27046, 9655, 25801, -23713, -53354, -34936, -48571, -77088, -115856, -155595, -125835, -116711, -108675, -137665, -129184, -114096, -120154, -85113, -84090, -120146, -138334, -85883, -84949, -140325, -123733, -103530, -83327, -126327, -119044, -86233, -116248, -140413, -144949, -150019, -117898, -99126, -97963, -54577, -98878, -111883, -111351, -96293, -124602, -119764, -108641, -101960, -123806, -124994, -123889, -128292, -75398, -110151, -148341, -108598, -84931, -93164, -58412, -77186, -92786, -125138, -111373, -79199, -113600, -141862, -89251, -76469, -65055, -110537, -103876, -102469, -97502, -52647, -134356, -134087, -76442, -62494, -62854, -49235, -123222, -176644, -118989, -114274, -125285, -111232, -115733, -138299, -127636, -89822, -123024, -134668, -117653, -46280, -12339, -89620, -71399, -43468, -46844, -17758, -32232, -8970]
2524h970j7902k6103l9665N079j5021J5879k0032l2018K5872P565l0917Q7400
2512d8833R335n3061P080J0851M7099J1182m9183j4244k0275l8110N8915L2391
2500d6853j4365j0108k1512K8480N3434o4224J6001o716N8893j157M4619o1949
2488b5457m0607O4326r463p505o908j58j0401K0033o3111K676O7852L2654m2041
2475a8110J4067j7267K8032P575L4866j2269p5585J5189K9521J6706J8046j4200
2463B6571k8094O824K7211J8409k3893n0654n363J7598M2077k3123j241o631k9460
2450b9769M6970N7899j9797J3705L2746L341j8021l100K4183J994L6418p0842
2438G5727L5432j7769J4206L3526j2716j2046L0149q643J9495M0342K0820k0690
$$ y = [-8970, -26872, -52975, -92640, -87561, -102582, -86703, -106735, -138753, -112881, -105316, -136233, -48833, -39498, -92559, -85479, -74628, -27529, -16347, -65530, -79774, -100049, -138159, -79244, -46853, -61218, -71326, -92838, -64358, -10924, -75148, -59147, -65863, -6970, -8127, 36492, -25457, -66064, -1738, -11201, -18706, -25614, -25772, -36173, -16140, -79251, -76575, -8723, 23931, -18110, -4043, -21310, 6722, 14297, 49163, 36894, -38691, -23502, 6019, 22725, 40771, 26571, -1523, 5301, 32512, 50921, 27028, -23626, -28989, -11391, 30686, 7563, 6322, -309, -29769, 17201, 75100, 55303, 69008, 101754, 105095, 87074, 83974, 108157, 110151, 146569, 75727, 111159, 93390, 107596, 141122, 128406, 116360, 146509, 137866, 157361, 197703, 218523, 197833]
2426A97833j4255r458J7278L6083J038L138m5022m7965J6186N8334L4209j4622
2414B32777K5851K6180J1767L6435j5869k5986O060Q230N2120N5742L339l392
2402D13254K7844L2550l1761L0935O0427L741Q492J4204K9295M1099N2929K8864
2390G11873N1812j0867L2717Q8795J7250K9806O570L9171O0326J7121k5063N2220
2378A071731P8052J07935Q2535N6433J28859J19988R2277P9387J01202N3969K8642
2367B001010J63860K03103K19164L07480M53801N38360O80058R49941J200849
2358F717626J814179K158221J646717j96779k254098k371491j764297j160035
2350D590043p47204n85457m25156l57627l09522j84360j96474j47665p5721m4547
$$ y = [197833, 183578, 174120, 191398, 227481, 228519, 231657, 186635, 138670, 154856, 213190, 247399, 232777, 258628, 284808, 296575, 333010, 317141, 291155, 297215, 305445, 357565, 413307, 416646, 413254, 441098, 473648, 441887, 472822, 533249, 536990, 545482, 559686, 588981, 630080, 683009, 711873, 763685, 752818, 785535, 874330, 891580, 921386, 927956, 967127, 1027453, 1044574, 1019511, 1071731, 1149783, 1257718, 1340253, 1396686, 1525545, 1645533, 1737810, 1817197, 1918399, 1972368, 2001010, 2164870, 2367973, 2587137, 2894617, 3348418, 3886778, 4566836, 5516777, 6717626, 8531805, 10690026, 12336743, 12139964, 9885866, 7514375, 5750078, 4590043, 3842839, 3257382, 2832226, 2474599, 2165077, 1980717, 1784243, 1636578, 1560857, 1516310]
2340A516310p6481j57552j77321j31556k5432p0486m3751n0334j00059n953k4058
2329F53327k8860r5757p8651J8750Q577o5478l8484q515P251k0062k8828k6793
2317B96477J7864j1188n7030K4204m6551n2017L5543r709K7160O189k0783M862
2305B15021l1700l1221O42L9350o4488o908l2541J1944J4032K720l8832M5419
2293A23438J5996n2625k1020l7841n914J436J8633L8830o0136J0548k9854k2768
2281b1277K8681m0276K6852N4613j9309J1388J3670l8496K5555J7185o7640o137
2269a5191K5420l619L435k2322p011j785p886J9241j666J8026p366M1066O7903
2256A08245n1268m0336j718J798j0590p672j7832J0278Q664k4655p677J6782j7770
$$ y = [1516310, 1439829, 1282277, 1104956, 973400, 947968, 877482, 833731, 783397, 683338, 677385, 653327, 624467, 528710, 450059, 468809, 477386, 411908, 373424, 364909, 372160, 352098, 323270, 296477, 314341, 303153, 246123, 270327, 223776, 171759, 207302, 197593, 224753, 230942, 210159, 215021, 183321, 152100, 152742, 192092, 127604, 120696, 88155, 100099, 114131, 116851, 78019, 123438, 139434, 86809, 65789, 27948, 22034, 23470, 42103, 80933, 20797, 31345, 1491, -21277, 7404, -32872, -6020, 48593, 29284, 40672, 54342, 15846, 41401, 58586, -9054, -15191, 10229, 6610, 10045, -12277, -19288, -21073, -28959, -9718, -11384, 6642, -724, 40342, 108245, 56977, 16641, 14923, 16721, 6131, -1541, -19373, -9095, -431, -25086, -32763, -15981, -33751]
2243c3751N4995j8965Q458j7978m64J3772l2903k0790j3174j2305N3413p708j8825
2230d6225j2325j0456K9048n918K0470J4931r804N120L0695k4314m0809j3086
2218f2673K2738M349m427J5768l082k7937O8530l1828l8409J9438k4510l473k4582
2205i0098M0009L1615K208P259J0498j4742K0803K1361p5801L1668J4952q5352
2193h5620J8303K2315M5711Q346m385L053m8353N762N673N741j7058n5800K0741
2180g5571K4378j6693K0662k8837L7333J6894k4212J0919q353r064O28j9144L6457
2167c4603q133K0623Q367J1583m3884n6662j4613m0625N5340M0912L2590j3448
2155d2553l3332p19j1928k5394K3679J860L2314J673J5335k991k4543L2171J1616
$$ y = [-33751, 21244, 2279, 10737, -7241, -7705, 6067, -26836, -47626, -60800, -73105, -19692, -27400, -46225, -58550, -69006, -39958, -45876, -25406, -10475, -20279, -15159, 15536, -8778, -49587, -62673, -39935, -35586, -40013, -24245, -27327, -55264, 13266, -18562, -56971, -37533, -62043, -65516, -90098, -50089, -18474, -16266, -9007, 1491, -13251, 7552, 28913, -46888, -15220, -268, -85620, -67317, -45002, 709, 9055, 4670, 7723, -40630, -34868, -29195, -23454, -40512, -96312, -75571, -51193, -67886, -47224, -76061, -38728, -21834, -46046, -35127, -43480, -52544, -51916, -71060, -34603, -42736, -22113, -13746, -2163, -46047, -102709, -117322, -157947, -102607, -61695, -29105, -42553, -75885, -76604, -88532, -113926, -90247, -88387, -56073, -54400, -39065, -42056, -66599, -34428, -22812]
2142b2812q827N006K3721n4561K2067l2755l2270P453J4578K429k4439j4304N7375
2129e7339o985L3949l3668R621J6084j0921p041n5188J0879k0279M4660l153K0628
2116e8753j9283K6198j7269Q4336J7926l7321m2552j0764L0386m4265k1913N7976
2104c5298R549Q923k07l7388K8337j8314j2492k5537J4316J6890m1365J3758M0153
2091c8675j3202J0178K0079l1558M2169J4895k5790L5931m529m0727n1538k4245
2079a07012M2318l588J3544N3738j4019n9957o1671N7121P0594k3528m1461K0471
2067e3450m986K2910M7440j9799o952p189k9973k0265L0798O953n62j0417k7077
2054g2569O057K1191J5440J2427n654L7332r31j2872m542J5234J994o4704l5750
$$ y = [-22812, -31639, -26633, -2912, -57473, -35406, -68161, -100431, -92978, -78400, -75971, -100410, -114714, -57339, -64324, -30375, -64043, -54422, -38338, -49259, -56300, -111488, -100609, -120888, -76228, -79381, -58753, -78036, -51838, -69107, 15229, 33155, -4166, -46718, -57482, -27096, -71361, -93274, -35298, -25749, -16826, -17033, -54421, -26084, -44398, -56890, -82427, -68111, -51221, -92586, -78828, -38675, -51877, -41699, -21620, -53178, -11009, 3886, -21904, 14027, 9498, -31229, -82767, -107012, -64694, -68282, -54738, -1000, -15019, -74976, -136647, -79526, -8932, -32460, -73921, -53450, -58436, -35526, 11914, -7885, -14837, -22026, -51999, -72264, -41466, -34513, -35075, -45492, -72569, -66512, -45321, -29881, -17454, -23108, 14224, 13293, 421, -4121, 11113, 13107, -51597, -87347]
2041h7347J2352Q538K724L2176M2048k3826j7847J9067m0436N19N3230k1735k8853
2028d9390N3965k7944N0030J1517r3732l4753M6205R596l7264J5991k9157m868
2016h9804r68k841M079L3622N1814q6344j6252L202j9356L1178N1287l145k6750
2003g0278j2153O552m16j8027k1863J1997J4326N5200j3612j0284O719k3117n669
1990h0625l0994J2797J4927O5296M034K8227o3020j9402Q030J4580m5375J7761
1978g3764M5072k8254J6692j2433p611l8801l5378J4192L7398m8348L4269j4880
1966a11846l5603N9721M6331k8656k993K4690J7713K4783j6210m9403M0091K5812
1954e570J697K5691n2898k5945j2790l5852j2129L6607L3930K2646m4573m6968
$$ y = [-87347, -74995, -66457, -63733, -31557, 10491, -13335, -31182, -12115, -52551, -52032, 1198, -20537, -49390, 4575, -23369, 26661, 38178, -55554, -90307, -44102, -34506, -71770, -55779, -84936, -89804, -90772, -93613, -89534, -55912, -4098, -90442, -106694, -103492, -122848, -91670, -40383, -43528, -70278, -82431, -75879, -76295, -94322, -116185, -104188, -89862, -34662, -48274, -58558, -51839, -74956, -80625, -111619, -98822, -83895, -18599, -14565, 13662, -49358, -68760, -60730, -46150, -91525, -73764, -28692, -56946, -40254, -52687, -60298, -99099, -134477, -120285, -82887, -131235, -96966, -111846, -147449, -87728, -41397, -70053, -73046, -48356, -30643, -5860, -22070, -71473, -31382, -5570, -3873, 21818, -31080, -57025, -69815, -105667, -117796, -81189, -47259, -24613, -69186, -116154]
1942a16154K3169N8118M658j3881n5683m021O2789j4592j4623L6207q420n6006
1930i8439L3786m1099M1709K1965k6748n37j2046L955N297l0023J9913O389k6295
1917a02173L5086l0485j5463N2156j548q972m0599K6542M4920k1462L0851r316
1905d0463n2685j5860Q219j5553O1419l2924J6437J9160k1805M8269k2355p1014
1893a19155L2837K2189n964q511k0898M3868J06791n1032m2730j7011L7254R876
1881a2486m1815k353K0824j5091k1210L4529l6683k3132M5387M5753n9111l1495
1869i6883J4269N5646N81k6058M9495J4480j0637l843R006O5j9062k5789k5946
1856f4676l8406O0194K4554n0497N557j1237M5389k5294l1412J9604j577J670
$$ y = [-116154, -92985, -34867, -30209, -44090, -99773, -103794, -41005, -55597, -70220, -34013, -42433, -98439, -64653, -105752, -64043, -42078, -68826, -69363, -81409, -77454, -72157, -102180, -82267, -75878, -102173, -67087, -97572, -113035, -60879, -62427, -71399, -111998, -85456, -40536, -61998, -31147, -40463, -93148, -109008, -100789, -116342, -54923, -87847, -71410, -52250, -74055, -25786, -48141, -119155, -86318, -64129, -70093, -78604, -99502, -55634, 51157, 125, -42605, -59616, -22362, -12486, -54301, -56654, -35830, -50921, -72131, -37602, -74285, -97417, -52030, -6277, -65388, -96883, -82614, -26968, -26387, -52445, -2950, 11530, 893, -2950, 6056, 6121, -12941, -38730, -64676, -103082, -42888, -18334, -68831, -63274, -74511, -29122, -54416, -85828, -66224, -67801, -66131]
1844f6131R192M7218K338o7645L9357j7434K5064j7527L6277J0806k6408k4252
1832d9145k2166J5836k018k6930M3887L4718R106j408o8484L0472m693O194m2699
1819g7330j9301M0997L8898j8999j5252n138q302L791K9833J8755k3840m2988
1807g8876Q926Q651J8367L5045L7976J041j6744m7858J6124N842L0710J8845k3844
1794A4205j5679n9153L4804K8438l8386j9482j541J0793k1705K4883o717Q170
1782d1370L3443j9462M3900J8420m0300O613J4603K5323l4709J1377J2193p0128
1770d0097R491J3208k626n5829K4401N9401k3755K9656J888J4224j4632k0685
1758e355J407l4550N6522l075q3380m2739J9924m492L8439K5513M5937l5280L016
$$ y = [-66131, -56939, -9721, -7383, -75028, -35671, -53105, -28041, -45568, -9291, 1515, -24893, -49145, -71311, -55475, -57493, -84423, -40536, -5818, 3288, 1880, -66604, -36132, -40825, -34631, -77330, -96631, -55634, -16736, -35735, -50987, -56125, -64427, -60636, -30803, -12048, -35888, -78876, -69950, -61299, -42932, -7887, 30089, 31130, 14386, -33472, -17348, -11506, 19204, 38049, 14205, -1474, -60627, -25823, 2615, -35771, -55253, -56794, -46001, -67706, -42823, -49540, -41370, -7927, -27389, 16511, 34931, -5369, 1244, 15847, 41170, 6461, 17838, 30031, -40097, -30606, -17398, -20024, -75853, -51452, 7949, -15806, 13850, 15738, 29962, 15330, -5355, -3948, -38498, 18024, 14949, -68431, -111170, -91246, -95738, -57299, -31786, 14151, -21129, -18113]
1745a8113l7888k8680k183J4204J5520O647J1829o359o49n6459O7061L3195k3593
1732b5468o074r810j934K839j6843l0771m288K6898K9135K4917J9192j6755m6386
1719e5348j3371P7531j933q079q569n3965j4749O301r796n28K6945J61K3238L7952
1705E790J683q84l0732L1775l5925k5530N4493n3660n0840M7901K1627l8285l4936
1692a07523n603K9974J6310L2211L632P828K1237M6413q639J6093l5461m7007
1680c0535L3247l7758J2540J7872k8795j4348N65J5686k9990l1541K1825M0834
1668c0398k1209R626k9907J6455O207Q182J7890J8601Q25k4285J0246k6839L2546
1655a2060l89J0717R40j6314L2581J3943l6884J0469L4124m5121J3947N3101m9120
$$ y = [-18113, -56001, -84681, -86864, -72660, -57140, -50493, -38664, -45023, -45672, -102131, -35070, -1875, -25468, -31542, -41352, -43286, -40447, -57290, -88061, -92349, -65451, -36316, -11399, 7793, -8962, -55348, -68719, 8812, 6879, -1200, -9769, -63734, -78483, -72182, -81978, -82506, -55561, -55400, -32162, 5790, 7473, 6589, -24143, 7632, -28293, -53823, 670, -52990, -103830, -55929, -34302, -72587, -107523, -113126, -83152, -66842, -34631, -30999, -23171, -1934, 44479, 35840, 51933, 16472, -30535, 2712, -35046, -22506, -4634, -33429, -47777, -47212, -31526, -61516, -93057, -71232, -30398, -51607, -41981, -71888, -55433, -49226, -41044, -23154, -4553, -3728, -28013, -17767, -44606, -12060, -12449, -1732, -792, -17106, 15475, 29418, -7466, 3003, 37127, -7994, 5953, 59054, 9934]
1642I934k3372l6351K5536j2999J7816j7982n602k4250R452J1303K8370J9213
1630A068k9388Q308R574L666n7763r487K779O9407m515r027O195q373k1110K8611
1616a0055j6262J5455k9900K7572J5947o949N7613Q725q7663j523K1425L1417
1604B5802q688j8433k2277J1877r217K9313p48l3652k9962N2787K3837K2136k5382
1591A7393p4241k8771J3717N0216j6603K8618J8605M5424k6319k5860n1788j749
1579e1358k8875M4151L1244k0506k4397J8478K0240K8623l4099l5498N9966j2132
1567d163J229k0975o554l92l0841j4657o68k3369r283O7865K7437k5165O3084
1554B3548K7259l0306k9587o137N3088n8737j8240l9979M1240j5501k9815M5709
$$ y = [9934, -13438, -49789, -24253, -37252, -19436, -37418, -43020, -67270, -57818, -46515, -18145, 1068, -28320, -20012, -10438, -6772, -64535, -74022, -71243, -1836, -6351, -15378, -9183, -17556, -38666, -10055, -26317, -10862, -40762, -13190, 2757, -4192, 53421, 62146, -25517, -27040, -5615, 25802, 17114, -1319, -23596, -11719, -20936, 8377, 7629, -26023, -55985, -3198, 20639, 42775, 17393, -56848, -85619, -71902, -21686, -38289, -9671, 8934, 54358, 28039, 2179, -49609, -51358, -80233, -36082, -4838, -25344, -49741, -31263, -11023, 17600, -16499, -51997, 7969, -4163, -2934, -23909, -30463, -30855, -61696, -76353, -77021, -100390, -109673, -41808, -14371, -39536, 23548, 50807, 20501, -9086, -15223, 37865, -20872, -39112, -79091, -37851, -53352, -83167, -37458]
1542c7458J5544l1269o447J5381J2107M4640j2579n252K6373o243K190k3151q741
1529a4905K3257O149o545M1051Q720l6997m4592M6329o645j1343J7810m2434l4719
1516e4864K6424K1252O895k2491J3607l495q282J8669L2824K3928n1711l183m5299
1503d5726O0528j4687J5142k1716l9166N167o578O3085J0268J4744j3054k3950
1491D057L1537R616l8633k410N299l4095j3761M9601j0610k4968K7195M0393K8710
1478G1931o1177k9494O5781k802j8793J2373j5361N753n8614m1100P1293j9086
1466a9296n1447L7966j1589M5761l652k0631l854K0594l1460J9965P4655l92K1079
1453G7699j7116l4163l9999L0040j5488N426m7222Q224O9033j3589n9876j563
$$ y = [-37458, -21914, -53183, -59630, -44249, -32142, 12498, -81, -5333, 21040, 14797, 16987, -6164, -14905, 8352, 14501, 7956, 49007, 57727, 20730, -23862, 22467, 15822, 4479, 22289, -20145, -54864, -28440, -7188, -293, -22784, -9177, -12672, -20954, -2285, 30539, 54467, 2756, -427, -45726, 14802, 115, 15257, -6459, -45625, -40458, -47036, 16049, 26317, 41061, 28007, 4057, 35594, 45210, 6577, 4167, 9466, -24629, -38390, 11211, 601, -24367, 2828, 43221, 71931, 10754, -18740, 47041, 44239, 25446, 37819, 22458, 28211, -30403, -71503, -210, -19296, -70743, -32777, -44366, 1395, -2257, -22888, -26742, -6148, -37608, -17643, 57012, 56620, 77699, 60583, 26420, -13579, 16461, 973, 6399, -40823, -32599, 36434, 22845, -37031, -38594]
1441c8594J0119l6785L1229N9742J8788n5179J2509l2142P5624k335k5259M970
1429B2687J4340n8809J5195k504R62K9795K45k7232K1392O881L0998j0510j6687
1416B6753L4916o2349j3906j160K3888Q807k6206m2395N1100K8542l832m0154
1404a5996J8220m0784p104L3736L7751k9448k8412j1348K1908k3830k237L6376
1392a1168J8851l2437j6207O8892j0641j782K5851n1011m58N5599l3018k816M1499
1379E1154l1853k6940J6379o091m7007j8178J6524N554O034J5053K0431k1151
1367b0091N4960m867l0793L0098n748k5459J9654j9147k3988K2098N3361M778
1355E4856j8003k5796o6656L1045K587K7010O600m5374M7858o598J3292k5403
$$ y = [-38594, -28475, -65260, -34031, 25711, 44499, -10680, 1829, -30313, 45311, 42976, 17717, 22687, 37027, -21782, -6587, -9091, -8129, 21666, 21911, -5321, 16071, 22952, 53950, 43440, 26753, 61669, -680, -14586, -15746, 8142, 16949, -9257, -51652, -552, 27990, 24158, -15996, 2224, -38560, -45664, -11928, 25823, -3625, -32037, -43385, -21477, -45307, -47544, -11168, 7683, -24754, -40961, 27931, 17290, 15508, 41359, -9652, -10110, 45489, 12471, 9655, 51154, 19301, -7639, 8740, 2649, -44358, -62536, -46012, -40458, -34424, -19371, 1060, -20091, 34869, 30002, -791, 29307, 23559, -1900, 17754, -1393, -25381, -3283, 50078, 54856, 36853, 11057, -55599, -24554, -21967, 5043, 11643, -33731, 14127, 7529, 20821, -4582]
1343d582l3663M3097l5324L6143L0024n8447L985l9718K5109j0622m233K4273
1331b3958N6416L9180k8467l206j5835m729K480q890n2876m564J4030R0840M307
1318F4728J3422m9042p0734j4588j1270Q225K4771L9295o0286l1525K8140M5156
$$ y = [-4582, -38245, 4852, -30472, 5671, 35695, -22752, -18767, -58485, -33376, -43998, -48231, -23958, 32458, 71638, 43171, 39965, 24130, 19401, 21881, 12991, -39885, -44449, -30419, 60421, 64728, 78150, 29108, -41626, -56214, -67484, -59259, -34488, 4807, -55479, -87004, -58864, -13708]
$$ [...]
##END NTUPLES=NMR SPECTRUM
##END=
