##TITLE=1H_CA-9249-3
 CDCl3
 8 sc, 
 4.3.2024
##JCAMPDX= 6.0         $$ Bruker NMR JCAMP-DX V2.0
##DATA TYPE= NMR SPECTRUM
##DATA CLASS= NTUPLES
##ORIGIN= UXNMR, Bruker Analytische Messtechnik GmbH
##OWNER= root
$$ XWIN-NMR		Version 3.5
$$ Mon Mar  4 14:18:10 2024 Russian Standard Time (UT+4h)  she@DPX200
##.OBSERVE FREQUENCY= 200.1313
##.OBSERVE NUCLEUS= ^1H
##.ACQUISITION MODE= SIMULTANEOUS
##.ACQUISITION SCHEME= undefined
##.AVERAGES= 8
##.DIGITISER RES= 18
##SPECTROMETER/DATA SYSTEM= spect
##.PULSE SEQUENCE= zg30
##.SOLVENT NAME= CDCl3
##.SHIFT REFERENCE= (INTERNAL, CDCl3, 0, 15.4681)
##AUDIT TRAIL= $$ (NUMBER, WHEN, WHO, WHERE, WHAT)
$$ ##TITLE= Audit trail, XWIN-NMR		Version 3.5
$$ ##JCAMPDX= 5.01
$$ ##ORIGIN= Bruker BioSpin GmbH
$$ ##OWNER= she
$$ F:/spectra/data/she/nmr/H-F/1/pdata/1/auditp.txt
$$ ##AUDIT TRAIL=  $$ (NUMBER, WHEN, WHO, WHERE, WHAT)
(   1,<2024-03-04 14:16:47.90 +0400>,<she>,<DPX200>,
      <created by zg, POWCHK disabled, PULCHK disabled
       configuration hash MD5:
       00 E9 B6 7A A2 85 ED C7 34 08 36 98 17 FE 4E 26
       data hash MD5: 16K
       EF F9 E7 7D D7 37 8D 77 08 6D 81 1E BA D8 0A 2F>)
(   2,<2024-03-04 14:16:50.56 +0400>,<she>,<DPX200>,
      <Start of raw data processing
       efp BC_mod = 2 LB = 0.24 FT_mod = 6 PKNL = 1 PHC0 = -24941.13 PHC1 = 12.85264 SI = 16K 
       data hash MD5: 16K
       33 F1 E9 E5 1F 4F 0B 12 9D 3C 7B C5 1D 24 DA 19>)
(   3,<2024-03-04 14:17:14.92 +0400>,<she>,<DPX200>,
      <pk PHC0 = 0.4172292 PHC1 = -1.4 
       data hash MD5: 16K
       14 9B 61 7B 4F D2 5B 90 8B D2 B6 D4 0D 7C 77 22>)
(   4,<2024-03-04 14:17:18.34 +0400>,<she>,<DPX200>,
      <abs ABSG = 5 
       data hash MD5: 16K
       66 FB 03 DE FD 49 64 6A 8F 21 37 B2 73 DE AF B4>)
$$ ##END=
$$ 
$$ hash MD5
$$ 0B 03 5B 03 DD 02 DD E0 72 F4 20 F2 BC AE 4F C6
##$RELAX= 
##$RELAX= 
##$RELAX= 
##$RELAX= 
##$RELAX= 
##$RELAX= 
$$ Bruker specific parameters
$$ --------------------------
##$DU= <F:/spectra>
##$EXPNO= 1
##$NAME= <H-F>
##$PROCNO= 1
##$TYPE= <nmr>
##$USER= <she>
##$AMP= (0..31)
100 100 100 100 100 100 100 100 100 100 100 100 100 100 100 100 100 100 
100 100 100 100 100 100 100 100 100 100 100 100 100 100 
##$AQSEQ= 0
##$AQ_mod= 1
##$AUNM= <au_zg>
##$AUTOPOS= <>
##$BF1= 200.13
##$BF2= 200.13
##$BF3= 200.13
##$BF4= 200.13
##$BF5= 200.13
##$BF6= 200.13
##$BF7= 200.13
##$BF8= 200.13
##$BYTORDA= 1
##$CFDGTYP= 0
##$CFRGTYP= 5
##$CHEMSTR= <none>
##$CNST= (0..31)
1 1 145 1 1 1 1 1 1 1 1 1 1 1 1 1 1 1 1 1 1 1 1 1 1 1 1 1 1 1 1 1 
##$CPDPRG= <>
##$CPDPRG1= <>
##$CPDPRG2= <>
##$CPDPRG3= <>
##$CPDPRG4= <mlev>
##$CPDPRG5= <mlev>
##$CPDPRG6= <mlev>
##$CPDPRG7= <mlev>
##$CPDPRG8= <mlev>
##$CPDPRGB= <>
##$CPDPRGT= <>
##$D= (0..31)
0 1.2 0 0 0 0 0 0 0 0.06 0 0.03 0 0 0 0 0.0002 0 0 0 0 0 0 0 0 0 0 0 0 
0 0 0 
##$DATE= 1709547407
##$DBL= (0..7)
120 120 120 120 120 120 120 120 
##$DBP= (0..7)
150 150 150 150 150 150 150 150 
##$DBP07= 0
##$DBPNAM0= <>
##$DBPNAM1= <>
##$DBPNAM2= <>
##$DBPNAM3= <>
##$DBPNAM4= <>
$$ [...]
##$SUBNAM3= <"">
##$SUBNAM4= <"">
##$SUBNAM5= <"">
##$SUBNAM6= <"">
##$SUBNAM7= <"">
##$SUBNAM8= <"">
##$SUBNAM9= <"">
##$SW= 18.0517328524113
##$SWIBOX= (0..15)
0 0 2 0 0 0 0 0 0 0 0 0 0 0 0 0 
##$SW_h= 3612.71676300578
##$TD= 16384
##$TD0= 1
##$TE= 0
##$TE2= 300
##$TE3= 300
##$TEG= 300
##$TL= (0..7)
0 120 120 120 120 120 120 120 
##$TP= (0..7)
150 150 150 150 150 150 150 150 
##$TP07= 0
##$TPNAME0= <>
##$TPNAME1= <>
##$TPNAME2= <>
##$TPNAME3= <>
##$TPNAME4= <>
##$TPNAME5= <>
##$TPNAME6= <>
##$TPNAME7= <>
##$TPOAL= (0..7)
0.5 0.5 0.5 0.5 0.5 0.5 0.5 0.5 
##$TPOFFS= (0..7)
0 0 0 0 0 0 0 0 
##$TUNHIN= 0
##$TUNHOUT= 0
##$TUNXOUT= 0
##$USERA1= <user>
##$USERA2= <user>
##$USERA3= <user>
##$USERA4= <user>
##$USERA5= <user>
##$V9= 5
##$VALIST= <valist>
##$VCLIST= <CCCCCCCCCCCCCCC>
##$VD= 0
##$VDLIST= <DDDDDDDDDDDDDDD>
##$VPLIST= <PPPPPPPPPPPPPPP>
##$VTLIST= <TTTTTTTTTTTTTTT>
##$WBST= 1024
##$WBSW= 4
##$XGAIN= (0..3)
0 0 0 0 
##$XL= 0
##$YL= 0
##$YMAX_a= 423167
##$YMIN_a= -477361
##$ZGOPTNS= <>
##$ZL1= 120
##$ZL2= 120
##$ZL3= 120
##$ZL4= 120
##$ABSF1= 15.45602
##$ABSF2= -2.595829
##$ABSG= 5
##$ABSL= 3
##$ALPHA= 0
##$AQORDER= 0
##$ASSFAC= 0
##$ASSFACI= 0
##$ASSFACX= 0
##$ASSWID= 0
##$AUNMP= <proc_1d>
##$AZFE= 0.1
##$AZFW= 0.1
##$BCFW= 0
##$BC_mod= 2
##$BYTORDP= 0
##$COROFFS= 0
##$CY= -3
##$DATMOD= 1
##$DC= 0
##$DFILT= <>
##$DTYPP= 0
##$F1P= 0
##$F2P= 0
##$FCOR= 1
##$FTSIZE= 16384
##$FT_mod= 6
##$GAMMA= 0
##$GB= 0
##$INTBC= 1
##$INTSCL= 3.70164e-10
##$ISEN= 128
##$LB= 0.24
##$LEV0= 0
##$LPBIN= 0
##$MAXI= 10000
##$MC2= 0
##$MEAN= 0
##$ME_mod= 0
##$MI= 1.114404
##$NCOEF= 0
##$NC_proc= -6
##$NLEV= 6
##$NOISF1= 3.799351
##$NOISF2= 2.8
##$NSP= 0
##$NTH_PI= 0
##$NZP= 0
##$OFFSET= 15.46813
##$PC= 1
##$PHC0= -24940.71
##$PHC1= 11.45264
##$PH_mod= 1
##$PKNL= yes
##$PPARMOD= 0
##$PSCAL= 0
##$PSIGN= 0
##$REVERSE= no
##$SF= 200.130010721399
##$SI= 16384
##$SIGF1= 3
##$SIGF2= 2
##$SINO= 5.538805
##$SIOLD= 16384
##$SREGLST= <1H.CDCl3>
##$SSB= 0
##$STSI= 16384
##$STSR= 0
##$SW_p= 3612.71676300578
##$SYMM= 0
##$S_DEV= 0
##$TDeff= 16384
##$TDoff= 0
##$TI= <>
##$TILT= no
##$TM1= 0
##$TM2= 0
##$TOPLEV= 0
##$USERP1= <user>
##$USERP2= <user>
##$USERP3= <user>
##$USERP4= <user>
##$USERP5= <user>
##$WDW= 1
##$XDIM= 16384
##$YMAX_p= 335781924
##$YMIN_p= -281999
$$ End of Bruker specific parameters
$$ ---------------------------------
##NTUPLES= NMR SPECTRUM
##VAR_NAME=  FREQUENCY,     SPECTRUM/REAL,   SPECTRUM/IMAG
##SYMBOL=    X,             R,               I
##VAR_TYPE=  INDEPENDENT,   DEPENDENT,       DEPENDENT
##VAR_FORM=  AFFN,          ASDF,            ASDF
##VAR_DIM=   16384,         16384,           16384
##UNITS=     HZ,            ARBITRARY UNITS, ARBITRARY UNITS
##FACTOR=    0.220516191357247, 1,           1
##FIRST=     3095.63704509338, 0,            0
##LAST=      -517.079717912398, 0,           0
##MIN=       -517.079717912398, -281999,     0
##MAX=       3095.63704509338, 335781924,    0
$$ Real data points
##PAGE= N=1
##DATA TABLE= (X++(R..R)), XYDATA
$$ [...]
7521F97154J0313k1547N3355Q571N73l0999j5199J08037J00543k9028l8066J5571
7509H59278j2620P0560L7027q9692k8257k6679L0775O0956j412Q2631M3988K0636
7497A047191J83m1538p7746K898J16034L8073r6033N3995O0783j02953J12653
7486A113540K4690J29582P9032l0917K958P4114p692j0985J33824l7690l8923
7475A431533N5012p6814N8240J08418K3768q122L2993J54856k0440K1306K73812
7464B054562P2586K5029J64488O585J28311J75826m439l5539o4295J9936J58812
7453B701862J03991J41623J56797O325j79o5752N0029K39037J12167J04730J72084
7442C722714K96390K31750K65822J34374Q5112K9414l3046q1696o7098l6246o3351
$$ plain form
7521 697154 707467 685920 739275 747846 748419 717420 702221 810258 910801 881773 843707 859278
7509 859278 846658 917218 954245 864553 836296 809617 840392 901348 899936 982567 1026555 1047191
7497 1047191 1047374 1005836 928090 930988 1047022 1085095 989062 1043057 1103840 1000887 1113540
7486 1113540 1138230 1267812 1346844 1315927 1318885 1392999 1385307 1374322 1508146 1470456 1431533
7475 1431533 1486545 1409731 1467971 1576389 1600157 1592035 1625028 1779884 1759444 1780750 2054562
7464 2054562 2127148 2152177 2316665 2323250 2451561 2627387 2622948 2587409 2523114 2543050 2701862
7453 2701862 2805853 2947476 3104273 3110598 3110419 3044667 3094696 3333733 3445900 3550630 3722714
7442 3722714 4019104 4250854 4516676 4651050 4736162 4765576 4732530 4650834 4583736 4547490 4484139
7431D484139r2201R0032r7674j280J60080J26906J79542O0906J38001J64259m4172
7420E168538n8113k33618j97111j06233M0277l2228L04609L55678J40764R3652
7410E476215K13881P4576j9598r1876j06020m5269J30412J61194N5162j02678
7400E745999l29285l88667l43881k78748l00061k86786j87646r728j63045j12806
7390C345346q7487m6588J41693Q2114l036q4391L8194n895j56758Q7047L7779
7379C348018J25188j3888m8780k30119n2644J35259K7106p322j6876k3375J08768
7368C351335J13911J38039J63663J94877L30573L00021K30326K91945M49820M63545
7358F028055L60345K53147J64187p9463k49246k407R9242J43634K84407K66169
$$ plain form
7431 4484139 4391938 4481970 4384296 4383016 4543096 4670002 4849544 4910450 5048451 5212710 5168538
7420 5168538 5110425 4876807 4679696 4573463 4613740 4581512 4886121 5241799 5382563 5476215
7410 5476215 5690096 5764672 5745074 5653198 5547178 5501909 5632321 5793515 5848677 5745999
7400 5745999 5416714 5028047 4684166 4405418 4105357 3818571 3630925 3621197 3458152 3345346
7390 3345346 3257859 3211271 3352964 3435078 3432042 3347651 3385845 3379950 3223192 3310239 3348018
7379 3348018 3473206 3459318 3410538 3180419 3127775 3263034 3290140 3282818 3265942 3242567 3351335
7368 3351335 3465246 3603285 3766948 3961825 4292398 4592419 4822745 5114690 5564510 6028055
7358 6028055 6388400 6641547 6805734 6726271 6477025 6474618 6573860 6717494 7001901 7268070
7348G268070p7916k21621l12295k02870p3309j81845j76384q6171l39273l76716
7338E219670m14843l70058m30708l49179k47184k52472k36363p5961j75172j02076
7328B565654j3584j21514j20831k2509k3621j02024p7787n6343L3899q0304L0955
7317B011991o2602L8948O3138l3010l2208n7621K207M5256k6683P2616K3435k77121
7305A768346p4015J14963J39004J19148j4674P0380J03868J24225R6022M7967
7295B495234k5594q6924o3632N9177O0593k5537N9327P2782j05915j28686n7159
7284B253666m5333m1523n0944l4821l9388K5245K7468R0049J01343L2097J7975
7273B335834J3753J4995r6789L0392J16726k4439n9236p7137j10051n3837j65553
$$ plain form
7348 7268070 7190154 6968533 6656238 6453368 6380059 6198214 6021830 5935659 5596386 5219670
7338 5219670 4804827 4434769 4004061 3654882 3407698 3155226 2918863 2842902 2667730 2565654
7328 2565654 2552070 2430556 2309725 2287216 2263595 2161571 2083784 2027441 2061340 1981036 2011991
7317 2011991 1949389 1988337 2051475 2018465 1986257 1928636 1930843 1976099 1949416 2022032 2045467 1768346
7305 1768346 1694331 1809294 1948298 2067446 2052772 2123152 2227020 2351245 2447267 2495234
7295 2495234 2469640 2382716 2319084 2378261 2438854 2413317 2472644 2545426 2439511 2310825 2253666
7284 2253666 2208333 2166810 2115866 2081045 2041657 2066902 2094370 2184419 2285762 2317859 2335834
7273 2335834 2349587 2364582 2267793 2298185 2414911 2390472 2331236 2254099 2144048 2090211 1924658
7262A924658l8107p2981k1702o0902L4686Q7800j307j8512M3179k5436L6835r569
7250A878642J68241K0089j36951J01446J62877J13894K0084R583P475R8413P8732
7239B522525J32217J03679Q6865P4278Q2779m0136J7837K5579P3841J02039N3232
7228C234735j16765q6832m2643q9543N573p0221p293m8665k7620n4534k02202
7217B493990k18952p3698N3850m5316j36844N0300J6175p3683j32201K7707M0871
7206B002199k2476N7534l2741N0296Q5679k71q3634J11083L002J13385P0536J03186
7194B457778O3700J3623J04333R8217n2991j13620J45412Q3379N947L6315l3570
7183B808523J01139Q8525N2319P2388n3902j35808L3488k180j57262r0359o3683
$$ plain form
7262 1924658 1886551 1813570 1791868 1730966 1765652 1853452 1852145 1833633 1876812 1851376 1888211 1878642
7250 1878642 2046883 2066972 1930021 2031467 2194344 2308238 2328322 2337905 2345380 2443793 2522525
7239 2522525 2654742 2758421 2845286 2919564 3002343 2962207 2980044 3005623 3079464 3181503 3234735
7228 3234735 3117970 3031138 2988495 2898952 2904525 2834304 2827011 2778346 2750726 2696192 2493990
7217 2493990 2275038 2201340 2255190 2209874 2073030 2123330 2139505 2065822 1933621 1961328 2002199
7206 2002199 1979723 2037257 2004516 2054812 2140491 2140220 2056586 2167669 2170671 2284056 2354592 2457778
7194 2457778 2521478 2535101 2639434 2737651 2684660 2571040 2716452 2799831 2805778 2842093 2808523
7183 2808523 2909662 2998187 3050506 3122894 3068992 2933184 2966672 2964492 2807230 2716871 2653188
7172B653188j441L129j0367n495L3944P4001k763N7663J11813J0457J60162O7706
7160C151997J38831J74856J35461J87955J96274J80465L10016L70345L52206L64614
7150E563020L71288M59942L87504J41210K47584K42967K00775K30921j680k43311
7140G600220m98070o28923n24515m98186l94338n19980l64228k02806k71000j18000
7130C580174r6989j11354k47525m8396Q661J6465n2048n8054r7709M4030L9553
7119B976808N400L7542Q2537Q2386Q4424J32629K9225J41540J78627Q3119P5709
7108C909946J91380K39189K59068K66652M20596L27153L59839O64027P28587P39185
7098H105622Q31627R55321R89701Q45656M36418N0399j60983m83359q62017r81144
$$ plain form
7172 2653188 2651747 2654876 2644509 2639014 2672958 2746959 2744196 2801859 2913672 2924129 3084291 3151997
7160 3151997 3290828 3465684 3601145 3789100 3985374 4165839 4475855 4846200 5198406 5563020
7150 5563020 5934308 6394250 6781754 6922964 7170548 7413515 7614290 7845211 7843531 7600220
7140 7600220 7102150 6473227 5948712 5450526 5056188 4536208 4171980 3969174 3698174 3580174
7130 3580174 3483185 3371831 3124306 3075910 3084571 3101036 3048988 2990934 2893225 2937255 2976808
7119 2976808 2982208 3019750 3102287 3184673 3269097 3401726 3430951 3572491 3751118 3834237 3909946
7108 3909946 4101326 4340515 4599583 4866235 5286831 5613984 5973823 6637850 7366437 8105622
7098 8105622 8937249 9892570 10882271 11727927 12164345 12214744 12053761 11570402 10708385 9727241
7088I727241r03556j043383j018223p60993p05029n40150m49131l97829l90217
7079C518730l23051l35762k32457j18722j66168r0443k9217j02985j25402M9537
7069B044060j28631r1310j06780j77602j50249l6649N1562l3480j18082p3147
7059A179692O7671j66493l9890K0100P6665r6231M3734p3666j12816K999m646
7048H97119l8033k3287j333l3579o1649K1194R445j7894Q521j04653J40128p9598
7036G16381q2688O8024K2155k5995K1848o5480J08051P2766K5960K4708r6250
7025G89480k864j3780n6200l3900r6712j16098P9908Q1579L626l6570j04103l9155
7013D55211J2806J08439n99o9797l5236R5086l4341L5721k3999q9747m2920P5962
$$ plain form
7088 9727241 8823685 7780302 6762079 6001086 5296057 4755907 4306776 3908947 3518730
7079 3518730 3195679 2859917 2627460 2508738 2342570 2252127 2222910 2119925 1994523 2044060
7069 2044060 1915429 1824119 1717339 1539737 1389488 1352839 1404401 1370921 1252839 1179692
7059 1179692 1247363 1080870 1040980 1061080 1137745 1041514 1085248 1011582 898766 901765 897119
7048 897119 859086 835799 834466 800887 739238 760432 769877 751983 760504 655851 795979 716381
7036 716381 633693 701717 723872 697877 719725 654245 762296 835062 861022 885730 789480
7025 789480 786616 772836 716636 682736 586024 469926 549834 631413 635039 598469 494366 455211
7013 455211 468017 576456 575857 506060 470824 565910 531569 567290 543291 453544 410624 486586
7001D86586L4025l1834J51591L8098q890l8849k9018L8966l7894L0405l9122m8111
6989E45953j30396j22436K5258J10787l3821j00403P6217K0390j2836N7044l4870
6978D00887l3154J4054l7803m5114l1689J08198o2238J8741N7547m7707l7624
6967C04098l2822J0129l9813R866k8452j6390J14103l1775l0818O130M9444R4731
6955D08431j2821l9789o5833m6196j6571K5669j2665J6044P488L371O0596j07754
6943B19970L154l5777k4671M6222O0522o5516n0291M6621M6904l5347p179J17797
6931C22409j0589m6111O0643M3394j00099p9595J12347O7755j1556q4233J0891
6920B85256J1107K1034k2490J8458N582r6908R319j8117n0027M1798N1735q1137
$$ plain form
7001 486586 520611 488777 640368 678466 669576 630727 601709 640675 602781 633186 594064 545953
6989 545953 415557 293121 318379 429166 395345 294942 371159 391549 378713 435757 400887
6978 400887 367733 381787 343984 298870 267181 375379 313141 331882 389429 341722 304098
6967 304098 271276 281405 241592 251458 223006 206616 320719 288944 258126 264256 313700 408431
6955 408431 395610 355821 289988 243792 227221 252890 240225 256269 263757 267128 327724 219970
6943 219970 223124 187347 162676 208898 269420 203904 153613 200234 247138 211791 204612 322409
6931 322409 311820 265709 326352 369746 269647 190052 302399 370154 358598 274365 285256
6920 285256 296363 317397 294907 313365 318947 222039 231358 213241 163214 205012 256747 175610
6908A75610n9750P7080j9495Q679J03052k7434o4688M569J827M3527J19195p6234
6896B85938m6608j3177K5144j0336j3139N765J0856o3356M7269m9277n2591N8712
6884A85200q3154R2902J39056j3414L1780j7822j24604m701J4349M2153p4018
6873A87727k9743R1776M7775p5816o566N376L7421l1472m9722J7452Q0810j8627
6861B56391m6402J51L5562j8728J6638j23010L3355J6585q5068M4414M4615L7328
6849B11831q7594M5398j6191L1012m5740J0945J6714O5576J8067k8905j50280
6838G0833n4720J08305L5828N26J9143M3370N182j6609J7140k3069J1888o0092
6826A57725Q7817J2701Q5749q7864q2829J0127k2097N0408L5272j4734m3991O5673
$$ plain form
6908 175610 115860 192940 173445 182124 285176 257742 193054 197623 199450 242977 362172 285938
6896 285938 239330 226153 251297 240961 227822 233587 244443 181087 228356 179079 126488 185200
6884 185200 102046 194948 334004 320590 352370 334548 209944 205243 219592 261745 187727
6873 187727 157984 249760 297535 221719 215153 220529 257950 226478 176756 194208 275018 256391
6861 256391 209989 210140 245702 226974 243612 120602 153957 170542 85474 129888 174503 211831
6849 211831 124237 169635 153444 184456 138716 149661 166375 231951 250018 221113 70833
6838 70833 16113 124418 160246 160772 179915 223285 228467 211858 228998 205929 217817 157725
6826 157725 245542 258243 343992 256128 173299 183426 161329 211737 247009 232275 188284 253957
6814B53957j0875o6353n2639J8482N1797k1056P1924k7910M1672r9082K1887J19498
6802C01302O5583o0053j66581K9554N8122J47791p749j5586o577j1512j0308J02018
6790D26004J6434j0436n2019O8038O6268M8255n3396j06364k9806J3011o7916
6779C18073L0635J8823K2973p8504j6510J4806k7830J08166j8387r944K4647m5412
6767C41536o323p0993j16428K7498Q0608J8411K642r2026Q1321J784P1218M931
6755C44179j4887k887k1515n2499L4485R1929J1856k0364l0571P0828R097j0583
6743D09068M8734J6780j7337l0446m7068p5018k3867N9464N1239m8536j10337
6732B32676L4451J01111o81p9032l0178M6574q7310n3901P0445J292K6545l6147
$$ plain form
6814 253957 243082 176729 124090 142572 194369 173313 245237 217327 258999 159917 181804 301302
6802 301302 366885 306832 140251 169805 227927 375718 367969 352383 345806 334294 323986 426004
6790 426004 442438 432002 379983 448021 514289 562544 509148 402784 372978 385989 318073
6779 318073 348708 367531 390504 312000 295490 310296 282466 390632 372245 362301 386948 341536
6767 341536 335213 264220 147792 175290 255898 274309 276951 184925 266246 268030 339248 344179
6755 344179 329292 326405 304890 252391 286876 378805 390661 370297 339726 410554 419651 409068
6743 409068 457802 474582 457245 426799 379731 304713 280846 340310 391549 343013 232676
6732 232676 267127 368238 367557 288525 258347 304921 217611 163710 234155 235447 261992 225845
6720B25845P3367l3767J17427o2359q4363J0603R3573l0682l7261N7219j63495
6709A66107o3490J1654j2786J33269Q9562N1905l2617K5243J078Q220r8865M0466
6697C19746J4385l6796R4427o7365j5055L4553P991L7820k0567n0947J1781N3962
6685C83935N8741j20424N7171L0247l0989j1848j2638J30831o3226j17675M8716
6674C52841J5876o6754J04449N6597R295j6615n605k2975j4920J11657j18590
6663D05256j4415M1733r834o4641m2151L9334p159J14910P0434p0977O2689J127
6651E26306r1965J0104L7337l3032J12358K3343o5863O0125K7465j2459O9193
6640F62912K6070q9989R1197n6568P732k6429j2685O5579J18521J29950j41426
$$ plain form
6720 225845 299212 265445 382872 320513 236150 246753 340326 309644 272383 329602 166107
6709 166107 102617 114271 101485 234754 324316 376221 343604 368847 369925 378145 279280 319746
6697 319746 334131 297335 391762 324397 309342 343895 351886 389706 369139 318192 329973 383935
6685 383935 442676 322252 379423 409670 378681 366833 354195 485026 421800 304125 352841
6674 352841 368717 301963 406412 463009 472304 455689 450084 427109 412189 523846 405256
6663 405256 390841 432574 422740 358099 315948 355282 348123 463033 533467 462490 525179 526306
6651 526306 434341 444445 481782 448750 561108 584451 518588 578713 606178 593719 662912
6640 662912 688982 598993 690190 633622 641354 614925 602240 667819 786340 916290 774864
6629G74864j4694L1813j09008M8406j8727q6190K8416N4507m0703J21177l2008
6618G57853N048J79042M7280Q7268K8368Q3995K7360L7074m2764n8790j53732
6607I98002N5306O0954O0035j39279q3214j5417l5748J01728J4583n9657j5697
6596I41596o0753J1635M4335p7764j38655J00472j2027O458J2385l6760O1157
6585H52079n9983L051j8019M3519J5760j22100j3051O1652L9071o4388j7803M7059
6573G66847K0915J71010P0228j53465Q196P7297m6065j03673J06966J89015M3124
6562A150395n893R0475N0981k9099l2641J8999J22176O1579O4381J14040K90657
6551A896050P7379K34864J72917K22812J50664o6129p7766r1168j32905k91977
$$ plain form
6629 774864 760170 791983 682975 731381 712654 626464 654880 709387 668684 789861 757853
6618 757853 762901 941943 989223 1076491 1104859 1188854 1216214 1253288 1210524 1151734 998002
6607 998002 1053308 1114262 1174297 1035018 951804 936387 900639 1002367 1016950 957293 941596
6596 941596 880843 892478 936813 859049 720394 820866 808839 815297 827682 790922 852079
6585 852079 792096 795147 777128 820647 836407 714307 701256 762908 801979 737591 719788 766847
6573 766847 787762 958772 1029000 875535 883731 961028 914963 811290 918256 1107271 1150395
6562 1150395 1144502 1234977 1285958 1256859 1224218 1243217 1365393 1426972 1491353 1605393 1896050
6551 1896050 1973429 2208293 2381210 2604022 2754686 2688557 2610791 2519623 2386718 2094741
6541B094741j45254m5717j26692j6469q1692j42111O9391O863j20191P1308J21683
6530A685860P6204K9613K6483J92676J98621K20165K50242J64741N6644j25216
6520B776033j40994q5949j62759k37498j74973k01648j36854q0719j52706K6026
6510A427959j35008j59743R2775n4935n3611K61j01198k8954r4642j1151J05749
6499I87502K8220q580r5051k5416r2576l5336N772R4421k8610n6936L8986m8195
6487G64201Q2326o2973p8608J29673o3900R8746N6878l9164r1677k9422O7633
6476H33713l341p3732R706j6008M8251K9834o6211m6915R2781M3315M3897P378
6464I02668q6096J5158m3379l3264Q079O7010J4095l1778n8887Q39N4890O2113
$$ plain form
6541 2094741 1949487 1903770 1777078 1760609 1678917 1536806 1606197 1613060 1492869 1564177 1685860
6530 1685860 1762064 1791677 1818160 2010836 2209457 2429622 2679864 2844605 2901249 2776033
6520 2776033 2635039 2549090 2386331 2148833 1973860 1772212 1635358 1554639 1401933 1427959
6510 1427959 1292951 1133208 1225983 1171048 1117437 1117698 1016500 987546 892904 881753 987502
6499 987502 1015722 1007142 912091 886675 794099 758763 764535 858956 830346 773410 812396 764201
6487 764201 846527 783554 704946 834619 770719 869465 926343 887179 795502 766080 833713
6476 833713 830372 756640 766346 750338 798589 828423 762212 715297 808078 851393 895290 902668
6464 902668 816572 831730 788351 755087 763166 830176 844271 812493 753606 754445 809335 871448
6452H71448q6937n2672P8383j2374k6973J00796p9143o4595K3770J03302j0682
6441H44323Q7317J422l8711j6273J5828P1094M6018K1495o5162q582K8056M57
6429I87282j6086m8683J4099K5288N9965m783K3659L4205n0031j2784l6796m6561
6417I28774J02530M4748k0214l6045J29321p8976K0844R8735l2355K3849k5857
6406A155354M184M8431J496K2038K9987K439k4018J3231q2650j0768O8378l1860
6394A196242R709m0502q6620o7645J26290N3061q1897P1735J40401P8885l8631
6383A361028k19876j7477L9212j7402J50556P1908o6824o2485L0335m0047L389
6372A232317p429P6670O8706o8752J2709M853M7697j18136N7948n7920r2038L2101
$$ plain form
6452 871448 784511 731839 810222 797848 770875 871671 792528 727933 751703 855005 844323
6441 844323 931640 933062 894351 878078 893906 965000 1011018 1032513 967351 958769 986825 987282
6429 987282 971196 922513 936612 961900 1021865 1017082 1040741 1074946 1024915 1012131 975335 928774
6417 928774 1031304 1076052 1055838 1019793 1149114 1070138 1090982 1189717 1157362 1181211 1155354
6406 1155354 1159538 1207969 1209465 1231503 1261490 1263929 1239911 1253142 1170492 1159724 1228102 1196242
6394 1196242 1205951 1165449 1078829 1011184 1137474 1190535 1108638 1180373 1320774 1399659 1361028
6383 1361028 1141152 1123675 1162887 1145485 1296041 1367949 1301125 1238640 1268975 1228928 1232317
6372 1232317 1224888 1301558 1370264 1301512 1314221 1319074 1366771 1248635 1306583 1248663 1156625 1188726
6360A188726O6847P7585J01804j6366j95905l250J06093J84652K3265j41958j6618
6349A374875R4439N8699o2828k4434J02640J03840j13576P6558K0928j6095j483
6338A613563r3739P3996K7073P8825P4220K0763j7618R4576k8582j04466P9137
6327A817748J4266J34131L5533p8537P7894J54472R2084P9560n2152J28444M1706
6316B445149L3446J5556K5610L2759O4351m9927q128j023L2643m6180P4270O6149
6304B684675M6670J16975L1250K093O6782J12558K9774M0766P8453K06190J0832
6293C427018K2751P0868Q2426M6107J67959L495k1382L1199K3884J28656J43837
6282D126818P439J16886R3326K28347O270j31564J6236J10575K4528K0701R357
$$ plain form
6360 1188726 1255573 1333158 1434962 1418596 1222691 1219441 1325534 1510186 1533451 1391493 1374875
6349 1374875 1469314 1528013 1465185 1440751 1543391 1647231 1533655 1610213 1631141 1615046 1613563
6338 1613563 1519824 1593820 1620893 1699718 1773938 1794701 1777083 1871659 1843077 1738611 1817748
6327 1817748 1832014 1966145 2001678 1923141 2001035 2155507 2247591 2327151 2274999 2403443 2445149
6316 2445149 2478595 2494151 2519761 2552520 2616871 2566944 2558816 2557793 2590436 2544256 2618526 2684675
6304 2684675 2731345 2848320 2879570 2881663 2948445 3061003 3090777 3131543 3209996 3416186 3427018
6293 3427018 3449769 3520637 3603063 3649170 3817129 3820624 3799242 3830441 3854325 3982981 4126818
6282 4126818 4134257 4251143 4344469 4572816 4579086 4447522 4463758 4574333 4598861 4619562 4628919
6271D628919j4797O3506P733m8000J05918K04146O6475J15624L4619J33736P2731
6260E370610j1271Q7956N3135M2401Q2209Q3298J15382J12039J75936J04403L9084
6249F255182P4571P1368J6136p5449j05491j22532j25694o7359j32411J21193
6239E909514J24838l3019Q6602k1451K4129o781J4869J5562J40364r4022o9691
6228F090914J11270J11645m2032p5O4847l1061L2493Q7043R1786r232o1727Q027
6216F453898m9709k9200K1264M4762n820j1383Q6826O6823l4407J04619Q0945
6205F728618K3827l1537J2810Q7912l9249L817L0005p9801P3515J35018R9346
6194G044281R3301J54586J48434K04923K13563P7373J76594J6360Q9926k5769
$$ plain form
6271 4628919 4614122 4677628 4685361 4637361 4743279 4947425 5013900 5129524 5164143 5297879 5370610
6260 5370610 5359339 5447295 5500430 5542831 5625040 5708338 5823720 5935759 6111695 6216098 6255182
6249 6255182 6329753 6401121 6417257 6341808 6236317 6113785 5988091 5920732 5788321 5909514
6239 5909514 6034352 6001333 6087935 6066484 6090613 6083832 6098701 6114263 6254627 6160605 6090914
6228 6090914 6202184 6313829 6271797 6271722 6336569 6305508 6338001 6425044 6516830 6507598 6445871 6453898
6216 6453898 6404189 6374989 6396253 6441015 6435195 6423812 6510638 6577461 6543054 6647673 6728618
6205 6728618 6752445 6720908 6733718 6821630 6782381 6786198 6816203 6736402 6809917 6944935 7044281
6194 7044281 7137582 7292168 7440602 7645525 7859088 7936461 8113055 8129415 8219341 8193572
6184H193572P8677J90304J5948p1590J06462J77535P4379J73408K45693J06206
6174I290594L16309L56501M20721M45987M65744N06813N28333N75179K97247J20974
6164A3324402J38479J25220J95598Q5353L13331N29389M95587N27759N91327P57146
6154A7083591P53870P65449Q86198R16034Q74726O39843N34652J80444j3842o8704
6144B2552261p5265J9352Q1331j8674j27868j33709o4535j74459j97616L0443
6134B1891261K97353N10497O89744R12597J253425J489588J692304J884651J852528
6125C2473948J666964J104467N53104L8051m11911m00625k06739j10620q2636
6116C4624003m13091o16148j043375j165320j205557r73796o04126l24555q1885
$$ plain form
6184 8193572 8272249 8462553 8478501 8406911 8513373 8690908 8765287 8938695 9184388 9290594
6174 9290594 9606903 9963404 10384125 10830112 11295856 11802669 12331002 12906181 13203428 13324402
6164 13324402 13462881 13588101 13783699 13869052 14182383 14711772 15207359 15735118 16326445 17083591
6154 17083591 17837461 18602910 19489108 20405142 21279868 21919711 22454363 22634807 22620965 22552261
6144 22552261 22476996 22496348 22577679 22559005 22431137 22297428 22232893 22058434 21860818 21891261
6134 21891261 22188614 22699111 23388855 24301452 25554877 27044465 28736769 30621420 32473948
6125 32473948 34140912 35245379 35798483 35836534 35424623 35023998 34817259 34706639 34624003
6116 34624003 34210912 33594764 32551389 31386069 30180512 29206716 28602590 28278035 28196150
6107B8196150R9318K55895M87281O34347M13516M22958N67652M81452O93401M03436
6097C2655406J60494q6462k64057j04506j86689j66185l03237o57603q44364r82453
6087B9220344j124609j106023r65285r31830r83238r31072o03141o08467o89125
6078B1277554n30795m38158k60441k01791j85777o9029o9367K8442j9637r28p8748
6067A9451325o893j067j44292k94879j41235j21096k99269k02817l43579k11313
6057A7684885o3755r1985j73816j74573m3656r6695o5805P4917j6547O0716J32566
6046A7226252J58998J33969L28807M62739M16052K72140K89143J34826O3248R2038
6036A9578212Q8177J04862K06170L52932L00728L84234L06329L42420O09433O42109
$$ plain form
6107 28196150 28295468 28551363 29038644 29672991 30086507 30509465 31077117 31558569 32251970 32655406
6097 32655406 32815900 32729438 32465381 32360875 32174186 32008001 31704764 31047161 30202797 29220344
6087 29220344 28095735 26989712 26024427 25092597 24109359 23178287 22575146 21966679 21277554
6078 21277554 20746759 20308601 20048160 19846369 19660592 19591563 19522196 19550638 19531001 19530073 19451325
6067 19451325 19444432 19443365 19299073 19004194 18862959 18741863 18442594 18239777 17896198 17684885
6057 17684885 17621130 17529145 17355329 17180756 17137100 17040405 16974600 17049517 17032970 17093686 17226252
6046 17226252 17385250 17519219 17848026 18310765 18726817 18998957 19288100 19422926 19486174 19578212
6036 19578212 19666389 19771251 19977421 20330353 20631081 21015315 21321644 21664064 22273497 22915606
6026B2915606O65657O75847Q58358Q37638R44978J257767J305630J444513J659439
6017C2565433J878250K277955K415849K873080L409921L815836L992781L954765
6009E7183870L382024K251433P75893q16768j984348k588627k788873k460494
6001E2954110j988848j450802r73681m89011j62078J47766O31332J120443J571947
5992E1361178K043774K618705L277906M055975M855193N608769O427852O844923
5984H7094275O694839N896806L775104O16746k677118n253588o642160o581620
5976H2923284n974502n237177m683148m325798l993755l434218k733711k116889
5968E0424086j474374r11162l42093K45083O50336J069374J620025K006911K361361
$$ plain form
6026 22915606 23581263 24257110 25115468 25953106 26898084 28155851 29461481 30905994 32565433
6017 32565433 34443683 36721638 39137487 42010567 45420488 49236324 53229105 57183870
6009 57183870 60565894 62817327 63593220 62776452 60792104 58203477 55414604 52954110
6001 52954110 50965262 49514460 48540779 48051768 47889690 48037456 48668788 49789231 51361178
5992 51361178 53404952 56023657 59301563 63357538 68212731 73821500 80249352 87094275
5984 87094275 93789114 99685920 103461024 104077770 101400652 96147064 89504904 82923284
5976 82923284 76948782 71711605 67028457 62702659 58708904 55274686 52540975 50424086
5968 50424086 48949712 48038550 47696457 47941540 48591876 49661250 51281275 53288186 55649547
5959E5649547K471999K299201J670320L81704j028864k476786l520902m103448
5951E1342771m054473l963196l430480l114100k666248k212232j959827j632804
5943B8309411j365116j242345j137710j229964j301337j091175r68776q83253
5935A9089735o58108p14975p36565m78810n22787m78504n06432n05859m05931
5926A4081764m44040l72793k44455k67694m55309l32061k27425k36162k65060
5917A1236765j61132k18688k00074j07229j39036k63227j75063p9163j70865o6409
5907I655879j05204j49097j91831j99407j76520p0205j1917n5393p7746l0552
5897H588007L4019r5096R8259L8302k26161o2979k4850o002j52995j6088l9373
$$ plain form
5959 55649547 58121546 60420747 62091067 62472771 61443907 58967121 55446219 51342771
5951 51342771 47288298 43325102 39894622 36780522 34114274 31902042 29942215 28309411
5943 28309411 26944295 25701950 24564240 23334276 22032939 20941764 19972988 19089735
5935 19089735 18431627 17716652 16980087 16501277 15978490 15499986 14993554 14487695 14081764
5926 14081764 13637724 13264931 13020476 12752782 12297473 11965412 11737987 11501825 11236765
5917 11236765 11075633 10856945 10656871 10549642 10410606 10147379 9972316 9893153 9722288 9655879
5907 9655879 9550675 9401578 9209747 9010340 8833820 8763615 8751698 8696305 8618559 8588007
5897 8588007 8622026 8526930 8625189 8663491 8437330 8374351 8349501 8343499 8190504 8174416 8135043
5886H135043n6181j66573j42225j25705j10287j08950p1942l3057J7246k5811
5876G311558j01557O0326K8431q045n8054o1539K3841m1704M6682L0100k5106
5865G204933R0742J29119j3074n2613k7851j15442r512K0292j00479l4884j28101
5854F963130n848j048l2374k3085M1464J279J1026n9576p4558J45064J5205q4122
5842F896557J9698l1552n7998k2103n516J26208n9371p8869l653l228P0649P1515
5830F922337r1198Q2428J69246j19291n4579Q4381m1655k173o5284o0211L8175
5819F862176J8546k5984J3220M3724M7982N0782r7531J3486J25358k213n4906
5808F994640M0356K3575k0119L1366P1226K4835J18864J25406o2850k4383N4204
$$ plain form
5886 8135043 8078862 7912289 7770064 7644359 7534072 7425122 7353180 7320123 7337369 7311558
5876 7311558 7210001 7270327 7298758 7290713 7232659 7171120 7194961 7153257 7199939 7230039 7204933
5865 7204933 7295675 7424794 7411720 7359107 7331256 7215814 7206302 7226594 7126115 7091231 6963130
5854 6963130 6957282 6956234 6923860 6900775 6942239 6943518 6954544 6894968 6820410 6965474 6980679 6896557
5842 6896557 6916255 6884703 6826705 6804602 6799086 6925294 6865923 6787054 6783401 6780173 6850822 6922337
5830 6922337 6831139 6913567 7082813 6963522 6908943 6993324 6951669 6949496 6884212 6824001 6862176
5819 6862176 6880722 6854738 6867958 6911682 6959664 7010446 6912915 6926401 7051759 7049546 6994640
5808 6994640 7034996 7058571 7038452 7069818 7141044 7165879 7284743 7410149 7347299 7322916 7377120
5797G377120k1377L3852M7726O4816R2295j3866J08560L5745R4246J65702O4063
5786H048882M0699K9853O5459Q1433J42459J05353M3101j7828J15757M174P466
5775H666808P2550J28700P3203J93323J01033N3826J77759R6952M6940J01247
5765I712341J88940P0661J28380J66184J22779P3147J17607J08885K37529K12428
5755A1138881J03756J45891K41140N5932K08557R6508J87958J30207J25717K25434
5745A2659981K51676K68876K22201L53104L32195K10795L21060K37976J62106
5736A5019970K26748L28015M40360N89472O79709O56742Q46467J063504J164778
5727B1015765J201603J221946J202836Q45482K76564q4633n48664o72044o44075
$$ plain form
5797 7377120 7355743 7389595 7437321 7502137 7594432 7580566 7689126 7724871 7819117 7984819 8048882
5786 8048882 8089581 8119434 8184893 8266326 8408785 8514138 8557239 8539411 8655168 8659342 8666808
5775 8666808 8739358 8868058 8941261 9134584 9235617 9289443 9467202 9564154 9611094 9712341
5765 9712341 9901281 9971942 10100322 10266506 10389285 10462432 10580039 10688924 10926453 11138881
5755 11138881 11242637 11388528 11629668 11685600 11894157 11990665 12178623 12308830 12434547 12659981
5745 12659981 12911657 13180533 13402734 13755838 14088033 14298828 14619888 14857864 15019970
5736 15019970 15246718 15574733 16015093 16604565 17284274 17941016 18787483 19850987 21015765
5727 21015765 22217368 23439314 24642150 25487632 25764196 25679563 25130899 24458855 23814780
5718B3814780n64620l04308k29790k5564J76044K41742J47822K34252K51324K53006
5708B3994688M25803N59470Q85038J128814J271130J577904K054787K258284K199132
5699C6355050J632898P67337n63827j521890j822038j686186j339791r09832n24691
5690C0387030k96204j22029l1948p6588j46061k37395k90214j62843r9987J3145
5680B8936906K37566L16672M12565N62813P42982P77973P30190M46852N9722k50793
5670C2973448o22051p01463n09764m75897j64648O5462J38696J73330J31722L15153
5660C1323988K85191J20444K84902K64591K81331K08096J94134K63850L04018
5651C3530545L15531M04775L60165N81602P66091O33121O53277P28257O83589
$$ plain form
5718 23814780 23250160 22945852 22716062 22690498 22866542 23108284 23256106 23490358 23741682 23994688
5708 23994688 24420491 24979961 25864999 26993813 28264943 29842847 31897634 34155918 36355050
5699 36355050 37987948 38755285 38191458 36669568 34847530 33161344 31821553 30911721 30387030
5690 30387030 30090826 29968797 29936849 29860261 29714200 29476805 29186591 29023748 28923761 28936906
5680 28936906 29174472 29491144 29903709 30466522 31209504 31987477 32717667 33164519 33224241 32973448
5670 32973448 32351397 31649934 31140170 30664273 30499625 30565087 30703783 30877113 31008835 31323988
5660 31323988 31609179 31729623 32014525 32279116 32560447 32768543 32962677 33226527 33530545
5651 33530545 33846076 34250851 34611016 35192618 35958709 36591830 37245107 37973364 38656953
5642C8656953O41176P72178P77174P49596P52729R55528J019466J261003J271944
5633D6857747J386137J611521J585657J818591J916568K240365K437752K631958
5625F2486296L023909L098683L413867L544077L613375L639786L722991L649187
5617I0192171L474036L040003K410894J547084P96240N22011M36851N27919Q07148
5608A03754357R99196J278351J588887J928022K669731L596034M262465M983657
5600A25060700N673854O347340O856205P081467P253238P176445O821949O021512
5592A78292710M672654K498569k50781l018527n403767p314022q666152r048474
5584A51762210r349453r173436q832248q117544p245415o486289n502716m714342
$$ plain form
5642 38656953 39298129 40070307 40847481 41597077 42349806 43305334 44324800 45585803 46857747
5633 46857747 48243884 49855405 51441062 53259653 55176221 57416586 59854338 62486296
5625 62486296 65510205 68608888 72022755 75566832 79180207 82819993 86542984 90192171
5617 90192171 93666207 96706210 99117104 100664188 101460428 101982439 102419290 102947209 103754357
5608 103754357 104753553 106031904 107620791 109548813 112218544 115814578 120077043 125060700
5600 125060700 130734554 137081894 143938099 151019566 158272804 165449249 172271198 178292710
5592 178292710 182965364 185463933 185213152 182194625 176790858 169476836 160810684 151762210
5584 151762210 142412757 133239321 124407073 116289529 109044114 102557825 97055109 92340767
5576I2340767l838588l127109k296355j757417j355940q41169p41470q19608o42416
5567G6920695n67834k50478Q123M65172Q47638J021190J096370J122683O17833
5558H1281392j86517q54330j380265j366994j033433n77350q4216M00806P58249
5549G6957342P32052L83426J52397K20818n766J22654N41075J149680J707851
5540H1961529K309906L279010L966249M873328N529212O005629N717531M354670
5532A17997064K473762J82726k313152m372924n482698n465876m734009l774663
5524I4510230k620318j418191k44432N78760J092662R89774N32480N84288O66262
5515I4671515R16028J555898K650384M040455N563039O695187P635646P717668
$$ plain form
5576 92340767 88502179 85375070 83078715 81321298 79965358 79124189 78382719 77563111 76920695
5567 76920695 76352861 76102383 76110506 76575678 77423316 78444506 79540876 80663559 81281392
5558 81281392 81094875 80240545 78860280 77493286 76459853 75882503 75798287 76199093 76957342
5549 76957342 77689394 78072820 78225217 78446035 78440269 78562923 79103998 80253678 81961529
5540 81961529 84271435 87550445 91516694 96390022 101919234 107924863 113642394 117997064
5532 117997064 120470826 120653552 118340400 113967476 108484778 103018902 98284893 94510230
5524 94510230 91889912 90471721 90227289 90806049 91898711 92888485 93420965 94005253 94671515
5515 94671515 95587543 97143441 99793825 103834280 109397319 116092506 123728152 131445820
5507A31445820O413502L507961q18831n099294q082436r233420r076890q189023
5499A00867389p404601o528787n500966m393430l496450k974695k383126k179636
5491F6005698j805574j259560q16108k75339K62256Q15183J253021J691053J830389
5482F7701019J608736J140761K22873j195861k623311l790483m326364m275661
5474E4461709l877659l236178k603389k257003j990710j782244j595552j514963
5466C5604011j386123j265410j206663j189872j030352r44112r50050r07327q53057
5457B5871045o82677o45040m63050m36421n73592o61910p73839o64441o55486
5448B0314589m84451n09214l71235l00728k75704l27303k74703k12519k46789
$$ plain form
5507 131445820 137859322 141367283 140548452 135449158 127366722 118133302 109056412 100867389
5499 100867389 93462788 86934001 81433035 77039605 73543155 70568460 68185334 66005698
5491 66005698 64200124 62940564 62124456 61849117 62111373 62926556 64179577 65870630 67701019
5482 67701019 69309755 70450516 70673389 69477528 66854217 63063734 58737370 54461709
5474 54461709 50584050 47347872 44744483 42487480 40496770 38714526 37118974 35604011
5466 35604011 34217888 32952478 31745815 30555943 29525591 28581479 27631429 26724102 25871045
5457 25871045 25188368 24543328 24080278 23643857 23070265 22408355 21634516 20970075 20314589
5448 20314589 19830138 19320924 18949689 18648961 18373257 18045954 17771251 17558732 17311943
5439A7311943l59017l86995l73054m45658l12388k74648l89551k74683k46629
5430A4249320k39816k85549k07698k74684l93698l31084n06572l03977k67153
5421A1439089l18828l03515j87251k24105l52338j43853j40146l49803o2314o951
5411I349985j11117j86167o0436j85630j11838l08118n3408j53003j83812j11495
5401G884961p4162j53678j35721L1351k6809j53811j63693L3457M6748j12165
5391G176478j20846o0867q9459r8628j23835m0360m3608j79845j2256n2707j10116
5380F243951P8596O8116R131r7572K9753K4267K6384N9416l165J6730J02278L3539
5368F591424k7808o2065O7219r6743J17831J55073M971J13036l4736k44224k60373
$$ plain form
5439 17311943 16952926 16565931 16192877 15747219 15434831 15160183 14770632 14495949 14249320
5430 14249320 14009504 13723955 13516257 13241573 12847875 12516791 12010219 11706242 11439089
5421 11439089 11120261 10816746 10629495 10405390 10053052 9909199 9769053 9419250 9356936 9349985
5411 9349985 9238868 9052701 8992265 8806635 8694797 8386679 8333271 8180268 7996456 7884961
5401 7884961 7810799 7657121 7521400 7552751 7525942 7372131 7208438 7241895 7288643 7176478
5391 7176478 7055632 6994765 6905306 6806678 6682843 6642483 6598875 6419030 6406774 6354067 6243951
5380 6243951 6322547 6390663 6399794 6302222 6331975 6356242 6382626 6442042 6438877 6455607 6557885 6591424
5368 6591424 6563616 6501551 6568770 6472027 6589858 6744931 6749902 6862938 6828202 6583978 6323605
5357F323605k48101j49376j09774J14619J03100p6159j05796r7541J58082J1406
5347E924065j76564j40062k06577j47308K3843n8830j78574P5418l019l8332p0738
5336E003322L3956r9759p109j7446J38426l5627j4297r397o529M6224j9126L4208
5324E046846J19253J39149J19811J19513K32393L59974K51648J32782j39713j58310
5314F223346l55175k71464j94707j46175j44084j0587O2288j27059l9317K5260
5304E022326j5134k1961J7895M7663O3787k1420P5611J3616L2L728J00364J54000
5292E440507J55251K22918O6272K69444K59418K66536K13672L14126J06719j46505
5282G168358j91284l34182l67076k14594j63492k10964j32464j81391k41647k9930
$$ plain form
5357 6323605 6075504 5926128 5816354 5930973 6034073 5957914 5852118 5754577 5912659 5924065
5347 5924065 5747501 5607439 5400862 5253554 5277397 5218567 5039993 5115411 5112392 5074060 5003322
5336 5003322 5037278 4937519 4930410 4912964 5051390 5015763 5001466 4992069 4985540 5031764 5012638 5046846
5324 5046846 5166099 5305248 5425059 5544572 5776965 6136939 6388587 6521369 6381656 6223346
5314 6223346 5868171 5596707 5402000 5255825 5111741 5101154 5163442 5036383 4997066 5022326
5304 5022326 5007192 4985231 5003126 5050789 5114576 5093156 5168767 5182383 5182415 5186143 5286507 5440507
5292 5440507 5595758 5818676 5884948 6154392 6413810 6680346 6894018 7208144 7314863 7168358
5282 7168358 6977074 6642892 6275816 6061222 5897730 5686766 5554302 5372911 5131264 5101334
5272E101334n2761p1415l5179j70122j27586j01984j13661k390J7502R015l0047
5261D422706L210j2862O2629l9967J6030M0610J83800J19100J23642K6210r5922
5250D849186j71437n669K5432K966K9273q4905O4942N6789n9295l8319J8905p4759
5238D613109j84005n5213J3670j66749l6261P9255M6606j37095p071M8728J5414
5227D230388m0065l5497n9130n0675N2785J40492K7578K2016M1117l5952p276
5216D285781k4900J57458M1564J10459L3882K1785o187J24533K56550l5725O8203
5205E033403Q5690N3743n6469J30653r461o8002R3580o272q485p7401J8637K6917
5193E216533k0110o1837M6260J41586J31096J47029J87387J12860k5455n8318
$$ plain form
5272 5101334 5048573 4977158 4941979 4771857 4644271 4542287 4428626 4426236 4443738 4452753 4422706
5261 4422706 4425916 4413054 4475683 4435716 4451746 4492356 4676156 4795256 4918898 4945108 4849186
5250 4849186 4677749 4672080 4697512 4700478 4729751 4644846 4709788 4766577 4707282 4668963 4687868 4613109
5238 4613109 4429104 4373891 4387561 4220812 4184551 4263806 4310412 4173317 4166246 4214974 4230388
5227 4230388 4190323 4154826 4095696 4045021 4097806 4238298 4265876 4287892 4329009 4293057 4285781
5216 4285781 4260881 4418339 4459903 4570362 4604244 4626029 4619842 4744375 5000925 4965200 5033403
5205 5033403 5119093 5172836 5116367 5247020 5237559 5169557 5263137 5256865 5248380 5170979 5189616 5216533
5193 5216533 5196423 5134586 5180846 5322432 5453528 5600557 5787944 5900804 5875349 5817031
5183E817031j94132N4654Q3871j53375p4673P2332q0730j25624L5455J61964R1215
5172E687988Q584L2810O66M4820K2824J30842J88817J26453Q8696M1653J38454
5161F512607P8555P7337M2581R6968J64570R6322k8273K776Q8213J2506J55822
5150G299984J80600O5295N35N338J26887O3837J235P24Q6219J1824N087K22299
5138H069864J50834J17038J92256n3193j06819n6739O5576O7788L3162L4370N8761
5127H572898J24943J37260K10578L99525K89304M23791L09306L84316K86430R1710
5117A1230061L43124M73780M23812M74962J26806m12315p38785p66543o62544
5108A0492358n98904k95411j78314j13432p1638N3727N2624J63118k1669j67634
$$ plain form
5183 5817031 5622899 5677553 5761424 5608049 5533376 5605708 5524978 5399354 5434809 5596773 5687988
5172 5687988 5696572 5729382 5730048 5774868 5797692 5928534 6117351 6243804 6332500 6374153 6512607
5161 6512607 6591162 6668499 6711080 6808048 6972618 7068940 7040667 7043443 7131656 7144162 7299984
5150 7299984 7480584 7545879 7546414 7551752 7678639 7742476 7743711 7744435 7830654 7842478 7847565 8069864
5138 8069864 8220698 8337736 8529992 8476799 8369980 8313241 8378817 8446605 8479767 8514137 8572898
5127 8572898 8697841 8835101 9045679 9445204 9734508 10158299 10467605 10851921 11138351 11230061
5117 11230061 11573185 12046965 12470777 12945739 13072545 12660230 11921445 11154902 10492358
5108 10492358 9893454 9598043 9419729 9306297 9234659 9288386 9341010 9504128 9482459 9314825
5098I314825k80766j17441j6190q6128p9614j65729k36828j81682o0839K3479
5088H113087j15282j39237l4215J10018L9015q0230Q232J67925k3026M4632j13266
5077G977653L5796O5676N0661N5897N6357O9811p4749k4448L363n2592j15820
5066H047605j16709j83517m2746r864O3870J36213l4579o099M9588J761J81195
5055H086718K8811N5241J57861K04196J13591J45613K52187J90833J49248J19062
5045I503361K47689J21796J7087k6224L2455Q0943Q1469Q3538J34349O2370K02711
5034A0541544J65655K14585Q6971J55549J70773P1741J72410J41857R1764q5169
5024A1727680j64322m7396P0931j69379j02552O8708J51403J30868J29698M2306
$$ plain form
5098 9314825 9034059 8916618 8900428 8814300 8734686 8568957 8332129 8150447 8089608 8113087
5088 8113087 7997805 7858568 7824353 7934371 7973386 7893156 7901388 8069313 8046287 8090919 7977653
5077 7977653 8013449 8079125 8129786 8185683 8242040 8311851 8237102 8212654 8216017 8163425 8047605
5066 8047605 7930896 7747379 7704633 7694769 7758639 7894852 7860273 7854174 7903762 7905523 8086718
5055 8086718 8115529 8170770 8328631 8532827 8646418 8792031 9044218 9235051 9384299 9503361
5045 9503361 9751050 9872846 9889933 9863709 9896164 9977107 10058576 10142114 10276463 10338833 10541544
5034 10541544 10707199 10921784 11008755 11164304 11335077 11406818 11579228 11721085 11812849 11727680
5024 11727680 11563358 11515962 11586893 11417514 11314962 11383670 11535073 11665941 11795639 11837945
5014A1837945Q8110J71262J03830K51108N7804L10849L16439J58820K26755J79660
5004A3702582K86509L55764M70408L55409M85746P02985P94843Q31333O98388
4995A8683967M55632J35033k91739l15647k45200j48331j10988J40355K23122
4986A8526204K48208J85114K50497K74520M46147M03207L91338K46649L33950
4977B1305834J92693J66985K52146K95711L85481N08581N63787O25053P04601
4968B5000872O01296O41514Q55938Q41983P36798Q33449P20932Q53241P88443
4959C1874466O95123O30139N55122M59911N34513M92238P29437Q60516P36766
4950C7568231R03722J025831R78731J187864J310290J382097J454720J355340
$$ plain form
5014 11837945 11926055 12097317 12201147 12452255 12510059 12820908 13137347 13296167 13522922 13702582
5004 13702582 13989091 14344855 14815263 15170672 15656418 16359403 17154246 17985579 18683967
4995 18683967 19139599 19274632 18982893 18667246 18422046 18273715 18162727 18303082 18526204
4986 18526204 18774412 18959526 19210023 19484543 19930690 20333897 20725235 20971884 21305834
4977 21305834 21498527 21665512 21917658 22213369 22598850 23107431 23671218 24296271 25000872
4968 25000872 25602168 26243682 27099620 27941603 28678401 29511850 30232782 31086023 31874466
4959 31874466 32569589 33199728 33754850 34214761 34749274 35241512 35970949 36831465 37568231
4950 37568231 38471953 39497784 40476515 41664379 42974669 44356766 45811486 47166826
4942D7166826J383304J164736O33535L55248L26997K00687M37094M36836P33011
4933E2838274J031769J213287J412992J515266J651460J646944J539403J440205
4925F4289600J297733J140978R93747Q30229J074898J234938J461260J672660
4917G3996043J774113J737775J586140J168596O73128L28504m5734o48384j225768
4908G9344413k146951l460970l936614l393132k926849k392601j952444j522459
4900E7612393j180926p13653m03887j13325L77203P37465J222973J838785K550372
4891F1927400L429703M100773M209168L068534L04846k756364l547725k863005
4883F7873330k147362j645170j179271q74544n09586l01130l03436j13349Q6163
$$ plain form
4942 47166826 48550130 49714866 50348401 50703649 51030646 51231333 51668427 52105263 52838274
4933 52838274 53870043 55083330 56496322 58011588 59663048 61309992 62849395 64289600
4925 64289600 65587333 66728311 67722058 68552287 69627185 70862123 72323383 73996043
4917 73996043 75770156 77507931 79094071 80262667 80935795 81264299 81218565 80570181 79344413
4908 79344413 77197462 73736492 69799878 66406746 63479897 61087296 59134852 57612393
4900 57612393 56431467 55717814 55313927 55200602 55577805 56315270 57538243 59377028 61927400
4891 61927400 65357103 69457876 73667044 76735578 77040424 74284060 70736335 67873330
4883 67873330 65725968 64080798 62901527 62026983 61517397 61216267 60912831 60799482 60885645
4874F0885645K68871L91743M06199O66088O62102P40702R32635J032406J080125
4865F7066516J206831J105906R67415R34909J098319J207899J178312J435315
4857G6201422J740849J995424K327095K621111K845006L344319L717307M271584
4849I9064117M741471N609969O467580P387567Q215424R167634R637496R896562
4841A60187820R678933R240936Q597788Q426127Q835932R370818R924817R467218
4833B33730389P893780N377129J813980j543129m798921p522947r488183j0631865
4825B14830233j0913422j0637734j0238480r725360r245809q751395q422014p902329
4817A38993690p415714p132135o619795o339068n928462n392856m961090m760065
$$ plain form
4874 60885645 61154516 61546259 61952458 62618546 63280648 64021350 64953985 65986391 67066516
4865 67066516 68273347 69379253 70346668 71281577 72379896 73587795 74766107 76201422
4857 76201422 77942271 79937695 82264790 84885901 87730907 91075226 94792533 99064117
4849 99064117 103805588 109415557 115883137 123270704 131486128 140653762 150291258 160187820
4841 160187820 169866753 179107689 187705477 196131604 204967536 214338354 224263171 233730389
4833 233730389 241624169 247001298 248815278 247272149 242473228 234950281 225462098 214830233
4825 214830233 203916811 193279077 183040597 173315237 164069428 155318033 146896019 138993690
4817 138993690 131577976 124445841 117826046 111486978 105558516 100165660 95204570 90444505
4809I0444505m547938m240026l677509l416529l013948k640632k349314k181658
4801F4376951k096685j857741j815206j761927j578143j616499j632795j702020
4793E0315935j432698j438622j562750j496318j392041j329628j177581j200102
4785C9286195j191849j056026j013657q72315p78830p49575p39860p36226p17400
4776C1430457p71503n23159m84931n28113o61894o01230n77731m70768l24804
4767B6486324m99834l10833l29928l19116k63769j86926j77690l45571k30516
4758B3822141j36089j44319j28941j17450j14221j88228k11774k00251k21247
4749B2359621k39493k96836j93107j3481j61000p8213j2973M2098r9928n3806
$$ plain form
4809 90444505 85896567 81656541 77979032 74562503 71548555 68907923 66558609 64376951
4801 64376951 62280266 60422525 58607319 56845392 55267249 53650750 52017955 50315935
4793 50315935 48883237 47444615 45881865 44385547 42993506 41663878 40486297 39286195
4785 39286195 38094346 37038320 36024663 35152348 34373518 33623943 32884083 32147857 31430457
4776 31430457 30658954 30135795 29650864 29122751 28460857 27859627 27281896 26811128 26486324
4767 26486324 25986490 25675657 25345729 25026613 24762844 24575918 24398228 24052657 23822141
4758 23822141 23686052 23541733 23412792 23295342 23181121 22992893 22781119 22580868 22359621
4749 22359621 22120128 21823292 21630185 21616704 21455704 21377491 21364518 21406616 21306688 21252882
4739B1252882L7262J45673j3245N2680J36695K22184O7420R1601K75352J53470
4729B2421974J32219J22683J07929O8202K05787K05982Q1083J48162K02909J96560
4719B3893490K14096J59079J00839L9311J71374L01224K11812J56885K99876L61776
4709B5909762L20325M06728M32127L90220N00211N38351N83489O83176O10414
4700C0374803N47522N38943M06528L85581O19551P40310N97104P73210Q86871
4691C5870423R10681J031783R66550J194187J591633J649690J925839J774722
4683D6915508J443749R17381Q66990J157479J383561J509580J697756J667865
4675E7559869J692418J802048J544423J526517J842795J938416K299304K598276
$$ plain form
4739 21252882 21290144 21435817 21422572 21475252 21611947 21834131 21901551 21993152 22268504 22421974
4729 22421974 22554193 22676876 22784805 22853007 23058794 23264776 23345859 23494021 23696930 23893490
4719 23893490 24107586 24266665 24367504 24406815 24578189 24879413 25091225 25248110 25547986 25909762
4709 25909762 26230087 26636815 27068942 27459162 27959373 28497724 29081213 29764389 30374803
4700 30374803 30922325 31461268 31867796 32253377 32872928 33613238 34210342 34983552 35870423
4691 35870423 36781104 37812887 38779437 39973624 41565257 43214947 45140786 46915508
4683 46915508 48359257 49276638 50143628 51301107 52684668 54194248 55892004 57559869
4675 57559869 59252287 61054335 62598758 64125275 65968070 67906486 70205790 72804066
4667G2804066L047311L563114M019677M798220N696151O788966Q027842R626800
4659A18372147J1101607J1972674J1664950J0131704Q339186O629812M685574
4652A82897654K424262J825728L171010N317101Q355999J2138433J6544803K1098054
4644B53773044K4864608K5763817K1316154J0064301o252719k1383711k9326802
4637B78818692k9811056k6729766k2886578j9395192j6596712j3982822j1699158
4630A37717408r683817p893830o568252n242604m167642l525610l009986l150428
4622I4475239l434488l588359l374649l053936k292471j829441j514406j619417
4614G3768072k102911k799415l481638l782986l731191l633240l190472k867701
$$ plain form
4667 72804066 75851377 79414491 83434168 88232388 93928539 100717505 108745347 118372147
4659 118372147 129473754 141446428 153111378 163243082 171582268 178212080 182897654
4652 182897654 185321916 187147644 190318654 195635755 203991754 216130187 232674990 253773044
4644 253773044 278637652 304401469 325717623 335781924 329529205 308145494 278818692
4637 278818692 249007636 222277870 199391292 179996100 163399388 149416566 137717408
4630 137717408 128033591 120139761 113571509 108328905 104161263 100635653 97625667 94475239
4622 94475239 91040751 87452392 84077743 81023807 78731336 76901895 75387489 73768072
4614 73768072 71665161 68865746 65384108 61601122 57869931 54236691 51046219 48178518
4606D8178518k712021k236996k033691j912504j632823j523169j499753j421099
4598C3206462j081718j110619j039999r19322r59020j023304r54681q44555p75556
4589B4497688p09842o06667m85802m26326l95715l36883k85229k27619l24518
4580B0699087l67965l19867m28127k77987k27289l90084k97326m11920l73677
4571A7604845l66487l80509l09258k22260k83168m61461j50560j02948m6984j0347
4561A5270863P162o2265M6624J431R1405K1895r9964j15679n638m1847j17970
4550A4996017k03232j5648j73204q4618k2763K38095K87997q161p048L0088J56991
4539A5194514K3886J56719Q2279K35013J64412J90807K54410J85695L77860K82626
$$ plain form
4606 48178518 45466497 43229501 41195810 39283306 37650483 36127314 34627561 33206462
4598 33206462 32124744 31014125 29974126 29054804 28095784 27072480 26117799 25273244 24497688
4589 24497688 23787846 23181179 22695377 22269051 21873336 21536453 21251224 21023605 20699087
4580 20699087 20331122 20011255 19583128 19305141 19077852 18687768 18390442 17978522 17604845
4571 17604845 17238358 16857849 16548591 16326331 16043163 15581702 15431142 15328194 15281210 15270863
4561 15270863 15278025 15215760 15262384 15263815 15355220 15377115 15277151 15161472 15155834 15113987 14996017
4550 14996017 14792785 14777137 14603933 14519315 14496552 14734647 15022644 15014483 15007435 15037523 15194514
4539 15194514 15218400 15375119 15457398 15692411 15856823 16047630 16302040 16487735 16865595 17148221
4529A7148221L12357K86097J40524o0550j68611j29366k86164k07354m5060n1802
4519A6938292m4646J58212K53511L21748N26131O62018R58002J001075J268577
4510B2042920J492060J819573K134487K181371J653026N64301j210812k418755
4502B8258171k558796k312681j881242j456018j281138r37628q06770o69886n62441
4493A5791571l87617m84500l69869j08911k43363j89450o1310k3682j90368N0848
4483A3783349K57464K15203J30619J61396K7827l5575k63015k03873j80318l05749
4473A3587328l11577k73309k42846j82516k68168j13533J33057J93495M5902J83806
4463A2751639O8648M7131l736J5164j24669j44360k0181q2957p5642o1252J21137
$$ plain form
4529 17148221 17460578 17746675 17887199 17826649 17658038 17528672 17242508 17035154 16990094 16938292
4519 16938292 16893646 17051858 17305369 17627117 18153248 18815266 19773268 20774343 22042920
4510 22042920 23534980 25354553 27489040 29670411 31323437 31887738 30676926 28258171
4502 28258171 25699375 23386694 21505452 20049434 18768296 17830668 17023898 16354012 15791571
4493 15791571 15403954 14919454 14549585 14440674 14197311 14007861 13946551 13922869 13732501 13783349
4483 13783349 14040813 14256016 14386635 14548031 14575858 14540283 14277268 14073395 13893077 13587328
4473 13587328 13275751 13002442 12759596 12577080 12308912 12195379 12328436 12521931 12567833 12751639
4463 12751639 12820287 12867418 12863682 12878846 12754177 12609817 12589636 12506679 12431037 12369785 12490922
4452A2490922R7898O9103J96946J56770j9269L1178j59542k18386k00839k05384
4442A2239397j35984K8805l7926k1574J37200P6951Q8060K05796J34400K25415
4432A2940540K04947K51386L58785L99524L78204L46893M80000M33189O13744
4423A6407212P45109O49510P09700Q59358Q74320J100998J223999J554171J883332
4414B6007709K120252K099482J874060J316762M98549j38068n80503q97981j161433
4405C1138829j252439r91327n01309K5541L06351P66322J205996J406948J643345
4396C3748257K071785K052759J501393P90299j72312q30647p14616j37660N16398
4387C8825656J294825K053775K938755L911509N005861O162376P182631P364415
$$ plain form
4452 12490922 12588820 12657923 12854869 13011639 12992370 13023548 12864006 12645620 12444781 12239397
4442 12239397 12103413 12132218 12094292 12072718 12209918 12286869 12374929 12580725 12715125 12940540
4432 12940540 13145487 13396873 13755658 14155182 14533386 14880279 15360279 15793468 16407212
4423 16407212 17152321 17801831 18511531 19370889 20245209 21346207 22570206 24124377 26007709
4414 26007709 28127961 30227443 32101503 33418265 33916814 33778746 33198243 32300262 31138829
4405 31138829 29886390 28895063 28393754 28419295 28725646 29491968 30697964 32104912 33748257
4396 33748257 35820042 37872801 39374194 40164493 39992181 39161534 38446918 38309258 38825656
4387 38825656 40120481 42174256 45113011 49024520 54030381 60192757 67375388 74739803
4379G4739803O163016L170957j566752n854405q201169q343936p346875o113198
4371D6647441n014967l941698l299296k791964k163969j966499j727226j290611
4363B4451211j201029j017014q66033p87754m73214k68338k36926o248J21466
4354A9716121J69542J45090k48641l96140m35018q8821r136L65586N53884Q76945
4344B0649412J088467J294327J108378O23954k58702j291731j951968k072407
4336A9189730j570010j298617r77568p26421o89019o76664n89866k47418l44435
4327A2069712m79371l48037l17889l45314k38586j41553q4818j35503j35113k36079
4317I607449k50455k57622j29438N7225J4737J4566j37185M3455J1807m0947o4897
$$ plain form
4379 74739803 80902819 84073776 82507024 76652619 68451450 60107514 52760639 46647441
4371 46647441 41632474 37690776 34391480 31599516 29435547 27469048 25741822 24451211
4363 24451211 23250182 22233168 21367135 20579381 20106167 19837829 19600903 19594655 19716121
4354 19716121 19885663 20030753 19782112 19385972 18950954 18862133 18852997 19218583 19772467 20649412
4344 20649412 21737879 23032206 24140584 24764538 24505836 23214105 21262137 19189730
4336 19189730 17619720 16321103 15343535 14617114 13928095 13251431 12661565 12414147 12069712
4327 12069712 11590341 11242304 10924415 10579101 10340515 10198962 10114144 9978641 9843528 9607449
4317 9607449 9356994 9099372 8969934 9027159 9041896 9056462 8919277 8962732 8974539 8933592 8868695
4306H868695o6919p6079j50779k4234J60394P9084P2984Q4897j00544K3874P4018
4295H945391o754k5455J1157J03371o5022j04097K9309p372J9050P7955n2L6982
4283I014463J74029K08483L91719M62267M84849P49195O99704N52079N21175K28227
4273A3486190j64674m53083o94004q35218p18504q18974p19423n64765m76006
4264H041539m85351n09494l16456j27539l03477k85390k11734j89851k02612k06455
4254E203180k7632r8586j52933q5251j23464k0812J049j50552k7593n4291j15730
4243D347385L2959O0301r0670l1633R2991k0791n4984j18553j29218j1820q0297
4232C995670n6965j8755R3779N8543J01058j28634j22512p901P475n4707m6080
$$ plain form
4306 8868695 8801776 8725697 8574918 8550684 8711078 8790162 8863146 8948043 8847499 8871373 8945391
4295 8945391 8938637 8913182 8924339 9027710 8962688 8858591 8887900 8880528 8899578 8977533 8977481 9014463
4283 9014463 9188492 9396975 9788694 10250961 10735810 11485005 12184709 12736788 13257963 13486190
4273 13486190 13321516 12868433 12174429 11339211 10620707 9801733 9082310 8517545 8041539
4264 8041539 7556188 7046694 6730238 6602699 6299222 6013832 5802098 5612247 5409635 5203180
4254 5203180 5175548 5076962 4924029 4838778 4715314 4694502 4695551 4544999 4517406 4463115 4347385
4243 4347385 4380344 4440645 4349975 4318342 4411333 4390542 4335558 4217005 4087787 4075967 3995670
4232 3995670 3938705 3919950 4013729 4072272 4173330 4044696 3922184 3914283 3921758 3867051 3820971
4221C820971r0357r3056j57337j8314l4693j20700j09537M4049o8640q1471K6151
4210C117066O2261K6092R6305l8124R5179M967L8025O2854j49245J73662K8180
4199C517222q8742k9612k8754p5977j3365j9520n9569J37346J3063o2881L8529
4188C327740K0403j08315l6607O1602j2225L9678L2102l3355Q3752O5355j13187
4177C326943l1123J9008j69843L8155M1448J1275J6465m3439J85763l1648N4357
4166C417361K6331n6505j74105K7339p448n2907P1914R2411O2961K2015k1743
4155C407624O1378j2077o647r9317k0851N9650j2206q6787L2811j16934q9217
4144C117427j19964O7440K5090p9390J56453P292N6326j4345R6614K06764J31922
$$ plain form
4221 3820971 3730614 3637558 3480221 3461907 3427214 3306514 3196977 3241026 3172386 3090915 3117066
4210 3117066 3179327 3205419 3301724 3263600 3358779 3363746 3401771 3464625 3315380 3489042 3517222
4199 3517222 3428480 3398868 3370114 3294137 3280772 3261252 3201683 3339029 3352092 3289211 3327740
4188 3327740 3348143 3239828 3203221 3264823 3252598 3292276 3324378 3291023 3374775 3440130 3326943
4177 3326943 3295820 3314828 3144985 3183140 3224588 3235863 3252328 3208889 3394652 3363004 3417361
4166 3417361 3443692 3387187 3213082 3240421 3232973 3180066 3251980 3344391 3407352 3429367 3407624
4155 3407624 3469002 3456925 3450278 3350961 3330110 3389760 3377554 3290767 3323578 3206644 3117427
4144 3117427 2997463 3064903 3089993 3010603 3167056 3174348 3230674 3216329 3312943 3519707 3651629
4133C651629k9565m5235j37761n4259M2979L7569p6243j62908K9318m0721j48768
4122C066035m1861j26366j40194Q2468k2297l1378k135j8655M7680j47306p5668
4111B590323m06L7561o4205Q7814j921j40100N5795l4108o1729R7794m9601r1361
4099B425856N9276M6191J17829m5118N0035M2973q0529j794K9268m7384j33964
4088B462639j28594n5594j54339q7993k3472l5891l3495P0959j01N46Q6405M0871
4076B141941m7852J42229q009K7567m001m3175k3195p6301j6267l7548k8004j02057
4064A925328K0307j89j01981k0689K3340r1956r1685r3981j31869j0031J4224
4053A440818q6931k5403l347j3548n7253P9513j09528Q6012K4360j02342m9909
$$ plain form
4133 3651629 3622064 3576829 3439068 3384809 3427788 3465357 3389114 3226206 3255524 3214803 3066035
4122 3066035 3024174 2897808 2757614 2840082 2817785 2786407 2784272 2765617 2813297 2665991 2590323
4111 2590323 2589917 2627478 2563273 2651087 2649166 2509066 2564861 2530753 2469024 2566818 2517217 2425856
4099 2425856 2485132 2531323 2649152 2604034 2654069 2697042 2616513 2614719 2643987 2596603 2462639
4088 2462639 2334045 2278451 2124112 2036119 2012647 1976756 1943261 2014220 2014119 2014665 2101070 2141941
4076 2141941 2094089 2236318 2228309 2255876 2251875 2208700 2185505 2109204 2092937 2055389 2027385 1925328
4064 1925328 1945635 1945446 1843465 1822776 1846116 1754160 1662475 1568494 1436625 1426594 1440818
4053 1440818 1353887 1328484 1325137 1311589 1254336 1333849 1224321 1310333 1334693 1232351 1182442
4042A182442K93l9088l7253m4845L0914M3391j2976m1926j0916J04338J18471
4031A292845P5720o7600n3977J1757r7165k7192r7922l2773N0629j7324l7493
4020I99505n9587P0438K9504l1296j07220K7265P1576m8464j2212j31081J01745
4009I10173k97q0254N0044j3239p2295M2739j03319l5256P7135N103l7626K4M2402
3996G85334P2256o9889O5455N2606p6647L2712j2630K3523j7086l4325o3237J17920
3984H75992o2417j27512j2210J25669j00875p746J9654P1723L654K0011p8112
3973G27831P004r376P1817J8012j2676L2747o3279J1147j9316m6418p3196j8130
3961F26167M9103K4798m7534J58392J8378k5493j37203m0945n03O75j2667p5990
$$ plain form
4042 1182442 1182735 1143647 1106394 1061549 1092463 1135854 1122878 1080952 1070036 1174374 1292845
4031 1292845 1368565 1300965 1246988 1258745 1161580 1134388 1036466 1003693 1054322 1036998 999505
4020 999505 939918 1010356 1039860 1008564 901344 928609 1000185 951721 939509 808428 910173
4009 910173 909876 829622 879666 866427 794132 836871 733552 698296 775431 780534 742908 742932 785334
3996 785334 857590 787701 853156 905762 829115 861827 849197 872720 855634 821309 758072 875992
3984 875992 813575 686063 673853 799522 698647 690901 710555 782278 785932 805943 727831
3973 727831 734835 725459 797276 815288 802612 835359 772080 783227 763911 717493 644297 626167
3961 626167 675270 700068 652534 810926 829304 803811 666608 625663 625160 625835 613168 537178
3949E37178J73205j7009j61449Q4796N8962N1553p6785J3880N9046P288O1528
3938G92193o2178k1871m3589j0261O6364L8636n2846n2867l9823J42280m3285
3927G12753k2799j4940l4065O8839K4919r7896N2506P1613n4206m6430l8763J00866
3915G22397P5446m5989o8057J58643P6309j18275m7247L299j6291M651R366K4413
3903G78665q8277K00795M8188o1058o4667o178N181J09004J03347j68119m1017
3892H15864p6060l2183O4243J06161K3879L932m1452r2859J60517N7412N137N9064
3880A053655r4152l0829J44703k5015k3132o155Q7311K0713j07811L6200k7675
3869A027813o5911p619k6624j01782J13602Q3504P7182m5791o3149n6846P6920
$$ plain form
3949 537178 710383 693374 531925 616721 675683 727236 650451 664331 723377 730665 792193
3938 792193 730015 708144 664555 654294 720658 759294 706448 653581 613758 756038 712753
3927 712753 689954 675014 640949 709788 734707 636811 689317 760930 706724 660294 621531 722397
3915 722397 797843 751854 683797 842440 918749 800474 753227 756526 740235 744886 754252 778665
3903 778665 690388 891183 939371 878313 813646 807468 812649 921653 1025000 856881 815864
3892 815864 739804 707621 771864 878025 901904 905836 864384 771525 932042 989454 994591 1053655
3880 1053655 959503 928674 1073377 1048362 1025230 1019075 1106386 1127099 1019288 1055488 1027813
3869 1027813 961902 954283 927659 825877 939479 1022983 1100165 1054374 991225 934379 1011299
3858A011299J0493q539L5574L1206r962o6608r3620N9135O1261K4063n80J8728
3846A072450M8096J1775M3255m8909l5797j8133R119M7713k0235j2741k8698l3145
3834A034750J4738q6155K2665J13871J0789m4291l0674P9386N1367O5597P4379
3823A306422o446l5704j84898K2103O6896j312j19803l0846J0798j2370O0612
3812A075452n4826O7923Q8796m8677Q1103R5731o899j9426l5173Q360m6652m9742
3800A155970m3718J499J3258J4640J1315O0783m6767j08770J19225L1933J04555
3789A313923m7606q6122L334L4041j9967p570o4168r863Q3381Q4273r6423l2814
3777A154419R1985j9273J3527m7508k6510J09445m4508j10107j3106M7610j1238
$$ plain form
3858 1011299 1021792 1013253 1048827 1080033 1070071 1003463 909843 968978 1030239 1054302 1053722 1072450
3846 1072450 1120546 1132321 1175576 1126667 1090870 1072737 1081856 1129569 1109334 1096593 1067895 1034750
3834 1034750 1049488 963333 985998 1099869 1110658 1066367 1035693 1115079 1166446 1232043 1306422
3823 1306422 1299976 1264272 1079374 1101477 1168373 1167061 1047258 1016412 1027210 1014840 1075452
3812 1075452 1020626 1088549 1177345 1128668 1209771 1305502 1298603 1279177 1244004 1252364 1205712 1155970
3800 1155970 1112252 1113751 1127009 1141649 1152964 1213747 1166980 1058210 1177435 1209368 1313923
3789 1313923 1266317 1180195 1183529 1217570 1197603 1190033 1125865 1116002 1199383 1283656 1187233 1154419
3777 1154419 1246404 1227131 1240658 1193150 1166640 1276085 1231577 1121470 1108364 1155974 1144736
3766A144736m8094J46862j3751l6538Q429K0497k4899n8794k9724m5502N1059
3755A114281M1259J2054N8366J03141m4217r1934n5211M494J93k4025j5661K100
3743A104840O1811N7097j2159j00041K0653q7981J31119O2629q1835j21126j5408
3732A019599O919L7139O2342q226J130j0639j9960j3959k0099O4800L1453r1577
3720A058922j45925N7564R4390J948M6231J3353M3077l6348j0232l3873k0852
3709A068255L5951n775j5583R1674q4058J101o3594J9256R7296J1113p3734R1333
3697A173235L975L4774m5027n0129J4613Q636k5657r096j622k8140M6181M1886
3685A163629l3901j25444j8989O4974O7829L9480K0606n4926o5595N2446P8004
$$ plain form
3766 1144736 1096642 1243504 1229753 1193215 1201644 1222141 1197242 1138448 1108724 1063222 1114281
3755 1114281 1155540 1167594 1225960 1329101 1284884 1192950 1137739 1142233 1142426 1118401 1102740 1104840
3743 1104840 1166651 1223748 1211589 1111548 1132201 1044220 1175339 1237968 1156133 1035007 1019599
3732 1019599 1026518 1063657 1125999 1117773 1118903 1108264 1088304 1074345 1054246 1119046 1150499 1058922
3720 1058922 912997 970561 1064951 1066899 1113130 1126483 1169560 1133212 1122980 1089107 1068255
3709 1068255 1104206 1098431 1082848 1174522 1090464 1091565 1027971 1047227 1144523 1155636 1081902 1173235
3697 1173235 1177210 1211984 1166957 1116828 1131441 1140077 1114420 1105324 1103702 1075562 1121743 1163629
3685 1163629 1129728 1004284 985295 1050269 1118098 1157578 1178184 1123258 1057663 1110109 1188113
3674A188113n0536P3186n6136p7867O4309O3554o74o26Q9002Q746O322j600l0416
3661A275377L8619M0244p036p3525P1933J4614n3340k2364Q2171j4494O3699j09233
3649A306665k645J07333J2238L5454n278n5858J11441O382O1449k2463l2774j2477
3637A509467L0460M6116J54344p5859q1740J22364l686p282m9469M3267L2488
3626A720470l723N435Q5646l228m1926M6593o4949K7768J3762L561J05950J86583
3614B081942n7923p8173m5617m0789J01113M9622J06182n5790m5942J12752J18217
3603B245594P579J086P5248J11338l5519n0777k1047P1868n826J10425Q4980J12302
3591B707251j7506K2128K209J08932R2227m5258k7975J35897J06634l3551n9647
$$ plain form
3674 1188113 1137577 1210763 1154627 1076760 1141069 1204623 1203949 1203323 1292325 1301071 1307393 1305793 1275377
3661 1275377 1313996 1354240 1347204 1273679 1345612 1360226 1306886 1284522 1366693 1352199 1415898 1306665
3649 1306665 1304020 1411353 1423591 1459045 1453767 1397909 1509350 1515732 1577181 1554718 1521944 1509467
3637 1509467 1539927 1586043 1740387 1664528 1582788 1705152 1701466 1694184 1644715 1687982 1720470
3626 1720470 1716747 1722182 1807828 1804600 1762674 1809267 1744318 1772086 1785848 1789409 1895359 2081942
3614 2081942 2024019 1945846 1900229 1859440 1960553 2010175 2116357 2060567 2014625 2127377 2245594
3603 2245594 2253173 2254259 2329507 2440845 2405326 2354549 2333502 2405370 2399544 2509969 2594949 2707251
3591 2707251 2689745 2711873 2714082 2823014 2915241 2869983 2842008 2977905 3084539 3050988 2991341
3580B991341K40959J4683O0949L3555K8313M9425M889J09088P3340K1854P5447
3569C703843N1494R7494M0798K14014q287P5358J76435l1770k3342r16J79809
3558D474930J28597J28125P3498J96861J90303K27626M5094J41328K18969K23105
3548F048436K40772K06523K67364L75047K97188L10660M12873O12876P50498P62338
3538A0284575Q81035Q66946M97171M6098n13483q62314q53233o31775m40193l22521
3528H952306k14399j83569r4800q1465K61j6744M6078m919J50421K31430J54242
3517H938842K36961K34398K55454K51024N05595M97442O25532P51464R29138J320772
3507A4546622J551518J791485K072847J600780R99741n08431j592953j778249
$$ plain form
3580 2991341 3232300 3246983 3307932 3341487 3369800 3419225 3424114 3533202 3606542 3628396 3703843
3569 3703843 3755337 3852831 3893629 4107643 4099356 4174714 4351149 4319379 4296037 4295121 4474930
3558 4474930 4603527 4731652 4805150 5002011 5192314 5419940 5465034 5606362 5825331 6048436
3548 6048436 6289208 6495731 6763095 7138142 7435330 7745990 8158863 8771739 9522237 10284575
3538 10284575 11165610 12032556 12529727 12575825 12062342 11200028 10346795 9715020 9274827 8952306
3528 8952306 8737907 8554338 8459538 8378073 8378334 8361590 8407668 8402749 8553170 8784600 8938842
3517 8938842 9175803 9410201 9665655 9916679 10422274 10919716 11545248 12296712 13225850 14546622
3507 14546622 16098140 17889625 19962472 21563252 22562993 22054562 20461609 18683360
3499A8683360j580444j052308p10358m66833k51703N5359O0984J44146L49194
3490A5231397L08791M35669N17196O45168N44070M12391K45195K7576l05606n40259
3480A7521588o54751o14106n41793l37143k76093j34167J88535L50932L90206
3471A5893208L11244j14195q01515r76795j070045q87658n58074m11305k94832
3462A1090033j51590j91439l67634k51531l13855n29321m98198n21583l30874
3453G934008l25516k82687k96737k54946k29720o7150j00052r7071j85757K2836
3443F117208K6138j83346j71458l6082o2353k704L0420m8571J43807J75992J85047
3432F174098L57448M35574N89110M69178K23475j53300m82777n67916o30083n70110
$$ plain form
3499 18683360 17102916 16050608 15340250 14873417 14621714 14677073 14738057 14882203 15231397
3490 15231397 15540188 15975857 16493053 17138221 17682291 18094682 18339877 18367453 18061847 17521588
3480 17521588 16866837 16252731 15710938 15373795 15097702 14963535 15152070 15503002 15893208
3471 15893208 16204452 16090257 15288742 14311947 13241902 12354244 11796170 11384865 11090033
3462 11090033 10938443 10747004 10379370 10127839 9813984 9284663 8786465 8264882 7934008
3453 7934008 7608492 7325805 7029068 6774122 6544402 6477252 6377200 6280129 6094372 6117208
3443 6117208 6143346 5960000 5788542 5752460 5690107 5687403 5717823 5669252 5813059 5989051 6174098
3432 6174098 6531546 6967120 7556230 8025408 8248883 8095583 7612806 7044890 6414807 5844697
3422E844697l78501l19043m62657k38321j04173j49819q3097j18178p6813r493
3412C904602O7964R1836j05009k81637j09172N1092m559R104l7180J3390J33912
3401C734343J7725Q1232K40371L07935J89257J24678J74133j72162l16896k39381
3391D141235l07513k76491j72426j51384k69594o8805o9807j38540r4623j03692
3381B488360P3315K7583r954j27571o4463j45468p9513k7253O4517J5311r8737
3370B116127N6324p1944j94490L0328Q8544N2041l0112q0068O3203j2286L9772
3359B057439J5672j44651p765o8378l6214L5087k4011L4028n693J9277m3890j5001
3347A815900J11476n6281l5465Q7293j68045q1271P5544p547N02j36236n7084
$$ plain form
3422 5844697 5466196 5147153 4684496 4446175 4342002 4192183 4109086 3990908 3914095 3904602
3412 3904602 3972566 4064402 3959393 3677756 3568584 3619676 3615117 3624221 3587041 3600431 3734343
3401 3734343 3752068 3833300 4073671 4381606 4570863 4695541 4869674 4697512 4380616 4141235
3391 4141235 3833722 3557231 3384805 3233421 2963827 2895022 2825215 2686675 2592052 2488360
3381 2488360 2561675 2589258 2579304 2451733 2387270 2241802 2162289 2135036 2199553 2214864 2116127
3370 2116127 2172451 2100507 1906017 1936345 2024889 2076930 2046818 1966750 2029953 2017667 2057439
3359 2057439 2073111 1928460 1920695 1852317 1816103 1851190 1827179 1861207 1855514 1874791 1830901 1815900
3347 1815900 1927376 1871095 1835630 1922923 1754878 1673607 1749151 1741604 1742106 1605870 1548786
3336A548786Q1495j4157q2234m5286K8585j05741n0334R6955n5102k4887R6484
3325A474564J01263q3061r4945J17749J3236m7215n4657N5978P9304K8236J6366
3314A606818j1962Q8688j04316M9658r9530n5960r483n5610l5514n4024n1332
3303A267433M5607k5475j6970Q5922l9427p2889o1076p069o8823L5042J06923
3292A249198K9598k8080m0498m6507J4808j04654O3061Q5313K8865J6288O5773
3281A333165q1736p6327L0085j1752l9784r059O131J214N2709l8720k3083P5774
3269A218617j6763O692Q1626j31895j34866M1018P0992O1161P7548j8913J3063
3258A268280L4572k0588m2806M4119J18501l9525P3789O8502j9121O3912k9170
$$ plain form
3336 1548786 1630281 1616124 1533890 1488604 1517189 1411448 1361114 1458069 1402967 1378080 1474564
3325 1474564 1575827 1492766 1397821 1515570 1528806 1481591 1426934 1482912 1562216 1590452 1606818
3314 1606818 1594856 1683544 1579228 1628886 1529356 1473396 1463913 1408303 1372789 1318765 1267433
3303 1267433 1313040 1287565 1270595 1356517 1317090 1244201 1183125 1176056 1107233 1142275 1249198
3292 1249198 1278796 1250716 1210218 1163711 1178519 1073865 1136926 1222239 1251104 1267392 1333165
3281 1333165 1251429 1175102 1205187 1193435 1153651 1144592 1150723 1151937 1204646 1165926 1142843 1218617
3269 1218617 1201854 1208546 1290172 1158277 1023411 1064429 1135421 1196582 1274130 1255217 1268280
3258 1268280 1302852 1282264 1239458 1283577 1402078 1362553 1436342 1504844 1485723 1549635 1520465
3247A520465J9352L3736j13049m730q959j8515O1651R252N8901j3604J885J3527
3235A559912l2810Q1705J27585o090p6084K2552Q5310J18684K2656n637k2889
3224A874894p1689J03566J18005J5970J04086P5884J22259Q4603j6294J14184
3214B525468J10855R5236Q6936Q160M2522j03679j21514j33691n3744q6064o0253
3203B310232M5924M1408o7990O8742Q074k3329P2837j2824j3819O8270K24667
3192B722192m0288M4482P3612n2445L3128P4656J780Q2271O66J01296j0325K12874
3180C243899J93717N3197J98740K9275j45850j26733p2739k02637l280m7656m1865
3169C078068O132l340j06959M0376K600O3897J5028o4309j6760K3576k2938J13096
$$ plain form
3247 1520465 1539817 1573553 1460504 1455774 1446815 1428300 1489951 1499203 1558104 1544500 1546385 1559912
3235 1559912 1527102 1608807 1736392 1730302 1654218 1676770 1762080 1880764 1903420 1897783 1874894
3224 1874894 1803205 1906771 2024776 2040746 2144832 2220716 2342975 2427578 2411284 2525468
3214 2525468 2636323 2731559 2818495 2826655 2869177 2765498 2643984 2510293 2456549 2370485 2310232
3203 2310232 2356156 2397564 2329574 2398316 2406390 2383061 2455898 2443074 2429255 2497525 2722192
3192 2722192 2681904 2726386 2799998 2747553 2780681 2855337 2857117 2939388 2940054 3041350 3031025 3243899
3180 3243899 3437616 3490813 3689553 3718828 3572978 3446245 3373506 3170869 3167589 3119933 3078068
3169 3078068 3084200 3080860 2973901 3014277 3016877 3080774 3095802 3031493 3014733 3038309 3015371 3128467
3157C128467J82963K9397l5179J67064k2227j51938R9628k0552M1883J06637J42152
3146C668295L5568Q3616J25229P8283L8354j22642j48057r6753j96690k09552
3136C255651j41788k8829j26059O6958j7041O0939L0959N5741R288q3814N5498
3125C137503j7339k5696P922m398R0969k4911L5900J8342P1418M931o1128j85084
3113C048429o3691n7820k19879J9552q8962p929n2062k8996j56696j2438O1176
3102B440684q7045k9982p3767m2311M1695J39536o6495j06338j988j49534j45136
3091A919319p6021o8911r251K6126m8285j54852p8000j9187j1551j13779j62161
3080A203447n888R3318m4895o2708o1779q1596M5827Q7455L8690j27798K5153
$$ plain form
3157 3128467 3311430 3340827 3305648 3472712 3450485 3298547 3398175 3377623 3419506 3526143 3668295
3146 3668295 3703863 3787479 3912708 3990991 4029345 3906703 3758646 3661893 3465203 3255651
3136 3255651 3113863 3085034 2958975 3025933 3008892 3069831 3100790 3156531 3165819 3082005 3137503
3125 3137503 3120164 3094468 3102390 3097992 3188961 3164050 3199950 3218292 3289710 3294641 3233513 3048429
3113 3048429 2984738 2926918 2707039 2726591 2637629 2629700 2577638 2548642 2391946 2379508 2440684
3102 2440684 2353639 2323657 2249890 2207579 2249274 2388810 2322315 2215977 2213989 2064455 1919319
3091 1919319 1843298 1774387 1765136 1791262 1742977 1588125 1510125 1490938 1479387 1365608 1203447
3080 1203447 1197559 1290877 1245982 1183274 1121495 1039899 1085726 1173181 1211871 1084073 1109226
3069A109226j092p532j6725o1170m9117m4051l8443M9008j9927r8012k344k2929
3057G96892p3008k4826J5521K025L644o5098O3709l7083j23176J298m011Q4285
3045F40172j47751r0224J47861k2125n1908P812p247J21878O0764o2478q5742
3034E11012O3197n5114n5148L2722n364N875R2086p2545m7989l7042M1283K8321
3022E01294j15915l9423j3748L4478L5884j4292K3004m8404l028N3082q3964J4701
3010C43669K9781K6017N7138m8796l4627K3768o403J4263q21k8695o3892j06994
2998B04408m2093R7071J46662m0553m9150n8014O3285j5509R919L113k4368r0346
2986B04425O7290O4614j62768O823L0567J0397j7348k472n4517J08350j25296
$$ plain form
3069 1109226 1108134 1100602 1083877 1022707 973590 929539 891096 940104 920177 822165 819821 796892
3057 796892 723884 699058 714579 716604 720248 655150 718859 681776 558600 559898 555887 640172
3045 640172 492421 402197 550058 527933 476025 483837 476590 598468 659232 596754 511012
3034 511012 574209 519095 463947 496669 491305 497180 589266 516721 468732 431690 472973 501294
3022 501294 385379 345956 332208 366686 402570 388278 411282 362878 359850 412932 328968 343669
3010 343669 373450 399467 456605 407809 373182 396950 390547 404810 403989 375294 311402 204408
2998 204408 162315 259386 406048 365495 316345 258331 321616 306107 316026 319139 294771 204425
2986 204425 271715 336329 173561 180384 210951 221348 204000 201528 147011 255361 130065
2975A30065k9317O2561J7159k2810J42660K827j79288L7208k7027R965K5373q0092
2963H9284J23727L472n0505k5204K3847O4013j00294n6441O4076O8514O6290l4346
2951B36433j09532M3182j9417p7466j5188K065N1874N770k5049k4108J05546J05025
2939B79135J4818p2508r1805q7081J5623q563N3406L8997j1867o3946N7492Q6149
2927B09850Q1319J9155r115l6307q983n0014P9932j0269k3075q9531O413o243
2915A63132r4243Q5848L2186r4162J70J32486p1145k8758J6449Q9546M3430m3888
2903B31051n7819l18j0147L796P6220N1981j46072l6366l617M5750Q3386K8963
2891B66808k3566n2635N7322O1059p7008m3159J1519J15430o1346L2270q354m3984
$$ plain form
2975 130065 100748 163309 180468 157658 300318 303145 123857 161065 134038 144003 169376 89284
2963 89284 213011 216483 165978 140774 164621 228634 128340 71899 135975 204489 270779 236433
2951 236433 126901 170083 150666 73200 58012 60077 111951 117721 92672 68564 174110 279135
2939 279135 293953 221445 129640 42559 58182 49619 103025 142022 130155 66209 123701 209850
2927 209850 291169 310324 301209 264902 255919 205905 285837 275568 252493 162962 169375 163132
2915 163132 68889 154737 186923 92761 92931 225417 154272 125514 141963 231509 274939 231051
2903 231051 173232 172914 162767 166563 242783 294764 148692 112326 108709 154459 237845 266808
2891 266808 243242 190607 247929 308988 231980 188821 200340 315770 254424 286694 278340 234356
2879B34356m801Q3283R9458n8907j1255j28005K3110P0483M8560j03400O0258
2868C13140J22436R1764p6874q8299K2156n332K4314p6733P9506l9197n8177q3175
2856B25529J050M1497R2771p4414Q0532K1547r1066o9416J5160j04402R1477R4220
2844C24485R982N1083K0707N646r681n0984n4869J09882M3315k126r562j8999
2832D18879j5079k3286m6202Q6253k6827j12760L1272r7971j9813P7270J22235
2821C93971j09117J2909J47171r3590l515J54377q0621p8236Q3721k9320j5721
2810C82029j11411o0309O4267n0367Q9073L069m6336n8268J5879Q276L5593o0114
2798B11381j09161N7443J1190J14140n2088j45765j02396M2917O2047P5945k1216
$$ plain form
2879 234356 229555 312838 412296 353389 342134 214129 237239 307722 356282 252882 313140
2868 313140 435576 527340 450466 362167 384323 378991 403305 326572 406078 366881 308704 225529
2856 225529 226579 268076 360847 286433 366965 388512 297446 228030 243190 138788 230265 324485
2844 324485 334467 385550 406257 411903 402222 351238 296369 406251 449566 447440 437878 418879
2832 418879 403800 380514 334312 420565 393738 280978 312250 214279 194466 271736 393971
2821 393971 284854 297763 444934 351344 347829 502206 421585 343349 427070 397750 382029
2810 382029 270618 210309 274576 224209 313282 316351 270015 211747 227626 235902 271495 211381
2798 211381 102220 159663 170853 284993 232905 87140 -15256 27661 89708 165653 144437
2787A44437M1696N1890k6148N266R539j02305Q7693r4526O0600R12L9081P8974
2775B97109k9772J2940k9909j38025p7533n0589M6643j25J01627R091J9437j04002
2763E6892M9413M2337o8878p879O6054J5308l2221k1171J4319n6308Q678N8737
2751A25281L537l1718O5352n9233j1157l8373M6342J5917n425O676N8399O8226
2739B43824j08131n052j69095Q955L9093K0494m3700J06659p4400o4958k0062
2728f6373O473l1686J28664o2236N5945K6902k0606N4588L1734J8229q5014o9727
2716a3107L3503M6200k9423j9876r6761K2469m6779O1432J43370j0949o4054k8735
2704b710l8118p2099Q2847P15j5918m4062J11397q1991n2041R4289O5088j11649
$$ plain form
2787 144437 186133 238023 211875 217141 226680 124375 212068 117542 178142 179054 218135 297109
2775 297109 267337 280277 250368 112343 34810 -15779 30864 30739 132366 141457 160894 56892
2763 56892 106305 148642 79764 71885 137939 153247 121026 99855 114174 57866 66544 125281
2751 125281 128818 97100 162452 103219 92062 53689 100031 115948 110523 117199 175598 243824
2739 243824 135693 130641 -38454 -29499 9594 30088 -13612 93047 18647 -46311 -66373
2728 -66373 -59900 -91586 37078 -25158 30787 57689 37083 91671 123405 141634 56620 -13107
2716 -13107 20396 66596 37173 17297 -79464 -56995 -103774 -42342 101028 90079 26025 -2710
2704 -2710 -40828 -112927 -30080 -29365 -45283 -89345 22052 -59939 -111980 -17691 47397 -64252
2692f4252L2307k9384j55973J18591R1762L8994R3116o2209o8423r944O2761j1629
2680C5717n6386j0319L5249J0172o195L6487M1526J2000j18048R8445k7981j03444
2668e2777m2025j02993O2589N8025n4679J21586O9835N2237o1283l3063P692q2914
2656e7770J33617m7932l5854L1201j3721n5696R3021L2895q2551N1637n5338K674
2644c817Q978l6871k9737j69Q8591K3695j8747K6367n6547J1296k3757m4717J35786
2631H0351Q6028r0117L9641p1666j10885L3778K4506L5677j06200m9609L2950
2620i5546L9357N133P466J56516K6513N8545o9520k3085n0474o506n4054o082
2608a1737R1337O3379j32219k6503l7651J18473N6777K1214j8781j19557K0998
$$ plain form
2692 -64252 -31945 -61329 -217302 -98711 -6949 32045 125161 62952 -5471 -15415 47346 35717
2680 35717 -20669 -30988 4261 14433 8238 44725 86251 98251 -19797 78648 50667 -52777
2668 -52777 -94802 -197795 -135206 -77181 -131860 -10274 59561 111798 50515 17452 25144 -57770
2656 -57770 75847 27915 -7939 23262 9541 -46155 46866 79761 -2790 48847 -6491 -3817
2644 -3817 5161 -31710 -61447 -61616 26975 50670 31923 58290 1743 13039 -10718 -55435 80351
2631 80351 166379 76262 115903 44237 -66648 -32870 -8364 27313 -78887 -128496 -95546
2620 -95546 -56189 -51056 -43590 112926 139439 197984 128464 105379 54905 48399 -5655 -11737
2608 -11737 79600 142979 10760 -15743 -53394 65079 121856 143070 124289 4732 25730
2597B5730j4067O3553j9984j12669L6425J7057n649K4607J3088r0222J097L6187
2585b4847p8609P2683l309M6946o1811K6354r6426J59132o012K307R8005l505
2573A30908k6491n6313l9559Q8246j01514l0613P1454N4979o9674r962P313m5098
2561b6324m1908L528J50485Q816r5320p0463j367J6058J58579r4057J3073J1757
2549C2857k1810K8050K205p1315O3902m8941j7676J44848q8868r2097p256q937
2537h5038N4448n445O0218l8486Q5067n6768r0162R4190n8460N8508N9886k3194
2525E4764K757m299R9535n1984L3477K8346J8355r2365k015J1153L9714O276j13484
2512C0230K7725n6344q1612P9093J04462j7969K3208j9705l4229p0972R1376l5952
$$ plain form
2597 25730 11663 75216 55232 -57437 -21012 -3955 -9604 15003 28091 -62131 -61034 -24847
2585 -24847 -103456 -30773 -34082 12864 -48947 -22593 -119019 40113 34101 36408 134413 130908
2573 130908 104417 48104 8545 96791 -4723 -35336 36118 91097 21423 11461 18774 -26324
2561 -26324 -68232 -64704 85781 94597 -723 -71186 -72553 -56495 102084 8027 21100 32857
2549 32857 11047 39097 41302 -30013 33889 -15052 -32728 112120 23252 -68845 -76101 -85038
2537 -85038 -30590 -36035 24183 -14303 70764 13996 -76166 18024 -40436 18072 77958 54764
2525 54764 57521 53222 152757 100773 134250 162596 180951 88586 86571 97724 137438 143714 30230
2512 30230 57955 1611 -80001 -908 103554 85585 108793 89088 54859 -16113 75263 39311
2500C9311J35091l3183q0274K2497l1165K4613l6147J06764M4719q7351N5893
2489A60768Q562j0696p5830O4162n6456p8028O131J13586K862k3339R3981m8060
2477A57643k2113J4845j080n7077k4940J24413N7364q8732k7422N80n96J066O6970
2464B00921L5582K9301q8045p0007O9162j6544j3005k458M8435k2324K1670R7175
2452B89863K3198m2493J2435K398m6531J3453J3988M6287O8213k2710J1048N5020
2440D24169j07880j7508L7397M7979M9232j4270o5443k5469K00924k9057m6895
2429D53179j4515j8054P0030N4783J0496K1396L6261j50943N0914J7363R3817
2418F24727M4566q5727K8496l5260O591K9511o0207N3822K7652N5397m1758M6185
$$ plain form
2500 39311 174402 141219 60945 83442 52277 76890 40743 147507 192226 104875 160768
2489 160768 169330 158634 82804 146966 90510 12482 18613 132199 135061 111722 205703 157643
2477 157643 135530 150375 149295 92218 67278 191691 249055 160323 132901 133481 132885 133951 200921
2464 200921 236503 265804 177759 107752 176914 160370 147365 144907 193342 171018 192688 289863
2452 289863 313061 270568 283003 285401 238870 252323 266311 312598 380811 358101 369149 424169
2440 424169 316289 298781 336178 384157 433389 419119 353676 328207 529131 500074 453179
2429 453179 438664 420610 490640 545423 555919 577315 613576 462633 513547 530910 624727
2418 624727 669293 583566 612062 576802 583393 612904 552697 606519 634171 689568 647810 693995
2406F93995P3343m2428O6269K1131p287M1703n3898R4449P5814j0971p13J09024
2394A060431n0465l1085J1593M6284O4882K6696J02495R4176J09877J4306P2078
2383A521268O0923j8062J4215J65749M3505P158J39916J37012M4034o7147P2916
2372B121487J40459k7775J0894J87348J89104M2730J89167K70848K30161J42775
2362C497198K37878L44971L32763J72798O2321K34990K63366M02770N48159Q18874
2352F916088J105708J516520J828908K449859L301479M486053M261726K590428
2344B8456769j748361n646378n125388l432202k119333j787813j300452q50422
2336F446420p68003n85258m33702m43714j77378k84861j15430j73496k79817l32197
$$ plain form
2406 693995 767338 724910 791179 812310 805023 846726 792828 887277 963091 952120 951407 1060431
2394 1060431 1009966 978881 990474 1036758 1101640 1128336 1230831 1325007 1434884 1449190 1521268
2383 1521268 1582191 1564129 1578344 1744093 1787598 1794756 1934672 2071684 2115718 2048571 2121487
2372 2121487 2261946 2234171 2245065 2432413 2621517 2664247 2853414 3124262 3354423 3497198
2362 3497198 3735076 4080047 4412810 4585608 4647929 4882919 5146285 5549055 6097214 6916088
2352 6916088 8021796 9538316 11367224 13817083 17118562 21604615 25866341 28456769
2344 28456769 26708408 21062030 15936642 12504440 10385107 8597294 7296842 6446420
2336 6446420 5678417 5093159 4659457 4215743 4038365 3753504 3638074 3464578 3184761 2852564
2326B852564k53625k17800k14311r1296j29770o9559j25331o7230r3295j60486
2316A429861j0803m4339n0139j72460k2713j4033j17923O142j2523r2871r025
2305H89174m9329p5602J07144q9263M6450M9957n9450j19222j02284M2070k5997
2294F13648o7215K1284K3915j0647j42921j00652O9671l834o147q648J07769p2733
2282D23490m6838k1070N5024k1014m7235m0991o1635J3890M2493Q0624J6240k6124
2270C66854l2952r4151n7018n1583r6175J28206N2872J521M4768l8728j07501
2259A16113J06565J8313o5331k4983l0198l9540J04965l8982j17811M7629J10974
2248A87714Q8741J6593p7803q4233r0898K7616J06841o211o8362J03021J09139
$$ plain form
2326 2852564 2598939 2381139 2166828 2075532 1945762 1876203 1750872 1683642 1590347 1429861
2316 1429861 1419058 1374719 1324580 1152120 1129407 1115374 997451 1003593 991070 898199 889174
2305 889174 839845 764243 871387 782124 828574 878531 819081 699859 597575 639645 613648
2294 613648 546433 567717 591632 580985 438064 337412 407083 403249 397102 388454 496223 423490
2282 423490 376652 355582 410606 389592 342357 301366 239731 253621 296114 376738 392978 366854
2270 366854 333902 239751 182733 131150 34975 163181 216053 217574 262342 223614 116113
2259 116113 222678 240991 175660 150677 120479 80939 185904 146922 29111 76740 187714
2248 187714 276455 293048 215245 131012 40114 67730 174571 168360 99998 203019 312158
2237C12158j64851j03357m9916P4543K7829J5908P1928p1648L6602n3397o4249
2226C1550k9657J51191l7502n5213j0694M8042n6636j0614M9328J8760l0796m6396
2214B1363k1511m536j290O8253K1976n5640q275R631M7559j15332N4842j9819
2202b779P613K5618j28648J3239P8956p817J4328O4663l4739K1360P4485K6582
2190A52861k0435P334P933j00547K9J25206K9230j38625j3214L5486n7938j154
2178B6166N5113M1375o92J3197j6205j15270M3841l8170j00373n326L9959M1811
2166a4574J46702J1070j0399k0263O1475k0723n3962l4303m6857K3531M5351p5012
2154A2036n595J927m5451o6740N3252J76099j33001P991J23016j5406K9951j06474
$$ plain form
2237 312158 147307 43950 -5966 68577 96406 112314 184242 112594 149196 95799 31550
2226 31550 1893 153084 115582 60369 49675 97717 41081 30467 79795 98555 67759 21363
2214 21363 -148 -4684 -5974 62279 84255 28615 20340 29971 77530 -37802 17040 -2779
2202 -2779 4834 30452 -98196 -84957 -6001 -13818 510 65173 30434 51794 126279 152861
2190 152861 132426 139760 147693 47146 47175 172381 201611 62986 49772 85258 27320 26166
2178 26166 81279 122654 121962 135159 118954 3684 47525 9355 -91018 -96344 -56385 -14574
2166 -14574 132128 143198 132799 112536 174011 153288 99326 65023 18166 41697 87048 12036
2154 12036 6441 8368 -37083 -103823 -50571 125528 -7473 518 123534 108128 138079 31605
2142C1605J780k7196k4432J13184l6197O365n8721O8667K796j8721R3528K0311
2130A72969m668l2808r6864m1993J7982j8793L7689j7047m577O369o394k2794
2118a0929Q141N4166M7621Q6215r3459j87681N2949J3618R368l9812Q0112K1424
2106D1733M647j20742k3135P1830j5730J08492n8181N213M0842n2160o4116J4534
2094d6773M7035p608P542O9102O9918O6343k73394k6296J8349J04168N0737p3697
2082E426k2251J4301N760M6293M8001p4664m7328J36773R7355p6885j7899m1588
2070G3294m7937K4522N975L5045J2381l6580m6284o6439M7241m4952O4339J5326
2058C5931q2764R912n5262M6575L1740j9365O8911q0212l912K3369l9441O9578
$$ plain form
2142 31605 33385 6189 -18243 94941 58744 65109 6388 75055 77851 59130 152658 172969
2130 172969 168301 135493 38629 -3364 14618 -4175 33514 16467 11890 18259 11865 -10929
2118 -10929 -2788 51378 98999 185214 91755 -95926 -42977 -29359 -19991 -59803 20309 41733
2106 41733 46380 -74362 -97497 -25667 -41397 67095 8914 14127 54969 2809 -61307 -46773
2094 -46773 262 -7346 196 69298 139216 205559 -67835 -94131 -75782 28386 79123 5426
2082 5426 -16825 -2524 3236 49529 97530 22866 -24462 112311 209666 132781 114882 73294
2070 73294 25357 49879 55854 90899 103280 66700 20416 -46023 1218 -43734 20605 35931
2058 35931 -46833 -36921 -92183 -45608 -13868 -33233 35678 -44534 -48446 -25077 -64518 5060
2046E060n1750j0849p0049J15919N1740p5584k94m0614n19N514M7445m5097R5970
2033B6892O5854n0700O9777Q0582k12864O287l8510n5631Q7335N1108K09k051
2021B8288l463p9081q4746Q4686O5270j048k1870P33o7810J9821o304J7242j1898
2008f0180j8851J04991K1299M4485M300l5863j00123L9435o0110P8402J5472l8328
1996e071P147J8636N8046j64378n5843J18056J8114N9706n7864K1059j04161J18798
1984C2245J4480n1449L2368Q756N104J8045j40783m762M304j07728R8211K3096
1972f8113M6618k190j01591j2991Q1763p524P0162j800O575m6712J2705O2890
1960C9792N418o4485M4222n3926J3115J0835o3913m5485J08199N0527l3l3954
$$ plain form
2046 5060 -46690 -57539 -127588 -11669 40071 -35513 -35807 -76421 -76940 -71426 -23981 -69078 26892
2033 26892 92746 42046 111823 192405 -20459 -14172 -52682 -108313 -20978 30130 30339 28288
2021 28288 24825 -54256 -139002 -54316 10954 9906 -11964 -11231 -79041 -59220 -65524 -48282 -60180
2008 -60180 -79031 25960 47259 91744 96044 60181 -39942 -507 -60617 17785 33257 -5071
1996 -5071 2076 20712 78758 -85620 -141463 -23407 -5293 54413 -3451 17608 -86553 32245
1984 32245 46725 -4724 27644 36400 41504 59549 -81234 -85996 -81692 -189420 -91209 -68113
1972 -68113 -21495 -23685 -125276 -138267 -56504 -64028 6134 4334 10909 -35803 -23098 39792
1960 39792 45210 -19275 24947 -28979 -15864 -5029 -68942 -114427 -6228 44299 44266 10312
1948A0312l3769o1286j9686J00931N714q5966M6988L9719j49153M333J35493o197
1936a2567R4059k5116n4496P4813j10127l6326K3810O6032R3196j02065q1375
1925g0162p3584N0616J28205n8093N5417q3744J1021J46145J5897j42349J09487
1914H8856N8021j5423n4306K28j04462l7202o58N5778N946M3513k232m5178O1254
1901E4135m1364J923Q129K554k3023L2976n0560k5632n5861K3842J2358L1992
1889b8531o151M536p043Q3748N235k1184K2367p9780k191O2677K0511n5490q2468
1876h3764M3255o672k4565J9164M5848L1279l3197K1513O3643l2064r7663p2142
1864a25365k2869O6539n625j04873P4489P3814N8672n0141K3961M8250p0669k5269
$$ plain form
1948 10312 -23457 -84743 -104429 -3498 2216 -83750 -36762 2957 -146196 -141863 -6370 -12567
1936 -12567 81492 56376 1880 76693 -33434 -69760 -45950 20082 113278 11213 -70162
1925 -70162 -143746 -93130 35075 -23018 32399 -51345 -40324 105821 121718 -20631 88856
1914 88856 146877 131454 77148 77376 -27086 -64288 -64946 -9168 -3222 40291 38059 -7119 54135
1901 54135 12771 14694 22823 25377 2354 35330 -15230 -40862 -96723 -72881 -60523 -28531
1889 -28531 -34682 -30146 -37189 46559 51794 30610 52977 -26803 -28994 33683 54194 -1296 -83764
1876 -83764 -40509 -47181 -71746 -52582 -6734 24545 -8652 12861 76504 44440 -53223 -125365
1864 -125365 -148234 -81695 -87320 -192193 -117704 -43890 14782 -35359 -11398 36852 -33817 -59086
1852e9086N0434N1209k3043k42435l13N8587J02743N5585l6243q425K4116K6788
1840h3q7033q2700k5572K8365p3838R6788R9005o680R6741o3540j15132L2023
1828a01656k8037K9744K2829k2306L6284l0375K9922J21318m5938N9794o0979
1817A0600N8864m1056o2040J1643L1848p2578R3949L3020j61334L4813l3811q2800
1805a78882M7377N7746J3391J7299n0734M1621M8467J996N4522j5084k3309m1802
1793b7392k5879M1724q7699N3040m5386L9988P7564l5332O748j0124R883o642
1781i507L2495j28150O031k1803P7114J9171m2141L8002M9290m1227n4495o76
1769g5896P6705m9918r6349L6186O1753K2451m5190M5790M0034K5057J810p1892
$$ plain form
1852 -59086 -8652 42557 19514 -222921 -223234 -164647 -61904 -6319 -42562 -50987 -26871 -83
1840 -83 -87116 -169816 -195388 -167023 -240861 -144073 -45068 -51748 44993 -18547 -133679 -101656
1828 -101656 -129693 -99949 -77120 -99426 -63142 -93517 -63595 57723 11785 71579 10600
1817 10600 69464 28408 -33632 -21989 9859 -62719 31230 64250 -97084 -62271 -96082 -178882
1805 -178882 -131505 -73759 -60368 -43069 -93803 -52182 -3715 -1719 52803 37719 14410 -27392
1793 -27392 -53271 -11547 -99246 -46206 -91592 -51604 25960 -9372 -2624 -12748 -2865 -9507
1781 -9507 22988 -105162 -99131 -120934 -43820 -24649 -66790 -28788 20502 -20725 -75220 -75896
1769 -75896 809 -49109 -145458 -109272 -47519 -25068 -70258 -24468 15566 40623 42433 -29459
1757b9459J8658R4078j10760J9793k8116q9868J46320J43302j22819q6716K2260
1746b3327n6029J9308O8629l9754L424l2893N3948P708l0675N3841j65153k1734
1734a62707R535j0863L2575P2309m3305J01735K3449k9373j2730K1028L4247k2473
1722A3427o9045q8950k3063l6977O7247o6336O9007O1306Q0716j7196l112m1986
1710e4962m7986j0610J17N1730l3236k4875k4631M0635J20323J00805m2650q3444
1698h784R9885k6719l8446J3730P2169n669J408n9089Q7344K8226j60111l5548
1686c1604L203M1305l3442k9089K2806Q548k7680Q2384j5705N5989J8053q6167
1674H601l0609l8589N0453O15m2431R5639N7301k6744N427j18722L2675j0210
$$ plain form
1757 -29459 -10801 83277 -27483 -7690 -35806 -125674 20646 163948 41129 -45587 -23327
1746 -23327 -79356 -60048 8581 -31173 -27749 -60642 -6694 1014 -29661 24180 -140973 -162707
1734 -162707 -153172 -164035 -131460 -59151 -102456 -721 22728 -6645 -19375 1653 35900 13427
1722 13427 -55618 -144568 -167631 -204608 -137361 -203697 -134690 -73384 7332 -9864 -12976 -54962
1710 -54962 -102948 -113558 -113441 -61711 -94947 -119822 -144453 -103818 16505 117310 74660 -8784
1698 -8784 91101 64382 25936 39666 111835 106166 107574 48485 135829 164055 3944 -31604
1686 -31604 -28401 12904 -20538 -49627 -26821 -18273 -45953 36431 20726 76715 94768 8601
1674 8601 -22008 -60597 -10144 -9529 -51960 43679 100980 74236 79663 -39059 -6384 -16594
1662a6594m4675L3609k388p424N9570K1897m8050m6778k4733N6150k8127m1223
1650h8766N4484J500m8633m570J9251M5975l9834k8543o4788n982R8995M8470
1638a2441Q113O6570M1592l5325l6702m9087N6975l8596o350K0002N3544n1765
1626A6530r7511j8460M2616J521L4764l2702o0271N2583J33413n9305m1609Q222
1614b0209j133l5846q2327J19675L7768L7735j1991K4622j20032M112L7604N1354
1602D1332K1051L2414j00997R0596O0670j9086o3014m5683l3204m1379q341p5529
1590a41170P3252M4678L6362k0224k125J516M4390p0997q6202J83734N8375l2218
1578H9371p104j2830p5707k4410j6919N6095p5210l3562Q1047Q5924k3872p917
$$ plain form
1662 -16594 -61269 -27660 -30048 -37472 22098 43995 -4055 -50833 -75566 -19416 -47543 -88766
1650 -88766 -34282 -32782 -81415 -85985 -66734 -20759 -60593 -89136 -153924 -159906 -60911 -12441
1638 -12441 -4328 62242 103834 68509 31807 -17280 39695 1099 -5251 14751 68295 16530
1626 16530 -80981 -99441 -56825 -55304 -20540 -53242 -113513 -60930 72483 13178 -28431 -20209
1614 -20209 -21342 -57188 -139515 -19840 17928 55663 43672 68294 -51738 -47626 -10022 41332
1602 41332 62383 94797 -6200 84396 145066 125980 62966 17283 -15921 -57300 -65641 -141170
1590 -141170 -67918 -23240 13122 -7102 -9227 -7711 36679 -34318 -120520 63214 121589 89371
1578 89371 82267 69437 -6270 -30680 -47599 8496 -66714 -100276 -19229 66695 42823 34906
1566C4906o6043m2990Q8499N9356L0509j0410k9168o2055j9468l6167p039p5170
1554a35240M8087J6551J5243k4793J00328J3259j59808l6139M1861k2052M4227
1543i8476R90M3872K4887O6469o5812j01062K4593q095k2213L3046J24603O4046
1531H6848l3917j02812Q1012k8604K850p2616l6738N5770N0485m3306j581J04735
1519F2126n4274j6301M9374k7469o8581M7410Q1327j10111n9505M7982n5963M4553
1507e9432J6292Q2096k7737n0685J17411j810m8502J1530m6632J19989n5813P4521
1495A31228l7985j41258Q4755L8646k163o6263m9411L623j8898j877J06049j32398
1483h5952O7069O2582j23271l0426m5443n0957J00892L0160K8092l496O2608m9144
$$ plain form
1566 34906 -31137 -74127 14372 73728 104237 93827 64659 2604 -16864 -53031 -60070 -135240
1554 -135240 -87153 -70602 -55359 -80152 20176 33435 -126373 -162512 -120651 -142703 -98476
1543 -98476 -97486 -53614 -28727 37742 -28070 -129132 -104539 -112634 -134847 -101801 22802 86848
1531 86848 52931 -49881 31131 2527 5377 -67239 -103977 -48207 2278 -41028 -42609 62126
1519 62126 7852 -8449 40925 13456 -55125 -7715 73612 -36499 -96004 -48022 -103985 -59432
1507 -59432 -43140 38956 11219 -39466 77945 76135 27633 39163 -7469 112520 56707 131228
1495 131228 93243 -48015 36740 75386 73223 6960 -42451 -38828 -57726 -59603 46446 -85952
1483 -85952 -18883 43699 -79572 -109998 -155441 -206398 -105506 -75346 -47254 -50750 11858 -37286
1471c7286Q0583R728r4468J0408j12906M200R4641O7961K4201N2382k942m3616
$$ plain form
1471 -37286 43297 53025 -41443 -31035 -143941 -139741 -45100 22861 47062 99444 96502 52886
$$ [...]
##END NTUPLES=NMR SPECTRUM
##END=
