##TITLE=1H_IG-crBrtol
 CDCl3
 8sc, 
 16.2.2024
##JCAMPDX= 6.0         $$ Bruker NMR JCAMP-DX V2.0
##DATA TYPE= NMR SPECTRUM
##DATA CLASS= NTUPLES
##ORIGIN= UXNMR, Bruker Analytische Messtechnik GmbH
##OWNER= root
$$ XWIN-NMR		Version 3.5
$$ Fri Feb 16 14:30:00 2024 Russian Standard Time (UT+4h)  she@DPX200
##.OBSERVE FREQUENCY= 200.1313
##.OBSERVE NUCLEUS= ^1H
##.ACQUISITION MODE= SIMULTANEOUS
##.ACQUISITION SCHEME= undefined
##.AVERAGES= 8
##.DIGITISER RES= 18
##SPECTROMETER/DATA SYSTEM= spect
##.PULSE SEQUENCE= zg30
##.SOLVENT NAME= DMSO
##.SHIFT REFERENCE= (INTERNAL, DMSO, 0, 15.5794)
##AUDIT TRAIL= $$ (NUMBER, WHEN, WHO, WHERE, WHAT)
$$ ##TITLE= Audit trail, XWIN-NMR		Version 3.5
$$ ##JCAMPDX= 5.01
$$ ##ORIGIN= Bruker BioSpin GmbH
$$ ##OWNER= she
$$ F:/spectra/data/she/nmr/H-F/1/pdata/1/auditp.txt
$$ ##AUDIT TRAIL=  $$ (NUMBER, WHEN, WHO, WHERE, WHAT)
(   1,<2024-02-16 14:29:03.18 +0400>,<she>,<DPX200>,
      <created by zg, POWCHK disabled, PULCHK disabled
       configuration hash MD5:
       00 E9 B6 7A A2 85 ED C7 34 08 36 98 17 FE 4E 26
       data hash MD5: 16K
       0E D6 39 7C BB 3A 64 8E 13 1A 14 B4 2D D6 A3 A6>)
(   2,<2024-02-16 14:29:05.56 +0400>,<she>,<DPX200>,
      <Start of raw data processing
       efp BC_mod = 2 LB = 0.24 FT_mod = 6 PKNL = 1 PHC0 = -24956.66 PHC1 = 10.85264 SI = 16K 
       data hash MD5: 16K
       08 7C 98 E8 42 A9 2A EE 11 3B 99 AF 43 93 EA 54>)
(   3,<2024-02-16 14:29:20.95 +0400>,<she>,<DPX200>,
      <pk PHC0 = -1.941862 PHC1 = 0.4 
       data hash MD5: 16K
       25 7B 16 77 38 85 24 D5 DC 30 1B 4B 0F 17 C8 0D>)
(   4,<2024-02-16 14:29:24.00 +0400>,<she>,<DPX200>,
      <abs ABSG = 5 
       data hash MD5: 16K
       F0 36 97 F4 3F 72 BD 70 D7 25 11 A9 55 FD 6C B4>)
$$ ##END=
$$ 
$$ hash MD5
$$ 44 22 12 5B CF F1 F5 38 B4 1F 25 27 B5 94 01 FB
##$RELAX= 
##$RELAX= 
##$RELAX= 
##$RELAX= 
##$RELAX= 
##$RELAX= 
$$ Bruker specific parameters
$$ --------------------------
##$DU= <F:/spectra>
##$EXPNO= 1
##$NAME= <H-F>
##$PROCNO= 1
##$TYPE= <nmr>
##$USER= <she>
##$AMP= (0..31)
100 100 100 100 100 100 100 100 100 100 100 100 100 100 100 100 100 100 
100 100 100 100 100 100 100 100 100 100 100 100 100 100 
##$AQSEQ= 0
##$AQ_mod= 1
##$AUNM= <au_zg>
##$AUTOPOS= <>
##$BF1= 200.13
##$BF2= 200.13
##$BF3= 200.13
##$BF4= 200.13
##$BF5= 200.13
##$BF6= 200.13
##$BF7= 200.13
##$BF8= 200.13
##$BYTORDA= 1
##$CFDGTYP= 0
##$CFRGTYP= 5
##$CHEMSTR= <none>
##$CNST= (0..31)
1 1 145 1 1 1 1 1 1 1 1 1 1 1 1 1 1 1 1 1 1 1 1 1 1 1 1 1 1 1 1 1 
##$CPDPRG= <>
##$CPDPRG1= <>
##$CPDPRG2= <>
##$CPDPRG3= <>
##$CPDPRG4= <mlev>
##$CPDPRG5= <mlev>
##$CPDPRG6= <mlev>
##$CPDPRG7= <mlev>
##$CPDPRG8= <mlev>
##$CPDPRGB= <>
##$CPDPRGT= <>
##$D= (0..31)
0 1.2 0 0 0 0 0 0 0 0.06 0 0.03 0 0 0 0 0.0002 0 0 0 0 0 0 0 0 0 0 0 0 
0 0 0 
##$DATE= 1708079342
##$DBL= (0..7)
120 120 120 120 120 120 120 120 
##$DBP= (0..7)
150 150 150 150 150 150 150 150 
##$DBP07= 0
##$DBPNAM0= <>
##$DBPNAM1= <>
##$DBPNAM2= <>
##$DBPNAM3= <>
##$DBPNAM4= <>
##$DBPNAM5= <>
$$ [...]
##$SUBNAM3= <"">
##$SUBNAM4= <"">
##$SUBNAM5= <"">
##$SUBNAM6= <"">
##$SUBNAM7= <"">
##$SUBNAM8= <"">
##$SUBNAM9= <"">
##$SW= 18.0517328524113
##$SWIBOX= (0..15)
0 0 2 0 0 0 0 0 0 0 0 0 0 0 0 0 
##$SW_h= 3612.71676300578
##$TD= 16384
##$TD0= 1
##$TE= 0
##$TE2= 300
##$TE3= 300
##$TEG= 300
##$TL= (0..7)
0 120 120 120 120 120 120 120 
##$TP= (0..7)
150 150 150 150 150 150 150 150 
##$TP07= 0
##$TPNAME0= <>
##$TPNAME1= <>
##$TPNAME2= <>
##$TPNAME3= <>
##$TPNAME4= <>
##$TPNAME5= <>
##$TPNAME6= <>
##$TPNAME7= <>
##$TPOAL= (0..7)
0.5 0.5 0.5 0.5 0.5 0.5 0.5 0.5 
##$TPOFFS= (0..7)
0 0 0 0 0 0 0 0 
##$TUNHIN= 0
##$TUNHOUT= 0
##$TUNXOUT= 0
##$USERA1= <user>
##$USERA2= <user>
##$USERA3= <user>
##$USERA4= <user>
##$USERA5= <user>
##$V9= 5
##$VALIST= <valist>
##$VCLIST= <CCCCCCCCCCCCCCC>
##$VD= 0
##$VDLIST= <DDDDDDDDDDDDDDD>
##$VPLIST= <PPPPPPPPPPPPPPP>
##$VTLIST= <TTTTTTTTTTTTTTT>
##$WBST= 1024
##$WBSW= 4
##$XGAIN= (0..3)
0 0 0 0 
##$XL= 0
##$YL= 0
##$YMAX_a= 76378
##$YMIN_a= -115973
##$ZGOPTNS= <>
##$ZL1= 120
##$ZL2= 120
##$ZL3= 120
##$ZL4= 120
##$ABSF1= 15.40643
##$ABSF2= -2.645417
##$ABSG= 5
##$ABSL= 3
##$ALPHA= 0
##$AQORDER= 0
##$ASSFAC= 0
##$ASSFACI= 0
##$ASSFACX= 0
##$ASSWID= 0
##$AUNMP= <proc_1d>
##$AZFE= 0.1
##$AZFW= 0.1
##$BCFW= 0
##$BC_mod= 2
##$BYTORDP= 0
##$COROFFS= 0
##$CY= -3
##$DATMOD= 1
##$DC= 0
##$DFILT= <>
##$DTYPP= 0
##$F1P= 0
##$F2P= 0
##$FCOR= 1
##$FTSIZE= 16384
##$FT_mod= 6
##$GAMMA= 0
##$GB= 0
##$INTBC= 1
##$INTSCL= 3.70164e-10
##$ISEN= 128
##$LB= 0.24
##$LEV0= 0
##$LPBIN= 0
##$MAXI= 10000
##$MC2= 0
##$MEAN= 0
##$ME_mod= 0
##$MI= 1.114404
##$NCOEF= 0
##$NC_proc= -8
##$NLEV= 6
##$NOISF1= 3.799351
##$NOISF2= 2.8
##$NSP= 0
##$NTH_PI= 0
##$NZP= 0
##$OFFSET= 15.57942
##$PC= 1
##$PHC0= -24958.6
##$PHC1= 11.25264
##$PH_mod= 1
##$PKNL= yes
##$PPARMOD= 0
##$PSCAL= 0
##$PSIGN= 0
##$REVERSE= no
##$SF= 200.129988449793
##$SI= 16384
##$SIGF1= 3
##$SIGF2= 2
##$SINO= 5.538805
##$SIOLD= 16384
##$SREGLST= <1H.CDCl3>
##$SSB= 0
##$STSI= 16384
##$STSR= 0
##$SW_p= 3612.71676300578
##$SYMM= 0
##$S_DEV= 0
##$TDeff= 16384
##$TDoff= 0
##$TI= <>
##$TILT= no
##$TM1= 0
##$TM2= 0
##$TOPLEV= 0
##$USERP1= <user>
##$USERP2= <user>
##$USERP3= <user>
##$USERP4= <user>
##$USERP5= <user>
##$WDW= 1
##$XDIM= 16384
##$YMAX_p= 403747363
##$YMIN_p= -2761765
$$ End of Bruker specific parameters
$$ ---------------------------------
##NTUPLES= NMR SPECTRUM
##VAR_NAME=  FREQUENCY,     SPECTRUM/REAL,   SPECTRUM/IMAG
##SYMBOL=    X,             R,               I
##VAR_TYPE=  INDEPENDENT,   DEPENDENT,       DEPENDENT
##VAR_FORM=  AFFN,          ASDF,            ASDF
##VAR_DIM=   16384,         16384,           16384
##UNITS=     HZ,            ARBITRARY UNITS, ARBITRARY UNITS
##FACTOR=    0.220516191357247, 1,           1
##FIRST=     3117.90916261047, 0,            0
##LAST=      -494.807600395307, 0,           0
##MIN=       -494.807600395307, -2761765,    0
##MAX=       3117.90916261047, 403747363,    0
$$ Real data points
##PAGE= N=1
##DATA TABLE= (X++(R..R)), XYDATA
$$ [...]
$$ plain form
12519 -193284 223600 365220 698077 489422 161494 -203944 -609941 -129349 174632 108451
12509 108451 -84723 422419 19971 -425011 -167511 -123665 -23023 91196 263813 537683
12499 537683 332660 330689 307729 -52717 224402 487315 -92187 -369091 -218782 -612742
12489 -612742 -196740 2501 -203142 -362581 94235 281927 42527 -344994 -26594 317060
12479 317060 338049 441711 -236974 -265809 -48158 70139 357704 236017 91517 -509863
12469 -509863 -367295 -380107 34808 275619 143316 149647 -213337 -423580 -99998 77362
12459 77362 102388 26996 -149392 148498 408798 200232 -417624 -487215 -334050 -63120
12449 -63120 20885 448597 408280 81773 160345 489003 453597 670454 366695 158394
$$ packed form
12519a93284M16884J41620L32857k08655l27928l65438m05997M80592L03981o6181
12509A08451j93174N07142m02448m44982K57500M3846J00642J14219J72617K73870
12499E37683k05023j971k2960l60446K77119K62913n79502k76904J50309l93960
12489f12742M16002J99241k05643j59439M56816J87692k39400l87521L18400L43654
12479C17060K0989J03662o78685k8835K17651J18297K87565j21687j44500o01380
12469e09863J42568j2812M14915K40811j32303O331l62984k10243L23582J77360
12459G7362K5026p5392j76388K97890K60300k08566o17856o9591J53165K70930
12449f3120Q4005M27712m0317l26507P8572L28658l5406K16857l03759k08301
$$ plain form
12439 158394 113511 414824 104424 -82154 288175 -197880 -400919 -509852 -393759 -90661
12429 -90661 -356840 56796 -170725 -379902 -262531 -317074 -70478 125171 -244412 -607543
12419 -607543 -754078 -760044 -837920 -941508 -527973 -189612 242496 296192 253743 115573
12409 115573 34458 -22349 61549 101626 -55672 -494021 -716980 -252325 -199557 93913
12399 93913 -123341 -43205 76351 251533 49292 -146572 150169 272947 391544 -59758
12389 -59758 -29725 -23929 44851 -25404 139950 142061 -268658 -75910 147658 345290 295825
12378 295825 -29283 -413285 -10163 -43501 -122949 -57188 124866 410264 119960 86760
12368 86760 -333026 -696857 -491051 -237844 -66330 19382 360309 -145140 -496590 -163660
$$ packed form
12439A58394m4883L01313l10400j86578L70329m86055k03039j08933J16093L03098
12429i0661k66179M13636k27521k09177J17371n4543K46596J95649l69583l63131
12419f07543j46535n966p7876j03588M13535L38361M32108N3696m2449j38170
12409A15573q1115n6807Q3898M0077j57298m38349k22959M64655N2768K93470
12399I3913k17254Q0136J19556J75182k02241j95864K96741J22778J18597m51302
12389e9758L0033N796O8780p0255J65354K111m10719J92748K23568J97632m9465
12378B95825l25108l84002M03122l3338p9448O5761J82054K85398k90304l3200
12368H6760m19786l63831K05806K53207J71514Q5712L40927n05449l51450L32930
$$ plain form
12358 -163660 -542484 -552374 -455794 -615275 -631239 -462465 -255931 -447548 -178355 -223087
12348 -223087 -228813 -469098 -333675 -72525 -357828 198067 118642 -54173 -749 197935
12338 197935 31249 -223415 -246699 20645 -313329 -52783 113432 195250 33374 -199487
12328 -199487 -526289 -575902 -331556 83909 198342 213742 15671 40983 390737 -24500
12318 -24500 -163328 41032 42528 116469 23237 -211101 96182 -75266 -282156 -11449
12308 -11449 172007 -202175 -161276 -208413 -370696 29978 3576 -252277 -168494 351585
12298 351585 610740 560356 522332 891021 805023 444257 100375 -266723 -390626 -1021486
12288 -1021486 -727033 -70871 -181707 106871 -191999 -363520 -210658 -350863 -253681 -403818
$$ packed form
12358a63660l78824r890R6580j59481j5964J68774K06534j91617K69193m4732
12348b23087n726k40285J35423K61150k85303N55895p9425j72815N3424J98684
12338A97935j66686k54664k3284K67344l33974K60546J66215Q1818j61876k32861
12328a99487l26802m9613K44346M15465J14433J5400j98071K5312L49754m15237
12318b4500j38828K04360J496P3941r3232k34338L07283j71448k06890K70707
12308a1449J83456l74182M0899m7137j62283M00674k6402k55853Q3783N20079
12298C51585K59155n0384l8024L68689q5998l60766l43882l67098j23903o30860
12288a021486K94453O56162j10836K88578k98870j71521J52862j40205R7182j50137
$$ plain form
12278 -403818 -114661 -133523 -64672 173447 -174678 249307 568513 -10484 -282690 -434071
12268 -434071 125746 583590 789732 629161 321392 249888 167670 83179 60413 106492
12258 106492 98810 140813 148625 274877 7304 -38154 -467281 -126426 116979 -155154 -6997
12247 -6997 228960 197411 -88416 -62699 -103691 94126 -40896 -328286 -240707 267052 3009
12236 3009 144373 117813 -36718 -316383 -167709 20664 -293102 -462366 -666281 -179218
12226 -179218 -313942 -364867 144773 -62184 -48490 73262 -239037 211371 -289761 -150301
12216 -150301 66861 238442 564547 306712 266893 -232371 64199 -141668 -296368 -396802
12206 -396802 -141840 -127743 -145890 -215709 -384394 -6216 -120373 178381 91668 -185704
$$ packed form
12278d03818K89157j8862O8851K38119l48125M23985L19206n78997k72206j51381
12268d34071N59817M57844K06142j60571l07769p1504q2218q4491k2766M6079
12258A06492p682M2003P812J26252k67573m5458m29127L40855K43405k72133J48157
12247f997K35957l1549k85827K5717m0992J97817j35022k87390Q7579N07759k64043
12236C009J41364k6560j54531k79665J48674J88373l13766j69264k03915M87063
12226a79218j34724n0925N09640k06957J3694J21752l12299M50408n01132J39460
12216a50301K17162J71581L26105k57835l9819m99264K96570k05867j54700j00434
12206c96802K54962J4097j8147o9819j68685L78178j14157K98754q6713k77372
$$ plain form
12196 -185704 -191830 -122779 -28867 68876 64427 -357480 93635 255854 16966 341040 945344
12185 945344 581369 60189 147980 449998 397919 428565 504111 -201773 -311060 -3936
12175 -3936 13970 278375 -129705 -141954 311019 105185 53721 228888 -100376 144215
12165 144215 249127 -969 137106 572965 637733 122769 132837 148690 147445 -502126
12155 -502126 -321896 -20223 683507 669772 486997 181681 147024 55842 -300895 -431092
12145 -431092 225419 105288 22345 362964 477343 254174 380411 392215 -158006 -273802
12135 -273802 -478381 -271494 -213736 -130614 -378296 -174276 229459 327436 72513 88512
12125 88512 -15384 -291526 -87397 8135 117295 149352 294258 53810 -19523 365386
$$ packed form
12196a85704o126O9051R3912R7743m449m21907M51115J62219k38888L24074O04304
12185I45344l63975n21180Q7791L02018n2079L0646P5546p05884j09287L07124
12175c936J7906K64405m08080j2249M52973k05834n1464J75167l29264K44591
12165A44215J04912k50096J38075M35859O4768n14964J0068J5853j245o49571
12155e02126J80230L01673P03730j3735j82775l05316l4657r1182l56737j30197
12145d31092O56511j20131q2943L40619J14379k23169J26237J1804n50221j15796
12135b73802k04579K06887N7758Q3122k47682K04020M03735R7977k54923J5999
12125H8512j03896k76142K04129R5532J09160L2057J44906k40448p3333L84909
$$ plain form
12115 365386 153666 502472 534594 407843 531931 188554 102371 449859 161480 46968
12105 46968 261532 -9354 -149786 566862 234974 48448 17213 100825 52292 35815
12095 35815 226506 185681 203766 444736 796174 583063 338437 519843 225105 124343
12085 124343 409438 534456 341170 165760 -133259 -214536 44162 -60948 145204 109636
12075 109636 185210 198354 -13858 321878 419124 486075 350822 446189 336339 93523
12065 93523 213091 269339 450591 246288 351457 602761 -21545 -419155 -127763 -176579
12055 -176579 344756 439244 276650 -53363 423503 437412 504713 -335838 -559928 -748814
12045 -748814 -580921 -173886 -319523 -292269 -48808 169719 152566 130704 303611 458529
$$ packed form
12115C65386k11720L48806L2122j26751J24088l43377q6183L47488k88379j14512
12105D6968K14564k70886j40432P16648l31888j86526l1235Q3612m8533j6477
12095C5815J90691m0825J8085K40970L51438k13111k44626J81406k94738j00762
12085A24343K85095J25018j93286j75410k99019q1277K58698j05110K06152l5568
12075A09636P5574J3144k12212L35736R7246O6951j35253R5367j09850k42816
12065I3523J19568N6248J81252k04303J05169K51304o24306l97610K91392m8816
12055a76579N21335R4488j62594l30013M76866J3909O7301q40551k24090j88886
12045g48814J67893M07035j45637K7254K43461K18527j7153k1862J72907J54918
$$ plain form
12035 458529 397911 203810 138079 -582 -171110 -27844 387986 429250 139698 195102
12025 195102 -169340 117427 227833 515400 561563 364207 53242 -22164 -224672 78040
12015 78040 91712 204853 76280 -73058 281996 19133 24432 377095 658268 363885
12005 363885 69238 347577 640719 741807 312044 325885 481338 630159 1132389 818211
11995 818211 469523 462023 9058 207737 404820 336675 366597 477199 387291 295594 353896
11984 353896 439484 -10599 217652 427596 520309 443469 563278 426389 562626 700706
11974 700706 479865 399365 331512 22758 35502 216390 -255367 153315 319426 442724
11964 442724 379697 609888 534969 250363 267428 -262675 -160183 709110 519022 101501
$$ packed form
12035D58529o0618j94101o5731j38661j70528J43266M15830M1264k89552N5404
12025A95102l64442K86767J10406K87567M6163j97356l10965p5406k02508L02712
12015G8040J3672J13141j28573j49338L55054k62863N299L52663K81173k94383
12005C63885k94647K78339K93142J01088m29763J3841J55453J48821N02230l14178
11995H18211l48688p500m52965J98679J97083o8145K9922J10602q9908r1697N8302
11984C53896Q5588m50083K28251K09944R2713p6840J19809j36889J36237J38080
11974G00706k20841q0500o7853l08754J2744J80888m71757M08682J66111J23298
11964D42724o3027K30191p4919k84606J7065n30103J02492Q69293j90088m17521
$$ plain form
11954 101501 55466 -136106 66436 322215 245061 574852 803395 1060750 1078553 960363
11944 960363 762914 703441 411941 302524 122754 391674 717563 490166 455704 414390
11934 414390 683341 874714 621443 515221 614663 743774 425211 705442 816364 520136
11924 520136 480149 70137 455421 841723 857277 581177 453594 175605 232790 750057
11914 750057 1038178 1167682 674780 792942 899790 720635 580728 1000785 1162576 969460
11904 969460 748675 692150 622671 655299 687344 391370 539631 590366 531453 636023 789116
11893 789116 864142 840674 843834 647229 896807 823310 859527 696393 938079 1523480 1398005
11882 1398005 1533446 1284808 994164 801527 1100086 918152 755579 634037 1009360
$$ packed form
11954A01501m6035j91572K02542K55779p7154L29791K28543K57355J7803j18190
11944I60363j97449n9473k91500j09417j79770K68920L25889k27397l4462m1314
11934D14390K68951J91373k53271j06222R9442J29111l18563K80231J10922k96228
11924E20136l9987m10012L85284L86302J5554k76100j27583k77989N7185N17267
11914G50057K88121J29504m92902J18162J06848j79155j39907M20057J61791j93116
11904I69460k20785n6525o9479L2628L2045k95974J48261N0735n8913J04570J53093
11893G89116P5026k3468L160j96605K49578p3497L6217j63134K41686N85401j25475
11882A398005J35441k48638k90644j92637K98559j81934j62573j21542L75323
$$ plain form
11873 1009360 1058334 575251 383195 679934 588864 1157399 1191510 710965 1290955 1134961
11863 1134961 1213271 932979 880398 1346653 1360250 1222434 973077 1051858 1319512 1345733
11853 1345733 1241375 1448626 1359302 955549 909269 1153666 1642542 1325592 893644 726186
11843 726186 791779 1231352 1446446 2032589 1822892 1615813 1973564 2080568 1979322 1833043
11833 1833043 1389276 1357784 1188427 1608858 1779765 1843473 1764094 1887580 1823976 1888792
11823 1888792 1923533 1812800 1947738 1605176 1334996 975309 1197941 1316801 1242250 1355922
11813 1355922 1746862 2100148 1753656 2094515 2609814 2605608 2557655 2364699 2395463 2098248
11803 2098248 2371519 2025161 2172703 2115780 1889254 1828747 1746288 1633379 1711317 1780897
$$ packed form
11873A009360M8974m83083j92056K96739r1070N68535L4111m80545N79990j55994
11863A134961P8310k80292n2581M66255J3597j37816k49357P8781K67654K6221
11853A345733j04358K07251q9324m03753m6280K44397M88876l16950m31948j67458
11843G26186O5593M39573K15094N86143k09697k07079L57751J07004j01246j46279
11833A833043m43767l1492j69357M20431J70907O3708p9379J23486o3604O4816
11823A888792L4741j10733J34938l42562k70180l59687K22632J18860p4551J13672
11813A355922L90940L53286l46492L40859N15299m206m7953j92956L0764k97215
11803B098248K73271l46358J47542n6923k26526o0507q2459j12909P7938O9580
$$ plain form
11793 1780897 1780343 2024596 2151395 2055348 1856787 1955201 2156695 2389563 2138062 2195573
11783 2195573 2332959 2292835 2161798 2437203 2298851 2147427 2969100 2786931 2831619 2609184
11773 2609184 2105657 2865072 3133107 2918076 2453634 2458119 2571373 2313953 2570774 2454201
11763 2454201 2569125 2861079 2828424 2753361 2631002 2578071 2844282 3239190 3217922 2896669
11753 2896669 3000730 3094040 3151551 3083511 3447573 3174305 2729171 2575073 2819024 3365726
11743 3365726 4098877 4358766 4192038 3855808 4067327 4180527 4119665 4089167 3876591 3738634
11733 3738634 3730639 3941474 3744804 4027424 4070825 4064948 4624187 4253210 3728217 4637536
11723 4637536 5189937 4974310 5061556 5259563 4659761 3908627 4348127 5006022 5182949 5188447
$$ packed form
11793A780897n54K44253J26799r6047j98561R8414K01494K32868k51501N7511
11783B195573J37386m0124j31037K75405j38352j51424Q21673j82169M4688k22435
11773B609184n03527P59415K68035k15031m64442M485J13254k57420K56821j16573
11763B454201J14924K91954l2655p5063j22359n2931K66211L94908k1268l21253
11753B896669J04061R3310N7511o8040L64062k73268m45134j54098K43951N46702
11743C365726P33151K59889j66728l36230K11519J13200o0862l0498k12576j37957
11733C738634p995K10835j96670K82620M3401n877N59239l70977n24993R09319
11723D637536N52401k15627Q7246J98007n99802p51134M39500O57895J76927N498
$$ plain form
11713 5188447 4862810 5796862 6013357 5805262 6035303 5747238 5953774 5812947 5608704
11704 5608704 6080282 6389158 6577873 6638402 6675590 6538583 7018475 6769105 6891969 6787438
11694 6787438 7036681 7271805 7547536 7517518 7324672 8132142 8560456 8347915 8466378 8420869
11684 8420869 8722134 8908277 8963189 9181910 9435244 9669045 9804682 10424950 10592511 10659725
11674 10659725 10646782 10834166 11472497 11198164 11127328 11671368 11765921 11888554 11884429 12951259
11664 12951259 12992473 13534327 13675025 13956636 14122499 14571249 14993048 15579784 15882364
11655 15882364 15717854 15941382 16179844 16712151 17013252 16985289 17285929 17950037 18520253
11646 18520253 19094994 19615318 20102737 20545320 20965234 21524372 21786394 22087100 23020070
$$ packed form
11713E188447l25637R34052K16495k08095K30041k88065K06536j40827k04243
11704E608704M71578L08876J88715O0529L7188j37007M79892k49370J22864j04531
11694F787438K49243K35124K75731l0018j92846Q07470M28314k12541J18463m5509
11684H420869L01265J86143N4912K18721K53334K33801J35637O20268J67561O7214
11674A0659725j2943J87384O38331k74333p0836N44040R4553J22633m125J066830
11664A2951259M1214N41854J40698K81611J65863M48750M21799N86736L02580
11655A5882364j64510K23528K38462N32307L01101k7963L00640O64108N70216
11646A8520253N74741N20324M87419M42583M19914N59138K62022L00706R32970
$$ plain form
11637 23020070 23290863 24153197 25264261 25597689 25942518 26734217 27406730 28175520 28663240
11628 28663240 29475642 29763200 30004028 31314378 32060667 32892633 33442025 33954295 35122961
11619 35122961 36123134 37330936 38046676 38955834 39858452 41267646 42294569 44174717
11611 44174717 45438501 46619767 48221322 49978683 51784167 54050909 56132794 57944198
11603 57944198 60100472 62071237 64205589 66459831 68602702 70780588 73998414 77103136
11595 77103136 79612452 82220100 84195260 85960605 88716768 90598723 92776400 94182168
11587 94182168 95155644 95642783 95984075 95988636 95294151 94396794 92917577 91082454 89008553
11578 89008553 87257251 85004016 82211891 79394130 76576534 73514154 70557185 68297942
$$ packed form
11637B3020070K70793Q62334J111064L33428L44829P91699O72513P68790M87720
11628B8663240Q12402K87558K40828J310350P46289Q31966N49392N12270J168666
11619C5122961J000173J207802P15740R09158R02618J409194J026923J880148
11611D4174717J263784J181266J601555J757361J805484K266742K081885J811404
11603E7944198K156274J970765K134352K254242K142871K177886L217826L104722
11595G7103136K509316K607648J975160J765345K756163J881955K177677J405768
11587I4182168R73476M87139L41292M561o94485q97357j479217j835123k073901
11578H9008553j751302k253235k792125k817761k817596l062380k956969k259243
$$ plain form
11570 68297942 65544234 62513216 60018836 57548916 55078579 52928262 50173828 48257500
11562 48257500 45994765 44337262 42735630 40839678 39090501 37976604 36185822 34868413
11554 34868413 33520296 31869120 30915737 29958454 29117254 27650923 26620847 25570225
11546 25570225 24859373 24550966 23638371 22399611 21675270 21116421 20589338 19833275 18933021
11537 18933021 18309399 17861460 17456316 17126334 16213637 15596661 15426057 14944509 14590808
11528 14590808 14455684 14037714 13757604 13580149 13190499 12347414 12059884 12099162 11312623
11519 11312623 10591770 10722390 10582711 9908322 9817724 10031671 9458619 8991170 8736572
11510 8736572 8759062 8286750 8377658 8400379 8455272 8411373 8046739 7512261 7607202 7416034
$$ packed form
11570F8297942k753708l031018k494380k469920k470337k150317k754434j916328
11562D8257500k262735j657503j601632j895952j749177j113897j790782j317409
11554C4868413j348117j651176r53383r57283q41200j466331j030076j050622
11546B5570225p10852l08407r12595j238760p24341n58849n27083p56063r00254
11537A8933021o23622m47939m05144l29982r12697o16976j70604m81548l53701
11528A4590808j35124m17970k80110j77455l89650q43085k87530L9278p86539
11519A1312623p20853J30620j39679o74389r0598K13947n73052m67449k54598
11510H736572K2490m72312R0908K2721N4893m3899l64634n34478R4941j91168
$$ plain form
11500 7416034 7633302 7263914 7222277 7066810 6963496 6661016 6107878 6346047 6138396 6232647
11490 6232647 6038394 5960448 5693878 5438395 4911043 5104748 5132001 5220922 4995253 4841535
11480 4841535 4799343 4429740 4656142 4622388 4432756 4082146 3929853 3919554 3659447 3644809
11470 3644809 3553002 3950998 3847655 3629364 3792408 3565732 3444169 3096699 3085423 3436016
11460 3436016 3619275 3537150 3530087 3379871 3076630 3443636 2978386 2728761 2129046 2062554
11450 2062554 2505674 3105034 3492687 3489951 2993185 2803373 2910193 3022270 2766356 2586993
11440 2586993 2909510 2573421 2443235 2591725 2620388 2509137 2550479 2460387 2572461 2463612
11430 2463612 1924520 1928099 1907137 1707333 1932318 2448490 2386021 2176492 1815340 1857405
$$ packed form
11500G416034K17268l69388m1637j55467j03314l02480n53138K38169k07651R4251
11490F232647j94253p7946k66570k55483n27352J93705K7253Q8921k25669j53718
11480D841535m2192l69603K26402l3754j89632l50610j52293j0299k60107j4638
11470C644809r1807L97996j03343k18291J63044k26676j21563l47470j1276L50593
11460C436016J83259q2125p063j50216l03241L67006m65250k49625n99715o6492
11450B062554M43120N99360L87653k736m96766j89812J06820J12077k55914j79363
11440B586993L22517l36089j30186J48490K8663j11251M1342r0092J12074j08849
11430B463612n39092L579k0962j99804K24985N16172o2469k09529l61152M2065
$$ plain form
11420 1857405 1938539 2013350 1947883 1864363 1922879 1669863 1294870 1558413 1368896 1242989
11410 1242989 1801741 2062073 2448409 2206961 1828326 1599233 1760414 1778964 2197247 2013802
11400 2013802 1585423 1242145 1046393 1507333 1705407 1831271 2021432 1937698 1965744 1816992
11390 1816992 2403083 2142510 1534007 1488582 1685772 2095781 2138756 1491089 1400199 1334699
11380 1334699 1591570 1523913 1528248 1407240 1484532 1542320 1366161 1237638 1627633 1756576
11370 1756576 1043889 1367748 1464741 1290447 1517310 1154765 1576847 1705851 1668600 1574203
11360 1574203 1811670 1645748 1330328 1245130 1195833 1142870 1193600 1726809 1892318 2323796
11350 2323796 1866120 1221950 1226580 1542032 1653590 1707301 1706743 1573361 1217436 1067916
$$ packed form
11420A857405Q1134P4811o5467q3520N8516k53016l74993K63543j89517j25907
11410A242989N58752K60332L86336k41448l78635k29093J61181J8550M18283j83445
11400B013802m28379l43278j95752M60940J98074J25864J90161q3734K8046j48752
11390A816992N86091k60573o08503m5425J97190M10009M2975o47667r0890o5500
11380A334699K56871o7657M335j21008P7292N7788j76159j28523L89995J28943
11370A756576p12687L23859R6993j74294K26863l62545M22082J29004l7251r4397
11360A574203K37467j65922l15420q5198m9297n2963N0730N33209J65509M31478
11350B323796m57676o44170M630L15452J11558N3711n58j33382l55925j49520
$$ plain form
11340 1067916 1003149 1382790 1405483 1214520 902167 1228960 1434753 1513935 1245345 1334188
11330 1334188 1183489 856573 1021080 1047049 1068223 1426022 1405349 1210219 947146 990214
11320 990214 1199619 908888 556068 594341 746031 740727 732644 779538 824941 1180391 1310533
11309 1310533 1065648 844800 1446736 1225833 1130934 1219308 1000212 1001322 686601 893515
11299 893515 1077246 779044 664990 985365 1157426 833676 927461 1172622 899452 570193
11289 570193 673404 598327 641542 538737 582035 477487 323332 531494 773647 665347
11279 665347 755509 527811 449622 11767 -153567 91243 512418 953386 624282 221563
11269 221563 441247 518066 394658 519279 318845 194292 -14525 524727 274093 292717
$$ packed form
11340A067916o4767L79641K2693j90963l12353L26793K05793P9182k68590Q8843
11330A334188j50699l26916J64507K5969K1174L57799k0673j95130k63073M3068
11320I90214K09405k90731l52820L8273J51690n304q083M6894M5403L55450J30142
11309A310533k44885k20848O01936k20903r4899Q8374k19096J110l14721K06914
11299H93515J83731k98202j14054L20375J72061l23750R3785K45161k73170l29259
11289E70193J03211p5077M3215j02805M3298j04548j54155K08162K42153j08300
11279F65347R0162k27698p8189m37855j65334K44810M21175M40968l29104m02719
11269B21563K19684P6819j23408J24621k00434j24553k08817N39252k50634J8624
$$ plain form
11259 292717 219697 -132538 260829 166527 -55991 56453 16853 17881 -141493 -147502 -233091
11248 -233091 372943 636237 575748 855866 979626 639975 467955 435745 623275 576857
11238 576857 780615 683284 700085 740567 672683 -44461 350091 662204 702020 469894
11228 469894 620608 734868 763100 344660 568803 627331 247808 242291 344599 494681
11218 494681 503926 674995 259618 331989 452840 430656 365095 711275 589671 472044
11208 472044 470213 407898 163689 267691 208701 448797 897128 799335 519588 294058
11198 294058 639886 355717 313430 220096 206899 -84753 -183262 270605 337313 405488 704860
11187 704860 771260 196593 48795 164503 521146 311026 305305 208610 129212 47949 -3993
$$ packed form
11259B92717p3020l52235L93367r4302k22518J12444l9600J028j59374o009q5589
11248b33091O06034K63294o0489K80118J23760l39651j72020l2210J87530m6418
11238E76857K03758r7331J6801M0482o7884p17144L94552L12113L9816k32126
11228D69894J50714J14260K8232m18440K24143N8528l79523n517J02308J50082
11218D94681R245J71069m15377P2371J20851k2184o5561L46180j21604j17627
11208D72044j831o2315k44209J04002n8990K40096M48331r7793k79747k25530
11198B94058L45828k84169m2287r3334j3197k91652r8509M53867O6708O8175K99372
11187G04860O6400n74667j47798J15708L56643k10120n721r6695p9398q1263n1942
$$ plain form
11176 -3993 199360 75697 146436 259847 -54202 246110 166136 640764 518804 162308
11166 162308 79970 -473083 -256741 162065 274646 383246 -110296 229998 -176031 -80180
11156 -80180 108009 28773 132372 167511 229934 228562 -167512 179322 396837 154458 301878
11145 301878 243136 502547 215574 -89300 86045 262661 291680 118595 -220361 -95776
11135 -95776 -275920 -571360 -249267 275037 371187 362537 246048 167478 117194 329503 140006
11124 140006 528205 349166 71192 331608 673458 647101 886977 609161 534425 518921
11114 518921 355069 686007 588280 276833 -4828 -148939 -46137 103038 386978 401782
11104 401782 517136 458315 552723 758539 190245 137072 358029 163654 101564 494790
$$ packed form
11176c993K03353j23663P0739J13411l14049L00312p9974M74628j21960l56496
11166A62308q2338n53053K16342M18806J12581J08600m93542L40294m06029R5851
11156h0180J88189p9236J03599L5139O2423j372l96074L46834K17515k42379J47420
11145C01878n8742K59411k86973l04874J75345J76616K9019j73085l38956J24585
11135i5776j80144k95440L22093N24304R6150q650j16489p8570n0284K12309j89497
11124A40006L88199j79039k77974K60416L41850k6357K39876k77816p4736j5504
11114E18921j63852L30938r7727l11447k81661j44111J02802J49175K83940J4804
11104D01782J15354n8821R4408K05816n68294n3173K20957j94375o2090L93226
$$ plain form
11094 494790 375042 416363 188227 178034 -31978 231288 93724 122093 -19325 151748
11084 151748 186077 -238393 411252 486167 431294 262910 295488 238233 316803 75115 -223325
11073 -223325 483452 457084 -80503 -312009 430282 324699 85060 -116703 -473662 -232829
11063 -232829 -143612 151921 249156 -250364 -187579 579356 902266 624989 79346 456763
11053 456763 406592 10694 39233 178569 -44935 39564 -431414 -65192 65606 -46558
11043 -46558 -63104 148555 340673 125304 354512 198612 188312 231556 -234388 -475139
11033 -475139 -433686 -184873 129144 472141 604262 744662 912187 266353 127109 429746
11023 429746 671160 308889 -34365 227152 56120 -66782 -107496 -81176 337994 696145
$$ packed form
11094D94790j19748M1321k28136j0193k10012K63266j37564K8369j41418J71073
11084A51748L4329m24470O49645P4915n4873j68384L2578n7255P8570k41688k98440
11073b23325P06777k6368n37587k31506P42291j05583k39639k01763l56959K40833
11063b32829Q9217K95533R7235m99520O2785P66935L22910k77277n45643L77417
11053D56763n0171l95898K8539J39336k23504Q4499m70978L66222J30798j12164
11043d6558j6546K11659J92118k15369K29208j55900j0300M3244m65944k40751
11033d75139M1453K48813L14017L42997J32121J40400J67525o45834j39244L02637
11023D29746K41414l62271l43254K61517j71032j22902m0714K6320M19170L58151
$$ plain form
11013 696145 117616 147665 -255721 -596257 -146833 154447 -120036 -23154 -110658 276301
11003 276301 324534 63759 291506 388959 660621 542091 -58337 -189835 107183 287340
10993 287340 755923 584573 533152 78713 93848 298695 80011 -57971 -24198 -123950
10983 -123950 117659 -223212 -120192 -45755 421026 686750 606821 -48089 -82192 432536
10973 432536 711351 467966 -134706 -534991 -511624 -91764 18965 275813 59213 201800
10963 201800 182756 601897 588413 176701 272188 256947 -151285 -14774 65615 -94097
10953 -94097 63200 1975 -209483 -107488 94089 14793 -64831 -362398 -504405 -970005
10943 -970005 -62396 364563 160143 -133522 -403854 -248244 306690 264606 -83773 -47422
$$ packed form
11013F96145n78529L0049m03386l40536M49424L01280k74483R6882q7504L86959
11003B76301M8233k60775K27747R7453K71662j18530o00428j31498K97018J80157
10993B87340M68583j71350n1421m54439J5135K04847k18684j37982L3773r9752
10983a23950K41609l40871J03020P4437M66781K65724p9929o54910l4103N14728
10973D32536K78815k43385o02672m00285K3367M19860J10729K56848k16600J42587
10963B01800j9044M19141j3484m11712R5487j5241m08232J36511Q0389j59712
10953i4097J57297o1225k11458J01995K01577p9296p9624k97567j42007m65600
10943i70005R07609M26959k04420k93665k70332J55610N54934m2084l48379L6351
$$ plain form
10933 -47422 37296 272578 288567 83861 30979 -6284 530297 172570 161612 557473 284741
10922 284741 -23360 -237716 160415 254045 33918 51620 350122 265992 410207 -65677
10912 -65677 324229 -228068 92150 142339 38171 247488 280767 190075 367914 351336
10902 351336 -2438 -840 -410556 -532435 -589979 12906 32421 116616 380090 -3643
10892 -3643 -282033 -262708 -270753 87003 122423 353983 754181 -117233 -576055 -231926 -162063
10881 -162063 -251927 70142 249786 70743 -676830 -604840 -214309 26580 -57545 -513957
10871 -513957 -198559 -108585 -30423 324790 192239 -210050 345080 293944 313223 -100463
10861 -100463 -188648 -340080 119048 -18352 142954 493375 523419 289489 -203227 190550
$$ packed form
10933d7422Q4718K35282J5989k04706n2882l7263N36581l57727j0958L95861k72732
10922B84741l08101k14356L98131R3630k20127J7702K98502q4130J44215m75884
10912f5677L89906n52297L20218N0189j04168K09317L3279r0692J77839j6578
10902C51336l53774J598m09716j21879n7544O02885J9515Q4195K63474l83733
10892c643k78390J9325q045L57756L5420K31560M00198q71414m58822L44129O9863
10881a62063q9864L22069J79644j79043p47573P1990L90531K40889q4125m56412
10871e13957L15398Q9974P8162L55213j32551m02289N55130n1136J9279m13686
10861a00463q8185j51432M59128j37400J61306L50421L0044k33930m92716L93777
$$ plain form
10851 190550 401121 184433 -286046 19951 -212168 140421 -21654 -47158 -468371 98421
10841 98421 -25171 -24947 313647 567262 135927 465183 550575 1614 -15937 137667 -73339
10830 -73339 -450658 -270720 -471068 -26926 314172 56366 -86877 -280287 -103162 -117244
10820 -117244 -326506 -108882 -135645 -207792 -170727 44655 225479 492191 278803 307444
10810 307444 -47299 482981 619581 -37254 -291436 255067 -11903 100197 363020 740588
10800 740588 337246 201415 240289 -96046 -277381 -349246 -273142 -601405 -654057 -628161
10790 -628161 -536144 -230960 114998 532281 373018 129073 69939 180790 -333967 -718210
10780 -718210 -72826 349805 44103 443209 44398 -166137 -347803 -333595 62879 25486
$$ packed form
10851A90550K10571k16688m70479L05997k32119L52589j62075k5504m21213N66792
10841I8421j23592K24L38594K53615m31335L29256Q5392n48961j7551J53604k11006
10830g3339l77319J79938k00348M44142L41098k57806j43243j93410J77125j4082
10820a17244k09262K17624k6763p2147L7065K15382J80824K66712k13388K8641
10810C07444l54743N30280J36600o56835k54182N46503k66970J12100K62823L77568
10800G40588m03342j35831L8874l36335j81335p1865P6104l28263n2652K5896
10790f28161R2017L05184L45958M17283j59263k43945n9134J10851n14757l84243
10780g18210O45384M22631l05702L99106l98811k10535j81666J4208L96474l7393
$$ plain form
10770 25486 88307 154200 264713 -122870 185558 467658 1922 -316924 -400598 -310110
10760 -310110 573129 451956 78575 248461 -245472 -414213 -405577 -237005 77740 -257540
10750 -257540 -38193 -10802 -83913 -68179 -33163 211239 206671 -40696 147638 88949 165138
10739 165138 -56152 329855 455276 195367 102404 163863 172608 -345610 -594906 -520154
10729 -520154 -600461 -494059 -352877 -501400 -514793 -405435 -329264 -146779 -483407 -338300
10719 -338300 67054 89816 109286 53061 99072 298024 195108 55249 -86563 329679
10709 329679 -158836 -31308 279076 -25602 -122790 171661 -40574 -120729 -215278 -611223
10699 -611223 -737633 -534176 -371130 93277 253150 -371897 -317069 -442387 370833 158666
$$ packed form
10770B5486O2821O5893J10513l87583L08428K82100m65736l18846q3674R0488
10760c10110Q83239j21173l73381J69886m93933j68741Q636J68572L14745l35280
10750b57540K19347K7391p3111J5734L5016K44402m568k47367J88334n8689P6189
10739A65138k21290L86007J25421k59909r2963O1459Q745n18218k49296P4752
10729e20154q0307J06402J41182j48523j3393J09358P6171J82485l36628J45107
10719c38300M05354K2762J9470n6225M6011J98952j02916j39859j41812M16242
10709C29679m88515J27528L10384l04678r7188K94451k12235q0155r4549l95945
10699f11223j26410K03457J63046M64407J59873o25047N4828j25318Q13220k12167
$$ plain form
10689 158666 -111140 -414219 73800 261481 209878 184616 233870 83767 -140039 -181726
10679 -181726 -78875 19307 324491 382908 152748 215852 71315 503227 82365 148420
10669 148420 182681 329144 -87666 -232901 -164478 -477104 -389632 -172832 -446698 9006
10659 9006 520804 181690 94730 280895 334437 81633 -272103 -66161 438439 45952
10649 45952 -66534 493 375743 203454 -37063 200375 -5909 -5653 395469 263453
10639 263453 -145585 83097 114068 -562339 -168901 111787 304931 606279 428874 -173997
10629 -173997 15862 24231 -174889 -157223 143821 -476504 -105186 109889 -302784 -169206
10619 -169206 -37909 -37636 -402198 -71264 596561 388861 -24596 -204119 -138214 -373949
$$ packed form
10689A58666k69806l03079M88019J87681n1603k5262M9254j50103k23806m1687
10679a81726J02851R8182L05184N8417k30160O3104j44537M31912m20862O6055
10669A48420L4261J46463m16810j45235O8423l12626Q7472K16800k73866M55704
10659I006N11798l39114q6960J86165N3542k52804l53736K05942N04600l92487
10649D5952j12486O7027L75250j72289k40517K37438k06284K56M01122j32016
10639B63453m09038K28682L0971o76407L93438K80688J93144L01348j77405o02871
10629a73997J89859Q369j99120J7666L01044o20325L71318K15075m12673J33578
10619a69206J31297K73l64562L30934O67825k07700m13457j79523O5905k35735
$$ plain form
10609 -373949 -421838 -398756 -167975 -151217 85010 693636 239754 8701 79693 12873
10599 12873 324910 375190 705067 632536 -21002 247828 -116363 -182105 -227008 -372466
10589 -372466 -132828 167827 161425 129767 -206646 -172473 -283054 -225955 -153391 39688 64738
10578 64738 472966 115188 -7420 48731 -110974 -214457 -579714 -195050 120633 -36943
10568 -36943 -385429 -344416 201781 -110795 -161564 134440 353046 344000 483374 648714
10558 648714 342421 94383 -39444 9842 22808 -171245 204 268644 34536 -62158
10548 -62158 175327 332414 775683 540349 15262 -138244 220193 130133 10125 166148
10538 166148 208822 121085 18511 54186 -56353 -544057 -330217 -65792 -24231 323060
$$ packed form
10609c73949m7889K3082K30781J6758K36227O08626m53882k31053P0992o6820
10599A2873L12037N0280L29877p2531o53538K68830l64191o5742m4903j45458
10589c72466K39638L00655o402l1658l36413L4173j10581N7099P2564J93079K5050
10578F4738M08228l57778j22608N6151j59705j03483l65257L84664L15683j57576
10568c6943l48486M1013N46197l12576n0769K96004K18606r046J39374J65340
10558F48714l06293k48038j33827M9286J2966j94053J71449K68440k34108r6694
10548f2158K37485J57087M43269k35334n25087j53506L58437r0060j20008J56023
10538A66148M2674q7737j02574L5675j10539m87704K13840K64425M1561L47291
$$ plain form
10528 323060 -53603 295024 430794 -8144 18854 -83596 -201245 183570 142703 45423
10518 45423 94679 199671 173882 165290 111143 44329 -132330 35659 165208 278240 -117332
10507 -117332 -181520 117973 291462 53778 47661 -117175 264090 247360 -337626 -526415
10497 -526415 122033 276858 104393 -318123 -227957 263400 202808 115582 124789 -376108
10487 -376108 10001 435352 183498 94176 11990 1485 -31756 118772 -182918 346698
10477 346698 573030 512266 120382 -34407 -56000 252021 635821 444681 205396 -99282
10467 -99282 -341124 -167162 -188076 -803676 -766442 -171215 366417 92471 533416 405866
10457 405866 -963 65563 -84959 387171 -85610 80564 232572 119476 38085 362628
$$ packed form
10528C23060l76663L48627J35770m38938K6998j02450j17649L84815m0867r7280
10518D5423M9256J04992k5789q592n4147o6814j76659J67989J29549J13032l95572
10507a17332o4188K99493J73489k37684o117j64836L81265j6730n84986j88789
10497e26415O48448J54825j72465m22516R0166M91357o0592q7226R207n00897
10487c76108L86109M25351k51854q9322q2186j0505l3241J50528l01690N29616
10477C46698K26332o0764l91884j54789k1593L08021L83800j91140k39285l04678
10467i9282k41842J73962k0914o15600L7234N95227N37632k73946M40945j27550
10457D05866m06829O6526j50522M72130m72781J66174J52008j13096q1391L24543
$$ plain form
10447 362628 375815 154605 620953 691540 192562 127279 165922 -206756 -434783 102539
10437 102539 161009 197988 368382 235627 550150 606196 398194 410194 276714 462936
10427 462936 350065 507640 721063 428380 263951 -33923 8978 515079 633677 380624
10417 380624 466590 640433 517920 448914 578046 361032 161334 -61580 -15927 -85233
10407 -85233 -67891 102319 -370870 -475801 -177683 -93557 81742 613239 1295837 1162364
10397 1162364 735134 261149 243403 1001442 1187106 910900 719836 258992 42202 11229
10387 11229 361538 186456 -205311 283038 906657 867290 260439 258847 231624 499820
10377 499820 181232 361104 540582 684361 365073 192311 359640 349399 556492 427368
$$ packed form
10447C62628J3187k21210M66348P0587m98978o5283L8643l72678k28027N37322
10437A02539N8470L6979J70394j32755L14523N6046k08002J2000j33480J86222
10427D62936j12871J57575K13423k92683j64429k97874M2901N06101J18598k53053
10417C80624Q5966J73843j22513o9006J29132k17014j99698k22914M5653o9306
10407h5233J7342J70210m73189j04931K98118Q4126J75299N31497O82598j33473
10397A162364m27230m73985j7746P58039J85664k76206j91064m60844k16790l0973
10387A1229L50309j75082l91767M88349O23619l9367o06851j592k7223K68196
10377D99820l18588J79872J79478J43779l19288j72762J67329j0241K07093j29124
$$ plain form
10367 427368 271768 -94583 -280565 327532 743654 481446 401308 547239 562450 801188
10357 801188 791502 894986 950211 728916 706724 316128 640973 677028 705915 508677 462395
10346 462395 407638 964758 634323 335478 409077 207267 206234 400006 490403 402944 420203
10335 420203 650983 571599 466294 693031 513993 460002 281720 410648 1012486 1028697
10325 1028697 1138266 1054578 764924 706440 994163 621967 719586 858190 1061207 1120477
10315 1120477 909132 717774 1067933 944613 857030 1016948 807773 864585 854224 1213582
10305 1213582 1119078 1186286 413968 716987 957104 1079400 1511129 1095100 990783 971922
10295 971922 754635 997415 1099248 1084558 1397677 1011307 1310753 1675054 1600369 1593768
$$ packed form
10367D27368j55600l66351j85982O08097M16122k62208q0138J45931J5211K38738
10357H01188r686J03484N5225k21295k2192l90596L24845L6055K8887j97238m6282
10346D62395n4757N57120l30435k98845P3599k01810j033J93772R0397q7459J7259
10335D20203K30780p9384j05305K26737j79038n3991j78282J28928O01838J6211
10325A028697J09569q3688k89654n8484K87723l72196R7619J38604K03017N9270
10315A120477k11345j91358L50159j23320q7583J59918k09175N6812j0361L59358
10305A213582r4504O7208p72318L03019K40117J22296M31729m16029j04317j8861
10295I71922k17287K42780J01833j4690L13119l86370K99446L64301p4685o601
$$ plain form
10285 1593768 1431981 1502845 1777791 1928799 1945557 1891383 1394390 1981249 2393985 2240478
10275 2240478 2439617 2294547 2325047 1984999 1906421 2335659 2469390 2479615 2582067 2601780
10265 2601780 2686108 2687276 2919690 2887294 2781300 3274125 3200481 3318081 3464579 3751670
10255 3751670 3091169 3202340 3408844 3441137 3561434 3240984 2992424 3175768 3348597 3381155
10245 3381155 3217345 3635509 4122392 3841134 3741810 4187964 3605082 3725796 3426864 3658397
10235 3658397 3663858 3837861 4129523 4104592 4536932 4160251 4219303 4300327 4096137 4236853
10225 4236853 4638158 4621839 4886759 5084469 5143346 4953354 5094301 5151937 5600023 6143948
10215 6143948 6589662 6573244 6921082 7274783 7596225 8218787 8603326 8556474 9157560 9624657
$$ packed form
10285A593768j61787P0864K74946J51008J6758n4174m96993N86859M12736j53507
10275B240478J99139j45070L0500l40048p8578M29238J33731J0225J02452J9713
10265B601780Q4328J168K32414l2396j05994M92825p3644J17600J46498K87091
10255C751670o60501J11171K06504L2293J20297l20450k48560J83344J72829L2558
10245C381155j63810M18164M86883k81258r9324M46154n82882J20714k98932K31533
10235C658397N461J74003K91662k4931M32340l76681N9052Q1024k04190J40716
10225D236853M01305j6319K64920J97710N8877j89992J40947N7636M48086N43925
10215F143948M45714j6418L47838L53701L21442O22562L84539m6852O01086M67097
$$ plain form
10205 9624657 9316034 10217194 10727211 11239285 11520704 11462725 12025874 12500541 13050411 13065832
10195 13065832 13384161 14157611 14236896 13751768 13177956 13189412 12983821 12204420 12198434 11857810
10185 11857810 11044112 10345321 10379514 10022600 9818234 9277111 9014703 8293962 8092364
10176 8092364 7528760 7170829 6841358 6405159 6665950 6853409 6142482 5592189 5298709
10167 5298709 5068516 5086402 4833485 4735470 4481449 4278276 4208212 4211597 3889917 3524428
10157 3524428 3722927 3990532 3576392 3431393 3134340 3124740 3237720 3324730 2823709 3157612
10147 3157612 3170633 2706705 2838425 2942699 2710903 2374217 3226397 3183273 3276278 3521601
10137 3521601 3317847 3701448 3985875 4287806 4230985 4271182 4481466 3787133 3825088 4514700
$$ packed form
10205I624657l08623R01160N10017N12074K81419n7979N63149M74667N49870J5421
10195A3065832L18329P73450P9285m85128n73812J1456k05591p79401n986l40624
10185A1857810q13698o98791L4193l56914k04366n41123k62408p20741k01598
10176H092364n63604l57931l29471m36199K60791J87459p10927n50293k93480
10167E298709k30193J7886k52917r8015k54021k03173p0064L385l21680l65489
10157C524428J98499K67605m14140j44999k97053r600J12980Q7010n01021L33903
10147C157612J3021m63928J31720J04274k31796l36686Q52180m3124R3005K45323
10137C521601k03754L83601K84427L01931n6821M0197K10284o94333L7955O89612
$$ plain form
10127 4514700 4201666 4014952 3887315 3763008 3330475 3124448 3061868 2344666 1997918 1866981
10117 1866981 1664000 1800120 1471362 1658468 1438383 1003893 1245421 1433092 1254964
10108 1254964 1550493 1124133 1432329 1712283 1685863 1612594 1458498 1483495 1469703 1667345
10098 1667345 1845898 1925052 1627450 1379591 1364143 1489940 1739390 1905764 1568442 1203860
10088 1203860 893175 1192454 1070404 1340128 1380940 1267911 1143329 1116366 977924 794357
10078 794357 628678 887531 1281135 1536256 1347134 1084928 636809 336685 764054 513888
10068 513888 636839 1046745 857188 1034579 1020645 1209252 808777 365041 567802 357318
10058 357318 379661 421639 522360 406013 484642 472036 592851 957361 733172 561904
$$ packed form
10127D514700l13034j86714j27637j24307m32533k06027o2580p17202l46748j30937
10117A866981k02981J36120l28758J87106k20085m34490K41528J87671j78128
10108A254964K95529m26360L08196K79954k6420p3269j54096K4997j3792J97642
10098A667345J78553P9154k97602k47859j5448J25797K49450J66374l37322l64582
10088A203860l10685K99279j22050K69724M0812j13029j24582k6963j38442j83567
10078G94357j65679K58853L93604K55121j89122k62206m48119l00124M27369k50166
10068E13888J22951M09906j89557J77391j3934J88607m00475m43736K02761k10484
10058C57318K2343M1978J00721j16347P8629j2606J20815L64510k24189j71268
$$ plain form
10048 561904 351209 503098 244569 244938 570395 507832 638317 639842 588564 128003 596416
10037 596416 428452 769962 346227 214017 382141 721412 673619 586935 737799 483517
10027 483517 630025 498402 499412 599440 688074 673736 922094 679269 506513 853081
10017 853081 982998 918054 956762 547342 478734 225080 560719 105217 -94020 625675
10007 625675 888286 749871 383958 94204 169133 308712 560976 1161499 939469 690598
9997 690598 870321 613009 520110 602246 806429 1055674 1204149 1117741 764996 844760
9987 844760 716159 770848 670958 592409 543574 546762 704704 952695 915038 654646 757594
9976 757594 1007284 1046924 1286161 854512 622678 925128 1446767 944336 847234 1214858
$$ packed form
10048E61904k10695J51889k58529L69L25457o2563J30485J525n1278m60561M68413
10037E96416j67964L41510m23735j32210J68124L39271m7793q6684J50864k54282
10027D83517J46508j31623J010J00028Q8634j4338K48358k42825j72756L46568
10017H53081J29917o4944L8708m09420o8608k53654L35639m55502j99237P19695
10007F25675K62611j38415l65913k89754P4929J39579K52264O00523k22030k48871
9997F90598J79723k57312r2899Q2136K04183K49245J48475q6408l52745P9764
9987H44760j28601N4689r9890p8549m8835L188J57942K47991l7657k60392J02948
9976G57594K49690L9640K39237m31649k31834L02450N21639n02431r7102L67624
$$ plain form
9966 1214858 1339459 1635347 1934745 2400642 2547730 1911684 1593071 1646719 1839544 1839321
9956 1839321 2032546 2380352 2159335 2689008 2940189 2871236 3081286 2490712 2386844 2672592
9946 2672592 2154761 2018138 1939773 2080212 1665896 1557948 1222443 1197876 1374668 1330877
9936 1330877 805122 1076677 1270532 1222583 900970 1039466 1064005 1436597 1059923 714136
9926 714136 835779 1367684 1076687 608282 351629 739782 1104152 1024193 1329819 1112144
9916 1112144 1038962 1348742 1447458 1471975 1504977 1302350 1328835 1283697 1570168 1297811 1107985
9905 1107985 1446907 1495630 1176602 1094107 1254336 1257618 1272381 1591738 1474389 1126494
9895 1126494 1130880 1635752 1418565 1486413 1321171 994590 967194 1171284 1455929 1162574
$$ packed form
9966A214858J24601K95888K99398M65897J47088o36046l18613N3648J92825k23
9956A839321J93225L47806k21017N29673K51181o8953K10050n90574j03868K85748
9946B672592n17831j36623p8365J40439m14316j07948l35505k4567J76792m3791
9936A330877n25755K71555J93855m7949l21613J38496K4539L72592l76674l45787
9926G14136J21643N31905k90997m68405k56653L88153L64370p9959L05626k17675
9916A112144p3182L09780R8716K4517L3002k02627K6485m5138K86471k72357j89826
9905A107985L38922M8723l19028q2495J60229L282J4763L19357j17349l47895
9895A126494M386N04872k17187O7848j65242l26581k7396K04090K84645k93355
$$ plain form
9885 1162574 1191030 1427980 1429022 1428659 1143876 983766 816928 949483 1026038 1337757 1895219
9874 1895219 2066625 1671482 1300718 1491295 1798876 1667379 1432305 1156748 1594298 1549175
9864 1549175 1456794 1971990 2074995 2116289 2159965 1992484 2364700 2147245 1837975 1769105
9854 1769105 1466374 1680844 1602659 1498068 1868840 1730816 1926208 1844653 2028267 1918083
9844 1918083 1765142 1589479 1568803 1677641 1584374 2156953 2225005 1862380 1894983 1929762
9834 1929762 2485621 2444955 2279000 2143406 2220547 1795957 1631200 2303415 2120142 2067579
9824 2067579 1903600 1871585 1839775 2063733 2253776 2154643 2640881 2319372 2270641 2474690
9814 2474690 2447036 2357438 1961398 2667820 2360541 2513035 2848310 2439234 2074171 2419311
$$ packed form
9885A162574K8456K36950J042l63k84783j60110j66838J32555P6555L11719N57462
9874A895219J71406l95143l70764J90577L07581j31497k35074k75557M37550m5123
9864A549175r2381N15196J03005M1294M3676j67481L72216k17455l09270o8870
9854A769105l02731K14470p8185j04591L70772j38024J95392q1555J83614j10184
9844A918083j52941j75663k0676J08838r3267N72579O8052l62625L2603L4779
9834A929762N55859m0666j65955j35594P7141m24590j64757O72215j83273n2563
9824B067579j63979l2015l1810K23958J90043r9133M86238l21509m8731K04049
9814B474690k7654q9598l96040P06422l07279J52494L35275m09076l65063L45140
$$ plain form
9804 2419311 2681944 2650276 2822388 3054894 3138241 2859773 2390987 2907836 3247163 3414268
9794 3414268 3273408 3107112 3236414 3403288 3022482 3319903 3711000 3526005 3637384 4007168
9784 4007168 3937403 4002346 4360002 4497406 4453322 3938098 3749888 4463811 5056308 5005051
9774 5005051 5119835 5533239 5436783 5555228 5558712 5252332 5360440 5115709 4901772 4782570
9764 4782570 4730017 5057203 4830569 4761323 4924111 4522999 4569979 5286603 5868311 6045936
9754 6045936 6354263 6039458 5710844 5628874 5882908 6098676 5975065 6012363 6352551 6785430
9744 6785430 6629635 6369021 6697451 6945647 7161176 6529462 6453682 6321308 6439900 6747376
9734 6747376 6854303 7052748 6828257 7322635 7726479 8088841 7862233 7485931 7482005 7171356
$$ packed form
9804B419311K62633l1668J72112K32506Q3347k78468m68786N16849L39327J67105
9794C414268j40860j66296J29302J66874l80806K97421L91097j84995J11379L69784
9784D007168o9765O4943L57656J37404m4084n15224j88210P13923N92497n1257
9774E005051J14784M13404r6456J18445L484l06380J08108k44731k13937j19202
9764D782570n2553L27186k26634o9246J62788m01112M6980P16624N81708J77625
9754F045936L08327l14805l28614q1970K54034K15768j23611L7298L40188M32879
9744F785430j55795k60614L28430K48196K15529o31714p5780j32374J18592L07476
9734F747376J06927J98445k24491M94378M03844L62362k26608l76302l926l10649
$$ plain form
9724 7171356 6577752 6213591 6129740 6555422 6665891 6309097 6552396 6845285 7140271 6852685
9714 6852685 6954069 7416739 7220785 7370797 7357471 7279753 7061715 7554405 7463928 7527226
9704 7527226 8293288 8040344 7857190 7874415 8004911 8131854 8196190 8548536 9099748 9323447
9694 9323447 9579935 10074177 10239740 10039779 9847324 10292922 10677599 10802457 11282816 11172731
9684 11172731 10868226 11627142 12456933 12602531 13003790 13003228 13433891 13820285 14210236 14382350
9674 14382350 14567781 14640026 14984853 15164835 15053302 15042941 14812141 15748917 15754787 15468147
9664 15468147 15810939 15940245 16676384 17091646 17241354 17706471 17949650 18240654 18508253
9655 18508253 18320658 18542333 19012698 19633998 20037798 20129699 20311968 20781049 21242341 22030092
$$ packed form
9724G171356n93604l64161q3851M25682J10469l56794K43299K92889K94986k87586
9714F852685J01384M62670j95954J50012j3326p7718k18038M92690r0477O3298
9704G527226P66062k52944j83154J7225J30496J26943O4336L52346N51212K23699
9694I323447K56488M94242J65563j99961j92455M45598L84677J24858M80359j10085
9684A1172731l04505P58916Q29791J45598M01259n62M30663L86394L89951J72114
9674A4382350J85431P2245L44827J79982j11533j0361k30800R36776N870k86640
9664A5468147L42792J29306P36139M15262J49708M65117K43179K91004K67599
9655A8508253j87595K21675M70365O21300M03800R1901J82269M69081M61292P87751
$$ plain form
9645 22030092 22489279 22955196 23295889 23768934 24172348 24369185 25084336 25843806 26525621
9636 26525621 27480383 28701267 28927101 30053227 31236122 31659094 32703828 33759166 34064108
9627 34064108 35147670 36060470 36994211 37980454 39374314 41273711 42863532 43784317 44778914
9618 44778914 46425796 47958608 49128693 51048226 53036051 54773378 56675393 58444161
9610 58444161 60824692 63280347 65495064 68086525 71067570 74035829 77544276 81518879
9602 81518879 85900194 90750699 96335370 102716036 109935381 118139514 128650382 140659716
9594 140659716 154987593 172588533 193882882 220324956 250490014 283730276 317532992
9587 317532992 347443365 369568416 381088611 382781034 378455946 373608973 371633852 373629022
$$ packed form
9645B2030092M59187M65917L40693M73045M03414J96837P15151P59470O81815
9636B6525621R54762J220884K25834J126126J182895M22972J044734J055338L04942
9627C4064108J083562R12800R33741R86243J393860J899397J589821R20785R94597
9618D4778914J646882J532812J170085J919533J987825J737327J902015J768768
9610E8444161K380531K455655K214717K591461K981045K968259L508447L974603
9602H1518879M381315M850505N584671O380666P219345Q204133J0510868J2009334
9594A40659716J4327877J7600940K1294349K6442074L0165058L3240262L3802716
9587C17532992K9910373K2125051J1520195J692423m325088m846973j975121J995170
$$ plain form
9579 373629022 377590166 378115704 371671498 354585557 327471557 293308550 257027643 222694882
9571 222694882 192853187 168577030 148951598 133469189 121310568 111315246 102714919
9564 102714919 95832835 89515435 84579642 80422967 76634957 73662478 70632553 67318481
9556 67318481 64816132 62119580 59022385 56583328 54182579 52198328 50468566 48396871
9548 48396871 47227749 45423463 43076339 41494843 39500297 37200097 35579280 34238095
9540 34238095 33139507 32095176 31414363 30390217 29428732 28746933 28153998 27984790 27682287
9531 27682287 27321769 27397586 27639525 28119959 28193367 28206227 28380575 28281679 27988964 27100188
9521 27100188 27496525 27173738 26478686 26191020 25828496 25210772 24497667 23406292 22124362
$$ packed form
9579C73629022L961144N25538o444206j7085941k7114000l4163007l6280907l4332761
9571B22694882k9841695k4276157j9625432j5482409j2158621r995322q600327
9564A02714919o882084o317400m935793m156675l788010k972479l029925l314072
9556F7318481k502349k696552l097195k439057k400749j984251j729762k071695
9548D8396871j169122j804286k347124j581496j994546k300200j620817j341185
9540C4238095j098588j044331o80813j024146r61485o81799n92935j69208l02503
9531B7682287l60518P5817K41939M80434P3408J2860J74348r8896k92715q88776
9521B7100188L96337l22787o95052k87666l62524o17724p13105j091375j281930
$$ plain form
9512 22124362 21785661 21334330 21139139 20714768 20039383 20153566 20116450 19905395 20001960 19905252
9502 19905252 20229459 21009816 20899960 20984800 21831259 22557786 23823267 25066943 25447483
9493 25447483 27002989 28971768 31166564 34115921 37683058 41752101 47096382 51636623
9485 51636623 54846123 56762912 57100948 56244987 54909849 54807730 55335633 55380607 54332120
9476 54332120 52145269 47434189 42031239 36583790 32601691 28487273 25167969 23084951
9468 23084951 21817232 20116025 18117426 17568714 16853563 16147558 15067220 14397502 13977227
9459 13977227 13455423 12985653 12815560 12335178 12015549 11740878 11220721 10941241 10601403
9450 10601403 10204461 9698241 9399747 9563485 8904763 8938584 8863637 8001107 7865301 7762372
$$ packed form
9512B2124362l38701m51331j95191m24371o75385J14183l7116k11055R6565r6708
9502A9905252L24207P80357j09856Q4840Q46459P26527J265481J243676L80540
9493B5447483J555506J968779K194796K949357L567137M069043N344281M540241
9485E1636623L209500J916789L38036q55961j335138j02119N27903M4974j048487
9476E4332120k186851m711080n402950n447449l982099m114418l319304k083018
9468B3084951j267719j701207j998599n48712p15151p06005j080338o69718m20275
9459A3977227n21804m69770j70093m80382l19629k74671n20157k79480l39838
9450A0601403l96942n06220k98494J63738o58722L3821p4947q62530j35806j02929
$$ plain form
9440 7762372 7480260 7434638 7558463 6713775 6884821 6489689 6638678 6597708 6151250 6354500
9430 6354500 6310242 6302137 5471072 5488961 5908954 6210000 6084163 6084692 6289431 6662467 6599289
9419 6599289 6064699 6295667 6597746 6467324 6604823 6739426 6687900 6151200 5996452 5594279
9409 5594279 5554033 5487749 5252428 5177118 5507548 5528133 5885215 5922778 6219928 6036376
9399 6036376 5488618 5569858 5605051 5252429 4883636 4935031 4610428 4759254 4277570 3874428
9389 3874428 4454005 4604870 4193370 4428579 4498705 4448856 4462059 5045651 5097987 5235704
9379 5235704 5162214 4734465 4436458 4475273 4729589 4887012 4852847 5153553 5659644 5110035
9369 5110035 4916861 5152233 4942653 4314245 3976849 3690167 3635877 3925335 4004764 3888077
$$ packed form
9440G762372k82112m5622J23825q44688J71046l95132J48989m0970m46458K03250
9430F354500m4258q105q31065J7889M19993L01046j25837N29K04739L73036o3178
9419F599289n34590K30968L02079j30422J37499J34603n1526n36700j54748m02173
9409E594279m0246o6284k35321p5310L30430K0585L57082L7563K97150j83552
9399F036376n47758Q1240L5193l52622l68793N1395l24603J48826m81684m03142
9389C874428N79577J50865m11500K35209P0126m9849J3203N83592N2336J37717
9379E235704p3490m27749k98007L8815K54316J57423l4165L00706N06091n49609
9369E110035j93174K35372k09580o28408l37396k86682n4290K89458P9429j16687
$$ plain form
9359 3888077 4105596 4220887 4155871 4318441 4112301 4646381 4478909 4361208 4056245 4280554
9349 4280554 4463065 4483433 4537546 5183329 5313317 5069606 4988138 4865374 5097536 4987199
9339 4987199 5418118 5355468 5456089 5982064 6107730 6076199 6029182 5877629 6258491 7072004
9329 7072004 7501977 7893040 8092788 7734962 7646710 7161193 6862658 6499448 6855810 7220288
9319 7220288 7536224 7557690 7689137 8202314 8240387 8548962 8888938 9017490 9254353 9755680
9309 9755680 10192836 10911231 10768872 10950464 10952789 10524261 10290501 10297358 9576124 8845253
9299 8845253 9178608 8674343 8374999 8194516 7969609 8303221 8767338 8944015 8821475 9082643
9289 9082643 9317859 9798592 10492174 10619932 10506545 11180103 12129147 12038317 11889405 11545855
$$ packed form
9359C888077K17519J15291o5016J62570k06140N34080j67472j17701l04963K24309
9349D280554J82511K0368N4113O45783J29988k43711q1468j22764K32162j10337
9339D987199M30919o2650J00621N25975J25666l1531m7017j51553L80862Q13513
9329G072004M29973L91063J99748l57826q8252m85517k98535l63210L56362L64478
9319G220288L15936K1466J31447N13177L8073L08575L39976J28552K36863N01327
9309I755680M37156P18395j42359J81592K325m28528k33760O857p21234p30871
9299H845253L33355n04265k99344j80483k24907L33612M64117J76677j22540K61168
9289I082643K35216M80733O93582J27758j13387O73558R49044r0830j48912l43550
$$ plain form
9279 11545855 11429984 11294740 11410885 11569865 11078257 11308200 11039266 10620537 10391345
9270 10391345 10310481 10322210 10209184 10171849 10257607 10052692 10182831 10485256 10747620 10865135
9260 10865135 10879888 11067525 10692439 11166750 11801514 12461669 12460755 12574555 13087839 13808513
9250 13808513 13722608 14386334 15097295 15652493 16917650 17410692 18249536 19361755 20188331
9241 20188331 21204640 22100184 23861147 26155415 27843318 30003470 33010648 36813697
9233 36813697 42165308 48537074 54915150 58495756 58013723 54760472 51834061 50304829
9225 50304829 51119172 53340018 54790753 53940814 49738622 43691214 37200375 31909588
9217 31909588 28549258 26261714 23926978 22110168 21345882 20388490 19293581 18877756 18203487
$$ packed form
9279A1545855j15871j35244J16145J58980m91608K29943k68934m18729k29192
9270A0391345q0864J1729j13026l7335Q5758k04915J30139L02425K62364J17515
9260A0865135J4753J87637l75086M74311O34764O60155r14J13800N13284P20674
9250A3808513q5905O63726P10961N55198J265157M93042Q38844J112219Q26576
9241B0188331J016309Q95544J760963K294268J687903K160152L007178L803049
9233C6813697N351611O371766O378076L580606m82033l253251k926411j529232
9225E0304829Q14343K220846J450735q49939m202192o047408o490839n290787
9217C1909588l360330k287544k334736j816810p64286r57392j094909m15825o74269
$$ plain form
9208 18203487 17794821 17467776 17222164 16849750 16555851 16505769 16541429 16567626 16982417 17321240
9198 17321240 17901435 18328925 18684857 18525694 18410346 17812678 16947802 16485285 16485797 16477070
9188 16477070 16785720 16807475 16067629 14839375 13848506 12884344 11994924 12006793 11118929 10749472
9178 10749472 11072429 10768900 10887805 11143782 10565422 10215485 9413103 9553460 9631441 9956802
9168 9956802 9822280 9639510 9515127 9112071 9382525 9716193 9953420 9787886 10274344 10205903
9158 10205903 10138617 9981865 9992946 10113543 9990919 10011364 10052545 9966795 9856944 10072547
9148 10072547 10333478 10712984 10973399 11244735 11513144 11210687 11610411 11653599 11937595 12130090
9138 12130090 11925076 12165033 12003823 12093482 12571773 12763958 13233397 13194331 13256645 13372625
$$ packed form
9208A8203487m08666l27045k45612l72414k93899n0082L5660K6197M14791L38823
9198A7321240N80195M27490L55932j59163j15348n97668q64876m62517N12q727
9188A6477070L08650K1755p39846j228254r90869r64162q89420J1869q87864l69457
9178A0749472L22957l03529J18905K55977n78360l49937q02382J40357P7981L25361
9168I956802j34522j82770j24383m03056K70454L33668K37227j65534M86458o8441
9158A0205903o7286j56752J1081J20597j22624K0445M1181q5750j09851K15603
9148A0072547K60931L79506K60415K71336K68409l02457L99724M3188K83996J92495
9138A2130090k05014K39957j61210Q9659M78291J92185M69439l9066O2314J15980
$$ plain form
9128 13372625 13916113 14155858 14260684 14412739 14449055 14051733 13844950 15057379 15308080
9119 15308080 15149765 15212460 15348171 15724860 16303497 16715435 16793705 17088971 17467714 17627730
9109 17627730 17991580 18852435 19182906 19283999 19344178 19478046 20253777 21080171 21269569 21258438
9099 21258438 21629882 21854593 22208032 23087599 23697035 24073165 24096807 25241427 25687828
9090 25687828 26071654 26398583 27015095 27800734 28399963 29597758 30555613 31277846 32104184
9081 32104184 33069996 33612313 34141893 34570083 35367919 36178082 37786281 38620433 39655625
9072 39655625 40575939 41282922 42019073 42962662 43978640 45178242 46019988 47375527 49625542
9063 49625542 51487354 53364954 55501256 57398354 60652545 63843199 67431096 71881957
$$ packed form
9128A3372625N43488K39745J04826J52055L6316l97322k06783J212429K50701
9119A5308080j58315O2695J35711L76689N78637M11938P8270K95266L78743J60016
9109A7627730L63850Q60855L30471J01093O0179J33868P75731Q26394J89398j1131
9099B1258438L71444K24711L53439Q79567O09436L76130K3642J144620M46401
9090B5687828L83826L26929O16512P85639N99229J197795R57855P22233Q26338
9081C2104184R65812N42317N29580M28190P97836Q10163J608199Q34152J035192
9072C9655625R20314P06983P36151R43589J015978J199602Q41746J355539K250015
9063D9625542J861812J877600K136302J897098L254191L190654L587897M450861
$$ plain form
9055 71881957 77612343 84191103 92115012 101458370 112611283 126435782 142705995 160480740
9047 160480740 175072257 181570064 179172929 172678637 167540758 165096986 166887964 173037993
9039 173037993 180563269 184302146 180011179 167247850 151372563 137427429 126255083
9032 126255083 117755878 110871228 105339018 101333554 98842714 97256881 96311334 96327176
9024 96327176 96713180 97515148 99070465 102052660 105606384 109516025 114373490 120715501
9016 120715501 128078178 137738135 149852537 165168439 184133623 206487973 233480677
9009 233480677 262764562 287982869 299097316 293781744 279710378 266309126 259091747
9002 259091747 259925239 267978497 279689442 284298541 273758521 248061258 216914702 186998442
$$ packed form
9055G1881957N730386O578760P923909R343358J1152913J3824499J6270213J7774745
9047A60480740J4591517O497807k397135o494292n137879k443772J790978O150029
9039A73037993P525276L738877m290967j2763329j5875287j3945134j1172346
9032A26255083q499205o884650n532210m005464k490840j585833r45547J5842
9024I6327176L86004Q01968J555317K982195L553724L909641M857465O342011
9016A20715501P362677R659957J2114402J5315902J8965184K2354350K6992704
9009B33480677K9283885K5218307J1114447n315572j4071366j3401252p217379
9002B59091747Q33492Q053258J1710945M609099j0540020k5697263l1146556k9916260
$$ plain form
8994 186998442 162607428 143991346 128993081 116860131 107528321 99575284 93574726
8987 93574726 87950117 83169261 79140074 75446642 72621633 70140943 67930326 65621350
8979 65621350 63941314 62471807 60969181 59408419 58079686 56779380 56135473 55391167
8971 55391167 54560385 54037725 53857475 53771252 53374195 52901853 52222562 52229360 51618008 51113281
8961 51113281 51149652 51233190 51496203 51339576 51600099 51592737 52303420 52530614 53027671 54091997
8951 54091997 54367696 54887135 56005837 56978931 58238819 59634846 60810989 61874222 63387865
8942 63387865 65274059 67093975 68922250 70873355 73648602 76737781 80594784 84246073
8934 84246073 88448243 93879452 100347058 108645834 118202454 130464448 145909712 163210362
$$ packed form
8994A86998442k4391014j8616082j4998265j2132950r331810p953037o000558
8987I3574726n624609m780856m029187l693432k825009k480690k210617k308976
8979F5621350j680036j469507j502626j560762j328733j300306o43907p44306
8971E5391167q30782n22660j80250q6223l97057m72342o79291O798o11352n04727
8961E1113281L6371Q3538K63013j56627K60523p362P10683K27194M97057J064326
8951E4091997K75699N19439J118702R73094J259888J396027J176143J063233J513643
8942F3387865J886194J819916J828275J951105K775247L089179L857003L651289
8934H4246073M202170N431209O467606Q298776R556620J2261994J5445264J7300650
$$ plain form
8926 163210362 176991132 180036860 173691726 164344651 158817893 157655157 160405344 167728189
8918 167728189 179088141 194619647 214969799 241118446 273741872 312886047 353911953
8911 353911953 387204120 403747363 399952700 375360240 335241374 289610473 247120641
8904 247120641 211994845 184435018 163560439 147316322 134473419 123875360 115189558
8897 115189558 109114378 103551060 99191470 95666633 92453765 89647516 88198316 86273574
8889 86273574 85190025 84466529 84145162 84863093 86310570 87739637 89894625 92593882 96438731
8880 96438731 101094461 107611293 116543596 127496790 141814070 159366606 180278357 202438225
8872 202438225 221432897 230853671 228885482 215055095 192465604 165701331 140548140
$$ packed form
8926A63210362J3780770L045728o345134r347075n526758j162736K750187P322845
8918A67728189J1359952J5531506K0350152K6148647L2623426L9144175M1025906
8911C53911953L3292167J6543243l794663k4592460m0118866m5630901m2489832
8904B47120641l5125796k7559827k0874579j6244117j2842903j0598059q685802
8897A15189558o075180n563318m359590l524837l212868k806249j449200j924742
8889H6273574j083549p23496l21367P17931J447477J429067K154988K699257L844849
8880I6438731M655730O516832Q932303J0953194J4317280J7552536K0911751K2159868
8872B02438225J8994672R420774j968189j3830387k2589491k6764273k5153191
$$ plain form
8865 140548140 119679835 103819504 91634155 81876515 73686663 67137204 61744691 57301493
8857 57301493 53609370 50166137 47216582 44861280 42471773 40687987 38841415 37117642
8849 37117642 35856831 34552207 33217478 32185866 30657277 29327882 28525396 27190684
8841 27190684 25261354 23928976 23719729 22871564 22161282 21576283 20903334 20059809 19168330
8832 19168330 18442674 18576793 18472907 17858363 16885722 16155464 16133513 15516432 15140911 14831755
8822 14831755 14575390 13922747 13150753 13228487 12401598 11982918 11954702 11821724 11327572 10906800
8812 10906800 10610353 10662312 10827389 10239233 9772460 9934790 9483008 9246109 8869330 8719977
8802 8719977 8550512 8416644 8456670 8317039 8075219 8369453 8153079 7714402 7569145 7470476
$$ packed form
8865A40548140k0868305j5860331j2185349r757640q189852o549459n392513m443198
8857E7301493l692123l443233k949555k355302k389507j783786j846572j723773
8849C7117642j260811j304624j334729j031612j528589j329395q02486j334712
8841B7190684j929330j332378k09247q48165p10282n84999o72949q43525q91479
8832A9168330p25656J34119j03886o14544r72641p30258k1951o17081l75521l09156
8822A4831755k56365o52643p71994P7734q26889m18680k8216j32978m94152m20772
8812A0906800k96447N1959J65077n88156m66773J62330m51782k36899l76779j49353
8802H719977j69465j33868M0026j39631k41820K94234k16374m38677j45257r8669
$$ plain form
8792 7470476 7328162 7181497 7462874 7301846 7180336 7015208 6575699 6226135 6280830 6124530
8782 6124530 6063289 5589699 5558295 5921933 6444113 6181071 6437058 6348509 6039247 5891498
8772 5891498 5474210 5285681 5228373 5488630 5292334 5137461 5226214 5342873 5250156 5373181
8762 5373181 5033593 4632422 4689319 4423010 4332636 4452543 4647303 4458756 4259393 3784846
8752 3784846 3920188 4345777 4036040 3681414 3992612 4124798 4118144 3924630 3995907 3667509
8742 3667509 3308660 3070866 3104135 3391611 3693327 3617392 3096938 3300123 3387699 3489917
8732 3489917 3117538 3178485 3422146 3304929 3299625 3401677 3380746 3655501 3087678 3006381
8722 3006381 2970230 3226636 3029750 3051215 3477467 3110078 2717132 2443657 2110924 2036419
$$ packed form
8792G470476j42314j46665K81377j61028j21510j65128m39509l49564N4695j56300
8782F124530o1241m73590l1404L63638N22180k63042K55987q8549l09262j47749
8772E891498m17288j88529n7308K60257j96296j54873Q8753J16659r2717J23025
8762E373181l39588m01171N6897k66309r0374J19907J94760j88547j99363m74547
8752C784846J35342M25589l09737l54626L11198J32186o654j93514P1277l28398
8742C667509l58849k37794L3269K87476L01716p5935n20454K03185Q7576J02218
8732C489917l72379O0947K43661j17217n304J02052k0931K74755n67823q1297
8722C006381l6151K56406j96886K1465M26252l67389l92946k73475l32733p4505
$$ plain form
8712 2036419 2692394 2392435 2236377 2571615 2840359 2788757 2606946 2662543 2603918 2233292
8702 2233292 1885716 1957051 2308338 2438273 2346686 1770305 2282898 2470026 2582001 2468561
8692 2468561 2672772 2404137 2019915 2121556 2387183 2373803 2000193 2322256 2273701 2375255
8682 2375255 2022346 2012122 2428676 2336652 2475114 2088588 1939621 2163421 2354756 2635231
8672 2635231 2699819 3032794 2907907 2942746 3501518 3554851 3298450 3017619 2841230 2645619
8662 2645619 2764768 3111611 2934882 2849286 2734973 3049051 2857906 2364215 2531437 2705847
8652 2705847 2433649 1938484 2040517 2664488 2439376 2087152 2116190 2462900 2232860 1838753
8642 1838753 1896971 2045866 2209694 2069507 2112916 2425491 2243206 2075309 1505077 2010661
$$ packed form
8712B036419O55975k99959j56058L35238K68744n1602j81811N5597n8625l70626
8702B233292l47576P1335L51287J29935r1587n76381N12593J87128J11975j13440
8692B468561K04211k68635l84222J01641K65627j3380l73610L22063m8555J01554
8682B375255l52909j0224M16554r2024J38462l86526j48967K23800J91335K80475
8672B635231O4588L32975j24887L4839N58772N3333k56401k80831j76389j95611
8662B645619J19149L46843j76729q5596j14313L14078j91145m93691J67222J74410
8652B705847k72198m95165J02033O23971k25112l52224K9038L46710k30040l94107
8642A838753N8218J48895J63828j40187M3409L12575j82285j67897n70232N05584
$$ plain form
8632 2010661 2462382 2104533 2245261 2295770 2388536 2312227 2296536 2493368 2165340 2169371 2433438
8621 2433438 2228615 2073098 2001777 1843808 2034190 1856418 1898566 1574280 1502186 1256462
8611 1256462 1554363 1588716 1109775 1589276 1443908 1246659 1224403 1422569 1723854 1088810
8601 1088810 633756 1441365 1287251 1368070 903628 1036640 1042550 1339923 1276133 1175100
8591 1175100 1300140 1099180 1102209 952871 1527652 1364815 871605 814096 726073 792656
8581 792656 1148438 1183421 760683 815992 416204 816224 1320800 712706 1009122 1170593
8571 1170593 1152573 1226702 1213170 1071930 1130958 1190051 1144414 684728 738015 803485 1007490
8560 1007490 1007474 1379380 1122686 1002978 1499325 1469886 1549108 1102230 1392634 1191593 1517301
$$ packed form
8632B010661M51721l57849J40728N0509R2766p6309j5691J96832l28028M031K64067
8621B433438k04823j55517p1321j57969J90382j77772M2148l24286p2094k45724
8611A256462K97901L4353m78941M79501j45368j97249k2256J98166L01285o35044
8601A088810m55054Q07609j54114Q0819m64442J33012N910K97373o3790j01033
8591A175100J25040k00960L029j49338N74781j62837m93210n7509q8023O6583
8581G92656L55782L4983m22738N5309l99788M00020N04576o08094K96416J61471
8571A170593j8020P4129j3532j41240N9028N9093m5637m59686N3287O5470K04005
8560A007490j6L71906k56694j19708M96347k9439P9222m46878K90404k01041L25708
$$ plain form
8549 1517301 1770688 1571149 1420015 1560259 2083090 2135943 2036564 2320836 2740472 2677398
8539 2677398 2432012 2011348 1445351 1535236 1803840 1429177 1264841 587501 876597 1150229
8529 1150229 1254738 1451839 1482144 1389529 1491573 1349670 1215495 1163437 1225419 1079492
8519 1079492 831245 1151279 1169976 1803055 1966762 1558375 990944 871704 1507468 1723609
8509 1723609 1224611 1355857 1847650 1745087 1780403 2120699 1970251 2142477 2211356 1862427
8499 1862427 1824990 2049515 1444167 926704 913258 738027 975239 1109465 874361 640627
8489 640627 561622 437392 530139 904085 936312 1166175 865819 392197 749572 693023
8479 693023 349318 487305 637516 890950 909243 1090881 943599 975182 561339 615396
$$ packed form
8549A517301K53387j99539j51134J40244N22831N2853r9379K84272M19636o3074
8539B677398k45386m20664n65997Q9885K68604l74663j64336o77340K89096K73632
8529A150229J04509J97101L0305r2615J02044j41903j34175n2058O1982j45927
8519A079492k48247L20034J8697O33079J63707m08387n67431j19240O35764K16141
8509A723609m98998J31246M91793j02563L5316L40296j50448J72226O8879l48929
8499A862427l7437K24525o05348n17463j3446j75231K37212J34226k35104k33734
8489F40627p9005j24230R2747L73946L2227K29863l00356m73622L57375n6549
8479F93023l43705J37987J50211K53434J8293J81638j47282L1583m13843N4057
$$ plain form
8469 615396 477800 638676 1022657 596008 383279 677353 639580 326811 443077 985440
8459 985440 484922 384642 323007 247446 589402 1118497 609516 364027 676450 522509
8449 522509 548058 801058 923567 575315 698409 760602 793949 379042 860514 1063979
8439 1063979 799268 472899 758923 567132 531278 515467 212927 -197015 71458 279644
8429 279644 587878 638615 601655 450887 198721 253516 385033 -45798 159347 481508
8419 481508 56468 -8711 36493 380800 442313 276470 4740 -320808 135622 292421
8409 292421 177247 114406 -20769 -172372 -271122 -448504 -550755 52388 -52900 -341721
8399 -341721 -420881 -484099 -209868 -65895 156512 75609 25482 -282561 116541 559689
$$ packed form
8469F15396j37596J60876L83981m26649k12729K94074l7773l12769J16266N42363
8459I85440n00518j00280o1635p5561L41956N29095n08981k45489L12423j53941
8449E22509K5549K53000J22509l48252J23094O2193L3347m14907M81472K03465
8439A063979k64711l26369K86024j91791l5854j5811l02540m09942K68473K08186
8429B79644L08234N0737l6960j50768k52166N4795J31517m30831K05145L22161
8419D81508m25040o5179M5204L44307O1513j65843k71730l25548M56430J56799
8409B92421j15174o2841j35175j51603r8750j77382j02251O03143j05288k88821
8399c41721p9160o3218K74231J43973K22407q0903n0127l08043L99102M43148
$$ plain form
8389 559689 262670 192305 342546 -96442 -388397 -76575 -2156 -68118 214882 171572
8379 171572 181845 609440 396482 55640 483039 -61447 -2533 -127929 -2842 132064
8369 132064 93288 -12313 -47317 388373 413331 53134 -231558 143106 157596 363712
8359 363712 300436 25377 254035 482577 246278 230079 640487 913069 553204 373842
8349 373842 297341 501189 60400 182448 373920 500930 575003 402964 -36394 206889
8339 206889 244941 253759 752837 1101647 884347 196067 555974 528930 203710 145617 41692
8328 41692 104356 173759 65775 -452988 -5047 372682 280466 266095 271769 -128728 73603
8317 73603 117853 -186307 -516880 -431803 -347224 -74153 35080 217310 22757 -11441 23901
$$ packed form
8389E59689k97019p0365J50241m38988k91955L11822P4419o5962K83000m3310
8379A71572J0273M27595k12958l40842M27399n44486N8914j25396J25087J34906
8369A32064l8776j05601l5004M35690K4958l60197k84692L74664J4490K06116
8359C63712o3276k75059K28658K28542k36299j6199M10408K72582l59865j79362
8349C73842p6501K03848m40789J22048J91472J27010P4073j72039m39358K43283
8339B06889L8052Q818M99078L48810k17300o88280L59907k7044l25220n8093j03925
8328D1692O2664O9403j07984n18763M47941L77729r2216j4371N674m00497K02331
8317G3603M4250l04160l30573Q5077Q4579K73071J09233J82230j94553l4198L5342
$$ plain form
8306 23901 29120 315228 -137126 -386005 -190785 -2641 236793 -198517 -196147 -259219 -247573
8295 -247573 -28230 70686 399222 606830 450701 489971 667896 190515 15706 -132535
8285 -132535 175912 271403 161263 -91718 88811 185795 153173 250517 -60222 -170501
8275 -170501 331856 257589 -112655 133914 460440 758682 453541 51816 -241152 -308583
8265 -308583 -67644 349413 149497 10672 -39643 -341764 122122 506525 458888 156288
8255 156288 -128076 71024 110544 158669 290052 51641 103735 24818 412757 234629
8245 234629 140514 -60210 -65511 -243363 -220939 198422 -116079 -413962 1257 -243200
8235 -243200 -95472 213910 533148 260906 86662 410219 387062 646466 783949 97537
$$ packed form
8306B3901N219K86108m52354k48879J95220J88144K39434m35310K370o3072J1646
8295b47573K19343R8916L28536K07608j56129L9270J77925m77381j74809j48241
8285a32535L08447R5491j10140k52981J80529R6984l2622R7344l10739j10279
8275a70501N02357p4267l70244K46569L26526K98242l05141m01725k92968o7431
8265c08583K40939M17057j99916j38825n0315l02121M63886L84403m7637l02600
8255A56288k84364J99100L9520M8125J31383k38411N2094p8917L87939j78128
8245B34629r4115k00724n301j77852K2424M19361l14501k97883M15219k44457
8235b43200J47728L09382L19238k72242j74244L23557k3157K59404J37483o86412
$$ plain form
8225 97537 67959 -142645 -410598 -46889 -85325 -432524 -330872 -304143 -337191 -173603 110651
8214 110651 15318 267467 377809 144721 332949 155292 83368 -181372 70162 -38572
8204 -38572 -180638 -230484 -285263 -453965 -608674 -795032 -458899 -1039985 -747754 -937908
8194 -937908 -1557131 -2761765 -170643 2398602 1583208 990379 293006 529080 217234
8185 217234 492021 380492 245058 56381 159058 -178364 -80314 -211695 -225991 -283485
8175 -283485 -115744 362652 711543 704581 814014 568147 271503 64079 191991 186958
8165 186958 56068 261078 248492 -81308 -177518 10337 -4090 357156 175461 573568
8155 573568 83791 -21814 447323 985812 262923 -272860 230274 317266 -179240 -213307
$$ packed form
8225I7537k9578k10604k67953L63709l8436l47199J01652K6729l3048J63588K84254
8214A10651r5333K52149J10342k33088J88228j77657p1924k64740K51534j08734
8204c8572j42066m9846n4779j68702j54709j86358L36133n81086K92231j90154
8194i37908o19223j204634K591122K569245q15394n92829o97373K36074l11846
8185B17234K74787j11529j35434j88677J02677l37422R8050j31381j4296n7494
8175b83485J67741M78396L48891o962J09433k45867k96644k07424J27912n033
8165A86958j30890K05010j2586l29800r6210J87855j4427L61246j81695L98107
8155E73568m89777j05605M69137N38489p22889n35783N03134Q6992m96506l4067
$$ plain form
8145 -213307 271077 -179154 16866 -146711 18051 -248152 18394 99406 410079 738513
8135 738513 66358 61534 8452 395441 522660 204487 68310 381221 236812 14458
8125 14458 417025 773159 681869 396652 101547 51033 -88746 -464615 -281274 30872
8115 30872 222681 116118 -60483 49086 -1856 -100868 34277 -516183 -468882 113731
8105 113731 528867 -98883 -341616 357221 451686 -180445 -511628 53727 -241983 -550994
8095 -550994 -486883 -359842 -182516 151114 -360303 -109551 221974 563451 234651 391824
8085 391824 218031 -100574 -271119 77313 -27935 -43357 -408825 -381619 -514481 -171318
8075 -171318 -97013 -90492 -199345 -303891 -6860 63506 239021 -137244 345464 -101564
$$ packed form
8145b13307M84384m50231J96020j63577J64762k66203K66546Q1012L10673L28434
8135G38513o72155m824n3082L86989J27219l18173j36177L12911j44409k22354
8125A4458M02567L56134r1290k85217k95105n0514j39779l75869J83341L12146
8115C0872J91809j06563j76601J09569n0942r9012J35145n50460M7301N82613
8105A13731M15136o27750k42733O98837R4465o32131l31183N65355k95710l09011
8095e50994O4111J27041J77326L33630n11417K50752L31525L41477l28800J57173
8085C91824j73793l18605j70545L48432j05248j5422l65468K7206j32862L43163
8075a71318P4305O521j08853j04546K97031P0366J75515l76265M82708m47028
$$ plain form
8065 -101564 -143750 -293618 -499926 95716 196038 -416497 -358016 -103716 -452042 -406861
8055 -406861 197141 121947 -497266 -733742 -626812 -46243 152253 -167956 173065 115549
8045 115549 -231351 -259793 -525344 -294812 397784 -51246 -288702 -511932 -603141 -624480
8035 -624480 -440035 -243824 -347057 -447960 -466971 -320913 -260369 -345955 -65602 2951
8025 2951 109882 -142500 -69887 -113214 -558589 -166805 101008 71502 47235 -93225 159613
8014 159613 111381 -309558 93788 156856 -116637 134223 -25425 44337 -20197 177220
8004 177220 423880 409872 414333 337693 -113107 -296572 38960 21030 -480509 3769 194182
7993 194182 289561 107212 -29406 -153382 181436 -623 76132 -197790 206451 433389
$$ packed form
8065a01564m2186j49868k06308N95642J00322o12535N8481K54300l48326M5181
8055d06861O04002p5194o19213k36476J06930N80569J98496l20209L41021n7516
8045A15549l46900k8442k65551K30532O92596m49030k37456k23230r1209k1339
8035f24480J84445J96211j03233j00903j9011J46058O0544q5586K80353O8553
8025B951J06931k52382P2613m3327m45375L91784K67813k9506k4267j40460K52838
8014A59613m8232m20939M03346O3068k73493K50860j59648O9762o4534J97417
8004A77220K46660j4008M461p6640m50800j83465L35532j7930n01539M84278J90413
7993A94182R5379j82349j36618j23976L34818j82059P6755k73922M04241K26938
$$ plain form
7983 433389 285810 265922 -208234 -394933 -75333 17065 -340996 -277119 -101045 237755
7973 237755 -263937 -157175 11392 -134876 184373 -329964 -311103 249494 25024 -569965
7963 -569965 -331149 73877 -856524 -715134 -505971 -241739 -312969 56258 24590 217322
7953 217322 -248274 -666244 -360181 -309227 -348290 -259036 53748 -90912 -184707 279288
7943 279288 181041 569596 493325 321885 -26808 365687 578495 18094 92817 32994
7933 32994 -396787 -901447 -548868 -347008 -779107 -462637 -81873 -310972 -358101 -348434
7923 -348434 -453086 -319805 171360 580987 260737 291577 226173 30125 -80071 -657091
7913 -657091 -427986 74227 -138272 -751019 -1038936 -832532 -538831 -9346 97684 -12648
$$ packed form
7983D33389j47579j9888m74156j86699L19600R2398l58061O3877J76074L38800
7973B37755n01692J06762J68567j46268L19249n14337J8861N60597k24470n94989
7963e69965K38816M05026r30401J41390K09163K64232p1230L69227l1668J92732
7953B17322m65596m17970L06063N0954l9063Q9254L12784j44660r3795M63995
7943B79288r8247L88555p6271j71440l48693L92495K12808n60401P4723n9823
7933C2994m29781n04660L52579K01860m32099L16470L80764k29099m7129R667
7923c48434j04652J33281M91165M09627l20250L0840o5404j96048j10196n77020
7913f57091K29105N02213k12499o12747k87917K06404K93701N29485J07030j10332
$$ plain form
7903 -12648 -386203 -34757 231386 280756 240397 270818 259106 5316 -679402 -593399 -167229
7892 -167229 373147 606098 123773 -91239 -651767 -513633 -374343 84747 340520 267771
7882 267771 7683 -246015 -400621 -372209 -114015 -437444 -710495 -192218 113608 123509
7872 123509 -40257 -363927 -371021 -137274 261064 538846 4699 -72103 -358908 -650184
7862 -650184 -559149 -480159 -600274 -359476 -199107 -91753 -254435 15250 -78512 46379
7852 46379 -115426 -398315 -301654 -349170 -365257 -57666 -362425 -370384 -520421 -241255 -83929
7841 -83929 -267288 229385 131448 445931 235914 -61377 208980 -53285 -146117 -7082
7831 -7082 -86343 -138877 -547035 -195210 28600 -4591 -218110 -157189 49482 -257623 -339185
$$ packed form
7903a2648l73555L51446K66143M9370m0359L0421j1712k53790o84718Q6003M26170
7892a67229N40376K32951m82325k15012n60528J38134J39290M59090K55773p2749
7882B67771k60088k53698j54606K8412K58194l23429k73051N18277L05826R901
7872A23509j63766l23670p094K33747L98338K77782n34147p6802k86805k91276
7862f50184R1035P8990j20115K40798J60369J07354j62682K69685r3762J24891
7852D6379j61805k82889R6661m7516j6087L07591l04759p959j50037K79166J57326
7841h3929j83359M96673r7937L14483k10017k97291K70357k62265r2832J39035
7831g082p9261n2534m08158L51825K23810l3191k13519O0921K06671l07105q1562
$$ plain form
7820 -339185 241937 382800 62896 -211687 -375811 -123832 -391726 -469029 89630 158017
7810 158017 -448969 -585377 681310 1116586 602005 149240 199883 253650 63913 -59368
7800 -59368 -38186 140150 155319 -131667 64097 35073 -95808 -466799 -391003 148662 342528
7789 342528 60092 4783 84085 182376 470639 12767 -272707 -302946 -724532 -412590
7779 -412590 269067 -279580 -314350 -91367 29651 39576 208644 106828 172165 28394
7769 28394 42836 -299478 -229558 -576254 -876521 13779 37087 -351782 -124264 132040
7759 132040 -162274 -689298 -569171 213773 -18206 -394585 82912 103558 -80675 11608
7749 11608 -130377 -413055 -314973 142174 474079 281768 -182825 -385361 -620796 -488671
$$ packed form
7820c39185N81122J40863l19904k74583j64124K51979k67894p7303N58659O8387
7810A58017o06986j36408J266687M35276n14581m52765N0643N3767j89737j23281
7800e9368K1182J78336J5169k86986J95764k9024j30881l70991P5796N39665J93866
7789C42528k82436n5309P9302R8291K88263m57872k85474l0239m21586L11942
7779d12590O81657n48647l4770K22983J21018R925J69068j01816O5337j43771
7769B8394J4442l42314O9920l46696l00267Q90300K3308l88869K27518K56304
7759A32040k94314n27024J20127P82944k31979l76379M77497K0646j84233R2283
7749A1608j41985k82678R8082M57147L31905j92311m64593k02536k35435J32125
$$ plain form
7739 -488671 13492 55206 -386963 -423222 -183662 249979 170879 92902 54125 -95879 152399
7728 152399 9599 -487736 -560590 -543149 -48903 62158 -157043 -122945 -26628 -490292
7718 -490292 -293341 -47625 24569 128721 200492 56611 105214 -124266 11782 -230942
7708 -230942 -512995 -200309 -312674 -124862 -144745 -88518 -91756 -404529 -186878 377780
7698 377780 71583 428360 463390 -27741 85195 144035 -40970 -92776 164561 136180
7688 136180 -65534 107882 -170186 71065 320006 -588 -29880 197992 83136 472166
7678 472166 -22263 -256475 -97093 -62345 178198 -196877 186973 259631 724254 516887
7668 516887 284553 266341 203436 324323 -48533 -148786 -298385 103623 -233908 -95332
$$ packed form
7739d88671N02163M1714m42169l6259K39560M33641p9100p7977l8777j50004K48278
7728A52399j42800m97335p2854J7441M94246J11061k19201L4098R6317m63664
7718d90292J96951K45716P2194J04152P1771j43881M8603k29480J36048k42724
7708b30942k82053L12686j12365J87812j9883N6227l238l12773K17651N64658
7698C77780l06197L56777L5030m91131J12936N8840j85005n1806K57337k8381
7688A36180k01714J73416k78068K41251K48941l20594k9292K27872j14856L89030
7678D72166m94429k34212J59382L4748K40543l75075L83850P2658M64623k07367
7668E16887k32334j8212o2905J20887l72856j00253j49599M02008l37531J38576
$$ plain form
7658 -95332 -224112 -485853 -106540 -103133 6147 122979 483260 360120 501174 180042
7648 180042 -123836 -457534 -589250 -233644 39250 -439578 -515074 -143945 -387333 -374479
7638 -374479 -333176 -73393 -333591 100462 -34285 329042 442286 164830 237202 -71075
7628 -71075 -665018 -719750 -434165 -289053 210678 353167 344980 81681 -40581 -134933 -33693
7617 -33693 -270748 -154090 31226 -409048 -437041 -312883 -267630 -269946 -396132 102591 99569
7606 99569 377191 245146 -62184 -152978 239590 -124966 -628009 -329734 -542006 -1016525
7596 -1016525 -793659 -266612 -374032 -218723 50527 321597 298249 45590 -269533 -389815
7586 -389815 -147004 -28677 249146 158941 311677 305887 186702 135576 13053 -142632
$$ packed form
7658i5332j28780k61741L79313L407J09280J16832L60281j23140J41054l21132
7648A80042l03878l33698j31716L55606K72894m78828p5496L71129k43388J2854
7638c74479M1303K59783k60198M34053j34747L63327J13244k77456P2372l08277
7628g1075n93943n4732K85585J45112M99731J42489q187k63299j22262r4352J01240
7617c3693k37055J16658J85316m40274k7993J24158M5253k316j26186M98723l022
7606I9569K77622j32045l07330r0794L92568l64556n03043K98275k12272m74519
7596a016525K22866N27047j07420J55309K69250K71070k3348k52659l15123j20282
7586c89815K42811J18327K77823r0205J52736n790j19185n1126j22523j55685
$$ plain form
7576 -142632 -166236 -293857 -438633 121821 -241593 -367257 -343530 -213803 -176305 -208388
7566 -208388 -184370 -287295 -35659 -61488 -244573 -571010 -367957 -508112 -642577 -115162
7556 -115162 95567 -218531 -296205 73703 -22121 711279 362565 -69736 -305733 -576369
7546 -576369 -217631 436725 276395 368391 -138536 -486495 30540 38201 217296 -248888
7536 -248888 -166971 -59120 -73465 75792 -39622 256890 101067 -244304 -132677 167458
7526 167458 173584 83446 -339983 -439267 -1653 20007 -65652 -169065 30677 4790 -484135
7515 -484135 -138638 535214 169400 110867 -246977 30537 -122065 -138115 22058 -66758
7505 -66758 -66277 -100348 -486498 -390617 -486849 -510436 -363286 -479381 -141145 -310503 26733
$$ packed form
7576a42632k3604j27621j44776N60454l63414j25664K3727J29727L7498l2083
7566b08388K4018j02925K51636k5829j83085l26437K03053j40155j34465N27415
7556a15162K10729l14098p7674L69908r5824P33400l48714m32301k35997k70636
7546e76369L58738O54356j60330R1996n06927l47959N17035P661J79095m66184
7536b48888Q1917J07851j4345J49257j15414K96512j55823l45371J11627L00135
7526A67458O126r0138m23429r9284M37614K1660q5659j03413J99742k5887m88925
7515d84135L45497O73852l65814n8533l57844K77514j52602j6050J60173q8816
7505f6758M81l4071l86150R5881r6232k3587J47150j16095L38236j69358L37236
$$ plain form
7494 26733 55925 -32829 -180178 -223731 63936 366065 50727 152850 213920 -144674 -290111
7483 -290111 -363850 -359803 -59820 -87121 -208379 9743 126494 235750 54613 -312168
7473 -312168 -302975 -455118 -265790 -153385 -350870 -454316 -302337 89234 179621 119591
7463 119591 -287063 -229083 -619780 -385914 -53906 -145306 -274113 -395026 -77930 27446
7453 27446 24085 -345430 -157812 118673 119291 218019 211582 100909 -214267 -201360 -150385 -247465
7441 -247465 -328668 -361060 -413393 -436226 -237697 261496 226271 -247090 -94942 186308 6962
7430 6962 -264713 -70233 -447819 -218605 616592 655619 185264 133187 132117 -226850 -367972
7419 -367972 -607890 -485633 -62891 336324 225254 -320427 -692978 -202058 129898 89749
$$ packed form
7494B6733K9192q8754j47349m3553K87667L02129l15338J02123O1070l58594j45437
7483b90111p3739M047K99983k7301j21258K18122J16751J09256j81137l66781
7473c12168R193j52143J89328J12405j97485j03446J51979L91571R0387o0030
7463A19591m06654N7980l90697K33866L32008r1400j28807j20913L17096J05376
7453B7446l361l69515J87618K76485O18R8728o437j10673l15176J2907N0975r7080
7441b47465q1203l2392n2333k2833J98529M99193l5225m73361J52148K81250j79346
7430F962k71675J94480l77586K29214Q35197L9027m70355n2077j070l58967j41122
7419c67972k39918J22257M22742L99215j11070n45681l72551M90920L31956m0149
$$ plain form
7409 89749 -168801 -262170 -246930 -559311 -577360 -15653 -23698 -44359 246490 285990 -159690
7398 -159690 81701 95477 127774 18081 -189461 -69569 -194268 184854 353894 24455
7388 24455 430255 345506 276377 74218 -127868 -72405 -112498 -112331 174552 172987 79633 -218772
7376 -218772 -697467 -626662 -225999 33139 -220178 -298168 -85335 96301 -419904 -230881
7366 -230881 -657922 -225094 -68155 -144309 -644839 -524013 -181777 185703 392516 323276
7356 323276 574939 178710 43135 541406 2321 -531918 -90478 -366425 -207666 126973
7346 126973 245828 62644 -268557 -46524 308872 368179 291071 -38348 -26722 -159540
7336 -159540 58858 -164465 -208421 169906 -252879 -22230 131489 -15400 -300256 15925
$$ packed form
7409H9749k58550r3369J5240l12381j8049N61707q045k0661K90849L9500m45680
7398a59690K41391J3776L2297j09693k07542J19892j24699L79122J69040l29439
7388B4455M05800q4749o9129k02159k02086N5463m0093J67K86883j565r3354k98405
7376b18772m78695P0805M00663K59138k53317p7990K12833J81636n16205J89023
7366b30881m27041M32828J56939p6154n00530J20826L42236L67480K06813o9240
7356C23276K51663l96229j35575M98271n39085n34239M41440k75947J58759L34639
7346A26973J18855j83184l31201K22033L55396N9307p7108l29419J1626j32818
7336a59540K18398k23323m3956L78327m22785K30649J53719j46889k84856L16181
$$ plain form
7326 15925 -368812 -252686 -115128 -470937 -454120 -359164 -218536 -532927 -135015 -67770
7316 -67770 -543745 -182944 202882 282576 -38834 -18161 462511 153363 -174919 -258649
7306 -258649 167856 242708 -108559 87722 -194565 -37184 -212754 -60917 11933 234027
7296 234027 301040 360376 335765 -539296 -635293 -424767 -452245 -461952 -566332 -664660 -356121
7285 -356121 -24859 101940 -142852 -4466 -140512 70345 -122894 -354422 -147973 -1161
7275 -1161 239425 577496 356852 -87533 234991 399441 285987 531483 244690 2136
7265 2136 -240965 -441383 -557039 -263915 -240906 -4958 224047 115697 -152377 -271944
7255 -271944 -173031 -215772 -39278 183579 -96049 -137533 -585433 -605649 -636099 -218703 -45980
$$ packed form
7326A5925l84737J16126J37558l55809J6817R4956J40628l14391L97912O7245
7316f7770m75975L60801L85826P9694l21410K0673M80672l09148l28282q3730
7306b58649M26505P4852l51267J96281k82287J57381j75570J51837P2850K22094
7296B34027O7013N9336k4611q75061r5997K10526k7478r707j04380r8328L08539
7285c56121L31262J26799k44792J38386j36046K10857j93239k31528K06449J46812
7275a161K40586L38071k20644m44385L22524J64450j13454K45496k86793k42554
7265B136k43101k00418j15656K93124K3009K35948K29005j08350k68074j19567
7255b71944R8913m2741J76494K22857k79628m1484m47900k0216l0450M17396J72723
$$ plain form
7244 -45980 -213481 -257199 -43907 172223 78239 161927 26218 -237920 -101629 -161441 -325214
7233 -325214 128411 -73007 196254 139526 183383 219949 130508 -177459 -466590 -799920
7223 -799920 -372757 -408917 -505289 -872488 -792586 -260056 -189134 -201618 -132159 -167730 12540
7212 12540 -195391 -509333 -167511 -368954 -592943 -193074 156377 343325 248524 43275
7202 43275 -298019 -579582 -112981 5646 197392 233995 399336 -39650 -291693 -10888
7192 -10888 -188658 -176080 -49206 276667 216976 325974 170800 210240 234722 299149 137728
7181 137728 -504525 -409477 127835 390194 -300635 -422508 -537846 -507816 -282853 -608201
7171 -608201 -837117 48375 -153994 -530038 -252170 -16003 -7872 -110459 -455523 -89502
$$ packed form
7244d5980j67501m3718K13292K16130r3984Q3688j35709k64138J36291n9812j63773
7233c25214M53625k01418K69261n6728M3857L6566q9441l07967k89131l33330
7223g99920M27163l6160r6372l67199P9902N32530P0922j2484O9459l5571J80270
7212A2540k07931l13942L41822k01443k23989L99869L49451J86948r4801k05249
7202D3275l41294k81563M66601J18627J91746L6603J65341m38986k52043K80805
7192a0888j77770J2578J26874L25873n9691J08998j55174L9440K4482O4427j61421
7181A37728o42253R5048N37312K62359o90829j21873j15338L0030K24963l25348
7171f08201k28916Q85492k02369l76044K77868K36167Q131j02587l45064L66021
$$ plain form
7161 -89502 -135787 -257818 -350357 -449877 39575 -166890 160227 245220 -131874 35570 223775
7150 223775 222790 369921 346306 554421 448499 -23979 -151212 45225 194688 -181391
7140 -181391 34453 -268976 -416869 -93329 40926 -171266 -262558 -315074 -356404 103425
7130 103425 105239 244248 -181091 54352 138467 -251017 -527143 -134754 134644 -310011
7120 -310011 -380467 293738 173400 118521 -315350 -145038 -484433 -904069 -495441 -716879
7110 -716879 -601670 -412994 -191376 -194756 -390281 -64649 127931 -164300 -23409 -669692
7100 -669692 -587914 -236393 -37332 329541 177249 97946 -199839 52739 -296064 -440116
7090 -440116 -303884 -201580 -448912 47678 374355 -251182 -231014 34405 -423547 -755697
$$ packed form
7161h9502m6285j22031r2539r9520M89452k06465L27117Q4993l77094J67444J88205
7150B23775r85J47131k3615K08115j05922m72478j27233J96437J49463l76079
7140a81391K15844l03429j47893L23540J34255k12192r1292n2516m1330M59829
7130A03425J814J39009m25339K35443Q4115l89484k76126L92389K69398m44655
7120c10011p0456O74205j20338n4879m33871J70312l39395m19636M08628k21438
7110g16879J15209J88676K21618l380j95525L25632J92580k92231J40891o46283
7100f69692Q1778L51521J99061L66873j52292p9303k97785K52578l48803j44052
7090d40116J36232J02304k47332M96590L26677o25537K0168K65419m57952l32150
$$ plain form
7080 -755697 -202525 217080 -47903 48800 -68330 82844 182600 -8262 24749 18318 122082
7069 122082 65600 58226 -21395 -61221 -196753 -415319 -209126 -58071 -315933 -143807 -46219
7058 -46219 174155 218117 -201059 217981 471751 278462 202957 -200205 -23692 201052
7048 201052 413501 245719 167201 -154010 -243824 -441618 -239452 -102862 176998 -134526
7038 -134526 -216119 125249 -23471 27562 -51901 108593 23601 2060 -241177 -245020 -326719
7027 -326719 -178102 -5035 -370118 71398 -91410 -206570 -266879 -430336 -231772 -186450
7017 -186450 132911 249254 161014 92258 -43835 159505 -170878 -294944 -419143 -456443
7007 -456443 -411122 -46935 418258 286992 56603 77918 76435 199408 -42939 -28908 -267375
$$ packed form
7080g55697N53172M19605k64983R6703j17130J51174R9756j90862L3011o431J03764
7069A22082n6482p374p9621l9826j35532k18566K06193J51055k57862J72126R7588
7058d6219K20374M3962m19176M19040K53770j93289p5505m03162J76513K24744
7048B01052K12449j67782p8518l21211q9814j97794K02166J36590K79860l11524
7038a34526q1593L41368j48720N1033p9463J60494q4992k1541k43237l843q1699
7027c26719J48617J73067l65083M41516j62808j15160o0309j63457J98564M5322
7017a86450L19361J16343q8240o8756j36093K03340l30383j24066j24199l7300
7007d56443M5321L64187M65193j31266k30389K1315j483J22973k42347J4031k38467
$$ plain form
6996 -267375 -176503 -258636 -628840 -198806 -456299 -398587 -353627 -316704 -74875 38767 -209949
6985 -209949 -17418 -184536 -220562 -57347 30266 -187412 -558338 -115912 82135 279502
6975 279502 -125260 -237506 -307204 -60555 348713 165234 301876 86027 -61632 402505
6965 402505 385673 55657 -318602 13114 12865 -412917 -275599 -34162 -219404 -30820
6955 -30820 544032 195717 -154363 362506 758750 672625 450998 627412 699273 998592
6945 998592 1196969 1126749 1081137 772774 888380 306541 495045 482048 332882 292576
6935 292576 176970 168835 14077 -119387 -3996 245012 246058 -110244 -240142 -293769 -168749
6924 -168749 -474045 22749 153187 147600 -190113 -26893 -130158 -231480 -195360 89930
$$ packed form
6996b67375R0872q2133l70204M30034k57493N7712M4960L6923K41829J13642k48716
6985b09949J92531j67118l6026J63215Q7613k17678l70926M42426J98047J97367
6975B79502m04762j12246o9698K46649M09268j83479J36642k15849j47659M64137
6965D02505j6832l30016l74259L31716k49m25782J37318K41437j85242J88584
6955c0820N74852l48315l50080N16869L96244q6125k21627J76414P1861K99319
6945I98592J98377p0220m5612l08363J15606n81839J88504j2997j49166m0306
6935B92576j15606q135j54758j33464J15391K49008J046l56302j29898n3627J25020
6924a68749l05296M96794J30438n587l37713J63220j03265j01322L6120K85290
$$ plain form
6914 89930 -25224 -332102 -86926 397424 525292 -57407 44582 423306 339362 104083
6904 104083 -113217 35550 -9516 -388634 -157975 -64995 25346 17114 -134714 101146 -61314
6893 -61314 -233225 -736195 -369248 40889 -190139 -55696 -723775 -592430 -327452 -470372
6883 -470372 -374999 -156041 -232737 35244 130019 -116943 -134371 306418 444214 91330
6873 91330 -394181 -82638 10423 121484 -334754 -237488 -264075 -359423 -315733 -102797 -275911
6862 -275911 -216709 -169702 -275948 -132499 -59714 200394 34090 -281500 -283938 154322 367499
6851 367499 57921 -148466 -195060 -228877 -60440 -90675 -270329 -246694 -603645 -303597
6841 -303597 -43218 -178500 -155742 -218022 -83140 -72885 5253 -260387 63806 -48811
$$ packed form
6914H9930j15154l06878K45176M84350J27868n82699J01989L78724q3944k35279
6904A04083k17300J48767m5066l79118K30659R2980R0341q232j51828K35860j62460
6893f1314j71911n02970L66947M10137k31028J34443o68079J31345K64978j42920
6883d70372R5373K18958p6696K67981R4775k46962j7428M40789J37796l52884
6873I1330m85511L11543R3061J11061m56238R7266k6587r5348M3690K12936j73114
6862b75911N9202M7007j06246J43449P2785K60108j66304l15590k438M38260K13177
6851C67499l09578k06387m6594l3817J68437l0235j79654K3635l56951L00048
6841c03597K60379j35282K2758o2280J34882J0255P8138k65640L24193j12617
$$ plain form
6831 -48811 -103956 -155851 295989 24608 -146939 -347998 -357162 -363690 -48008 357043 -369864
6820 -369864 -268779 -100724 -155775 -150287 176077 33619 -483017 -521265 -70598 -144008 12844
6809 12844 438507 435995 325700 38993 5475 -37323 347132 274540 -46105 508109 -200259
6798 -200259 -679241 -597015 -371102 -319477 -102708 284785 193703 64884 119328 166878 -63551
6787 -63551 -120513 -168816 -272655 -351731 -613250 -275310 -511412 -157989 74217 32277 53515
6776 53515 234625 262021 -143805 -194856 -207570 -313764 -80517 69832 -356884 -579085
6766 -579085 -607903 -4694 -113301 -278275 -20551 -40163 20335 125964 -517581 -966682
6756 -966682 -577534 -234453 -254011 103543 310025 88741 -22803 -357586 -604614 -331925
$$ packed form
6831d8811n5145n1895M51840k71381j71547k01059r164o528L15682M05051p26907
6820c69864J01085J68055n5051N488L26364j42458n16636l8248M50667p3410J56852
6809A2844M25663k512j10295k86707l3518m2798L84455p2592l20645N54214p08368
6798b00259m78982Q2226K25913N1625K16769L87493r1082j28819N4444M7550k30429
6787f3551n6962m8303j03839p9076k61519L37940k36102L53423K32206m1940K1238
6776E3515J81110K7396m05826n1051j2714j06194K33247J50349m26716k22201
6766e79085k8818O03209j08607j64974K57724j9612O0498J05629o43545m49101
6756i66682L89148L43081j9558L57554K06482k21284j11544l34783k47028K72689
$$ plain form
6746 -331925 -356479 -433181 -9963 173748 -184225 -228171 -315834 -528013 -503859 17090 101174
6735 101174 197590 -267004 -106582 -168790 -303309 73546 -70177 -12114 82390 65222 16496
6724 16496 241507 122657 -85019 -86950 -62564 -221721 -391354 -406300 -97230 -442726 -441061
6713 -441061 90104 -155966 -273849 -195237 -333249 -131726 135549 107174 -379805 -694695
6703 -694695 -592872 -938957 -897958 -258976 -578204 -721697 -83339 -84776 157920 30038
6693 30038 -540120 -565590 221115 80482 -125870 -154610 -18577 -75343 -757919 -671402 -243472
6682 -243472 -365166 27660 -62088 -383159 -176908 176912 99163 -40112 -34787 -160381
6672 -160381 -272934 -305664 -187999 -296547 -140634 -345523 -274303 -50878 49572 -223852
$$ packed form
6746c31925k4554p6702M23218J83711l57973m3946q7663k12179K4154N20949Q4084
6735A01174R6416m64594J60422o2208j34519L76855j43723N8063R4504j7168m8726
6724A6496K25011j18850k07676j931K4386j59157j69633j4946L09070l45496J665
6713d41061N31165k46070j17883P8612j38012K01523K67275k8375m86979l14890
6703f94695J01823l46085M0999O38982l19228j43493O38358j437K42696j27882
6693C0038n70158k5470P86705j40633k06352k8740J36033n6766o82576Q6517M27930
6682b43472j21694L92826q9748l21071K06251L53820p7749j39275N325j25594
6672a60381j12553l2730J17665j08548J55913k04889P1220K23425J00450k73424
$$ plain form
6662 -223852 -255909 -404784 -151920 226740 -24703 -87583 209748 -94269 131278 447788
6652 447788 64882 -118058 -162107 164138 -288575 -450783 -188564 -271625 -444128 -363917
$$ packed form
6662b23852l2057j48875K52864L78660k51443o2880K97331l04017K25547L16510
6652D47788l82906j82940m4049L26245m52713j62208K62219q3061j72503Q0211
$$ [...]
##END NTUPLES=NMR SPECTRUM
##END=
