##TITLE=1H_CA-9245-1
 CDCl3
 8sc, 
 16.2.2024
##JCAMPDX= 6.0         $$ Bruker NMR JCAMP-DX V2.0
##DATA TYPE= NMR SPECTRUM
##DATA CLASS= NTUPLES
##ORIGIN= UXNMR, Bruker Analytische Messtechnik GmbH
##OWNER= root
$$ XWIN-NMR		Version 3.5
$$ Fri Feb 16 14:35:25 2024 Russian Standard Time (UT+4h)  she@DPX200
##.OBSERVE FREQUENCY= 200.1313
##.OBSERVE NUCLEUS= ^1H
##.ACQUISITION MODE= SIMULTANEOUS
##.ACQUISITION SCHEME= undefined
##.AVERAGES= 8
##.DIGITISER RES= 18
##SPECTROMETER/DATA SYSTEM= spect
##.PULSE SEQUENCE= zg30
##.SOLVENT NAME= DMSO
##.SHIFT REFERENCE= (INTERNAL, DMSO, 0, 15.5816)
##AUDIT TRAIL= $$ (NUMBER, WHEN, WHO, WHERE, WHAT)
$$ ##TITLE= Audit trail, XWIN-NMR		Version 3.5
$$ ##JCAMPDX= 5.01
$$ ##ORIGIN= Bruker BioSpin GmbH
$$ ##OWNER= she
$$ F:/spectra/data/she/nmr/H-F/1/pdata/1/auditp.txt
$$ ##AUDIT TRAIL=  $$ (NUMBER, WHEN, WHO, WHERE, WHAT)
(   1,<2024-02-16 14:34:17.31 +0400>,<she>,<DPX200>,
      <created by zg, POWCHK disabled, PULCHK disabled
       configuration hash MD5:
       00 E9 B6 7A A2 85 ED C7 34 08 36 98 17 FE 4E 26
       data hash MD5: 16K
       2B 75 38 7C 5A F0 82 A9 E6 52 DD A4 90 A3 BF 16>)
(   2,<2024-02-16 14:34:19.46 +0400>,<she>,<DPX200>,
      <Start of raw data processing
       efp BC_mod = 2 LB = 0.24 FT_mod = 6 PKNL = 1 PHC0 = -24958.6 PHC1 = 11.25264 SI = 16K 
       data hash MD5: 16K
       7F 02 5B D4 1F C7 67 E0 03 1F 1F 13 E8 BD 1B BA>)
(   3,<2024-02-16 14:34:33.06 +0400>,<she>,<DPX200>,
      <pk PHC0 = 0.4079591 PHC1 = -3.4 
       data hash MD5: 16K
       44 07 ED 38 1F 61 C3 C5 5A 1D 33 57 56 11 75 1B>)
(   4,<2024-02-16 14:34:37.07 +0400>,<she>,<DPX200>,
      <abs ABSG = 5 
       data hash MD5: 16K
       EE 95 58 8A 7D 9B A9 52 9C 54 36 AD 62 B3 09 70>)
$$ ##END=
$$ 
$$ hash MD5
$$ 1E 61 C8 2C 05 4E 2D E8 5A 90 C4 BC 39 68 2F B5
##$RELAX= 
##$RELAX= 
##$RELAX= 
##$RELAX= 
##$RELAX= 
##$RELAX= 
$$ Bruker specific parameters
$$ --------------------------
##$DU= <F:/spectra>
##$EXPNO= 1
##$NAME= <H-F>
##$PROCNO= 1
##$TYPE= <nmr>
##$USER= <she>
##$AMP= (0..31)
100 100 100 100 100 100 100 100 100 100 100 100 100 100 100 100 100 100 
100 100 100 100 100 100 100 100 100 100 100 100 100 100 
##$AQSEQ= 0
##$AQ_mod= 1
##$AUNM= <au_zg>
##$AUTOPOS= <>
##$BF1= 200.13
##$BF2= 200.13
##$BF3= 200.13
##$BF4= 200.13
##$BF5= 200.13
##$BF6= 200.13
##$BF7= 200.13
##$BF8= 200.13
##$BYTORDA= 1
##$CFDGTYP= 0
##$CFRGTYP= 5
##$CHEMSTR= <none>
##$CNST= (0..31)
1 1 145 1 1 1 1 1 1 1 1 1 1 1 1 1 1 1 1 1 1 1 1 1 1 1 1 1 1 1 1 1 
##$CPDPRG= <>
##$CPDPRG1= <>
##$CPDPRG2= <>
##$CPDPRG3= <>
##$CPDPRG4= <mlev>
##$CPDPRG5= <mlev>
##$CPDPRG6= <mlev>
##$CPDPRG7= <mlev>
##$CPDPRG8= <mlev>
##$CPDPRGB= <>
##$CPDPRGT= <>
##$D= (0..31)
0 1.2 0 0 0 0 0 0 0 0.06 0 0.03 0 0 0 0 0.0002 0 0 0 0 0 0 0 0 0 0 0 0 
0 0 0 
##$DATE= 1708079656
##$DBL= (0..7)
120 120 120 120 120 120 120 120 
##$DBP= (0..7)
150 150 150 150 150 150 150 150 
##$DBP07= 0
##$DBPNAM0= <>
##$DBPNAM1= <>
##$DBPNAM2= <>
##$DBPNAM3= <>
##$DBPNAM4= <>
##$DBPNAM5= <>
$$ [...]
##$SUBNAM3= <"">
##$SUBNAM4= <"">
##$SUBNAM5= <"">
##$SUBNAM6= <"">
##$SUBNAM7= <"">
##$SUBNAM8= <"">
##$SUBNAM9= <"">
##$SW= 18.0517328524113
##$SWIBOX= (0..15)
0 0 2 0 0 0 0 0 0 0 0 0 0 0 0 0 
##$SW_h= 3612.71676300578
##$TD= 16384
##$TD0= 1
##$TE= 0
##$TE2= 300
##$TE3= 300
##$TEG= 300
##$TL= (0..7)
0 120 120 120 120 120 120 120 
##$TP= (0..7)
150 150 150 150 150 150 150 150 
##$TP07= 0
##$TPNAME0= <>
##$TPNAME1= <>
##$TPNAME2= <>
##$TPNAME3= <>
##$TPNAME4= <>
##$TPNAME5= <>
##$TPNAME6= <>
##$TPNAME7= <>
##$TPOAL= (0..7)
0.5 0.5 0.5 0.5 0.5 0.5 0.5 0.5 
##$TPOFFS= (0..7)
0 0 0 0 0 0 0 0 
##$TUNHIN= 0
##$TUNHOUT= 0
##$TUNXOUT= 0
##$USERA1= <user>
##$USERA2= <user>
##$USERA3= <user>
##$USERA4= <user>
##$USERA5= <user>
##$V9= 5
##$VALIST= <valist>
##$VCLIST= <CCCCCCCCCCCCCCC>
##$VD= 0
##$VDLIST= <DDDDDDDDDDDDDDD>
##$VPLIST= <PPPPPPPPPPPPPPP>
##$VTLIST= <TTTTTTTTTTTTTTT>
##$WBST= 1024
##$WBSW= 4
##$XGAIN= (0..3)
0 0 0 0 
##$XL= 0
##$YL= 0
##$YMAX_a= 113954
##$YMIN_a= -173350
##$ZGOPTNS= <>
##$ZL1= 120
##$ZL2= 120
##$ZL3= 120
##$ZL4= 120
##$ABSF1= 15.57942
##$ABSF2= -2.472431
##$ABSG= 5
##$ABSL= 3
##$ALPHA= 0
##$AQORDER= 0
##$ASSFAC= 0
##$ASSFACI= 0
##$ASSFACX= 0
##$ASSWID= 0
##$AUNMP= <proc_1d>
##$AZFE= 0.1
##$AZFW= 0.1
##$BCFW= 0
##$BC_mod= 2
##$BYTORDP= 0
##$COROFFS= 0
##$CY= -3
##$DATMOD= 1
##$DC= 0
##$DFILT= <>
##$DTYPP= 0
##$F1P= 0
##$F2P= 0
##$FCOR= 1
##$FTSIZE= 16384
##$FT_mod= 6
##$GAMMA= 0
##$GB= 0
##$INTBC= 1
##$INTSCL= 3.70164e-10
##$ISEN= 128
##$LB= 0.24
##$LEV0= 0
##$LPBIN= 0
##$MAXI= 10000
##$MC2= 0
##$MEAN= 0
##$ME_mod= 0
##$MI= 1.114404
##$NCOEF= 0
##$NC_proc= -8
##$NLEV= 6
##$NOISF1= 3.799351
##$NOISF2= 2.8
##$NSP= 0
##$NTH_PI= 0
##$NZP= 0
##$OFFSET= 15.58162
##$PC= 1
##$PHC0= -24958.19
##$PHC1= 7.85264
##$PH_mod= 1
##$PKNL= yes
##$PPARMOD= 0
##$PSCAL= 0
##$PSIGN= 0
##$REVERSE= no
##$SF= 200.129988009318
##$SI= 16384
##$SIGF1= 3
##$SIGF2= 2
##$SINO= 5.538805
##$SIOLD= 16384
##$SREGLST= <1H.CDCl3>
##$SSB= 0
##$STSI= 16384
##$STSR= 0
##$SW_p= 3612.71676300578
##$SYMM= 0
##$S_DEV= 0
##$TDeff= 16384
##$TDoff= 0
##$TI= <>
##$TILT= no
##$TM1= 0
##$TM2= 0
##$TOPLEV= 0
##$USERP1= <user>
##$USERP2= <user>
##$USERP3= <user>
##$USERP4= <user>
##$USERP5= <user>
##$WDW= 1
##$XDIM= 16384
##$YMAX_p= 440248328
##$YMIN_p= -3667120
$$ End of Bruker specific parameters
$$ ---------------------------------
##NTUPLES= NMR SPECTRUM
##VAR_NAME=  FREQUENCY,     SPECTRUM/REAL,   SPECTRUM/IMAG
##SYMBOL=    X,             R,               I
##VAR_TYPE=  INDEPENDENT,   DEPENDENT,       DEPENDENT
##VAR_FORM=  AFFN,          ASDF,            ASDF
##VAR_DIM=   16384,         16384,           16384
##UNITS=     HZ,            ARBITRARY UNITS, ARBITRARY UNITS
##FACTOR=    0.220516191357247, 1,           1
##FIRST=     3118.3494670678, 0,             0
##LAST=      -494.36729593798, 0,            0
##MIN=       -494.36729593798, -3667120,     0
##MAX=       3118.3494670678, 440248328,     0
$$ Real data points
##PAGE= N=1
##DATA TABLE= (X++(R..R)), XYDATA
$$ [...]
11795C125366k2194l71484K63550J26855J44585k72605K97215L95536K50507o9101
11785C868230l99074j07625m75903P826O53447J34889K28631n88361P3815j56507
11775C239368l20303L85040J98886O66854m59747J28355J72639j50574M40459
11766D300977J44519l72935n8699M00203l48620M1093J68500l7289J22699J80734
11756D541182N22661P1178n9432L1903M5513m16423l2996J71486J44720J6143
11746E035935J2224L72828K54440O5344L52163J22896m76525n2764J4150J71451
11736E872142M76959K98606R3148j23635K24933J57447L83821l74022L64153J72948
11726G546500o7809n4584j22016L16733L18951J63293j9255j73633N20856k2376
$$ plain form
11795 3125366 3103172 2731688 2995238 3122093 3266678 2994073 3291288 3686824 3937331 3868230
11785 3868230 3469156 3361531 2885628 2893454 3546901 3681790 3910421 3322060 3395875 3239368
11775 3239368 2919065 3304105 3502991 4169845 3710098 3838453 4011092 3860518 4300977
11766 4300977 4445496 4072561 4013862 4414065 4065445 4106538 4275038 4237749 4360448 4541182
11756 4541182 5063843 5135021 5075589 5107492 5153005 4736582 4703586 4875072 5019792 5035935
11746 5035935 5048159 5420987 5675427 5740771 6092934 6215830 5739305 5686541 5700691 5872142
11736 5872142 6349101 6647707 6740855 6617220 6842153 6999600 7383421 7009399 7373552 7546500
11726 7546500 7478691 7424107 7302091 7618824 7937775 8101068 8081813 7908180 8429036 8406660
11716H406660J69098Q16623r1645P9764K55097K59571Q11160l65252K07675L01475
11706A0850226l53689L34093P16866J51705K77958M7401K94302P24451M14756
11697A3458069M4621K49069N42677P0759M12710R07785N10940K92448K93329l47198
11687A6435209k24521K60467Q51915J48679k2626N26859O62176M65507m25700
11678A8677965K18615K00247J66665K53604M11405L70128N58315M45361j87975
11669B1114330N38634L08707M06402K64610j746P23725N57392L00690M76692O67253
11659B5356689P17924L68190j22270M67232J327074J139049K97550L51635J054310
11650C0957383J013136O15610M84542Q25576J380452J351781P97278R53430J186471
$$ plain form
11716 8406660 8575758 9392381 9300736 9380500 9635597 9895168 10706328 10341076 10548751 10850226
11706 10850226 10496537 10830630 11547496 11699201 11977159 12024560 12318862 13043313 13458069
11697 13458069 13502690 13751759 14294436 14365195 14777905 15685690 16196630 16489078 16782407 16435209
11687 16435209 16210688 16471155 17323070 17471749 17449123 17975982 18638158 19103665 18677965
11678 18677965 18896580 19096827 19263492 19517096 19928501 20298629 20856944 21302305 21114330
11669 21114330 21652964 21961671 22368073 22632683 22630937 23354662 23912054 24212744 24689436 25356689
11659 25356689 26074613 26442803 26320533 26787765 28114839 29253888 29551438 29903073 30957383
11650 30957383 31970519 32586129 33070671 33896247 35276699 36628480 37425758 38379188 39565659
11641C9565659J524238J547259J580116J406632K120228J578754J357495J855533
11633E2535914K231199J919134K339020J835620K445065K495117K158767K276802
11625G0236638K523088K394747K051854K163854K332551J946337J379240J329423
11617H6357732J517583J003272N98987R3890k45371j015225j451203j638783k124102
11608H3096780j848690k132184k707798k193151l146831k988179k561433k502746
11600F3015768k614674l025542k645418k023838k053570k187345k125329j940159
11592D4399893j858166k273161j299956j832500j658638j313920j178402r95735
11584C1989415j442391j387571j101008p91459r63288q14556j416010r05674l74712
$$ plain form
11641 39565659 41089897 42637156 44217272 45623904 47744132 49322886 50680381 52535914
11633 52535914 54767113 56686247 59025267 60860887 63305952 65801069 67959836 70236638
11625 70236638 72759726 75154473 77206327 79370181 81702732 83649069 85028309 86357732
11617 86357732 87875315 88878587 89477574 89571464 89326093 88310868 86859665 85220882 83096780
11608 83096780 81248090 79115906 76408108 74214957 71068126 68079947 65518514 63015768
11600 63015768 60401094 57375552 54730134 52706296 50652726 48465381 46340052 44399893
11592 44399893 42541727 40268566 38968610 37136110 35477472 34163552 32985150 31989415
11584 31989415 30547024 29159453 28058445 27266986 26303698 25489142 24073132 23167458 22792746
11575B2792746q77892j019349j093535l16446n09277k81271p67052p23683j51664
11566A7052577p48020k46872o08953l84983j16066o19047l99914m52749k78391
11557A3197582k05014J75252o94468m62456m3627l32039m26500j06930j06155
11548A0995645n45470l18667L46481n75874m43021m09834M99142l50113p43931
11539H454358K63715r3991o0812m97505m37155K54938l79217J39291j08965m16299
11529G118358q6929K03136j50394l76973k9942n8221O0557k53045L45021J39161
11519F910729j44777o54037k90238M79476K83363l55640k31280j78525n10944
11510E308127J15757M48923l99841j83249J16717l64015K09189l13287o3976J65342
$$ plain form
11575 22792746 21914854 20895505 19801970 19485524 18976247 18694976 17927924 17204241 17052577
11566 17052577 16304557 16057685 15448732 15063749 14947683 14328636 13928722 13475973 13197582
11557 13197582 12992568 13167820 12473352 12010896 11967269 11635230 11208730 11101800 10995645
11548 10995645 10450175 10131508 10477989 9902115 9459094 9049260 9548402 9198289 8454358
11539 8454358 8718073 8624082 8563270 8065765 7628610 7883548 7504331 7643622 7534657 7118358
11529 7118358 7031429 7234565 7084171 6707198 6677256 6619035 6679592 6426547 6771568 6910729
11519 6910729 6765952 6111915 5821677 6301153 6584516 6228876 5997596 5819071 5308127
11510 5308127 5423884 5872807 5472966 5289717 5406434 5042419 5251608 4938321 4874345 5039687
11500E039687J39484j52111N0254K02822l64311k9662J37253j18100k93625p9571
11490D532120M24596K5913J75427K42955o8047p1033L25234j72524m02873L2077
11480E043845j57183K78859n984K01311l84790K73281j2733J68214K50424p3434
11470E581810Q2462l19233p5833p076r2838J17142L46218N79349l08505m53324
11460E450172j48577N10599K35266j9133m97133O54103N4195p87018L43374j07056
11450E688792O4120L14579k26423K0212J3709O5913M54633K63270K75982j01491
11440F833296k84171M6540M64651j81990k21586M83152J19202K63574J76568J14663
11430G813899k33501O1545K46794j1254L47949l38803K45706k05389N07612K56900
$$ plain form
11500 5039687 5179171 5027060 5077314 5280136 4915825 4886163 5023416 4905316 4611691 4532120
11490 4532120 4956716 4982629 5158056 5401011 5332964 5261931 5587165 5414641 5011768 5043845
11480 5043845 4886662 5165521 5159537 5360848 4976058 5249339 5236606 5404820 5655244 5581810
11470 5581810 5664272 5345039 5269206 5262130 5169292 5286434 5632652 6212001 5903496 5450172
11460 5450172 5301595 5812194 6047460 6028327 5531194 6185297 6239492 5452474 5795848 5688792
11450 5688792 5752912 6067491 5841068 5861280 5874989 5940902 6395535 6658805 6934787 6833296
11440 6833296 6549125 6595665 7060316 6878326 6656740 7139892 7259094 7522668 7699236 7813899
11430 7813899 7580398 7641943 7888737 7877483 8225432 7886629 8132335 7926946 8434558 8691458
11420H691458j63126k16768L98182M29586J22768l8939K08077R792Q43391K8362
11410A0312783j61530L05498J46785L27972M66570N07421j69485J58423m0837
11401A1853600l43470L49057P30407P15568L60102N3384R74k61857M37084O47750
11391A4542599N65934J3141K65468K34317N92671J73135J10414K24397O92014
11382A7414090K74876Q58395O16239K94163M20271K23179M12349M57080Q19542
11373B1790184J022590J049132O86940N62337P81777O36764K93391J303247J162081
11364B9288443P16654J108044J016320P48402J233755J088775M97618J073872
11356C6771883R58462J227908J393468J221794Q98775J125399M35363N65463Q79544
$$ plain form
11420 8691458 8528332 8311564 8709746 9139332 9262100 9223161 9431238 9441030 10284421 10312783
11410 10312783 10151253 10456751 10603536 10931508 11398078 11905499 11736014 11894437 11853600
11401 11853600 11510130 11859187 12589594 13305162 13665264 13718648 13719622 13457765 13894849 14542599
11391 14542599 15108533 15121674 15387142 15621459 16214130 16387265 16497679 16722076 17414090
11382 17414090 17688966 18547361 19163600 19457763 19878034 20101213 20513562 20970642 21790184
11373 21790184 22812774 23861906 24548846 25111183 25892960 26529724 26823115 28126362 29288443
11364 29288443 30005097 31113141 32129461 32877863 34111618 35200393 35698011 36771883
11356 36771883 37730345 38958253 40351721 41573515 42472290 43597689 44033052 44598515 45478059
11347D5478059P85790K19877l3626l54627l84702m15595m32656n44047j050257
11338D3268216q69291o98190r00730j336224j375927j717258j089032p54341j363210
11329C3164013j623684j144333j450854j020703n97916j289469r06582r48437
11321B4182035j458296r76382r17258p77496o69739k95978k74468j129601r15849
11312A6766968o84821k82558k43415p64903m39752n98600o79355r23484j17252
11303A2032828k16619l07802l94195k31095n83749p7038j65836k56534m01872
11294I398088J9271l52058k47626l34977j52072N8142o97086l84233N5782j19752
11284G243479k38292J11692p98613q4528K0783J9825m98049K80236j5432k80572
$$ plain form
11347 45478059 46263849 46483726 46450100 46095473 45710771 45295176 44862520 44318473 43268216
11338 43268216 42398925 41700735 40800005 39463781 38087854 36370596 35281564 34527223 33164013
11329 33164013 31540329 30395996 28945142 27924439 27326523 26037054 25130472 24182035
11321 24182035 22723739 21747357 20830099 20052603 19382864 19086886 18812418 17682817 16766968
11312 16766968 16082147 15799589 15556174 14791271 14351519 13752919 13073564 12150080 12032828
11303 12032828 11816209 11508407 11114212 10883117 10299368 10222330 10056494 9799960 9398088
11294 9398088 9417359 9065301 8817675 8482698 8330626 8388768 7691682 7307449 7363231 7243479
11284 7243479 7005187 7116879 6318266 6233738 6254521 6274346 5776297 6056533 6041101 5760529
11274E760529k17176m78245k24462L06343j46377k29772j58239p1668j57144R6543
11264D480332L56602n78627j36915J18354J57647n0172n61832k74132J25346q5102
11254C551501k36135K59357R2864l71146r6394j06900L88117N9660J17891p70124
11244B888691j70666L61722O38688k34931l59730m00731J5841J93328l06282m6055
11234B579875K4836k73577L86486K79732m15327J25729m1426k20082l49771m1738
11224B054737m9281R5498J59331j94033Q1843j13958l58527N27029m2238l63088
11214A797313N58912j48027k28575L55668q393k71000r3714M90000J28699k53260
11204B327623k6316k51957N2127j40131m10005K5897p9581K95157l49082l0318
$$ plain form
11274 5760529 5543353 5065108 4840646 5146989 5000612 4770840 4612601 4540933 4383789 4480332
11264 4480332 4836934 4258307 4121392 4239746 4397393 4347221 3785389 3511257 3636603 3551501
11254 3551501 3315366 3574723 3667587 3296441 3200047 3093147 3481264 3540924 3658815 2888691
11244 2888691 2718025 3079747 3718435 3483504 3123774 2723043 2738884 2932212 2625930 2579875
11234 2579875 2604711 2331134 2717620 2997352 2582025 2707754 2666328 2446246 2096475 2054737
11224 2054737 2005456 2100954 2260285 2066252 2148095 2034137 1675610 2202639 2160401 1797313
11214 1797313 2356225 2208198 1979623 2335291 2326898 2055898 1962184 2452184 2580883 2327623
11204 2327623 2301307 2049350 2101477 1961346 1551341 1577238 1497657 1792814 1443732 1413414
11194A413414L61616J67641k93536q9465K50018j15715K21195N5687l08423J35146
11184A797578o4569Q6800k78779J83026j30366j73423k00771j49231k34528K02455
11174A038192L79428j62783L6775L01830K9876m07476k04672L3844J15181L63778
11164A523973M7944j78741J07051J66406j17032R5556k60364K19777J11376m08070
11154A307876m5805J89617k59485j57088N7610M53619N8044j77513J30191j27712
11144A429354J9041J31481N6164n80046L0064O58656L68912l37720l08263K65247
11134A732890K39017K34880j93365q1813K216k70149K64861p8234N35216K27758
11124B613277l27794l37927n42201k09350L18761M2072Q8755K62648j01562k68378
$$ plain form
11194 1413414 1775030 1942671 1649135 1559670 1809688 1693973 1915168 1970855 1662432 1797578
11184 1797578 1733009 1819809 1541030 1724056 1593690 1420267 1219496 1070265 835737 1038192
11174 1038192 1417620 1254837 1291612 1593442 1623318 1215842 1011170 1045014 1160195 1523973
11164 1523973 1571917 1393176 1500227 1666633 1549601 1645157 1384793 1604570 1715946 1307876
11154 1307876 1262071 1451688 1192203 1035115 1092725 1546344 1604388 1426875 1557066 1429354
11144 1429354 1448395 1579876 1636040 1055994 1086058 1744714 2113626 1775906 1467643 1732890
11134 1732890 1971907 2206787 2013422 1931609 1933825 1663676 1928537 1850303 2385519 2613277
11124 2613277 2285483 1947556 1405355 1196005 1514766 1556838 1645593 1908241 1806679 1538301
11114A538301J8849J91337l01651K9010L96179m3102j71980j14205j2159l63908
11104A166671K10599M69864j72880j88549N618k27698K05358M83179L34042l11865
11094A974339K88712K87950j35261j34217K70728J61508l22787k45608J93333
11085B338697N11453k61731K20055K35498p08417N7175Q78j54659M86092K77420
11075C002461j66296L45258o69682j6393O39610j12250l41047L39936O37781j87913
11065C471465J62947L0930K81142j55765J47859M481O4347O3560n695J18964K6720
11054D210955l14534j29579K83487o1575l63104k0387K1644p96416L46744p3605
11044C103630k26961L34600l96853L51079j27549l26359M6682R1517K82052k24568
$$ plain form
11114 1538301 1557150 1748487 1446836 1475846 1872025 1828923 1656943 1542738 1530579 1166671
11104 1166671 1377270 1847134 1674254 1485705 1491323 1263625 1468983 1952162 2286204 1974339
11094 1974339 2263051 2551001 2415740 2281523 2552251 2713759 2390972 2145364 2338697
11085 2338697 2850150 2588419 2808474 3043972 2335555 2392730 2393608 2238949 2725041 3002461
11075 3002461 2836165 3181423 2511741 2495348 3134958 3022708 2681661 3021597 3659378 3471465
11065 3471465 3634412 3665342 3946484 3790719 3938578 3943059 4007406 4070966 4065271 4184235 4210955
11054 4210955 3896421 3766842 4050329 3988754 3625650 3605263 3626907 2830491 3177235 3103630
11044 3103630 2876669 3211269 2814416 3165495 3037946 2711587 2758269 2849786 3131838 2907270
11034B907270n60932k38136j62468J68828j09348j25887N152K71801K22859m58827
11024A920312m4220j70483J28284N8978Q4631o00187K67120P2248k79589l739
11014A433355j80555J39352K46399m54704K1557K95616l05168j87246K01445K05515
11004A415566m99717l0249L19226q9641l01956k98714q2709M14824J32304l99089
10994E79845j32729N41378l04183k6771o0145l03494N10393M75078n39677o0980
10984F78715k81660K61635K44422j49085K69970j9088k86202R8776j67694j96220
10974D53569L25328Q2287K28094k45805k97444J30581L85627l83136j63976M85032
10964A000157K36829l64931r5370j2372K1140K4652q29951P92768j36676O2909
$$ plain form
11034 2907270 2346338 2108202 1945734 2114562 2005214 1879327 1884479 2156280 2379139 1920312
11024 1920312 1876092 1705609 1833893 1892871 1977502 1377315 1644435 1716683 1437094 1433355
11014 1433355 1252800 1392152 1638551 1183847 1205404 1501020 1195852 1008606 1210051 1415566
11004 1415566 915849 885600 1204826 1115185 813229 514515 431806 846630 978934 579845
10994 579845 447116 988494 684311 657540 597395 293901 804294 1279372 739695 678715
10984 678715 397055 658690 903112 754027 1023997 1004909 718707 817483 649789 453569
10974 453569 778897 861184 1089278 843473 546029 676610 1062237 679101 515125 1000157
10964 1000157 1236986 872055 776685 764313 785453 810105 -19846 772922 636246 699155
10954F99155K06571j27399J22166L8329q1132K76780J44248p08758K27965k33713
10944E64212L9191r283K52282o1285m60003k68033j02058M55763N14205j52621
10934G72370P9362J36452o8984l86523l23205j57025J78386N19072j42465m61758
10924A45682L01900P7048k70270R516N83241m21834n24360R0492j85001N30865
10914C37279q54N53262J33388K67460j46588l68605n7633k57083J29090o2495
10904E27221L4677M75548l86583n58463k07191K59077O7007J88651J75689j06052
10894D69581K67430L0479L55658o893n28934K02702l43937K74567K34414j39540
10884H15527l32105m58991M72333J77280m08536m11441M02496O99413m07352j14281
$$ plain form
10954 699155 905726 778327 900493 938822 857690 1134470 1278718 569960 797925 564212
10944 564212 603403 594120 846402 785117 325114 57081 -44977 410786 924991 772370
10934 772370 851732 988184 919200 532677 209472 52447 230833 749905 607440 145682
10924 145682 447582 524630 254360 263876 847117 425283 -99077 -8585 -193586 337279
10914 337279 336425 889687 1023075 1290535 1143947 775342 717709 460626 589716 527221
10904 527221 561898 1037446 650863 92400 -114791 144286 211293 399944 575633 469581
10894 469581 737011 767490 1123148 1116255 587321 790023 446086 720653 955067 815527
10884 815527 483422 24431 496764 674044 265508 -145933 256563 955976 548624 434343
10874D34343Q0245R5081J16326m54332k22319L8829M62268L12490j6586k60574
10864E85771k22532O3016K737j88332O98286j56757k48680j74395k57589r2883
10854H642j62965L30993N66033N888j65672n43092L469J03930L14752K10501K64191
10843I36670k43248l71297J09959K59572j5354m7125j90970M04157j93720Q1805
10833G30449m08707Q2606L93621k73287r0726J34305J67920l91969K16225m5117
10823E15320J50833k06607l71371o5138Q49495l58393j54135K92863l94486J83481
10813D41862j9159M1154J6085j34716j56753n1945R698L2428J77344J57914j00674
10802D13238J45496j61529j05563J08667j72994n1670k71590J09261K13452j23990
$$ plain form
10874 434343 514588 609669 725995 271663 49344 88173 550441 862931 846345 585771
10864 585771 363239 426255 428992 240660 938946 782189 533509 359114 101525 8642
10854 8642 -154323 176670 742703 748591 582919 39827 43296 147226 461978 672479 936670
10843 936670 693422 322125 432084 691656 676302 629177 438207 842364 648644 730449
10833 730449 321742 404348 797969 524682 433956 568261 736181 344212 560437 515320
10823 515320 666153 459546 88175 23037 872532 514139 360004 652867 258381 441862
10813 441862 422703 463857 479942 345226 188473 136528 146226 178654 355998 513912 413238
10802 413238 558734 397205 291642 400309 227315 175645 -95945 13316 226768 102778
10792A02778J4461N7701J84425J88957r7107l06126K11605j66166k21736M49525
10782D18317J82327k93589N1610L85969l44233k09045K03976m9877o3851P1717
10772C53321m26695J19692J0752L1062O5270J64886p538k40842L59J20838j43272
10761D7833M80514k13019k76551K2253R0208m06174J22586M85421K70402r9270
10751E24203k42224m65737J93541J89418K59550l00570J88799J56141m84445L02891
10741C21567j09060o6822j44805r3730l17343J30835K00922K75263L4019J39849
10731C70695j9346k4879k69193Q17729K64802n67269l36553k94218L31459K32641
10721E05868j48991J34436n97381M0419M54913m7791j81673J26993l32117R3398
$$ plain form
10792 102778 117239 174940 359365 548322 451215 145089 356694 190528 -31208 418317
10782 418317 600644 307055 358665 744634 400401 191356 395332 345455 281604 353321
10772 353321 -73374 46318 57070 88132 153402 318288 310750 69908 70267 191105 47833
10761 47833 528347 315328 38777 61030 151238 -254936 -132350 353071 623473 524203
10751 524203 281979 -183758 9783 199201 458751 158181 346980 503121 18676 321567
10741 321567 212507 145685 880 -92850 -410193 -279358 -78436 196827 230846 370695
10731 370695 351349 326470 57277 875006 1139808 572539 235986 -58232 273227 505868
10721 505868 356877 491313 -106068 -65649 389264 341473 159800 286793 -45324 48074
10711D8074L84813Q5715J58142l53241L47324n87260j98913J58025O286N0244
10701I9209l16161J81604K69783J80875Q2086n04604r9756N1961M88720L94802
10691H28519k4894K13800m56465r2633l0484J58828q3290j60477K72418p08515
10681h3193K32004J17250O3899M70107K4398J02980m40012J05190L63033m12301
10671E43355j95719k35588L68021J69526m90680K98734m37914l94810K85736N69495
10661D80156J16761m02482j85308l21756K96522M93150j08825j82656L10276J55931
10651F51769L42919j56647j47188L11779l98897o8695l08246L18560k4823m57763
10641F2768K72715J34113n3284j74338L70679M10666o84655j16022L30549J14975
$$ plain form
10711 48074 432887 518602 676744 323503 670827 83567 -115346 42679 48965 99209
10701 99209 -216952 -35348 234435 415310 497396 -7208 -106964 -55003 433717 828519
10691 828519 803625 1017425 560960 468327 437843 596671 513381 352904 625322 -83193
10681 -83193 148811 266061 329960 800067 824465 927445 487433 592623 955656 543355
10671 543355 347636 112048 480069 649595 158915 457649 19735 -375075 -89339 480156
10661 480156 596917 194435 9127 -312629 -16107 477043 368218 185562 495838 651769
10651 651769 994688 838041 690853 1002632 603735 535040 226794 545354 520531 62768
10641 62768 335483 469596 416312 241974 612653 1023319 338664 222642 553191 668166
10631F68166j07351P6182k08546p5613k11926M21874K19040l66145n65520J4357
10621a35482P1565L97887J8064m8944q223j04871N27694o82236K22922O2087J58622
10610D79085N3410m63159q9109M06792J03509R4303k26530m2999K71795j77930
10600D09167L378J50934K97683j35806o8658J29514k76701J19359j60922K05140
10590F73088L74694k64705k29961L25438L6503j21816M6442m05349n81160J21911
10580b4915J11387K13411K33833k05880O3013o5982L51553J34374j80591K36536
10570H66739m35678j3221M74971r6446j52615J94462K77082l93981O9152K75363
10560A065828k6627l84984j67302j66134J74184j65738o7137K88983J46133p1882
$$ plain form
10631 668166 560815 636997 428451 352838 140912 562786 781826 415681 -149839 -135482
10621 -135482 -63917 333970 352034 303090 294867 189996 717690 35454 258376 320463 479085
10610 479085 532495 69336 -19773 387019 490528 584831 358301 315302 587097 409167
10600 409167 412545 563479 861162 725356 656698 786212 509511 628870 467948 673088
10590 673088 1047782 783077 553116 878554 915057 793241 839683 434334 -146826 -24915
10580 -24915 86472 299883 533716 327836 390849 324867 676420 810794 630203 866739
10570 866739 431061 417840 892811 796365 643750 838212 1115294 721313 790465 1065828
10560 1065828 1039201 654217 486915 320781 494965 329227 262090 551073 697206 625324
10550F25324n8451k95227k17425K03380K24329J7898j98056j51067o4007K12939
10540B99637l65511K804O6631k69978K21379J41562M66309K52532q1353k34312
10530D99700j01660J4118L59085j06108k2976K56841l19231l36200n3036K39494
10520D30027m21350N38293N09082m6441m16222k43005j12426Q4716j31346L57888
10510E49216J21337R3914J84631o38024j63441K11650O62648j84209k40012L10837
10500I08547K4292M1999k43513k76821j53172L22879L91386k67902k3058k98353
10490D26284j86360M54465k07358j24332J65653o7690J28368N3570r4559j47990
10480D00051J57015N4837m94644O00582K9054O9639k29841m3375J5412k85088
$$ plain form
10550 625324 566873 271646 54221 257601 481930 499828 301772 150705 86698 299637
10540 299637 -65874 -63070 3561 -266417 -45038 96524 562833 815365 734012 499700
10530 499700 398040 412158 771243 665135 642159 899000 579769 243569 190533 430027
10520 430027 8677 546970 1056052 1009611 593389 350384 237958 322674 191328 549216
10510 549216 670553 764467 949098 311074 147633 359283 1021931 837722 597710 908547
10500 908547 932839 974838 731325 454504 301332 624211 1015597 747695 724637 426284
10490 426284 239924 694389 487031 362699 528352 460662 589030 642600 548041 400051
10480 400051 557066 611903 117259 717841 746895 816534 586693 543318 558730 273642
10470B73642M3913M63151L65580n76643j05370P723Q15282J89744o81306p78529
10460A7187N7345k8158M85976L97319k84842q0258M70389N0127m30635m64144
10450A90306L93413k91241n3660K61505K19969L92402m76350J51963q3825L39091
10440A043573J88213K3310o84109j59576K94766K22978M6896j75811j76219j79804
10430D44217L16373J70596l84267K41975R5314O629j25337L7322r7632N7106j02390
10419F59906J19673k41252n5416p6562R1065K58984J86152J88415L29587k2053
10409A438499l71743j31794q55071M09356J4044k36798J59815N4064j39983K21307
10399E61696l10211K79211R4205m4897k91259J7016J0774L85044m07561L64120
$$ plain form
10470 273642 317555 780706 1146286 569643 464273 471996 1287278 1477022 795716 17187
10460 17187 74532 46374 532350 929669 644827 564569 1034958 1085085 654450 190306
10450 190306 583719 292478 238818 500323 720292 1112694 636344 788307 704482 1043573
10440 1043573 1231786 1255096 570987 411411 706177 929155 976051 800240 624021 444217
10430 444217 760590 931186 546919 788894 884208 890837 765500 802822 705190 762296 659906
10419 659906 779579 538327 482911 406349 497414 756398 942550 1130965 1460552 1438499
10409 1438499 1066756 934962 79891 489247 503291 266493 426308 480372 340389 561696
10399 561696 251485 530696 624901 580004 288745 305761 316535 701579 294018 658138
10389F58138L12934l13268J52111K83334K48238j91532j64342K83299L50003K7259
10379A646174n49290m46073P40488J5228k4316m65740m3006j22658K46984p7336
10369I20455J05310L11580L91016k46796n68946O5276j48339K35366j96860L87199
10359A255261L7335k49768K17592K03876n72014J4045K6484r4259J97440q5499
10349I50493l8386M9796K28082L25578K08352k83535l4044o12843j08237M55328
10339A140584N3902L17757K97923m0128P3729k58275N9794R4762k72361k64109
10329A203578L3622o6730K92257L63089k01768L1836J17706O910K51983N0796
10319B083279j91020J72580j29073L98938j43446n92408O2387j3668J29413O48884
$$ plain form
10389 658138 971072 657804 809915 1093249 1341487 1149955 985613 1268912 1618915 1646174
10379 1646174 1096884 650811 1391299 1406527 1382211 916471 873465 750807 997791 920455
10369 920455 1025765 1337345 1728361 1481565 912619 977895 829556 1064922 868062 1255261
10359 1255261 1292596 1042828 1260420 1464296 892282 906327 932811 838552 1035992 950493
10349 950493 912107 961903 1189985 1515563 1723915 1440380 1406336 793493 685256 1140584
10339 1140584 1194486 1512243 1810166 1770038 1843767 1585492 1645286 1740048 1467687 1203578
10329 1203578 1237200 1170470 1462727 1825816 1624048 1655884 1773590 1780500 2032483 2083279
10319 2083279 1892259 2064839 1935766 2334704 2191258 1598850 1661237 1647569 1776982 2425866
10309B425866l57354j8109R1830k79405J62421M6245O04285m56908J30716J55177
10299B504764M758o19806O003O23800j34396J11195j05639J47386M4780k63448
10289B319397M77630K49814L18336P8157j78406J63587N594l32129k54551J16952
10279B964381k65736K80387R6391M2127K19701N3246j04878O04655K7974Q5651
10269D003899Q8628M47665K51553l92651J28399K22030r0519p3055L03277m1359
10259D847867M82436j14724L96375K28822M6302j04721k98075J31347l15470J74664
10249E474823P05174Q2698k61169J71839j06049n1393M38647J7741r716K8457
10239F491052j63427L8745J34769J73633N25233J00095K49817K17967L10773N54495
$$ plain form
10309 2425866 2068512 2050403 2142233 1862828 2025249 2071494 2675779 2218871 2349587 2504764
10299 2504764 2509522 1889716 1895719 2519519 2385123 2496318 2390679 2538065 2582845 2319397
10289 2319397 2797027 3046841 3365177 3443334 3264928 3428515 3434109 3101980 2847429 2964381
10279 2964381 2698645 2979032 3075423 3117550 3337251 3390497 3285619 3890274 3918248 4003899
10269 4003899 4092527 4540192 4791745 4399094 4527493 4749523 4659004 4585949 4889226 4847867
10259 4847867 5330303 5215579 5611954 5840776 5887078 5782357 5484282 5615629 5300159 5474823
10249 5474823 6179997 6262695 6001526 6173365 6067316 6015923 6454570 6472311 6462595 6491052
10239 6491052 6327625 6366370 6501139 6674772 7200005 7300100 7549917 7767884 8078657 8633152
10229H633152l4771K56154K5498L85157M30074J04905L05996Q18981j33923M69735
10219A1260958N58652J16782N18757P14876P00397M77215O86002M58515J17964
10210A5610118O17440M64001R2633R2122l87844K58845j34255m7764n37354o72595
10200A5355347j20694o25775p38420l98032n54736o13468l4418q19023m72363
10191A0978418p20906m74825o68410l42044j58888o33518l50761m53555J34856
10182G310367n65103l78642N1620n17309r81933J63109L6859l61478J7714l6800
10172D738404m90512M09995K34483m81964j67604j75094k3145P4094m93072J37358
10162C762943l2045j61033k79331j90206n8395L08795Q7317m16497j31089j20111
$$ plain form
10229 8633152 8598381 8854535 8880033 9265190 9695264 9800169 10106165 10925146 10791223 11260958
10219 11260958 11819610 11936392 12455149 13170025 13870422 14347637 15033639 15492154 15610118
10210 15610118 16227558 16691559 16784192 16876314 16488470 16747315 16613060 16565296 16027942 15355347
10200 15355347 15234653 14608878 13870458 13472426 12917690 12304222 12269804 11450781 10978418
10191 10978418 10257512 9782687 9114277 8772233 8613345 7979827 7629066 7175511 7310367
10182 7310367 6745264 6366622 6418242 5900933 4919000 5082109 5118968 4757490 4775204 4738404
10172 4738404 4247892 4657887 4892370 4410406 4242802 4067708 4044563 4118657 3625585 3762943
10162 3762943 3730898 3569865 3290534 3100328 3041933 3350728 3438045 3021548 2890459 2770348
10152B770348L05541j12831k40708K82061p0599J8848O2899k18336q424l04703
10142B484096K28224K61774J55117P321j14684r87457m5750M00966J36289k41017
10132B284879k08269k14564p4236M55626k89762L13295K03838J57888K2013m34840
10122B215868J41642K86387K45079M59078k7473l35379N34839l00219j41047M74820
10112C553595M0725M25081O99384Q5129J95123k1648M660k10085M04275k04948
10102D971291l67555j30161K65038k52242n73702o328k41472o67171l82543J87676
10092B802831m3982l45259m2711R0173k62461M17523J31757j06029L995k59931
10082B385906j17038K10456N07623R5357q21629m36583j21756p5175l27227L16606
$$ plain form
10152 2770348 3075889 2963058 2722350 3004411 2933812 2952660 3015559 2797223 2788799 2484096
10142 2484096 2712320 2974094 3129211 3136532 3021848 2034391 1988641 2389607 2525896 2284879
10132 2284879 2076610 1862046 1787810 2243436 1953674 2266969 2470807 2628695 2650708 2215868
10122 2215868 2357510 2643897 2888976 3348054 3320581 2985202 3520041 3219822 3078775 3553595
10112 3553595 3594320 4019401 4718785 4803914 4999037 4977389 4982049 4771964 5176239 4971291
10102 4971291 4603736 4473575 4738613 4486371 3912669 3906341 3664869 2997698 2615155 2802831
10092 2802831 2758849 2413590 2370879 2461052 2198591 2616114 2747871 2641842 2645837 2385906
10082 2385906 2268868 2479324 2986947 3082304 2260675 1824092 1702336 1627161 1299934 1616540
10072A616540O11677j14768o63080k87145M2634J19071K02228j05165O42500Q6229
10062B150721k14692m92451N345O8440k54947K29902J88354l30716L65302L86269
10052B101527p29239J83897j14595j04866j47987m56086K58515R01975k77031
10043A616110k79726K10575j09051L4173L41780K03638l55277l55266L39765m56790
10033A189931J54914j29138J9983j83070J51882N9511j05618K99716P4792Q0696
10023A613599K66388j53193j91449R4995K74175m59058M2730L9974j94113J80721
10013A514769j51590L00850Q2112l13592L29145J56484k39706k42959L48828l7278
10003A747063k30638k00910L00092M50909J262K05908r7423K1622l34657k18j26822
$$ plain form
10072 1616540 2228217 2113449 1450369 1163224 1205858 1324929 1527157 1421992 2064492 2150721
10062 2150721 1936029 1443578 1448923 1517363 1262416 1492318 1680672 1349956 1715258 2101527
10052 2101527 1372288 1556185 1441590 1336724 1188737 732651 991166 1893141 1616110
10043 1616110 1336384 1546959 1437908 1472081 1813861 2017499 1662222 1306956 1646721 1189931
10033 1189931 1344845 1215707 1235690 1052620 1204502 1264013 1158395 1458111 1532903 1613599
10023 1613599 1879987 1726794 1535345 1630340 1904515 1445457 1488187 1528161 1334048 1514769
10013 1514769 1363179 1664029 1746141 1432549 1761694 1918178 1678472 1435513 1784341 1747063
10003 1747063 1516425 1315515 1615607 2066516 2067778 2273686 2176263 2197885 1863228 1863010 1736188
9992A736188j74740o9607N18478k2980l49266j01363L51885M7804q8812N243l17579
9981A535251l45870M90310J52193j7071k59996J01498j9598L78675n1583N4730
9971B018539O8397k4485k55380o9632k1454j8543r5159K76796K36240l55468l1030
9960A728821m6273N52248J6730k36888j61273Q81809L72397Q9639k88665p3626
9950B834919L38668j79432L88466j74803M15921l6938j4540L39911k86793m20582
9940C204797N6736l1822l46454J79686j87623k22507m16449n5869k90127m12315
9930A478053Q22709P0152m96872J42094l97386K71271L58844l36187K19273J69605
9920B301556J09393m30659J18478j67862j386K67856l9580K44569k84925J10586
$$ plain form
9992 1736188 1561448 1491841 2010319 1987339 1638073 1536710 1888595 1936399 1847587 1852830 1535251
9981 1535251 1189381 1679691 1831884 1814813 1554817 1656315 1636717 2015392 1963809 2018539
9971 2018539 2086936 2062451 1807071 1737439 1715985 1697442 1602283 1879079 2115319 1759851 1728821
9960 1728821 1682548 2234796 2251526 2014638 1853365 2735174 3107571 3197210 2908545 2834919
9950 2834919 3173587 2994155 3382621 3207818 3623739 3586801 3572261 3912172 3625379 3204797
9940 3204797 3261533 3229711 2883257 3062943 2875320 2652813 2236364 2180495 1890368 1478053
9930 1478053 2300762 2370914 1874042 2016136 1618750 1890021 2248865 1912678 2131951 2301556
9920 2301556 2410949 1980290 2098768 1930906 1929520 2197376 2157796 2402365 2117440 2228026
9910B228026j28575L27986p1568J78744L54529o20376l15151J06654L20742k89323
9900B091688J71118R3722O7380j41548k4056J82427O806J07687k94734K00111
9890B460601L26433j21866n476j47836J5167J79897l86117P6507j44605P78852
9880C031557J82562r5679l75932J2496L45618K33956l48236k57573M95487o9263
9870C154993J15882P5106J36735N74O73580L15181l24747J63047L43461j10277
9860D543535L34163K72437l3396j55164K53585L72530j22848q86722k92795K30425
9850D515750j5505K49022L373O3091l82635m66684j44638k127j17980k82602J74396
9839C593461L95994J75821m52521M385J87157J74026J13615k75593j93287j36540
$$ plain form
9910 2228026 2099451 2427437 2355869 2534613 2889142 2268766 1953615 2060269 2381011 2091688
9900 2091688 2262806 2356528 2423908 2282360 2258304 2440731 2447537 2555224 2260490 2460601
9890 2460601 2787034 2665168 2659692 2511856 2527023 2706920 2320803 2397310 2252705 3031557
9880 3031557 3214119 3118440 2742508 2755004 3100622 3334578 2986342 2728769 3224256 3154993
9870 3154993 3270875 3345981 3482716 3483290 4156870 4472051 4147304 4310351 4653812 4543535
9860 4543535 4877698 5150135 5116739 4961575 5215160 5587690 5464842 4578120 4285325 4515750
9850 4515750 4500245 4749267 4752640 4815731 4433096 3966412 3821774 3819647 3701667 3419065 3593461
9839 3593461 3989455 4165276 3712755 3717140 3904297 4078323 4191938 3916345 3723058 3586518
9829C586518K9435J09386k11741j39679L32545J41048K692j65069j97122l6706
9819C451307m0347j40798J82046j40272K95814L0875Q9524k65676Q6254J01260
9809C649987J8371K95490k88495l69510M40636L50109k81638j33856J10470L88333
9799D179897K4792k5700L07106L04189k00115n6387l39485J40084L54513k97695
9789D391199r4731j10089j51080M04001L10781K72026n23921n52827L85035j37158
9779D193236l38089Q3130N14469n6759n7197R353j01805J93879O6284J56282k50500
9768D412283J45087q1402l88544J82238L99361L06359o0657N86368l87779P5556
9758E188870M67667R54L85981o482K6883J93164J98599K13382j86951k08537K25206
$$ plain form
9829 3586518 3615953 3725339 3513598 3373919 3706464 3847512 3850204 3685135 3488013 3451307
9819 3451307 3410960 3270162 3452208 3311936 3607750 3638625 3728149 3462473 3548727 3649987
9809 3649987 3668358 3963848 3675353 3305843 3746479 4096588 3814950 3681094 3791564 4179897
9799 4179897 4204689 4178989 4486095 4790284 4590169 4533782 4194297 4334381 4688894 4391199
9789 4391199 4296468 4186379 4035299 4439300 4750081 5022107 4498186 3945359 4330394 4193236
9779 4193236 3855147 3938277 4452746 4395987 4338790 4348143 4246338 4440217 4506501 4662783 4412283
9768 4412283 4557370 4475968 4087424 4269662 4669023 4975382 4914725 5501093 5113314 5188870
9758 5188870 5656537 5657491 6043472 6036990 6063873 6257037 6455636 6669018 6482067 6273530 6498736
9747F498736l82995k00219M59665l7695M56935O14396n14877P6776l208j54739
9737F812775M51055L65897m09738N09903L22757L73343K4452k95276K75193j10893
9727H319468l14083M91730O36809J32256j91240j61320L17064L09635j63667K61120
9717I637772J19246k56644M71468M67775k48889R9949K78424J52645l36836o4593
9707A0320317K64599M06574O50206R1652n8448J50092O65879l50219k8088N10249
9697A2622813L49918L63462L03065l15515K07862K20998O0062K44612j5086J73951
9687A4216142R49411N69713M13490M54649K44159L79541N25974J28060Q16174
9678A8697313P40412N84040L95489K78143P31028J83819P62874J101591R60300
$$ plain form
9747 6498736 6115741 5915522 6375187 6337492 6794427 7408823 6893946 6970722 6967514 6812775
9737 6812775 7263830 7629727 7219989 7729892 8052649 8425992 8450444 8155168 8430361 8319468
9727 8319468 8005385 8497115 9133924 9266180 9074940 8913620 9230684 9540319 9376652 9637772
9717 9637772 9757018 9500374 9971842 10439617 10190728 10290677 10569101 10721746 10384910 10320317
9707 10320317 10584916 10991490 11641696 11733348 11674900 11824992 12490871 12140652 12112564 12622813
9697 12622813 12972731 13336193 13639258 13323743 13531605 13752603 13812665 14057277 14042191 14216142
9687 14216142 15165553 15735266 16148756 16603405 16847564 17227105 17753079 17881139 18697313
9678 18697313 19437725 20021765 20417254 20695397 21426425 21610244 22373118 23474709 24435009
9669B4435009N42172M95955R92257Q21660O24195P72540Q96090K40587L48068
9660C0168533J221830R72402J193498P74346J100762J097036J014518O33523J296849
9651C9473297J510566J919429J832570J817370K360489K438884K867203L487631
9643E7707439L442231M792878N278352O211984P836983Q801346R041515Q178164
9635A11290892P695587M697971J698309m26664j181201j029025K41585Q33453
9627A23820907J583603j23630k758116n787259p335240q672997q276554p606274
9619H4844440n653755l518811l123103j871454j568825j176479p33708J16450
9611F7314755l05111J24082O03058R26011Q75104J286117J183804J484550J207513
$$ plain form
9669 24435009 24977181 25473136 26465393 27287053 27911248 28683788 29579878 29820465 30168533
9660 30168533 31390363 32362765 33556263 34330609 35431371 36528407 37542925 38176448 39473297
9651 39473297 40983863 42903292 44735862 46553232 48913721 51352605 54219808 57707439
9643 57707439 61149670 65942548 71220900 77432884 85269867 94071213 103112728 111290892
9635 111290892 118986479 123684450 125382759 124956095 123774894 122745869 122987454 123820907
9627 123820907 125404510 125280880 122522764 116735505 109400265 100727268 92450714 84844440
9619 84844440 79190685 75671874 72548771 70677317 69108492 67932013 67198305 67314755
9611 67314755 67009644 67133726 67736784 68662795 69537899 70824016 72007820 73492370 74699883
9602G4699883J638989J897173K081930K226394K288378K580521K947125L629460
9594I3989853L937842L819878M461538N839882O467503P876009R108127J0825189
9586A46325821J2442946J4780884J7913807K2049179K5738909K9165600L0438578
9579B98855724K7703804K2092786J2762562L101818l406782n581803l730141L04865
9571C52102833L261791J969351l989079j2543140k3126025l0521068l3194192
9564B53960471l2448765k8353289k3232082j9214638j4878367j1783525j0160431
9557A13889374q498573p384875n905540n381935m675371m154563l052953k366530
9549G2469034k259989k275271k038946j549883j258369j433241j794619j501480
$$ plain form
9602 74699883 76338872 78236045 80317975 82544369 84832747 87413268 90360393 93989853
9594 93989853 97927695 101747573 106209111 112048993 118516496 126392505 135500632 146325821
9586 146325821 158768767 173549651 191463458 213512637 239251546 268417146 298855724
9579 298855724 326559528 348652314 361414876 364516694 361109912 355528109 351797968 352102833
9571 352102833 355364624 357333975 353344896 340801756 317675731 287154663 253960471
9564 253960471 221511706 193158417 169926335 150711697 135833330 124049805 113889374
9557 113889374 105390801 98005926 92100386 86718451 82043080 77888517 74835564 72469034
9549 72469034 70209045 67933774 65894828 64344945 63086576 61653335 59858716 58357236
9541E8357236j076075r51813l51367o56415k61265l03898o09337n28020p01390
9532E2917656n36850j85560n34353l87117m77876m21381j84859l70995m6852K1730
9522D9793543m42914P86739J298524N92098J210743K982586L355273M231373M026418
9513F7834383L966409M606721L979589L291933K688310K851576R30723m60848
9505H9688796j114843l102933m606812n160872n705383m960136m598007m163065
9497E6276745l314065k939550j933710j570660j305802k88689k39477j24981k58085
9488D4301726M96280L45263O08675N04913J208393J950458J976652K898701L955963
9479E8247024M002718M716394N178231N296159N277141M121127M110264K473651
$$ plain form
9541 58357236 57281161 56329348 55977981 55321566 55060301 54756403 54147066 53619046 52917656
9532 52917656 52380806 52195246 51660893 51273776 50795900 50374519 50189660 49818665 49771813 49793543
9522 49793543 49350629 50137368 51435892 52027990 53238733 56221319 59576592 63807965 67834383
9513 67834383 71800792 76407513 80387102 83679035 86367345 89218921 90149644 89688796
9505 89688796 88573953 85471020 80864208 75703336 69997953 65037817 60439810 56276745
9497 56276745 52962680 50023130 48089420 46518760 45212958 44924269 44684792 44559811 44301726
9488 44301726 44798006 45143269 45751944 46256857 47465250 49415708 51392360 54291061 58247024
9479 58247024 62249742 66966136 72144367 77440526 82717667 86838794 90949058 93422709
9471I3422709J071779O90110o63800j336125j220855o13531n17641M94339P42518
9462I2069503k52170j469542j817326k637565l016973k020138j022073r24111
9454G8909605j753098l743259n044920o222790p651779o618992m959162m637039
9446C8278566l618493k598116k138543j949255j374546j195387j020365j332952
9438B3050909r52717p47019r52494q83375q15894o47870p28197j084496r52342
9429A5286505j81630m31945l50040o69397m15951o03059n7062l73007m78765k80120
9419A1445529k69915q10346m75495M9390l56763j55434J57985N17750Q7058K86820
9409A0476579K26055j87734k01889p84279J93316l00587R9238r8144p19650J85669
$$ plain form
9471 93422709 94494488 95184598 94520798 93184673 91963818 91350287 90832646 91326985 92069503
9462 92069503 91817333 90347791 88530465 85892900 82875927 80855789 79833716 78909605
9454 78909605 77156507 73413248 68368328 62145538 54493759 47874767 42915605 38278566
9446 38278566 34660073 32061957 29923414 27974159 26599613 25404226 24383861 23050909
9438 23050909 22098192 21351173 20398679 19515304 18699410 18051540 17323343 16238847 15286505
9429 15286505 15104875 14672930 14322890 13653493 13237542 12634483 12577421 12204414 11725649 11445529
9419 11445529 11175614 10365268 9889773 9939163 9582400 9426966 9584951 10102701 10189759 10476579
9409 10476579 10702634 10514900 10313011 9528732 9722048 9421461 9520699 9422555 8702905 8888574
9399H888574j6811m22872j61191M7282n14161n14292N73768n16145r7794Q119
9389G274477L3769K71293m25361L24570L91918j54731m68120j71496J8164K99533
9379G394016K45230j84978R5150q8759k43861J54104J34677k26964m38133K14231
9369G054713Q7593k40333J00957K20707M6926n24686r7147q2963j88613O27338
9359G004492k52902J18723j69348J29719l80699j62554L98300n25988m05388j16018
9349E638337O1434R5175K24017m1766N36096j51500m09805K47673K45686l80882
9339F064465J86885j71419J46970L95491k99783k96629r6115J7598K63200K93505
9329F504168j00040l69910L80743N44256l62756J42902p01356J43728N3185n7194
$$ plain form
9399 8888574 8871763 8448891 8287700 8334982 7820821 7306529 7880297 7364152 7266358 7274477
9389 7274477 7308246 7579539 7154178 7478748 7870666 7715935 7247815 7076319 7094483 7394016
9379 7394016 7639246 7454268 7549418 7460659 7216798 7370902 7505579 7278615 6840482 7054713
9369 7054713 7142306 6901973 7002930 7223637 7270563 6745877 6648730 6565767 6377154 7004492
9359 7004492 6751590 6870313 6700965 6830684 6449985 6287431 6685731 6159743 5754355 5638337
9349 5638337 5699771 5794946 6018963 5977197 6513293 6361793 5951988 6199661 6445347 6064465
9339 6064465 6251350 6079931 6226901 6622392 6322609 6025980 5929865 5947463 6210663 6504168
9329 6504168 6404128 6034218 6414961 6959217 6596461 6739363 6038007 6181735 6234920 6177726
9319F177726N8151P8417R7568N68357n095M0910p3276L0278L79264k01376Q8117
9308G239041J11695J99414M88266k05803l90689q8186K95285Q75436J74965J09678
9298H809102m52761J33863J28467J74544K84212k62224K76224M74024M20413n1161
9288I934703O47622M85978n8230J406368P64011M24186O19906J16884o30614p11517
9278A2999297n15605k47144K2032N5244k07126j01259N21848K97197K03942J38899
9268A3167325K01427J46126M56720N15432l00850j15417J15418l14682k58967
9259A3612532N65023K67521K20263P8348o9499k37498j60845O8385j14716J58564
9249A4388078o3560P81485O53059j75360J93591n8185L40722K72043J37731P2360
$$ plain form
9319 6177726 6235877 6314294 6411862 6980219 6975124 7016034 6942758 6973036 7352300 7150924 7239041
9308 7239041 7350736 7550150 8038416 7832613 7441924 7353738 7649023 8524459 8699424 8809102
9298 8809102 8356341 8490204 8618671 8793215 9077427 8815203 9091427 9565451 9985864 9934703
9288 9934703 10582325 11068303 11010073 12416441 13180452 13604638 14224544 14341428 13710814 12999297
9278 12999297 12483692 12236548 12258580 12313824 12106698 12005439 12527287 12824484 13028426 13167325
9268 13167325 13368752 13514878 13971598 14487030 14186180 14070763 14186181 13871499 13612532
9259 13612532 14177555 14445076 14665339 14743687 14674188 14436690 14275845 14344230 14229514 14388078
9249 14388078 14324518 15106003 15759062 15583702 15777293 15719108 16059830 16331873 16469604 16541964
9239A6541964J58391N96311M09904J070878O30326n71M38945L69171Q04633P45775
9229B1765727P79975J337571J053810J023144J211359J565997J777310J984936
9221C2499829K734059L432673M390850N527033O042554P221256O706343L596700
9213G2151297j344317m044674l943220p16615J043234J940998J793429k042861
9205F4837271o173880p988090o796537n078129m018238k340678k250654k078081
9197B8112984j414043j207114r24555m59689k0715o34265K95303k06577K81640
9188B3822969K9387J19856n87876o44794n82030q43764k61370j02230K96990L37500
9178B1584638k58668j447267j592185j175394o22139m39188l22365m53824j80191
$$ plain form
9239 16541964 16700355 17296666 17706570 18777448 19407774 19407203 19846148 20215319 21019952 21765727
9229 21765727 22545702 23883273 24937083 25960227 27171586 28737583 30514893 32499829
9221 32499829 35233888 38666561 43057411 48584444 54626998 61848254 68554597 72151297
9213 72151297 70806980 66762306 62819086 62102471 63145705 65086703 66880132 64837271
9205 64837271 58663391 50675301 43878764 38800635 34782397 32441719 30191065 28112984
9197 28112984 26698941 25491827 24567272 24107583 24086868 23452603 23747906 23541329 23822969
9188 23822969 23852356 23972212 23384336 22739542 22157512 21313748 21052378 20950148 21247138 21584638
9178 21584638 21325970 19878703 18286518 17111124 16488985 16049797 15727432 15273608 15093417
9169A5093417m63649K20897l60703J493n23864j37320O6664n1848K81097m89967
9159A3636217K33689K18403k41220J98948k84719k19526K17527K72245K56083
9150A4287647l18941J2381P4067k13732r3831J71143K37542M09272M0158K92040
9140A4897746J63039k76134K33530L94659p3424P1532J76543O24121j32406P13003
9130A6792209J51049J36977K85548j32221M26326j1932K78990J21017P57220K15815
9120A9020998j33766M60560N43129p6640J86561N90694L54836Q20976M29773N42051
9110B2739172k23337K92181R2442j4484M26352J81647q6017M52086Q01575J17699
9100B4779316M5588N70794P83778P03211P06710M28710K57397R75101Q05695K72788
$$ plain form
9169 15093417 14629768 14850665 14489962 14491455 13967591 13830271 13896935 13845087 14126184 13636217
9159 13636217 13869906 14088309 13847089 14046037 13761318 13541792 13759319 14031564 14287647
9150 14287647 13968706 13981087 14055154 13841422 13747591 13918734 14156276 14565548 14605706 14897746
9140 14897746 15060785 14784651 15018181 15412840 15339416 15410948 15587491 16211612 16079206 16792209
9130 16792209 16943258 17080235 17365783 17233562 17659888 17647956 17926946 18047963 18805183 19020998
9120 19020998 18887232 19347792 19890921 19814281 20000842 20591536 20946372 21767348 22197121 22739172
9110 22739172 22515835 22808016 22900458 22885974 23312326 23493973 23407956 23860042 24661617 24779316
9100 24779316 24824904 25395698 26179476 26882687 27589397 28018107 28275504 29250605 30056300 30329088
9090C0329088P86116P86196N62565J039551J053011N26839N93911O96048Q13826
9081C7187151J215134J391155J728316P46227O71175J477967R51727Q61264J084216
9072D7314332J206554J187497N79583J356284J356318P08384J642084J240626
9064E6591662J527562J987250J515516N67021J314173J411162J777410J774329
9056F8466085J654975K141177K503595K485115L044020L589837M073599M175533
9048I2133936M438341N888086O684810P865477Q907869J1508761J3535247J4970129
9040A65932656J6074254J4085946Q060566q70542m480286l320380j26913L973574
9032A99328875Q304851Q952941O512519q4152o907496q770591p799395m600865
$$ plain form
9090 30329088 31115204 31901400 32463965 33503516 34556527 35083366 35677277 36373325 37187151
9081 37187151 38402285 39793440 41521756 42267983 42939158 44417125 45368852 46230116 47314332
9072 47314332 48520886 49708383 50287966 51644250 53000568 53708952 55351036 56591662
9064 56591662 58119224 60106474 61621990 62189011 63503184 64914346 66691756 68466085
9056 68466085 70121060 72262237 74765832 77250947 80294967 83884804 87958403 92133936
9048 92133936 96572277 102460363 109145173 117010650 125918519 137427280 150962527 165932656
9040 165932656 182006910 196092856 204153422 203282880 198802594 195482214 195355301 199328875
9032 199328875 207633726 216586667 223099186 223015034 216107538 207336947 199537552 194936687
9024A94936687k555793l772584m749582l773052k644743q94555M62025J630906
9016A78639309K131856J979304J01211j363804j475900j58499K200452M257123
9008A86311052O622668R373008J1643185J4023418J7587846K1753444K6153751
9001B93468372K7847247K5294859J5340810K319661m985739k778543M697855J2487858
8993C73692380K0391680K3044136J8059595N060537r678792j8081766j8728470
8986C93759300j6654643j4478342j4308570j6866941j7349255j6177771j4545058
8979B83378720j1483065r361941r115882j2131529j6962847j8211206j6905393
8972A89206857j3973118j0432141q161570o698145m517035l044022j580651n47469
$$ plain form
9024 194936687 192380894 188608310 183858728 180085676 177440933 176546378 177008403 178639309
9016 178639309 180771165 182750469 182851680 181487876 180011976 179853477 182053929 186311052
9008 186311052 192933720 202306728 213949913 227973331 245561177 267314621 293468372
9001 293468372 321315619 346610478 361951288 364270949 359285210 356506667 361204522 373692380
8993 373692380 394084060 417128196 435187791 440248328 430569536 412487770 393759300
8986 393759300 377104657 362626315 348317745 331450804 314101549 297923778 283378720
8979 283378720 271895655 262533714 253417832 241286303 224323456 206112250 189206857
8972 189206857 175233739 164801598 156640028 149941883 145424848 142380826 140800175 140252706
8964A40252706J388645K408121L163125R79520j085411k663246k754906j879744
8956A39808810l327687m290822o672516o645954n594446m704423l523209k450317
8948A02599436j767776p39637l96208o18127q07028l00781Q2251J91389O44226
8939I8887745Q57852J025448J490972J928920L158518L035548M669653O262774
8931A21317430P410430Q662402J0888090J3714702J5193997J2498966J498248
8924A91184265j0957887j4249267j1631196p140970m744818k035327j179430m79230
8916A38766140L84090K027251L429587N312386O974950Q913871J1791448J3291462
8908A90891185J6265167J8486766K1567938K1405354J9786920J8067797J7447319
$$ plain form
8964 140252706 141641351 144049472 147212597 148192117 147106706 144443460 141688554 139808810
8956 139808810 136481123 132190301 125517785 118871831 113277385 108572962 105049753 102599436
8948 102599436 100831660 100092023 99695815 99077688 98270660 97969879 98052130 98243519 98887745
8939 98887745 99745597 100771045 102262017 104190937 107349455 110385003 115054656 121317430
8931 121317430 128727860 137390262 148278352 161993054 177187051 189686017 191184265
8924 191184265 180226378 165977111 154345915 147204945 142460127 140424800 139245370 138766140
8916 138766140 139150230 141177481 144607068 149919454 156894404 165808275 177599723 190891185
8908 190891185 207156352 225643118 247211056 268616410 288403330 306471127 323918446
8901C23918446J8164644K0876959K2291138J7241563L279444j2893705k8362638
8894C64515851l9663155m2647886l8209063l0783517k4095262j8609459j4172860
8887A56334649j1471932r189292p062938n497177m516442l776494l592461k870977
8879A08356936j748285j443652p60512R7969O52595J189733K494930L912279M410346
8870A17162339N297478P516361R408941J0047251J0441934R558493Q960626Q920088
8862A87313511R843626J1708699J2848875J0329117K211685o883099j6040869
8855B11331545k3146209k5220726k3031724j8132545j4348546j1762648q857240
8848H6831907p505602n745936m750126m261719l548011l563972k733208k513441
$$ plain form
8901 323918446 342083090 362960049 385251187 402492750 405772194 392878489 364515851
8894 364515851 324852696 282204810 243995747 213212230 189116968 170507509 156334649
8887 156334649 144862717 135673425 128610487 123113310 118596868 114820374 111227913 108356936
8879 108356936 106608651 105164999 104404487 104502456 105155051 106344784 108839714 112751993 117162339
8870 117162339 122459817 129976178 139385119 149432370 159874304 169432797 178393423 187313511
8862 187313511 197157137 208865836 221714711 232043828 234255513 227372414 211331545
8855 211331545 188185336 162964610 139932886 121800341 107451795 95689147 86831907
8848 86831907 79326305 73580369 68830243 64568524 61020513 57456541 54723333 52209892
8840E2209892k060296j889532j408840j314174j027893j127260j116321j314196
8832D0951380q68410j214425j193319j037526j001413q16083n54699K28711o87177
8823C3807039n8843m18668m70608n25915m54066K89420J60038L02117O64040L77126
8813C3671680Q38033J084382J187035J212042J735923K670153K257987K908941
8805D7566176L532652L380693J950100P6460r74258j858984j410863q89102N93574
8796E1966448M32915J633599J194552q30053k253061l858588l245147k697949
8788D2342716k600198q35867q66156n46312n76916L33761J357575J451320J615332
8779D1675255J731221K628353L077434J860130J170795Q06515Q44451J152582
$$ plain form
8840 52209892 50149596 48260064 46851224 45537050 44509157 43381897 42265576 40951380
8832 40951380 40082970 38868545 37675226 36637700 35636287 34820204 34265505 34494216 33807039
8823 33807039 33748196 33329528 32858920 32333005 31878939 32168359 32328397 32630514 33294554 33671680
8813 33671680 34509713 35594095 36781130 37993172 39729095 42399248 44657235 47566176
8805 47566176 51098828 54479521 56429621 56506081 55531823 53672839 52261976 51372874 51966448
8796 51966448 52399363 54032962 55227514 54397461 52144400 48285812 45040665 42342716
8788 42342716 39742518 38906651 38040495 37494183 36917267 37251028 38608603 40059923 41675255
8779 41675255 43406476 46034829 49112263 50972393 52143188 52949703 53794154 54946736
8771E4946736K095857L124417L296124L376409R37944j93699k854978m190221
8763F0538589l871692k856428j483836l55908k74985j711382l416164m348733
8755D2219461m015729l069692k914905j512991j106079r77179r48281m68639R4880
8746B7300846L77236Q39536Q87715J077861J331631J073867P00821K92661q96956
8737C2985218j000469j118985n97857N9929O52085N30912Q145j180528k301140
8728B8037310k517761k544499k490472k219384j992716j065067j462701r94369
8720A2750341n02589q38119o76431m22403K51562o20362n06871o3103k46969n02304
8710H622752k65583m44546j66430p923j64633j79997k3990l26010m06206L17406
$$ plain form
8771 54946736 57042593 60167010 63463134 66839543 67777487 67583788 64728810 60538589
8763 60538589 56666897 53810469 52326633 51970725 51695740 49984358 46568194 42219461
8755 42219461 38203732 35134040 32219135 30706144 29600065 28622886 27674605 27205966 27300846
8746 27300846 27678082 28517618 29405333 30483194 31814825 32888692 33589513 33882174 32985218
8737 32985218 31984749 30865764 30267907 30327836 30979921 31510833 31518978 30338450 28037310
8728 28037310 25519549 22975050 20484578 18265194 16272478 15207411 13744710 12750341
8720 12750341 12247752 11409633 10733202 10310799 10562361 9941999 9435128 9372025 9125056 8622752
8710 8622752 8357169 7912623 7746193 7738270 7573637 7393640 7369650 7043640 6637434 6954840
8700F954840j6402K39163J63676k74467k6557o97534O1996p89184l88842M01782
8690E628471j14433m14511o31186J88959K13146l33398L77269P5626l93925L8995
8680D635013J9030j29282k11137l90817J24487q0571O0854j16735k18907Q4481
8670C776416L24748M58494O97106k26477n54493J19477K32725l8568k9056N68670
8660E329042K32790l2112m69851k31957l99671O5865J56294L28060j83477p4970
8650D720013q06363j1969J06694j8509l10865L55499L17553l57833o4263j71021
8640C758936n94106p2034q9176o6561k2287j50899M40843l38352q9974M56226
8630C232616Q2585J79107R8065j0827p8142k81041J4837L85924l75067j07733
$$ plain form
8700 6954840 6938438 7177601 7341277 7066810 7040253 6342719 6404715 5615531 5226689 5628471
8690 5628471 5514038 5099527 4468341 4657300 4870446 4537048 4914317 4989943 4596018 4635013
8680 4635013 4654043 4524761 4313624 3922807 4047294 3966723 4027577 3910842 3691935 3776416
8670 3776416 4101164 4559658 5256764 5030287 4475794 4595271 4827996 4789428 4760372 5329042
8660 5329042 5561832 5529720 5059869 4827912 4428241 4494106 4650400 4978460 4794983 4720013
8650 4720013 3913650 3901681 4008375 3989866 3679001 4034500 4352053 3994220 3929957 3758936
8640 3758936 3164830 3092796 3003620 2937059 2914772 2763873 3204716 2866364 2776390 3232616
8630 3232616 3315201 3494308 3592373 3581546 3503404 3222363 3237200 3623124 3248057 3140324
8620C140324J68086O9529K70391k53019j95173K14862k83415j36610K05178k38879
8610B961274j19184M21665K7236j48099l73209j52566k77965j35226N6168l12465
8600A947629j34266K69809L39288k52760m1032l84890O5471L76309P2125j31967
8590B125716j09530j89880q6496n8869q237J48677j16025j124K6304K32591O1894
8579B025021j58917L70638m30604m64500j97458M7425l02024k41392J38152k62329
8569E24012L17483J0236J07594J57227J01680J5023k83641o2528j92592L55427
8559A049921j9205j69459R9115J58221O5235k11084j91343p8661m0698M7473O926
8548G16441L17650k94349N2306L2944O3660J58865O2843k4476K33382J93724N53063
$$ plain form
8620 3140324 3308410 3377939 3648330 3395311 3200138 3415000 3131585 2994975 3200153 2961274
8610 2961274 2842090 3263755 3290991 3142892 2769683 2617117 2339152 2203926 2260094 1947629
8600 1947629 1813363 2083172 2422460 2169700 2128668 1743778 1809249 2185558 2257683 2125716
8590 2125716 2016186 1826306 1739810 1680941 1672704 1821381 1705356 1704232 1730536 1963127 2025021
8579 2025021 1866104 2236742 1806138 1341638 1144180 1191605 889581 648189 786341 524012
8569 524012 841495 851731 959325 1116552 1218232 1233255 949614 887086 694494 1049921
8559 1049921 1030716 861257 960372 1118593 1183828 972744 781401 702740 662042 709515 716441
8548 716441 1034091 739742 792048 824992 888652 1047517 1110360 1085884 1319266 1512990 2066053
8537B066053J11752l44370j60049m43122J01578O68839J82895q1510n0137j23702
8527A928227j10531l75836M0437k51388J77055p84574m654N17273o12455M56754
8517I80308k7740l00372m374K1176l8995Q7567J70870K05792k2554j45472j18162
8506H08044K98987j90030J19718r7318j55665N67545l82082k83059J26612N40651
8496A353403L07542J39207K99508l26505r6578R9324p483O8983j0731p30250M6308
8485A142728k60518j76006J14204K35457l25200j85391k47700k14575O23258k37532
8475D68725K48268j80818M8442k54678k60393J29594l23682M42446J45959n1310
8465D12553p758o4471N18913M2255p0269j44650L8202j28515Q2492q8558j74934
$$ plain form
8537 2066053 2177805 1833435 1673386 1230264 1331842 2000681 2183576 2102066 2051929 1928227
8527 1928227 1817696 1441860 1482297 1230909 1407964 623390 618736 1136009 523554 980308
8517 980308 952568 652196 647822 668998 630003 717570 888440 1094232 1071678 926206 808044
8506 808044 1107031 917001 1036719 939401 783736 1351281 969199 686140 812752 1353403
8496 1353403 1660945 1800152 2099660 1773155 1676577 1775901 1768418 1837401 1826670 1096420 1142728
8485 1142728 882210 706204 820408 1055865 730665 545274 297574 82999 706257 468725
8475 468725 716993 536175 584617 329939 69546 199140 -124542 317904 463863 412553
8465 412553 404795 340324 859237 901492 831223 686573 724775 596260 678752 590194 415260
8454D15260j20684j70353N7008K87076M51119P23724m19250l48146o9954J25394
8444I31194m17589J58724p6660j44431k95975K06292l40371O6860M31249P5864
8434E95157l47727l03557L80502J25291L50099l73148m23752O08995P8020l92460
8424B97420J29858K7199p2269k09199J89798J99223l49571j63035K43651j9062
8414B74013J2350M70695N1726r4179j41694O0619P8300j83225L39855N08684m77761
8403H99383n15225N98161j59673K22127l46217j44500j40228r5193J80679n612
8393D93702r899L09339l50123o06023k23840O3538J19100m0024P55161J74369
8383F85300o23705K3291K52903J01252m5916k42876m92541K45257K22695j99798
$$ plain form
8454 415260 294576 124223 181231 468307 919426 1643150 1223900 875754 805800 931194
8444 931194 513605 672329 595669 451238 155263 361555 21184 88044 519293 595157
8434 595157 247430 -56127 324375 449666 799765 426617 2865 611860 689880 297420
8424 297420 427278 454477 382208 173009 362807 562030 212459 49424 293075 274013
8414 274013 286363 757058 808784 714605 572911 633530 711830 528605 868460 1377144 899383
8403 899383 384158 982319 822646 1044773 698556 554056 413828 318635 499314 493702
8393 493702 483803 793142 443019 -163004 -386844 -323306 -204206 -244230 510931 685300
8383 685300 61595 84886 337789 439041 393125 150249 -342292 -97035 125660 -74138
8373g4138M95850k58395L1630L34774j66839j86874M9432O2070l41063o7870J62160
8362D0737l22381J50877Q288K6020k74849K67217N73161j91532l77259Q3079P94452
8351G77810l45954P5060m37388j61556K39236l9150n4765j76702R0387j81562
8341b14584j41734O5628k8374L01125J07440J50168k48295K84231J10352K3573
8331D09530J54548n21728J6517L50671m69964o0414r780k86743m06918P34567
8321h9714L04128j57479r3328o9138k72022L65695M7730m21201j82143M13131
8311a54341M08514n24368j96408J79965J5328j56793K83898k46020L25948J35111
8301G0834m7326j79337J73421j40928K53650n1953O2719M86380n33909l08114
$$ plain form
8373 -74138 421712 163317 194947 529721 362882 176008 225440 287510 -53553 -121423 40737
8362 40737 -281644 -130767 -122479 -96459 -371308 -104091 469070 277538 -99721 -16642 777810
8351 777810 431856 506916 69528 -92028 147208 108058 53293 -123409 -33022 -214584
8341 -214584 -356318 -290690 -319064 -17939 89501 239669 -8626 275605 385957 409530
8331 409530 564078 42350 58867 409538 -60426 -120840 -130620 -417363 -824281 -89714
8321 -89714 214414 56935 -36393 -105531 -377553 -11858 35872 -385329 -567472 -154341
8311 -154341 254173 -270195 -466603 -286638 -271310 -428103 -144205 -390225 -64277 70834
8301 70834 23508 -155829 17592 -123336 130314 78361 141080 627460 93551 -214563
8291b14563j80220q3647M51936m47858J44703N33502l82253j69899L8429L34094
8281B4224o9194k0001j33826m91475M74979l49488L28108k22247l7861r023J71059
8270c34745P5089j03704K21718j82283L78786L8202N7084j11195l93637k22512
8260e77197j36311O21434P8823n23358R6149J16458r0029j08177J87181P8937
8250b56090J42753L6398p8194l9314L9043m88650k42887M49727l2072J31476J89736
8239a48074r2331K41265M8366k30317J11640K45934n23395O8117L49466j67108
8229i6437m36616l72578M499J84250L9610m8865L15317l295J86120k3202l7446
8218b88643o3346J5653K45251o9993J83726l6725Q240r6813L9266J80106m9730
$$ plain form
8291 -214563 -394783 -478430 -26494 -474352 -329649 203853 -178400 -348299 -309870 24224
8281 24224 -44970 -64971 -198797 -690272 -215293 -564781 -236673 -458920 -496781 -505804 -334745
8270 -334745 -259656 -363360 -141642 -323925 54861 93063 150147 38952 -354685 -577197
8260 -577197 -713508 -92074 -13251 -536609 -440460 -324002 -414031 -522208 -335027 -256090
8250 -256090 -113337 -76939 -155133 -194447 -155404 -644054 -886941 -437214 -469286 -337810 -148074
8239 -148074 -240405 860 49226 -181091 -69451 176483 -346912 -278795 70671 -96437
8229 -96437 -533053 -905631 -901132 -716882 -677272 -726137 -410820 -414115 -227995 -251197 -288643
8218 -288643 -351989 -336336 -91085 -161078 22648 -14077 -5837 -102650 -63384 116722 66992
8207F6992j3291N2028j20571l40999m93260J89785J14938j6639l5028l02940J8470
8196h80515K81126p987J91745r73432k278057K035240P67161l77235J85378L38985
8186g17591N04598j34494K06636J27979L3912n7131k86489l2171J91983l94268
8176e57036J75359j98672K46360k06811j2917J45099J40748l09487J91769R3749
8166b91839J13785m97782N58001M76597n68267k11011j83158L06330J62204Q6931
8156d8209l04181L62279k45678j27083q9583Q8275J71336j30923K51560k51972
8146c24179o86111K41939N99453o1362j74154L3255K39388J3458P4748m17205
8136d60770N0189j53057j42739K36882M79169J6252L9358K65913n97379m45632
$$ plain form
8207 66992 53701 105729 -14842 -355841 -849101 -659316 -544378 -561017 -596045 -898985 -880515
8196 -880515 -599389 -607376 -415631 -1389063 -3667120 -1631880 -864719 -1241954 -1056576 -717591
8186 -717591 -212993 -347487 -140851 -12872 21040 -36091 -322580 -354751 -162768 -557036
8176 -557036 -381677 -580349 -333989 -540800 -553717 -408618 -267870 -577357 -385588 -291839
8166 -291839 -178054 -675836 -117835 358762 -209505 -420516 -603674 -297344 -135140 -48209
8156 -48209 -352390 9889 -235789 -362872 -452455 -364180 -192844 -323767 -72207 -324179
8146 -324179 -1010290 -768351 -168898 -230260 -404414 -371159 -131771 -118313 -43565 -460770
8136 -460770 -410581 -563638 -706377 -469495 9674 25926 65284 331197 -266182 -711814
8126g11814L35747O8167J17291J46088j37439j41773j03896M41882k20107N1991
8116a53863l07355K81835P4051j45014p1084K48803j29819o55312N70953N43776
8106B56971o57993n9235J34412j17576K89957j16152r8947J67687m49457J19654
8096e30679K26005j62333l32696o21436M38897K18687L38717L8426N55320r6965
8086G1943k40020j76106j63974J89331L52523l38955J90603k0155L4655j17015
8076b17170K37791k17916j78527j81403j25485P01543k15498L05397n61890k18755
8066f71913Q747K75791M24906m27103k6535M91743o3581l31278K66927k45865
8056b98161n39099J30812l7344k08106k13796K1598K20320M26219j95738j19435
$$ plain form
8126 -711814 -376067 -307900 -190609 -44521 -181960 -323733 -427629 14253 -205854 -153863
8116 -153863 -461218 -179383 -105332 -250346 -321430 -72627 -202446 -857758 -286805 256971
8106 256971 -401022 -460257 -325845 -443421 -153464 -269616 -368563 -200876 -650333 -530679
8096 -530679 -304674 -467007 -799703 -1421139 -982242 -763555 -424838 -386412 168908 71943
8086 71943 -168077 -344183 -508157 -318826 33697 -305258 -114655 -134810 -100155 -217170
8076 -217170 20621 -197295 -375822 -557225 -682710 18833 -196665 108732 -453158 -671913
8066 -671913 -663166 -387375 37531 -389572 -416107 75636 12055 -319223 -52296 -298161
8056 -298161 -837260 -706448 -743792 -951898 -1165694 -1144096 -923776 -497557 -693295 -812730
8046h12730L72973N07258p04783K31498K2931j80681K18841n0840P5240J26166
8036a94127q4182L80017L90253j81011j71687l42200j98265l65817Q9320P7267
8026f00432J39181L0488M13025K94243J10388l62237n62105L54960j55237m08982
8016g46708l96868M8910L64879L37577O9972k63603K58803K71125o29434r925
8006f95272K29225j0836J27170P6696J34916k32094j46958k9850L25518p2229
7996b93714K06351k49345r6585N87437l97289m19500n1371M1317M6987q2343K66318
7985d41737N16568k37643J48757M8226m23608K72281L5670J11941j43177j16907
7975b29629L06386J23041n7303l35475j42335M96438J86374l32716k17092k22542
$$ plain form
8046 -812730 -439757 67501 -637282 -405784 -382853 -563534 -344693 -395533 -320293 -194127
8036 -194127 -278309 101708 491961 310950 139263 -202937 -401202 -767019 -677699 -600432
8026 -600432 -461251 -430763 -17738 276505 386893 24656 -537449 -182489 -337726 -746708
8016 -746708 -1143576 -1094666 -729787 -392210 -322238 -585841 -327038 -55913 -685347 -695272
8006 -695272 -466047 -476883 -349713 -273017 -138101 -370195 -517153 -547003 -221485 -293714
7996 -293714 -87363 -336708 -433293 154144 -243145 -662645 -714016 -672699 -625712 -708055 -441737
7985 -441737 74831 -162812 -14055 34171 -389437 -117156 -81486 30455 -112722 -229629
7975 -229629 76757 199798 142495 -192980 -335315 161123 347497 14781 -202311 -424853
7965d24853J1249K04686P6398k77679M74622L526j58488k34252k88060N0145J25068
7954d37638P0121j51494N49515L2052k09517k30104K77996j4771L38546J15479
7944C40185k24749l57213m83140N17855J95392Q3182j74451k07434j195J95335
7934a16233N8059j41832J00478n8487L16774j74110r4260P944J32663l52510m64823
7923g86337L79230K51529j28138J94058k86023P2732L89643j77830o9865N79525
7913D18524k58577k38848j68625l75748K36320M0004K76286j94296N6842m2189
7903b50307J52273k77043j91061k429M54662j65308l85649K04536N7063J97043
7893b06220j71088K72448J94967l3954K1013l14766l90854J59014k9928K68328
$$ plain form
7965 -424853 -413604 -208918 -132520 -410199 64423 67949 -90539 -324791 -612851 -562706 -437638
7954 -437638 -367517 -519011 30504 62556 -146961 -377065 -99069 -113840 224706 340185
7944 340185 115436 -241777 -724917 -207062 -11670 71512 -102939 -310373 -311568 -116233
7934 -116233 -58174 -200006 -99528 -158015 158759 -15351 -109611 -101667 30996 -321514 -786337
7923 -786337 -407107 -155578 -283716 -89658 -375681 -302949 86694 -91136 -161001 418524
7913 418524 159947 -78901 -247526 -623274 -386954 -346950 -70664 -264960 -208118 -250307
7903 -250307 -98034 -375077 -566138 -568567 -113905 -279213 -664862 -460326 -403263 -206220
7893 -206220 -377308 -104860 90107 56153 77166 -237600 -628454 -469440 -499368 -231040
7883b31040J08661m72955K45563K03048o8774r4614M75165L5433r8117j66063
7873f3693M37390l59171j45358K27257k65012K71885L4326n14246m1931O40883
7863B22330k02537k84712k176K75923J15501q0130K62461j23653o81188k59148
7853g57329J86004M7172J67670J39935j13582J15470j7240m9056K24344k34841
7843b91453k96977J65783q4774J72607K23736R2049k7301K10127l8338l46162
7833b20703M12714j83607n26675L3440m39923p9791K29900K03411O86367J51952
7823B67085p90588k38068Q40l9679M73425J76881j19857M64344j31132M74631
7813E37882k11020o21321l7464k26161p66522L77526J913768q21417k83102j61453
$$ plain form
7883 -231040 -122379 -595334 -349771 -146723 -215497 -310111 165054 200487 102370 -63693
7873 -63693 373697 14526 -130832 96425 -168587 103298 137624 -376622 -418553 222330
7863 222330 19793 -264919 -267095 8828 124329 44199 306660 183007 -498181 -757329
7853 -757329 -571325 -524153 -356483 -216548 -330130 -214660 -231900 -280956 -56612 -291453
7843 -291453 -588430 -422647 -507421 -334814 -111078 -19029 -46330 163797 125459 -220703
7833 -220703 192011 8404 -518271 -484831 -924754 -1004545 -774645 -571234 115133 267085
7823 267085 -523503 -761571 -760731 -800410 -326985 -150104 -269961 194383 63251 537882
7813 537882 326862 -294459 -331923 -558084 -1324606 -947080 966688 145271 -137831 -299284
7803b99284J80799K8716m10942J64171j16547L42968j59075M283j58178M83437
7793F0348k39989n8265R7566J42243P8315q8879n27707J94503J03391j10830M21623
7782G2319m68198J16705K87564j10640N669p3906q436K92243m336j09704k33868
7771b34588L25609l11082K9277K74299l53041k48242J80769j53377j02271N09082
7761h3565p8342l65088L6512R6309N2825k58859Q7114L8325P07988P7373o78617
7750c68025o24O7415j02129l4676M2791L26614o9283j4308J15437K7406J40024
7739A30642j17754K16046l32976O400j91782N3364j7649n56579J13984J18015
7729e78289j25605J01883J68978K3945L61983k68713k92381J37812j53917J48114
$$ plain form
7803 -299284 -118485 -89769 -500711 -336540 -453087 -110119 -269194 -264911 -423089 60348
7793 60348 -179641 -237906 -140340 1903 80218 -8661 -536368 -341865 -238474 -349304 72319
7782 72319 -395879 -279174 8390 -102250 -96581 -170487 -178923 113320 108984 -720 -234588
7771 -234588 91021 -220061 -190784 83515 -269526 -517768 -336999 -490376 -592647 -83565
7761 -83565 -161907 -526995 -490483 -394174 -341349 -600208 -513094 -474769 233219 310592 -368025
7750 -368025 -368649 -301234 -403363 -438039 -395248 -68634 -137917 -152225 -36788 -9382 130642
7739 130642 12888 228934 -104042 -97642 -289424 -236060 -253709 -810288 -696304 -578289
7729 -578289 -703894 -602011 -433033 -409088 -47105 -315818 -608199 -470387 -624304 -476190
7719d76190N011K58312O8394j08195K2880k04747K04290k88710K48433P17792
7709D47270l32896m86366J80779P2646j21332j92395l81574N47406J63421j57825
7699b60866j11145R7155j19554M22655M68398l19339l14566k06061N16553J97
7689A73427k52963M5095k76747m87636M5057L61121K79608j42485J57410l7029
7679a35142J1218l21227K93180J81341l8407L60524k64127J42698l89085J89463
7669C0436J19487m79443j47754m3552N51445n7333J691m6644l59450L10941j48914
7658b69090j80055N9520J67505K09900L0498K16626l79596j93333L8318J16536
7648a83171o3093Q899m8250j49520j3250J23456j46459Q6936L15542l8586j59299
$$ plain form
7719 -476190 -471179 -212867 -144473 -252668 -229788 -434535 -230245 -518955 -270522 447270
7709 447270 114374 -371992 -191213 -118567 -239899 -432294 -813868 -266462 -103041 -260866
7699 -260866 -372011 -274856 -394410 28245 496643 177304 -137262 -343323 173230 173427
7689 173427 -79536 -34441 -311188 -798824 -753767 -392646 -113038 -255523 -98113 -135142
7679 -135142 -123924 -445151 -151971 29370 -9037 351487 87360 230058 -159027 30436
7669 30436 149923 -329520 -477274 -520826 30619 -26714 -25023 -71667 -431117 -120176 -269090
7658 -269090 -449145 -389625 -222120 -12220 18278 234904 -144692 -338025 -299707 -183171
7648 -183171 -246264 -237365 -285615 -435135 -448385 -324929 -471388 -384452 -68910 -107496 -266795
7637b66795n48028L8303O78610j59488m090j51209J49385L73980Q522n5851J8570
7626H1909M86208l03591K00479l97365o90874K20897J12381l15852k4480R6686
7616e33602M87693K81290j79263n23568M00720k01104K80782j72107j75675O03802
7606B68968k72789J56084k9343m11081K58159j534J80365l34568L03081J06183
7596B23525L0185r3876m47383l02772L10275p9433K06341K38988l96812K22992
7586h7970q7674o4857K11152K27620K08456r3230m95225j33452m1045J83733J07298
7575f5194K01717j55897n3004M78383J60395p64559l46634L74024J15222k95525
7565c51072K69732k89590m0143L04408q4181K10899j42192j69493L2611k65418
$$ plain form
7637 -266795 -814823 -776520 -97910 -257398 -261488 -412697 -263312 110668 119190 63339 81909
7626 81909 568117 264526 465005 67640 -623234 -402337 -289956 -605808 -630288 -533602
7616 -533602 -45909 235381 56118 -467450 -66730 -267834 12948 -159159 -334834 268968
7606 268968 -3821 152263 122920 -288161 -30002 -31536 148829 -185739 117342 223525
7596 223525 253710 159834 -287549 -590321 -280046 -359479 -153138 85850 -310962 -87970
7586 -87970 -175644 -240501 -29349 198271 406727 313497 -181728 -315180 -356225 -172492 -65194
7575 -65194 136523 -19374 -72378 406005 566400 -198159 -544793 -170769 -55547 -351072
7565 -351072 -81340 -370930 -411073 -106665 -190846 20053 -122139 -291632 -259021 -524439
7555e24439L30902m40970J63716N28760J03834k75575K5624M9004R2668l07318
7545b53794k37632L39046J60228j06860L603L36319q3611j34237k22216J67648
7535c1506J90871K6135J38975k99670l8842n4461J05434q9205o7654J99157j33989
7524e4755m26906K98389j29974R6450k33244m416j86300k45099M83011O069J52153
7513b44622K18895N1972k53733L13509k08038o88601L27136L24810j46522j61673
7503d66867K82040J5131j80717l10168L30549m0264m61585J86359L84160L16064
7493E4702l08364p1025L83196J69075l91309k65710J49347j51465n4510R2399
7483c93664J93610K84811m40965O0239k07065k77553M3212L95446j12209L12213
$$ plain form
7555 -524439 -193537 -634507 -470791 57969 161803 -113772 -88148 -39144 53524 -253794
7545 -253794 -491426 -152380 7848 -99012 -95409 240910 157299 23062 -199154 -31506
7535 -31506 159365 185500 324475 24805 -14037 -68498 36936 -52269 -119923 79234 -54755
7524 -54755 -481661 -183272 -313246 -216796 -450040 -454456 -640756 -885855 -402844 -396775 -244622
7513 -244622 -25727 26245 -227488 86021 -122017 -810618 -483482 -158672 -305194 -466867
7503 -466867 -184827 -169696 -350413 -660581 -330032 -370296 -831881 -645522 -261362 54702
7493 54702 -253662 -324687 58509 227584 -163725 -429435 -280088 -431553 -486063 -393664
7483 -393664 -200054 84757 -356208 -295969 -503034 -780587 -737375 -341929 -454138 -141925
7473a41925j75196n2083K38809M71002k47488l89907k22168j6988M28778k44175
7463c51341J20475L64550j45039j83748j00374K11376l27160j8882L45884o2382
7453a46641j3329k0144n7620j40140J51875m0400l19437J74842M02041P1916l76614
7442c13651n11111N21488J04769J07341j72713J85665J09961K0902K85204l90776
7432e2921j19774k79161j30377L18912N15341j07070J8993Q8199q8419j26637
7422C7086n5200m17915M3497L07828M69580m61409l13421R6235J1241J08575k01789
7411c75692j18722M8925K05241J03330j08856k17672P4292L87653j38802k25021
7401c65324k90328M22842J28890l28513K09652o3522M954j73332J87589K02849
$$ plain form
7473 -141925 -317121 -369204 -130395 340607 93119 -296788 -518956 -535944 -107166 -351341
7463 -351341 -230866 133684 -11355 -195103 -295477 -84101 -411261 -430143 -84259 -146641
7453 -146641 -159970 -180114 -237734 -377874 -225999 -266399 -585836 -410994 -8953 62963 -313651
7442 -313651 -824762 -303274 -198505 -91164 -263877 -78212 31749 52651 337855 -52921
7432 -52921 -172695 -451856 -582233 -263321 252020 144950 163943 252142 163723 37086
7422 37086 -18114 -436029 -392532 -84704 384876 -76533 -389954 -293719 -282478 -173903 -375692
7411 -375692 -494414 -445489 -240248 -136918 -245774 -463446 -389154 -1501 -140303 -365324
7401 -365324 -655652 -232810 -103920 -432433 -222781 -286303 -281349 -454681 -267092 -64243
7391f4243m074j08299l60623L21331L15291n19352L2573j9427p6512K35367M4142
7380b03826m21661j4778J50811J20601J3011N66390N95584m36866q25707J49141
7370c07300J78679L84015j33965m08597j93867K07572P39944k92706k84053K5830
7360h4448l6559J48250m70199K86584L09983o3275j91394k02403O6865l50478
7350e87074k0597L69398J97709n5183j19869j93886L45575J14024J51079K60543
7340D61719l18862L98192r0952j11565R4882K41932m69552j14983q1875M8571
7330E7507l13631k85586M9140l0085M88550K15824l99688k27431L28337O4834
7320e2229M85m56651K60681J70895j04676J19388J22417k65659o6342O42864K06513
$$ plain form
7391 -64243 -68317 -176616 -537239 -215908 99383 -419969 -387396 -406823 -483335 -247968 -203826
7380 -203826 -625487 -640265 -489454 -368853 -355842 210548 806132 369266 -456441 -307300
7370 -307300 -128621 255394 121429 -287168 -481035 -273463 466481 173775 -110278 -84448
7360 -84448 -121007 27243 -442956 -156372 153611 90336 -101058 -303461 -236596 -587074
7350 -587074 -607671 -238273 -40564 -95747 -215616 -409502 -63927 50097 201176 461719
7340 461719 142857 541049 450097 338532 433414 675346 205794 90811 8936 57507
7330 57507 -256124 -541710 -492570 -522655 -34105 181719 -217969 -445400 -117063 -52229
7320 -52229 -51744 -508395 -247714 -76819 -181495 -62107 60310 -205349 -271691 371173 577686
7309E77686l68732j54405K63440k17119m39790L6201J00089l9727J65906L36483
7299B60032j07601o66703R3173o434J8531L63665L52508l85349K42943J11122
7289B75887l76134K43464m36381K22813K26379k84727P8190j59527j42530L31667
7279b0899j2656K41367j91545M88389k5334l38821n97951J76528j46802L52172
7269g5552K3331j15082j5104M02446n97073j10633O5744M07714J14625j26502
7259b6086p4520k32823M30406L3139m3290l98372n427r4180N8839m6596O25053
7248B26143J39452l03160k65009j45676j31369N86053K6697l89018J78873L65366
7238B88352n11112J11038q2244O6261M3162k11311j22678m12515L33325n9299
$$ plain form
7309 577686 208954 54549 317989 100870 -338920 -302719 -202630 -242357 -76451 260032
7299 260032 152431 -514272 -421099 -427533 -409002 -45337 307171 -78178 164765 275887
7289 275887 -100247 143217 -293164 -70351 156028 -128699 -50509 -210036 -352566 -20899
7279 -20899 -33555 207812 16267 504656 479322 140501 -457450 -280922 -427724 -75552
7269 -75552 -52221 -167303 -182407 220039 -377034 -487667 -421923 -14209 100416 -26086
7259 -26086 -100606 -333429 96977 130116 86826 -311546 -316973 -411153 -352314 -398910 226143
7248 226143 365595 62435 -202574 -348250 -479619 106434 133131 -255887 -77014 288352
7238 288352 -222760 -111722 -193966 -127705 -84543 -295854 -418532 -831047 -497722 -557021
7228e57021j3764M14129m24065j49051L68467k828m05658K50573K22619J57468
7218a39131L46557P104k50203k37165j38279M17577m04275m97395K34954K24161
7208d36095q8055k74917P6108M88219L83422l90735r6449L64199j9805p4248l7847
7197a06203J49881r9476l02088N8889m11993J87040N60011j8266L6453R957K1021
7186H5226M3166j83499M20486j86657l122j97424j94832J0830q8679K53597k65080
7175c05988j83073L90599p9185Q6882P7464m85611M18022L30555L5455l67237
7165h2117k63067j96385K00208M41523k2121j69713J3099M3737k16954j13645
7155c65435L68429M12089j22276k20241k38356k85736l8803R3583K80164M26269
$$ plain form
7228 -557021 -570785 -156656 -580721 -729772 -361305 -364133 -769791 -519218 -296599 -139131
7218 -139131 207426 214530 -35673 -272838 -411117 6460 -397815 -895210 -660256 -436095
7208 -436095 -524150 -799067 -722959 -234740 148682 -242053 -338502 25697 5892 -68356 -106203
7197 -106203 43678 -55798 -357886 -298997 -710990 -523950 36061 17795 54248 64205 85226
7186 85226 128392 -55107 365379 178722 175600 -21824 -216656 -205826 -294505 -40908 -305988
7175 -305988 -489061 -98462 -177647 -90765 -13301 -498912 -80890 249665 285120 -82117
7165 -82117 -345184 -541569 -341361 100162 78041 -91672 -78573 -34836 -251790 -365435
7155 -365435 2994 415083 292807 72566 -165790 -451526 -490329 -396746 -116582 309687
7145C09687j68848J0109N6926j86434O407K67762j86843l70788j76959J39639
7135b99342M39700L2339q4163l25063o0779K29646k22429J13685p632k83978l7096
7124e05112P9193J48006n223N7915n9606j85858k52170J35113K36807R5475J85088
7113g0372k13573k44435N69164J1510n70793J04864J10305j7917l360J1105R2804
7102b20698M61949k3720J58678m52418l0450O06179l63081o2244M16447p02367
7092b11725l14139j7072m1939O12888J16677j24025l18212O6528k7417K02053
7082e6383l7446k09598J61408k08823N630J04816J06361J91374j58880p5470j83120
7071c60131q4773O090j18464K33332K42814o4884J74924p998M48507J49600l7687
$$ plain form
7145 309687 140839 150948 207874 21440 27847 295609 108766 -262022 -438981 -299342
7135 -299342 140358 172697 88534 -236529 -297308 -67662 -290091 -176406 -184038 -468016 -505112
7124 -505112 -425919 -277913 -283136 -225221 -284827 -470685 -722855 -587742 -350935 -255460 -70372
7113 -70372 -283945 -528380 40784 52294 -518499 -413635 -303330 -321247 -324607 -313502 -220698
7102 -220698 241251 217531 376209 -76209 -106659 499520 136439 74195 490642 -211725
7092 -211725 -525864 -542936 -584875 28013 144690 20665 -297547 -231019 -258436 -56383
7082 -56383 -93829 -303427 -142019 -350842 -345212 -240396 -134035 57339 -101541 -177011 -360131
7071 -360131 -444904 -438814 -557278 -323946 -81132 -146016 28908 20910 469417 619017 581330
7060E81330l60561L27762j01754m89665J78589k08817K39199o77757n0232M70957
7050i0949k20394j47465k2085J12229K05307J16250L37958K20907l00309J12480
7040C23929j39890J18298k16871j76282L18840q8129m03954j40047L86178m05201
7030d23129M6674L62644q5986n9555j10432o2763M61391k24668J71655j49359
7020g3528k74013J66320n860k28151J94974l4433k15794J58216K54072J89662
7010A31465m32521Q2745L02448K84662j52652l5194q1201K09313L95589l95848
7000C08806p15398M97833n7072o3022J69039l47651J43679L82090k54677m82659
6990d19032J84846L8692n8604M4940K6041K1459J39340j63762j04415J8384J22550
$$ plain form
7060 581330 220769 548531 446777 -42888 135701 -73116 166083 -511674 -561906 -90949
7050 -90949 -311343 -458808 -480893 -368664 -163357 -47107 290851 511758 211449 323929
7040 323929 184039 302337 85466 -90816 228024 139895 -264059 -404106 -17928 -423129
7030 -423129 -376455 -13811 -99797 -159352 -269784 -332547 128844 -95824 75831 -73528
7020 -73528 -347541 -181221 -187081 -415232 -220258 -254691 -470485 -312269 -58197 131465
7010 131465 -301056 -218311 84137 368799 216147 180953 99752 309065 704654 308806
7000 308806 -406592 91241 34169 -28853 140186 -207465 -63786 318304 63627 -419032
6990 -419032 -234186 -195494 -254098 -209158 -183117 -161658 -22318 -186080 -290495 -272111 -149561
6979a49561M48691n16036o07075L68386K85135j7123k14975J51489J06220J63023
6969A8174L01486j75213p298k07922r2489k2159r3454J33769q6007R1348k07180
6958c46945r765L77852l44246N9491J19413O7444q2310M207j20161J12365k97771
6947d60426K5648P72237j51371K9245q8106j52406O2130P50562L35867o92372
6937D31008O6381r1782K37656L36695j43829o47954R407j27571k9309R517k20690
6926a70471M68612m26973N54263k73575j8942j4812N260n3220J3826P1579K83050
6915D38597m76190j30813p503k08337N5764k92292L15972n57771M05527K03378
6905b53668N8475p5335M6340K23441k6747J82519M14629m0576j69923N7793q1000
$$ plain form
6979 -149561 299130 -216906 -823981 -455595 -170460 -187583 -402558 -251069 -144849 18174
6969 18174 319660 144447 137149 -70773 -163262 -185421 -278875 -145106 -231113 -139765 -346945
6958 -346945 -356710 21142 -323104 -263613 -144200 -76756 -159066 -154859 -275020 -162655 -460426
6947 -460426 -434778 337459 186088 215333 127227 -25179 36951 787513 1123380 431008
6937 431008 497389 405607 643263 979958 836129 188175 197582 70011 40702 50219 -170471
6926 -170471 298141 -128832 425431 151856 132914 118102 123362 70142 83968 155547 438597
6915 438597 -37593 -168406 -175909 -384246 -328482 -620774 -304802 -862573 -457046 -253668
6905 -253668 -195193 -270528 -224188 -747 -27494 155025 569654 529078 359155 416948 335948
6894C35948J4110k73731k37726m33343J12296O3175J63200J1170J10704P6291
6884e7906Q5258O8248l80786m4182M9330J66610m3259k41013K4476M2669L13703
6873a6852p393p7680p1760J80456O5080l49520m40487K80787Q3458q7468K63771
6862a77608j38735r5359L06618k6206J27475Q8143o95781K23737L12690n5990
6852a31016l36274k09194K83334J2436n5196K87611l50916L83344J7819r1855
6842a89907p2536M0383K20516j38383j62428q3573N4325N85986m0420N3779J40863
6831D08605j16482J1945l22215J14686k68196k99920J66650j95419N218L41520
6821a53608p8772j0648j3884j95272j65348K18086M37329K56141j7676j10912
$$ plain form
6894 335948 350058 76327 -161399 -594742 -482446 -419271 -256071 -244901 -134197 -57906
6884 -57906 27352 95600 -285186 -329368 -280038 -113428 -156687 -397700 -373224 -330555 -16852
6873 -16852 -24245 -101925 -173685 6771 71851 -277669 -718156 -437369 -353911 -441379 -177608
6862 -177608 -316343 -411702 -105084 -131290 -3815 84328 -611453 -387716 -75026 -131016
6852 -131016 -467290 -676484 -393150 -380714 -435910 -148299 -499215 -115871 -98052 -189907
6842 -189907 -262443 -222060 -1544 -139927 -302355 -385928 -331603 254383 213963 267742 408605
6831 408605 292123 304068 -18147 96539 -171657 -471577 -304927 -500346 -495128 -153608
6821 -153608 -232380 -243028 -256912 -452184 -617532 -399446 37883 294024 276348 165436
6811A65436k55957L685M92244k02439k37505m85951l6833K85785L5821K07764
6801b7950R2032R5368j00042n04531J62380j59749k13932K71312j65157K37885
6791c12384L90298j35863k48390l8653J7659J57096J04138L38270n1361k31872
6781a1062P8172k29759q4731M97221j38548k73011k35429l66023q2717N24533
6771c21354J76588j18575K14576L40638n6716n34365j99662n2781j3031J04072
6761d60610L23202K42462n01942j82578K52810k2896m16256K61220M41578j5852
6751g8862J89626j63219J31600j517o23733Q4014L70783L01439l31146l22577
6741d43592r727K62244J04184K14268R5536n99078k2926J78608J74466m09127
$$ plain form
6811 165436 -90521 -86836 405408 202969 -34536 -520487 -557320 -271535 -235714 -27950
6801 -27950 64082 159450 59408 -445123 -282743 -442492 -656424 -385112 -550269 -312384
6791 -312384 77914 -57949 -306339 -344992 -327333 -170237 -66099 272171 220810 -11062
6781 -11062 67110 -162649 -247380 249841 111293 -161718 -397147 -763170 -845887 -321354
6771 -321354 -144766 -263341 -48765 291873 235157 -299208 -498870 -551651 -564682 -460610
6761 -460610 -137408 105054 -396888 -579466 -326656 -349552 -765808 -504588 -63010 -78862
6751 -78862 110764 -52455 79145 77628 -546105 -462091 -91308 210131 -121015 -443592
6741 -443592 -453319 -191075 -86891 127377 222913 -376165 -399091 -220483 -46017 -455144
6731d55144K71528m88633k35807O04300m43103J52240J95488M01451P0537o3008
6721I849j09167Q4294l09258O3477M97749j64709J99446j45428J73386M03272
6711G02911j43719l08296l53060L7145N2929n2644n8868J31719L74699k93912
6701H8904m3752q5233n7570M60425n13112l04240N78521L52900l19074k37314
6691g9545J11209Q1443j62330J7156m51707m5419K41783K7739J39876M4238l19508
6680c95065m37164N2288K26150K93040J3540M04693k26644q6646J40581j90492
6670b05719O35385j86855k89310J1936k45268L64136k64190j78121K39773m6217
6660a64450j75899M5074K48963L56729k37364q3059r701m48265M72812K94924
$$ plain form
6731 -455144 -183616 -672249 -908056 -303756 -746859 -594619 -399131 2320 72857 9849
6721 9849 -99318 -15024 -324282 -260805 236944 72235 271681 126253 299639 702911
6711 702911 559192 250896 -102164 -65019 -12090 -64734 -123602 8117 382816 88904
6701 88904 45152 -40081 -97651 362774 -150338 -454578 123943 476843 157769 -79545
6691 -79545 31664 113107 -49223 -32067 -483774 -529193 -287410 -259671 -119795 -75557 -395065
6680 -395065 -832229 -779941 -553791 -260751 -247211 157482 -69162 -155808 -15227 -205719
6670 -205719 429666 242811 -46499 -34563 -279831 84305 -179885 -358006 -118233 -164450
6660 -164450 -340349 -295275 -46312 310417 73053 -10006 -19707 -467972 4840 299764
6650B99764o90873j64067k4335L00404K07457q3627L87638k33450J13844l75891
6640b63136j91311j45216j52159O2559L53140J86472K24654j34827j69569P0545
6630a58848q9909M4318J22468O30974l82238j2072L30764q5414k93130J41921
6620B48834j56204J85415o45053L0961N54216l90979K73250L2282m05458K72733
6610cl73677o4322L21897k9039k42701o7566P61359k3794l80563K2699j55356
6599b31066J86996l36640l79984J0665N04612j00125Q7140M5235l6980M97280
6589B47133j8206l66282k77687L00129n3056K36319K30463j46873l47452o57482
6579h52994K71034L63041l05587K47698L84537M9239l55369k6156L84182j69817
$$ plain form
6650 299764 -391109 -555176 -579511 -279107 -71650 -155277 232361 -1089 112755 -263136
6640 -263136 -454447 -599663 -751822 -689263 -336123 -149651 75003 -59824 -229393 -158848
6630 -158848 -248757 -204439 -81971 549003 166765 154693 485457 400043 106913 248834
6620 248834 92630 278045 -367008 -336047 218169 -172810 100440 132722 -272736 -3
6610 -3 -373680 -438002 -116105 -145144 -387845 -455411 305948 282154 -98409 -75710 -231066
6599 -231066 -44070 -380710 -760694 -750029 -245417 -345542 -258402 -213167 -250147 247133
6589 247133 228927 -137355 -415042 -114913 -167969 68350 298813 151940 -195512 -852994
6579 -852994 -581960 -218919 -524506 -276808 107729 156968 -198401 -224557 159625 -10192
6569a0192j66042R3500K01202K5730M4573J30396k69734l24594k06347l92245
6559h73753n0754J50025J18674M10989O2944L7617L84954j70548l67455P57452
6549D60145l72139K32720n18967p8938L37309K79371l01457m26488L95031l06602
6539c00015m02541L30694J75737k0027K26682l2766k37346J14888K40687j52016
6529e6023j41348J60668k92554k77547K51442K05096l32619J16505N10768J10396
6519B54784k38846l30379M98238K60340l93608O8892j03554o2543j63413K89507
6509G9418l926m14261o9683m1043J45937J03399j12757n3133K18471j84364j6763
6498c48705k50560N71201Q9134j21895j48651M9313L46153j57636J14294J42113
$$ plain form
6569 -10192 -176234 -82734 118468 144198 188771 319167 49433 -275161 -481508 -873753
6559 -873753 -924507 -774482 -655808 -244819 -181875 -144258 240696 70148 -297307 460145
6549 460145 88006 320726 -198241 -277179 60130 339501 38044 -388444 6587 -300015
6539 -300015 -702556 -371862 -196125 -216152 10530 -22236 -259582 -144694 95993 -56023
6529 -56023 -197371 -36703 -329257 -606804 -355362 -150266 -482885 -366380 144388 254784
6519 254784 15938 -314441 183797 444137 50529 119421 15867 -46676 -210089 79418
6509 79418 75492 -338769 -408452 -449495 -303558 -200159 -312916 -366049 -147578 -331942 -348705
6498 -348705 -599265 -28064 61070 -60825 -209476 -160163 185990 28354 142648 284761
6488B84761P2473l98711o68787N20529L35496j39423l45171l4720r6707M5313
6478d24947N11051J02029j33054q9646o30712K05849J09359k04803M22272r1292
6468b23894l8578j23854j0336K88797q2162J68873q9282O3306M9141j35901L6809
6457i7081j20447p6925K95847m35019j28876r7890l5284M76994j89507K5849L19514
6446f2825m47675L02526L27388o7639R6766l64257j09716N00761M8815k67292
6436d3148J55582O0187k55048j98975n9890l17252J39887J22948M83075J14500
6426B01866R436m8607J09113Q9949j13788m7092J754k63282R0134J81837o5239
6415A46081l00187K57755M87798k20689J92288m29835J34269j48042N7886k68973
$$ plain form
6488 284761 357234 -41477 -710264 -189735 145761 6338 -338833 -373553 -470260 -424947
6478 -424947 86104 188133 55079 -34567 -665279 -459430 -350071 -554874 -132602 -223894
6468 -223894 -262472 -386326 -396662 -107865 -190027 -21154 -110436 -47130 2011 -133890 -97081
6457 -97081 -217528 -294453 1394 -433625 -562501 -660391 -695675 -218681 -408188 -382339 -62825
6446 -62825 -510500 -207974 119414 51775 148541 -215716 -325432 175329 224144 -43148
6436 -43148 112434 172621 -82427 -281402 -341292 -658544 -518657 -395709 87366 201866
6426 201866 211302 162695 271808 361757 247969 200877 202631 -60651 29483 211320 146081
6415 146081 -154106 103649 591447 370758 563046 133211 267480 119438 177324 -91649
6405i1649O5005P04403m12423k34644k01813Q8550m9910J76188l20132k6800r9363
6394d02588J56392K38007k57872l23318J44582L79132Q7547l43588J70691k2182
6384a73197p3920M71506m38832k07649M25488m0988L28520m5905l42049n71474
6374f68500L98117J42304j40907n6930k47709q1027j38693K45327L63954J10326
6364g3738J49346L15542k9402o74433J47171j85865j25034M99373K52844l07380
6354c1576k03437L12917o5889J63115R8736K7403l97247K91999j38595j12125
6344e4699j89075j02156m03496K03974L40001L40145J5386J37186O6232j22911
6334B30587k54999j40926K75275l98620R1154L65101L44202o54647k44747j60872
$$ plain form
6405 -91649 -26644 677759 265336 30692 -171121 -82571 -132481 43707 -276425 -303225 -402588
6394 -402588 -246196 -8189 -266061 -589379 -444797 -65665 21882 -321706 -151015 -173197
6384 -173197 -247117 224389 -214443 -422092 3396 -37592 290928 245023 -97026 -668500
6374 -668500 -270383 -128079 -268986 -325916 -573625 -654652 -793345 -548018 -184064 -73738
6364 -73738 75608 391150 361748 -312685 -165514 -351379 -476413 22960 275804 -31576
6354 -31576 -235013 77904 12015 175130 273866 301269 -95978 196021 57426 -54699
6344 -54699 -243774 -345930 -749426 -545452 -205451 134694 150080 287266 353498 230587
6334 230587 -24412 -165338 109937 -288683 -197529 167572 511774 -142873 -387620 -548492
6324e48492j31484J022844k76617l86797J37352J70969j72687P1994o4124J76673
6314c69m1618N70134m11772l37816K8672o8116K71372K35121j82263k00957K63993
6303A26381q4548J5844l16569L87528l88034M67357M1972m31406j9838j3903j62494
6292c77710l9113L81320L19460J2425k94245j26259j77833J17797K71127J65533
6282B52502j16420n6674k43220J24669M8306K47852m8139J75348J73830k78512
6272B79542k09894k2699J50641m15702j28718j13767K6411M00912J61184l07547
6262a79637l35419K42807j37793P2865K07183l30423n5131J09070J79361P4746
6252a52371M1112j69236J41086k05430k69367J89444K10294n8370k40307K00786
$$ plain form
6324 -548492 -679976 342868 66251 -320546 -183194 -12225 -184912 -112918 -177042 -369
6314 -369 -41987 528147 116375 -221441 -192769 -260885 10487 245608 63345 -137612 126381
6303 126381 41833 57677 -258892 128636 -259398 207959 249931 -181475 -201313 -215216 -377710
6292 -377710 -416823 -35503 283957 296382 2137 -124122 -301955 -184158 86969 252502
6282 252502 136082 79408 -163812 -39143 9163 257015 208876 384224 558054 279542
6272 279542 69648 46949 197590 -218112 -346830 -460597 -434186 -33274 127910 -179637
6262 -179637 -515056 -272249 -410042 -337177 -129994 -460417 -515548 -406478 -227117 -152371
6252 -152371 -111259 -280495 -139409 -344839 -614206 -424762 -214468 -272838 -513145 -312359
6242c12359J52367M9318K833o10691R767M30381J63357K5216K56507n45132n9526
6231d37962k75260M00211J75517R6144J84716l15503K48621l21643j72478P60403
6221C42766l05073p23835K89443L78204O395j27586q094N0626j71185r8652L60600
6210f391J33758j81577k69420M27690J00910j0058K73491l15853l92343L79033
6200A39240J70699j90779l3192K68961K09973k3743k05130M18157l11238k62642
6190A80306k44323j30426j11336J23479N8854M19739K42921l55802j66069l83268
6180c65925J94911J64751k56754k71649p3532L01428M82800P6270o16821k24837
6170e89358J54785O3677O07397J09875l17201O2891q3602n74159J62195J54227
$$ plain form
6242 -312359 -159992 -110674 -107841 -718532 -708765 -278384 -115027 -89811 166696 -378436 -437962
6231 -437962 -713222 -313011 -137494 -41350 143366 -172137 76484 -245159 -417637 342766
6221 342766 37693 -686142 -396699 -18495 -12100 -139686 -147780 -97154 -268339 -366991 -6391
6210 -6391 127367 -54210 -323630 104060 204970 194912 468403 152550 -239793 139240
6200 139240 309939 119160 85968 354929 564902 541159 336029 754186 442948 180306
6190 180306 -64017 -194443 -305779 -182300 -123446 296293 539214 183412 17343 -365925
6180 -365925 -171014 -6263 -263017 -534666 -608198 -306770 176030 252300 -364521 -589358
6170 -589358 -434573 -370896 236501 346376 29175 92066 8464 -565695 -403500 -249273
6160b49273N07613M55022j09367p32331L76323r7196k94300k4977k42555L19501
6150i1540M00026n22436K09596J12632R8444K41578n61223l45070k7171J07371
6140c77793M20950L23586o26908j75832j5642O47886J83712r9919l63296K70251
6130A86995l13601k60752M68271J27189k91605m4775J987k40371k4466L97651
6120F523L6199k40272j93534L85724L10055j00491k46164M36008k11638l57392
6110a74982J35677L16254L93985k89151m14202N0115r303j89356K17489j55154
6100a18628J64996l85332p4875Q0759J6895j97049M3944o9938K51605P1375k12251
6089d28499P5867N54579L63514j65859k9882l5158K20803o6489k13822p75947
$$ plain form
6160 -249273 258340 713362 603995 -128336 247987 150791 -143509 -168486 -411041 -91540
6150 -91540 308486 -213950 -4354 108278 206722 448300 -112923 -457993 -485164 -377793
6140 -377793 43157 366743 -260165 -435997 -451639 196247 379959 280040 -83256 186995
6130 186995 -126606 -387358 80913 208102 -83503 -128278 -126291 -366662 -391128 6523
6120 6523 42722 -197550 -391084 -5360 304695 204204 -41960 394048 182410 -174982
6110 -174982 -39305 276949 670934 381783 -32419 17696 8393 -180963 36526 -118628
6100 -118628 46368 -338964 -413839 -333080 -316185 -513234 -469290 -539228 -287623 -216248 -428499
6089 -428499 -352632 201947 565461 399602 369720 334562 555365 488876 275054 -500893
6079e00893K58983M48624P4499j73056l20795K54480L09512n79399K38872R3797
6069A04624J60079j73617m28494K05535K0875L88675l60190l6509O2940K02155
6059A46073j68812k21907N6667l76330K83298n7325J77337N06791m33669o6119
6049a53996K90437J69094l83791k3238P94403l02061k67867j94200K0752n50375
$$ plain form
6079 -500893 -241910 206714 281213 108157 -212638 41842 351354 -228045 10827 104624
6069 104624 264703 91086 -337408 -131873 -110998 277677 -82513 -119022 -56082 146073
6059 146073 -22739 -244646 -187979 -564309 -281011 -338336 -160999 345792 -87877 -153996
6049 -153996 136441 305535 -78256 -101494 692909 390848 122981 -71219 -50467 -600842
$$ [...]
##END NTUPLES=NMR SPECTRUM
##END=
