##TITLE=1H_CA-9244-1k
 CDCl3
 8 sc, 
 11.3.2024
##JCAMPDX= 6.0         $$ Bruker NMR JCAMP-DX V2.0
##DATA TYPE= NMR SPECTRUM
##DATA CLASS= NTUPLES
##ORIGIN= UXNMR, Bruker Analytische Messtechnik GmbH
##OWNER= root
$$ XWIN-NMR		Version 3.5
$$ Mon Mar 11 13:50:49 2024 Russian Standard Time (UT+4h)  she@DPX200
##.OBSERVE FREQUENCY= 200.1313
##.OBSERVE NUCLEUS= ^1H
##.ACQUISITION MODE= SIMULTANEOUS
##.ACQUISITION SCHEME= undefined
##.AVERAGES= 8
##.DIGITISER RES= 18
##SPECTROMETER/DATA SYSTEM= spect
##.PULSE SEQUENCE= zg30
##.SOLVENT NAME= CDCl3
##.SHIFT REFERENCE= (INTERNAL, CDCl3, 0, 15.4031)
##AUDIT TRAIL= $$ (NUMBER, WHEN, WHO, WHERE, WHAT)
$$ ##TITLE= Audit trail, XWIN-NMR		Version 3.5
$$ ##JCAMPDX= 5.01
$$ ##ORIGIN= Bruker BioSpin GmbH
$$ ##OWNER= she
$$ F:/spectra/data/she/nmr/H-F/1/pdata/1/auditp.txt
$$ ##AUDIT TRAIL=  $$ (NUMBER, WHEN, WHO, WHERE, WHAT)
(   1,<2024-03-11 13:49:00.60 +0400>,<she>,<DPX200>,
      <created by zg, POWCHK disabled, PULCHK disabled
       configuration hash MD5:
       00 E9 B6 7A A2 85 ED C7 34 08 36 98 17 FE 4E 26
       data hash MD5: 16K
       A6 92 70 8D 82 2E 28 D4 E7 B0 71 F2 1C CE 84 72>)
(   2,<2024-03-11 13:49:03.07 +0400>,<she>,<DPX200>,
      <Start of raw data processing
       efp BC_mod = 2 LB = 0.24 FT_mod = 6 PKNL = 1 PHC0 = -25105.49 PHC1 = 8.98731 SI = 16K 
       data hash MD5: 16K
       8D 85 58 C8 BE 36 5B 8D E6 5D 82 47 8D FA 96 4A>)
(   3,<2024-03-11 13:49:22.71 +0400>,<she>,<DPX200>,
      <pk PHC0 = -191.5621 PHC1 = -0.8 
       data hash MD5: 16K
       1F 3D F7 81 E9 03 B3 50 D9 B5 1E DD 40 46 6C 73>)
(   4,<2024-03-11 13:49:26.37 +0400>,<she>,<DPX200>,
      <abs ABSG = 5 
       data hash MD5: 16K
       D0 FD D4 7E D3 9C 44 A7 CA A1 BC 32 24 E8 63 94>)
$$ ##END=
$$ 
$$ hash MD5
$$ 6C 9A 46 2B C7 38 80 1C C9 08 5D 86 71 8F 08 EB
##$RELAX= 
##$RELAX= 
##$RELAX= 
##$RELAX= 
##$RELAX= 
##$RELAX= 
$$ Bruker specific parameters
$$ --------------------------
##$DU= <F:/spectra>
##$EXPNO= 1
##$NAME= <H-F>
##$PROCNO= 1
##$TYPE= <nmr>
##$USER= <she>
##$AMP= (0..31)
100 100 100 100 100 100 100 100 100 100 100 100 100 100 100 100 100 100 
100 100 100 100 100 100 100 100 100 100 100 100 100 100 
##$AQSEQ= 0
##$AQ_mod= 1
##$AUNM= <au_zg>
##$AUTOPOS= <>
##$BF1= 200.13
##$BF2= 200.13
##$BF3= 200.13
##$BF4= 200.13
##$BF5= 200.13
##$BF6= 200.13
##$BF7= 200.13
##$BF8= 200.13
##$BYTORDA= 1
##$CFDGTYP= 0
##$CFRGTYP= 5
##$CHEMSTR= <none>
##$CNST= (0..31)
1 1 145 1 1 1 1 1 1 1 1 1 1 1 1 1 1 1 1 1 1 1 1 1 1 1 1 1 1 1 1 1 
##$CPDPRG= <>
##$CPDPRG1= <>
##$CPDPRG2= <>
##$CPDPRG3= <>
##$CPDPRG4= <mlev>
##$CPDPRG5= <mlev>
##$CPDPRG6= <mlev>
##$CPDPRG7= <mlev>
##$CPDPRG8= <mlev>
##$CPDPRGB= <>
##$CPDPRGT= <>
##$D= (0..31)
0 1.2 0 0 0 0 0 0 0 0.06 0 0.03 0 0 0 0 0.0002 0 0 0 0 0 0 0 0 0 0 0 0 
0 0 0 
##$DATE= 1710150540
##$DBL= (0..7)
120 120 120 120 120 120 120 120 
##$DBP= (0..7)
150 150 150 150 150 150 150 150 
##$DBP07= 0
##$DBPNAM0= <>
##$DBPNAM1= <>
##$DBPNAM2= <>
##$DBPNAM3= <>
##$DBPNAM4= <>
$$ [...]
##$SUBNAM3= <"">
##$SUBNAM4= <"">
##$SUBNAM5= <"">
##$SUBNAM6= <"">
##$SUBNAM7= <"">
##$SUBNAM8= <"">
##$SUBNAM9= <"">
##$SW= 18.0517328524113
##$SWIBOX= (0..15)
0 0 2 0 0 0 0 0 0 0 0 0 0 0 0 0 
##$SW_h= 3612.71676300578
##$TD= 16384
##$TD0= 1
##$TE= 0
##$TE2= 300
##$TE3= 300
##$TEG= 300
##$TL= (0..7)
0 120 120 120 120 120 120 120 
##$TP= (0..7)
150 150 150 150 150 150 150 150 
##$TP07= 0
##$TPNAME0= <>
##$TPNAME1= <>
##$TPNAME2= <>
##$TPNAME3= <>
##$TPNAME4= <>
##$TPNAME5= <>
##$TPNAME6= <>
##$TPNAME7= <>
##$TPOAL= (0..7)
0.5 0.5 0.5 0.5 0.5 0.5 0.5 0.5 
##$TPOFFS= (0..7)
0 0 0 0 0 0 0 0 
##$TUNHIN= 0
##$TUNHOUT= 0
##$TUNXOUT= 0
##$USERA1= <user>
##$USERA2= <user>
##$USERA3= <user>
##$USERA4= <user>
##$USERA5= <user>
##$V9= 5
##$VALIST= <valist>
##$VCLIST= <CCCCCCCCCCCCCCC>
##$VD= 0
##$VDLIST= <DDDDDDDDDDDDDDD>
##$VPLIST= <PPPPPPPPPPPPPPP>
##$VTLIST= <TTTTTTTTTTTTTTT>
##$WBST= 1024
##$WBSW= 4
##$XGAIN= (0..3)
0 0 0 0 
##$XL= 0
##$YL= 0
##$YMAX_a= 295504
##$YMIN_a= -400218
##$ZGOPTNS= <>
##$ZL1= 120
##$ZL2= 120
##$ZL3= 120
##$ZL4= 120
##$ABSF1= 15.48246
##$ABSF2= -2.569389
##$ABSG= 5
##$ABSL= 3
##$ALPHA= 0
##$AQORDER= 0
##$ASSFAC= 0
##$ASSFACI= 0
##$ASSFACX= 0
##$ASSWID= 0
##$AUNMP= <proc_1d>
##$AZFE= 0.1
##$AZFW= 0.1
##$BCFW= 0
##$BC_mod= 2
##$BYTORDP= 0
##$COROFFS= 0
##$CY= -3
##$DATMOD= 1
##$DC= 0
##$DFILT= <>
##$DTYPP= 0
##$F1P= 0
##$F2P= 0
##$FCOR= 1
##$FTSIZE= 16384
##$FT_mod= 6
##$GAMMA= 0
##$GB= 0
##$INTBC= 1
##$INTSCL= 3.70164e-10
##$ISEN= 128
##$LB= 0.24
##$LEV0= 0
##$LPBIN= 0
##$MAXI= 10000
##$MC2= 0
##$MEAN= 0
##$ME_mod= 0
##$MI= 1.114404
##$NCOEF= 0
##$NC_proc= -7
##$NLEV= 6
##$NOISF1= 3.799351
##$NOISF2= 2.8
##$NSP= 0
##$NTH_PI= 0
##$NZP= 0
##$OFFSET= 15.40313
##$PC= 1
##$PHC0= -25297.05
##$PHC1= 8.18731
##$PH_mod= 1
##$PKNL= yes
##$PPARMOD= 0
##$PSCAL= 0
##$PSIGN= 0
##$REVERSE= no
##$SF= 200.130023730637
##$SI= 16384
##$SIGF1= 3
##$SIGF2= 2
##$SINO= 5.538805
##$SIOLD= 16384
##$SREGLST= <1H.CDCl3>
##$SSB= 0
##$STSI= 16384
##$STSR= 0
##$SW_p= 3612.71676300578
##$SYMM= 0
##$S_DEV= 0
##$TDeff= 16384
##$TDoff= 0
##$TI= <>
##$TILT= no
##$TM1= 0
##$TM2= 0
##$TOPLEV= 0
##$USERP1= <user>
##$USERP2= <user>
##$USERP3= <user>
##$USERP4= <user>
##$USERP5= <user>
##$WDW= 1
##$XDIM= 16384
##$YMAX_p= 478521559
##$YMIN_p= -667849
$$ End of Bruker specific parameters
$$ ---------------------------------
##NTUPLES= NMR SPECTRUM
##VAR_NAME=  FREQUENCY,     SPECTRUM/REAL,   SPECTRUM/IMAG
##SYMBOL=    X,             R,               I
##VAR_TYPE=  INDEPENDENT,   DEPENDENT,       DEPENDENT
##VAR_FORM=  AFFN,          ASDF,            ASDF
##VAR_DIM=   16384,         16384,           16384
##UNITS=     HZ,            ARBITRARY UNITS, ARBITRARY UNITS
##FACTOR=    0.220516191357247, 1,           1
##FIRST=     3082.62868789851, 0,            0
##LAST=      -530.088075107267, 0,           0
##MIN=       -530.088075107267, -667849,     0
##MAX=       3082.62868789851, 478521559,    0
$$ Real data points
##PAGE= N=1
##DATA TABLE= (X++(R..R)), XYDATA
$$ [...]
$$ plain form
12100 -217532 46130 -86983 -23565 56951 -67423 -54165 81990 -105696 -192447 -126992
12090 -126992 33797 7827 -58971 61165 -76887 -279555 -76340 -116241 -255961 -99156
12080 -99156 126098 68423 45548 42982 145187 106233 66452 43481 83374 162075 -64017
12069 -64017 -21115 253855 43821 -108453 203166 190393 158660 -18564 -360498 -139519
12059 -139519 -88684 -229247 -324550 -200319 185755 64627 -49274 -48216 -58504 -322235
12049 -322235 -229612 28177 215556 116285 119874 4025 28326 28483 30747 56757 -35154 -78729
12037 -78729 -37257 24127 -30948 74666 96848 -218074 -254739 -153474 -242940 -278032 -56033
12026 -56033 243624 102324 13282 56013 172932 945 -43040 -47190 -39767 118531 -124545
$$ packed form
12100b17532K63662j33113O3418Q0516j24374J3258J36155j87686q6751O5455
12090a26992J60789k5970o6798J20136j38052k02668K03215l9901j39720J56805
12080i9156K25254n7675k2875k566J02205l8954l9781k2971L9893P8701k26092
12069f4017M2902K74970k10034j52274L11619j2773l1733j77224l41934K20979
12059a39519N0835j40563r5303J24231L86074j21128j13901J058j0288k63731
12049c22235R2623K57789J87379r9271L589j15849K4301J57K264K6010r1911m3575
12037g8729M1472O1384n5075J05614K2182l14922l6665J01265q9466l5092K21999
12026e6033K99657j41300q9042M2731J16919j71987m3985m150P423J58298k43076
$$ plain form
12015 -124545 -74919 -52168 -47449 22913 -57384 77777 21730 9664 30863 99121 -108367
12004 -108367 -66890 -2436 -5703 -10273 -173940 -11290 -43986 -33017 144626 -106340 -108292
11993 -108292 75246 71783 180331 85799 27184 55968 87899 -85620 -113485 -243389 -189411
11982 -189411 6483 -71134 -49357 -151567 -175819 -232744 -160604 -128670 48370 151906 31242
11971 31242 57689 69057 217694 302249 253375 107086 162141 20198 -100408 187275 259555
11960 259555 206667 33922 101631 194253 322543 19941 156399 62226 -200651 -207243 -232462
11949 -232462 -205095 -268045 -239589 -114290 34668 19537 50204 -42873 -183187 -96180 25326
11938 25326 76762 -128999 -82389 -529 58893 10133 98135 262917 199055 182447 75102
$$ packed form
12015a24545M9626K2751M719P0362q0297J35161n6047j2066K1199O8258k07488
12004a08367M1477O4454l267m570j63667J62650l2696J0969J77643k50966j952
11993a08292J83538l463J08548r4532n8615K8784L1931j73519k7865j29904N3978
11982a89411J95894p7617K1777j02210k4252n6925P2140L1934J77040J03536j20664
11971C1242K6447J1368J48637Q4555m8874j46289N5055j41943j20606K87683P2280
11960B59555n2888j72745O7709R2622J28290l02602J36458r4173k62877o592k5219
11949b32462K7367o2950K8456J25299J48958j5131L0667r3077j40314Q7007J21506
11938B5326N1436k05761M6610Q1860N9422m8760Q8002J64782o3862j6608j07345
$$ plain form
11927 75102 133512 112002 -90247 -209723 -22137 143023 276805 234937 21220 -32591
11917 -32591 97570 107376 -38058 -16880 102891 1091 15198 -70770 34904 14875 30122
11906 30122 140181 56966 -53515 -140988 10481 10250 -102925 -95960 -150094 -165350 -108126
11895 -108126 -76112 -153340 -189351 4510 187747 75240 72568 1077 -157025 -142770 164120
11884 164120 57676 65571 96613 -134205 16772 -15478 -102972 -145705 -199654 -118677 10966
11873 10966 134712 40039 88765 76238 71358 52796 -60833 32761 -52829 136915 206937
11862 206937 18952 66541 189104 478958 354813 152295 195754 91387 129804 -42388
11852 -42388 18051 30263 138743 81735 128993 16078 -160003 -28165 77287 39874 70085
$$ packed form
11927G5102N8410k1510k02249j19476J87586J65160J33782m1868k13717n3811
11917c2591J30161R806j45434K1178J19771j01800J4107q5968J05674k0029J5247
11906C0122J10059q3215j10481q7473J51469k31j13175O965n4134j5256N7224
11895a08126L2014p7228l6011J93861J83237j12507k672p1491j58102J4255L06890
11884A64120j06444P895L1042k30818J50977l2250q7494m2733n3949Q0977J29643
11873A0966J23746r4673M8726j2527m880j8562j13629R3594q5590J89744P0022
11862B06937j87985M7589J22563K89854j24145k02518M3459j04367L8417j72192
11852d2388O0439J2212J08480n7008M7258j12915j76081J31838J05452l7413L0211
$$ plain form
11841 70085 141644 238118 212216 -9547 84980 99833 250495 54329 54977 -16019 -115205
11830 -115205 -141116 -87961 -250814 -156845 -198743 -182434 -83530 -36609 -27589 -117301 -196658
11819 -196658 -252704 -64880 -12745 -29549 -164986 -162064 -185419 -186301 -107937 -197356 -84680
11808 -84680 167828 17787 -51020 -20767 60233 -14344 -75436 19768 69501 -113585 -14422
11797 -14422 -67520 103221 107083 -237148 -197177 -35802 156528 125802 46852 150020 120018
11786 120018 -108320 -333394 -231870 -38207 -27583 7824 58396 204101 212691 -66926
11776 -66926 -49209 -212163 -406218 -228527 50273 67100 -24814 -39432 -43924 81616 116971
11765 116971 -29134 -165856 -212487 -195917 -242928 -7146 241042 239972 30225 -24088 -59555
$$ packed form
11841G0085P1559R6474k5902k21763R4527J4853J50662j96166O48p0996r9186
11830a15205k5911N3155j62853R3969m1898J6309R8904M6921R020q9712p9357
11819a96658n6046J87824N2135j6804j35437K922k3355q82P8364q9419J12676
11808h4680K52508j50041o8807L0253Q1000p4577o1092R5204M9733j83086R9163
11797a4422n3098J70741L862l44231L9971J61375J92330l0726p8950J03168l0002
11786A20018k28338k25074J01524J93663J0624L5407N0572J45705Q590k79617
11776f6926J7717j62954j94055J77691K78800J6827r1914j4618m492J25540L5355
11765A16971j46105j36722m6631J6570m7011K35782K48188j070k09747n4313l5467
$$ plain form
11754 -59555 -262009 -217151 23270 150605 -38802 -181150 -11973 218807 125398 115202
11744 115202 193793 81750 1622 133089 -56578 62696 136799 185622 1335 -100081
11734 -100081 -215886 -287196 -215590 -163392 -88335 111265 120295 13318 83324 -75517 -73621
11723 -73621 -143725 -21174 30859 -46381 -209014 -127311 -67923 46901 77529 119698 191048
11712 191048 147698 92434 -55382 24319 20825 -63992 -121016 24494 -111323 -114294 -20155
11701 -20155 -125457 -127969 -100796 59584 58414 64537 82794 -17863 13705 34233 21642 139878
11689 139878 257069 186856 -213890 -220535 25625 -65197 116221 49880 18227 -46489 -92078
11678 -92078 -58547 156552 140384 -158744 -89624 -136768 -30380 -65614 63423 170701 -55076
$$ packed form
11754e9555k02454M4858K40421J27335j89407j42348J69177K30780r3409j0196
11744A15202P8591j12043q0128J31467j89667J19274P4103M8823j84287j01416
11734a00081j15805p1310P1606N2198P5057J99600R030j06977P0006j58841J896
11723g3621p0104J22551N2033p7240j62633Q1703N9388J14824L0628M2169P1350
11712A91048m3350n5264j47816P9701l494q4817n7024J45510j35817k971R4139
11701b0155j05302k512K7173J60380j170O123J8257j00657L1568K0528j2591J18236
11689A39878J17191p0213m00746o645K46160r0822J81418o6341l1653o4716m5589
11678i2078L3531K15099j6168k99128O9120m7144J06388l5234J29037J07278k25777
$$ plain form
11667 -55076 -72901 -38305 -29479 -24553 -108657 -37079 -182303 -62934 145354 22446 -30438
11656 -30438 -115319 -73160 -87866 -71784 -266914 -174349 21740 -1313 158480 49869 19790
11645 19790 -29040 29391 -84126 -106831 -165501 -85482 142937 128459 97869 195162 286709
11634 286709 268074 149256 32363 -2390 70385 54303 154885 78074 -76082 2226 -1149
11623 -1149 225184 109824 -152939 -207943 2834 -36710 -93993 -48171 -39320 -89669 -84151
11612 -84151 16394 -16269 -205094 -121197 -214241 -324871 -236916 6256 62897 -170001 -73397
11601 -73397 -63520 -85733 -59186 64018 -151343 -169336 -36297 -67198 -102878 -222353 -59604
11590 -59604 -123999 -135810 -152765 -148189 -21528 79053 -223779 -85232 172061 165608 86597
$$ packed form
11667e5076j7825L4596Q826M926q4104P1578j45224J19369K08288j22908n2884
11656c0438q4881M2159j4706J6082j95130R2565J96089k3053J59793j08611l0079
11645A9790m8830N8431j13517k2705n8670Q0019K28419j4478l0590R7293R1547
11634B86709j8635j18818j16893l4753P2775j6082J00582p6811j54156P8308l375
11623a149K26333j15360k62763n5004K10777l9544n7283M5822Q851n0349N518
11612h4151J00545l2663j88825Q3897r3044j10630Q7955K43172N6641k32898R6604
11601g3397R877k2213K6547J23204k15361j7993J33039l0901l5680j19475J62749
11590e9604o4395j1811j6955M576J26661J00581l02832J38547K57293o453p9011
$$ plain form
11579 86597 37285 117298 168526 207858 169614 208986 -99435 -79950 105891 240411 159442
11568 159442 -112607 -271210 35826 174143 93935 -113841 -158406 -219096 -67472 -17394
11558 -17394 -137187 -182969 -54321 -4851 -163505 -166547 -50096 35273 53871 8216 77783
11547 77783 211393 189356 84758 -110919 -160505 -82846 70284 78360 140198 152771 168530
11536 168530 130898 -25261 -8781 -67461 -23042 82267 2479 5139 -7596 -136989 -226064
11525 -226064 -114531 -131508 133098 142766 5128 -36693 61734 113426 287234 38026 -47607
11514 -47607 44741 -122604 -209041 12345 61 -136682 -132199 -138879 42430 39244 46451 -46070
11502 -46070 68760 26176 -12520 -22180 -114561 94821 46056 220117 166809 128119 206754
$$ packed form
11579H6597m9312Q0013N1228L9332l8244L9372l08421J9485J85841J34520q0969
11568A59442k72049j58603L07036J38317q0208k07776m4565o0690J51624N0078
11558a7394j19793m5782J28648M9470j58654l042J16451Q5369J8598m5655O9567
11547G7783J33610k2037j04598j95677m9586P7659J53130Q076O1838J2573J5759
11536A68530l7632j56159J6480n8680M4419J05309p9788K660j2735j29393q9075
11525b26064J11533j6977K64606R668j37638m1821R8427N1692J73808k49208q5633
11514d7607R2348j67345q6437K21386j2284j36743M483o680J81309l186P207r2521
11502d6070J14830m2584l8696r660r2381K09382m8765J74061n3308l8690P8635
$$ plain form
11491 206754 96708 141958 55604 61902 82032 151637 133515 60299 18815 191119 1706
11480 1706 -141817 -90684 -47392 -85365 71339 329154 32883 -160565 -106625 -176398 -14799
11469 -14799 40021 24399 13983 83606 101048 99418 -37378 -178420 -181486 -28517 141686
11458 141686 79731 4924 -9781 41076 -12807 4086 26442 99755 -101249 -250753 62203
11447 62203 69858 -53529 -81462 77141 250995 124465 9829 12092 -186891 -62830 65336
11436 65336 83528 129414 164258 206335 28024 -136326 -213758 -141703 -69061 22532 -42251
11425 -42251 -44623 -45331 -173982 -143344 79518 -114421 -159536 -101963 -14616 78580 85204 178478
11413 178478 84040 -27412 -203324 -224684 -167621 -73936 139623 85653 -82420 -8986 47645
$$ packed form
11491B06754j10046M5250q6354O298K0130O9605j8122p3216m1484J72304j89413
11480A706j43523N1133M3292l7973J56704K57815k96271j93448N3940o9773J61599
11469a4799N4820j5622j0416O9623J7442j630j36796j41042l066J52969J70203
11458A41686o1955p4807j4705N0857n3883J6893K2356P3313k01004j49504L12956
11447F2203P655j23387k7933J58603J73854j26530j14636K263j98983J24061J28166
11436F5336J8192M5886L4844M2077j78311j64350p7432P2055P2642R1593o4783
11425d2251k372p08j28651L0638K22862j93939m5115N7573Q7347R3196O624R3274
11413A78478r4438j11452j75912k1360N7063R3685K13559n3970j68073P3434N6631
$$ plain form
11402 47645 59735 83858 131777 -140304 -40695 -140009 -193463 -80699 -29932 105389 51211
11391 51211 -251309 -372071 -146422 20696 -37245 -99582 -49555 177413 165826 -118842
11381 -118842 78499 114730 68020 -27026 217231 342276 61806 -138580 -92134 -54503
11371 -54503 -185592 -143603 -76997 98808 127657 -24542 -26986 -134645 -178264 -137809 -170832
11360 -170832 -191685 172357 355196 252942 -49920 -140071 49243 105542 -75750 -134164
11350 -134164 -68736 16501 -59710 -55297 -139784 -51036 -197229 -185907 89617 -62017 -29014
11339 -29014 11750 -139626 -206148 -250518 -244613 -110806 -231000 -144284 -74615 38940 100221
11328 100221 -43827 -68187 127494 271118 207250 195861 -51873 -218231 -50744 -115898
$$ packed form
11402D7645J2090K4123M7919k72081R9609r9314n3454J12764N0767J35321n4178
11391E1211l02520j20762K25649J67118n7941o2337N0027K26968j1587k84668
11381a18842J97341L6231m6710r5046K44257J25045k80470k00386M6446L7631
11371e4503j31089M1989O6606J75805K8849j52199k444j07659m3619M0455l3023
11360a70832k0853L64042J82839j02254l02862r0151J89314N6299j81292n8414
11350a34164O5428Q5237p6211M413q4487Q8748j46193J1322K75524j51634L3003
11339b9014M0764j51376o6522m4370N905J33807j20194Q6716O9669J13555O1281
11328A00221j44048k4360J95681J43624o3868j1389k47734j66358J67487o5154
$$ plain form
11318 -115898 -226006 -134599 37166 -51578 -72514 -17957 106395 189383 52247 155855
11308 155855 19528 -65590 -120547 49636 161755 88580 32721 91943 80351 20603 20222
11297 20222 -34585 -117462 -25350 -81259 -129955 76597 34004 112934 140155 53148 -110446
11286 -110446 -15874 -47677 45580 132986 -68775 -22183 66761 46164 -50453 -63748 14600
11275 14600 80954 156013 102254 125244 115481 174152 -37149 -87955 -170150 -177414 -190211 -11346
11263 -11346 101940 128060 -32383 -86493 -55096 98062 328519 247500 230973 -6550 -63899
11252 -63899 34523 8315 329043 208567 -25645 147616 76180 -60034 -10860 38731 -66314
11241 -66314 172478 194399 65241 177567 -42590 -89538 -9697 21735 155970 -64201
$$ packed form
11318a15898j10108R1407J71765q8744k0936N4557J24352Q2988j37136J03608
11308A55855j36327q5118n4957J70183J12119p3175n5859N9222j1592n9748l81
11297B0222n4807q2877R2112n5909m8696K06552m2593P8930K7221q7007j63594
11286a10446R4572l1803R3257Q7406k01761M6592Q8944k0597r6617j3295P8348
11275A4600O6354P5059n3759K2990r763N8671k11301n0806q2195p264j2797J78865
11263a1346J13286K6120j60443n4110L1397J53158K30457q1019j6527k37523n7349
11252f3899R8422k6208L20728j20476k34212J73261p1436j36214M9174M9591j05045
11241f6314K38792K1921j29158J12326k20157m6948P9841L1432J34235k20171
$$ plain form
11231 -64201 -94871 -5398 190 85211 62915 131193 177540 432749 305146 231709 182455
11220 182455 6116 -11822 103090 61886 -41016 215168 147610 82667 -92040 -107414
11210 -107414 -68836 -10965 -156999 -177027 -149942 -162210 -128765 -154139 -122876 -150064 -279864
11199 -279864 -90278 -52313 -109320 -38448 -192497 -124848 41941 139552 227846 158277 -16384
11188 -16384 -165980 -99999 -232215 -104933 -111209 -183484 -148710 -305378 -31469 -106995 -203122
11177 -203122 -47266 -293103 -91798 -77109 62858 59491 -163311 -15049 -12311 131617
11167 131617 201085 16135 18277 64069 79304 -130447 -222117 -241547 -132505 114665 144701
11156 144701 98866 103059 -192276 -39749 44895 7348 -1769 171967 72886 -41634 89880
$$ packed form
11231f4201l0670Q9473N588Q5021k2296O8278M6347K55209j27603p3437m9254
11220A82455j76339j7938J14912m1204j02902K56184o7558o4943j74707j5374
11210a07414L8578N7871j46034k0028K7085j2268L3445k5374L1263k7188j29800
11199b79864J89586L7965n7007P0872j54049O7649J66789R7611Q8294o9569j74661
11188a6384j49596O5981j32216J27282o276p2275L4774j56668K73909p5526r6127
11177b03122J55856k45837K01305J4689J39967l367k22802J48262K738J43928
11167A31617O9468j84950K142M5792J5235k09751r1670j9430J09042K47170L0036
11156A44701m5835M193k95335J52527Q4644l7547r117J73736r9081j14520J31514
$$ plain form
11145 89880 6938 146414 141776 25547 -140255 9657 38732 -112920 -167825 205409 43119
11134 43119 -37520 -105856 -117985 -133825 -72362 90805 -14071 -37237 -109599 68371 143671
11123 143671 -6213 -33401 -176955 -42876 -35854 -34583 -39739 -157594 -127440 -103116 -226907
11112 -226907 -166363 -110748 -30706 -156915 -319133 -114121 -4505 43183 -66564 -18901
11102 -18901 18718 36969 44992 -154532 -30638 -19366 -73758 -103010 -20718 143625 216363
11091 216363 142079 342124 225482 11428 167739 75854 -12929 -34662 -65222 196604
11081 196604 193481 154190 7659 -65736 -28170 96810 117721 172676 147230 -113651 -53686
11070 -53686 6400 1251 26954 119396 -1469 -63822 67426 93663 78768 142684 -112047
$$ packed form
11145H9880q2942J39476m638j16229j65802J49912K9075j51652n4905L73234j62290
11134D3119q0639o8336j2129j5840O1463J63167j04876k3166p2362J77970P5300
11123A43671j49884k7188j43554J34079P022J271n156j17855L0154K4324j23791
11112b26907O0544N5615Q0042j26209j62218K05012J09616M7688j09747M7663
11102a8901L7619J8251Q023j99524J23894J1272n4392k9252Q2292J64343P2738
11091B16363p4284K00045j16642k14054J56311r1885q8783k1733l0560K61826
11081A96604l123l9291j46531p3395L7566J24980K0911N4955k5446k60881N9965
11070e3686O0086n149K5703R2442j20865o2353J31248K6237j4895O3916k54731
$$ plain form
11059 -112047 -52344 -299526 -419835 -153574 -52386 -33710 -83157 -41535 25447 -35682 80908
11048 80908 -4222 267046 327315 97989 78914 -100118 -144932 -105329 -161517 -70500 56609
11037 56609 94028 -82858 34988 264247 2903 29829 76212 152585 128930 215847 125601
11026 125601 -233298 -272648 -95960 -48221 -131870 -86240 -221924 -179119 -243531 -72441 119110
11015 119110 275665 272756 150035 177065 184457 161913 135373 -40012 -121753 10101 -86595
11004 -86595 32623 120318 165695 91565 79197 211444 140185 -108971 -321605 -328109 -235420
10993 -235420 -975 193090 90686 64344 73396 29861 82423 120326 -130537 -273052 -233086
10982 -233086 -106280 -178390 -242300 -283783 -122407 45067 5770 79762 10956 38928 79372
$$ packed form
11059a12047N9703k47182j20309K66261J01188J8676m9447M1622O6982o1129J16590
11048H0908q5130K71268O0269k29326j9075j79032m4814L9603n6188R1017J27109
11037E6609L7419j76886J17846K29259k61344K6926M6383P6373k3655Q6917r0246
11026A25601l58899l9350J76688M7739q3649M5630j35684M2805o4412J71090J91551
11015A19110J56555k909j22721K7030P392k2544k6540j75385q1741J31854r6696
11004h6595J19218Q7695M5377p4130j2368J32247p1259k49156k12634o504R2689
10993b35420K34445J94065j02404k6342R052m3535N2562L7903k50863j42515L9966
10982b33086J26806p2110o3910m1483J61376J67474l9297P3992o8806K7972M0444
$$ plain form
10971 79372 87047 49066 99709 -44687 -101076 -210696 -351118 -174385 -100116 -76693 22787
10960 22787 61461 121833 -33682 -21363 23364 167249 36536 -30968 138394 237970 111783
10949 111783 130774 451813 231530 295078 35070 -91620 21141 -153094 -32466 -2900
10939 -2900 50896 -59665 124778 87666 91200 -21278 -61947 -23774 -249333 -184253 -133240
10928 -133240 -119522 -144253 -53900 -43936 92858 -148861 -59685 17760 91108 -271237 -124622
10917 -124622 -10550 -234775 -167372 -411341 -162185 95745 164709 160412 128308 157525 104527
10906 104527 250980 305947 286922 204887 127862 57447 -80019 -86481 -176051 -109037 186990
10895 186990 -33221 -252130 -7255 188624 -63504 -106091 -12489 -253912 -266348 -55539
$$ packed form
10971G9372P675l7981N0643j44396n6389j09620j40422J76733P4269K3423R9480
10960B2787L8674O0372j55515J2319M4727J43885j30713o7504J69362R9576j26187
10949A11783J8991L21039k20283O3548k60008j26690J12761j74235J20628K9566
10939b900N3796j10561J84443l7112L534j12478m0669L8173k25559O5080N1013
10928a33240J3718k4731R0353R964J36794k41719Q9176P7445P3348l62345J46615
10917a24622J14072k24225O7403k43969K49156K57930O8964m297l2104K9217n2998
10906A04527J46453N4967j9025q2035p7025p0415j37466o462q9570O7014K96027
10895A86990k20211k18909K44875J95879k52128m2587R3602k41423j2436K10809
$$ plain form
10885 -55539 -37010 -114820 19836 244379 45425 14289 157203 -57950 -8870 78303 197466
10874 197466 180750 86822 151545 35913 -49086 7887 168410 -16421 -160930 -110810 -203269
10863 -203269 -246183 -113225 -27095 -61550 -87087 -83474 -48627 43658 -123438 -143608 39677
10852 39677 -5768 -46852 44825 -64384 -187958 120887 110900 36171 10352 -178263 -130050
10841 -130050 -78757 -31622 135127 65611 128033 20576 3079 -216684 -113741 22431
10831 22431 -6499 59166 216419 -66332 994 162851 170215 180252 100791 69638 692
10820 692 69530 256226 69551 -70135 121499 46617 -49702 107284 7836 4921 1169
10809 1169 2160 -37918 -165020 -162086 -175026 -48033 79458 59296 -33360 192477 -28145
$$ packed form
10885e5539J8529p7810J34656K24543j98954l1136J42914k15153M9080Q7173J19163
10874A97466j6716r3928O4723j15632q4999N6973J60523j84831j44509N0120r2459
10863b03269m2914J32958Q6130l4455k5537L613L4847R2285j67096k0170J83285
10852C9677m5445m1084R1677j09209j23574L08845r987p4729k5819j88615M8213
10841a30050N1293M7135J66749o9516O2422j07457j7497k19763J02943J36172
10831B2431k8930O5665J57253k82751O7326J61857P364J0037p9461l1153o8946
10820F92O8838J86696j86675j39686J91634p4882r6319J56986r9448k915l752
10809A169R91m0078j27102K934j2940J26993J27491k0162r2656K25837k20622
$$ plain form
10798 -28145 -90058 6688 109426 9883 173285 110140 104469 239309 -38370 120967 62844
10787 62844 -14293 -38216 47077 291634 219712 300659 110813 622 80592 -82902 -100694
10776 -100694 48902 19940 -107537 -26200 20754 159019 -16618 -61406 -133790 -183635 14836
10765 14836 -83079 -58849 -18892 234437 168540 83466 51760 69596 -10264 -9261 -83253 81515
10753 81515 171405 -105325 -122720 -171486 -51458 126828 78269 199409 205118 17078 63462
10742 63462 75084 360375 175379 140787 118738 117096 -229808 -174886 5607 -82955 -44266
10731 -44266 -90249 -233375 -294753 -15008 -153321 -168968 -126752 -80640 -152813 -105568 -356928
10720 -356928 -323681 -251731 -66467 57941 138160 166872 221563 288187 256389 81012 -216458
$$ packed form
10798b8145o1913R6746J02738r9543J63402o3145n671J34840k77679J59337n8123
10787F2844p7137k3923Q5293K44557p1922Q0947j89846j10191P9970j63494j7792
10776a00694J49596k8962j27477Q1337M6954J38265j75637m4788p2384m9845J98471
10765A4836r7915K4230L9957K53329o5897q5074l1706J7836p9860J003p3992J64768
10753H1515Q9890k76730j7395m8766J20028J78286m8559J21140N709j88040M6384
10742F3462J1622K85291j84996l4592k2049j642l46904N4922J80493q8562L8689
10731d4266m5983j43126o1378K79745j38313j5647M2216M6112p2173M7245k51360
10720c56928L3247P1950J85264J24408Q0219K8712N4691O6624l1798j75377k97470
$$ plain form
10709 -216458 40364 -9420 -22476 62498 -117822 -89708 -138847 -6490 54098 46519 75842
10698 75842 75480 -176750 -57316 80590 -43786 54552 13859 38137 20240 145668 46413
10687 46413 -177232 55917 104024 -42079 -34917 -165439 -253761 -109980 -12990 40916 148204
10676 148204 4024 -137434 -50492 -178942 -168085 -23511 -12532 -130166 -149939 -250367
10666 -250367 -33884 44946 -282401 -25342 8149 144191 328609 360836 337721 264895
10656 264895 147260 -8115 49182 16681 -155250 -69008 -115469 -153501 -289860 -181903
10646 -181903 -121408 -144236 -138058 -184285 -40007 -64321 -48857 -56417 50929 107232 -80505
10635 -80505 -27820 -75999 -9231 15150 65625 137307 30266 6902 -49053 60860 286673
$$ packed form
10709b16458K56822m9784j3056Q4974j80320K8114m9139J32357O0588p579K9323
10698G5842l62k52230J19434J37906j24376R8338m0693K4278j7897J25428r9255
10687D6413k23645K33149M8107j46103P162j30522q8322J43781R6990N3906J07288
10676A48204j44180j41458Q6942j28450J0857J44574J0979j17634j9773j00428
10666b50367K16483P8830l27347K57059L3491J36042J84418L2227k3115p2826
10656B64895j17635j55375N7297l2501j71931Q6242m6461l8032j36359J07957
10646a81903O0495k2828O178m6227J44278k4314J5464p560J07346N6303j87737
10635h0505N2685m8179O6768K4381N0475P1682j07041k3364n5955J09913K25813
$$ plain form
10624 286673 216642 230682 243540 155518 47603 180426 151640 63942 -28219 -78421 -41170
10613 -41170 39403 18394 32410 25536 -32410 -4026 41850 11057 8343 191988 241603 245817
10601 245817 281571 310440 134667 233903 -13044 -113613 -158222 -177711 -59818 -155502 -12819
10590 -12819 11818 -31473 -79838 226347 118389 -8975 14520 -51546 192447 317539 79065
10579 79065 -165971 72302 -71975 -215952 -186611 -36085 -33459 58510 -26489 41087 213327
10568 213327 126336 101023 36233 47965 155067 114904 146399 86104 151360 30500 46894
10557 46894 -57702 -26747 271672 251854 106597 113117 127754 35136 177657 -151614 42416
10546 42416 -12453 161781 238211 134492 300188 231232 123293 30530 -181690 10117
$$ packed form
10624B86673p0031J4040J2858q8022j07915J32823k8786q7698r2161n0202L7251
10613d1170Q0573k1009J4016o874n7946K8384M5876l0793k714J83645M9615M214
10601B45817L5754K8869j75773R9236k46947j00569m4609j9489J17893r5684J42683
10590a2819K4637m3291m8365L06185j07958j27364K3495o6066K43993J25092k38474
10579G9065k45036K38273j44277j43977K9341J50526K626R1969q4999O7576J72240
10568B13327q6991k5313o4790J1732J07102m0163L1495o0295O5256j20860J6394
10557D6894j04596L0955K98419j9818j45257O520J4637r2618J42521l29271J94030
10546D2416n4869J74234P6430j03719J65696o8956j07939r2763k12220J91807
$$ plain form
10536 10117 70920 -135126 122624 385925 362193 104750 75303 154187 80949 36730 -60374
10525 -60374 192430 203982 -154867 666 11186 79922 65562 -30306 31007 178200 45681
10514 45681 -156797 137212 152008 11848 -106746 -121108 -29323 -17553 79177 175067 216458
10503 216458 144986 133007 106826 273059 80550 69662 -160985 45550 135726 86238 -69089
10492 -69089 144164 -33128 -89176 -12253 109215 -64692 19813 88404 -51476 262070
10482 262070 320158 284268 138152 201043 -6331 -54259 1474 210213 42481 -45431 -37568
10471 -37568 -1897 137799 171547 142262 165702 129131 -2209 -154578 -65099 -236323 -51265
10460 -51265 -87786 59954 54699 17220 -11010 -28546 -136978 -178855 -179512 -56953 91787
$$ packed form
10536A0117O0803k06046K57750K63301k3732k57443k9447P8884p3238m4219r7104
10525f0374K52804J1552l58849J55533J0520O8736j4360r5868O1313J47193j32519
10514D5681k02478K94009J4796j40160j18594j4362R1785J1770R6730R5890M1391
10503B16458p1472j1979k6181J66233j92509j0888k30647K06535R0176m9488j55327
10492f9089K13253j77292n6048P6923J21468j73907Q4505O8591j39880L13546
10482B62070N8088l5890j46116O2891k07374m7928N5733K08739j67732q7912P863
10471c7568L5671J39696L3748k9285K3440l6571j31340j52369Q9479j71224J85058
10460e1265l6521J47740n255l7479k8230j7536j08432m1877o57J22559J48740
$$ plain form
10449 91787 201569 30561 116092 297445 148027 138454 172341 21387 -69414 169348 151514
10438 151514 57864 -7884 134010 222909 215914 374861 321137 127297 61820 -44141 19741
10427 19741 -15695 119953 129094 156632 267673 199799 126584 -29608 -20735 168421 48647
10416 48647 -25408 -202666 -112965 137193 262111 315440 121149 73332 -150384 50275
10406 50275 16840 35113 122389 66952 162221 13018 -55361 -59184 -21239 -52151 6175 126235
10394 126235 55019 -5243 -34189 1404 107013 -6161 -45303 -59688 97751 93435 -71083
10383 -71083 -62066 39688 49311 271039 338125 237727 257827 232321 312286 484741 366154
10372 366154 121412 -86877 -49469 148487 120848 -3016 -8610 -86817 26302 32998 97975
$$ packed form
10449I1787J09782j71008Q5531J81353j49418r573L3887j50954r0801K38762j7834
10438A51514r3650o5748J41894Q8899o995J58947n3724j93840o5477j05961O3882
10427A9741l5436J35648R141K7538J11041o7874p3215j56192Q873J89156j19774
10416D8647p4055j77258Q9701K50158J24918N3329j94291m7817k23716K00659
10406E0275l3435J8273Q7276n5437R5269j49203o8379l823L7945l0912N8326J20060
10394A26235p1216o0262k8946L5593J05609j13174l9142j4385J57439m316j64518
10383g1083R017J01754R623K21728O7086j00398K0100k5506P9965J72455j18587
10372C66154k44742k08289L7408J97956k7639j23864n594p8207J13119O696O4977
$$ plain form
10361 97975 -38080 -18846 111269 -46658 -79261 -432 117231 92604 39756 33984 335602
10350 335602 448276 307472 141467 132233 46554 133932 76788 144453 286861 128812 57316
10339 57316 225200 267347 221062 267022 233916 78126 213610 199465 119173 151600 61713
10328 61713 -17644 58002 29232 -52927 104998 191515 110678 -109773 -80237 38748 28144
10317 28144 81963 -31761 529 206669 330600 308418 267913 365277 356750 350442 278789
10306 278789 -9483 -119388 66088 65481 202668 285251 148540 115242 6491 -28191 156737
10295 156737 64950 97244 128746 154448 107269 102043 252252 292839 122510 187328 132316
10284 132316 24364 258394 307742 193818 -12061 68024 86159 25832 76372 174868 320776
$$ packed form
10361I7975j36055J9234J30115j57927l2603P8829J17663k4627n2848n772L01618
10350C35602J12674j40804j66005r234q5679Q7378n7144O7665J42408j58049p1496
10339E7316J67884M2147m6285M5960l3106j55790J35484j4145q0292L2427q9887
10328F1713p9357P5646k8770q2159J57925Q6517q0837k20451K9536J18985j0604
10317B8144N3819j13724L2290K06140J23931k2182m0505R7364q527o308p1653
10306B78789k88272j09905J85476o07J37187Q2583j36711l3298j08751l4682J84928
10295A56737r1787L2294L1502K5702m7179n226J50209M0587j70329O4818n5012
10284A32316j07952K34030M9348j13924k05879Q0085J8135o0327N0540R8496J45908
$$ plain form
10273 320776 341340 253212 97928 238458 464612 531712 575082 473364 347634 493009
10263 493009 612210 532838 333650 276832 233562 154327 254173 191928 31985 240692 273253
10252 273253 45175 236673 205180 235566 275712 307616 180377 283847 346273 293729 381821
10241 381821 401962 281752 179493 105739 49985 423940 500770 547812 464464 556695 591095
10230 591095 463820 225700 56096 263197 458962 353685 248621 284852 302398 326742
10220 326742 338654 326599 193386 166746 363052 257562 179863 139362 288612 160844
10210 160844 111547 26417 146037 288414 190272 309865 75038 89151 185972 280043 59553
10199 59553 46963 198100 177682 345744 101614 62124 130636 127335 245759 256753 225740
$$ packed form
10273C20776K0564q8128j55284J40530K26154O7100M3370j01718j25730J45375
10263D93009J19201p9372j99188n6818m3270p9235R9846o2245j59943K08707L2561
10252B73253k28078J91498l1493L0386M0146L1904j27239J03470O2426n2544Q8092
10241C81821K0141j20210j02259p3754n5754L73955P6830M7042q3348R2231L4400
10230E91095j27275k38120j69604K07101J95765j05277j05064L6231J7546K4344
10220C26742J1912j2055j33213k6640J96306j05490p7699m0501J49250j27768
10210A60844m9297q5130J19620J42377r8142J19593k34827J4113R6821R4071k20490
10199E9553j2590J51137k0418J68062k44130l9490O8512l301J18424J0994l1013
$$ plain form
10188 225740 339821 235493 212255 113650 24214 124799 145218 128300 159680 405208 134152
10177 134152 329251 216663 201033 207071 220849 330619 375549 308842 345707 262376 136927
10166 136927 87508 -33259 188934 506513 383367 453190 279056 288619 321894 305257 376719
10155 376719 234005 310796 403742 345026 142389 26895 113494 -3369 -48726 38919 63647
10144 63647 127882 203344 185477 180430 357030 261679 379921 536319 484810 297546 369735
10133 369735 306305 330354 609987 591669 504115 369301 419750 460414 389532 423463 598813
10122 598813 783027 509322 253173 397075 652657 458138 510566 700040 683215 752356
10112 752356 675927 553024 614868 433953 589227 706863 732588 856742 727778 793095
$$ packed form
10188B25740J14081j04328k3238r8605q9436J00585K0419j6918L1380K45528k71056
10177A34152J95099j12588j5630O038J3778J09770M4930o6707L6865q3331j25449
10166A36927m9419j20767K22193L17579j23146O9823j74134R563L3275j6637P1462
10155C76719j42714P6791R2946n8716k02637j15494Q6599j16863m5357Q7645K4728
10144F3647O4235P5462j7867n047J76600r5351J18242J56398n1509j87264P2189
10133C69735o3430K4049K79633j8318q7554j34814N0449M0664p0882L3931J75350
10122E98813J84214k73705k56149J43902K55582j94519N2428J89474j6825O9141
10112G52356p6429j22903O1844j80915J55274J17636K5725J24154j28964O5317
$$ plain form
10102 793095 1074176 1004076 777718 744025 729729 785077 799199 657129 591973 783057 989781
10091 989781 762357 609725 754355 919301 1006709 837852 986971 934751 885170 817557
10081 817557 1001713 1257187 1240924 1241278 1386188 1334301 1065787 1155259 1066303 1088918 1194158
10070 1194158 1346912 1640267 1719639 1767946 1932552 2189505 2520910 2303948 2246911 2131293
10060 2131293 2115176 2031492 2060788 2078787 1848368 1785439 1676459 1449940 1297528 1299682 1378377
10049 1378377 1442954 1502442 1387344 1609318 1778911 1638158 1508488 1369087 1518788 1453997
10039 1453997 1425609 1687305 1869765 1912810 2035896 2337514 2255609 2384297 2657232 2884244
10029 2884244 2796580 2675358 2801047 2971972 3096413 2893023 2743785 2827174 2604959 2309974
$$ packed form
10102G93095K81081p0100k26358l3693j4296N5348J4122j42070o5156J91084K06724
10091I89781k27424j52632J44630J64946Q7408j68857J49119n2220m9581o7613
10081H17557J84156K55474j6263L54J44910n1887k68514Q9472q8956K2615J05240
10070A194158J52754K93355P9372M8307J64606K56953L31405k16962n7037j15618
10060B131293j6117q3684K9296J7999k30419o2929j08980k26519j52412K154P8695
10049A378377O4577N9488j15098K21974J69593j40753j29670j39401J49701o4791
10039A453997k8388K61696J82460M3045J23086L01618q1905J28688K72935K27012
10029B884244q7664j21222J25689J70925J24441k03390j49238Q3389k22215k94985
$$ plain form
10019 2309974 2401344 2417583 2353709 2222318 2209107 2349559 2265733 2507061 2599876 2741520
10009 2741520 3133692 3271959 3597224 3904063 4437552 5018854 5230271 5522958 5611395 5710007
9999 5710007 5741799 5476393 4958529 4339684 4014907 3398845 3057536 2820453 2769338 2661483
9989 2661483 2283264 2138281 2009793 1895407 2073754 1849797 1863155 1729734 1745868 1641680
9979 1641680 1594829 1645547 1617410 1617609 1562316 1581323 1403303 1348402 1467519 1344172 1211511
9968 1211511 1295438 1304749 1149217 1238514 1170859 1253329 1217319 1332042 1464874 1486879 1654167
9957 1654167 1542237 1509035 1500262 1407824 1547362 1544365 1620177 1597162 1727457 1637234 1612886
9946 1612886 1639238 1446181 1299454 1582788 1643375 1638971 1381311 1281734 1389177 1404065 1422821
$$ packed form
10019B309974R1370J6239o3874j31391j3211J40452q3826K41328R2815J41644
10009B741520L92172J38267L25265L06839N33489N81302K11417K92687Q8437R8612
9999E710007L1792k65406n17864o18845l24777o16062l41309k37083n1115j07855
9989B661483l78219j44983j28488j14386J78347k23957J3358j33421J6134j04188
9979A641680m6851N0718k8137J99n5293J9007j78020n4901J19117j23347j32661
9968A211511Q3927R311j55532Q9297o7655Q2470l6010J14723J32832K2005J67288
9957A654167j11930l3202q773r2438J39538k997P5812k3015J30295r0223k4348
9946A612886K6352j93057j46727K83334O0587m404k57660r9577J07443J4888J8756
$$ plain form
9935 1422821 1481539 1430235 1475741 1620495 1540254 1568074 1562860 1678874 1699078 1909894 1613770
9924 1613770 1622540 1726454 1846861 1780978 1880673 2064367 1958626 1871542 1942949 2011285 2016878
9913 2016878 1984245 1942613 1977306 1929574 2097203 2150225 1879635 2162171 2253448 2098023 2173298
9902 2173298 2316384 2401471 2265967 2231322 2289808 2305890 2375420 2253606 2458116 2585636
9892 2585636 2636150 2468991 2695037 2738763 2763420 2608179 2488566 2691274 2798213 2633266
9882 2633266 2504293 2447310 2519995 2559150 2642923 2828168 2870677 2700836 2863329 2965008
9872 2965008 2958814 3026148 3056604 3060466 2984397 2820075 2866731 2762308 2857107 3028349 2886294
9861 2886294 2813849 2873563 3152929 3352013 3439639 3211163 3145929 3239587 3304420 3359498 3539477
$$ packed form
9935A422821N8718n1304M5506J44754q0241K7820n214J16014K0204K10816k96124
9924A613770Q770J03914J20407o5883R9695J83694j05741q7084P1407O8336N593
9913B016878l2633m1632L4693m7732J67629N3022k70590K82536R1277j55425P5275
9902B173298J43086Q5087j35504l4645N8486J6082O9530j21814K04510J27520
9892B585636N0514j67159K26046M3726K4657j55241j19613K02708J06939j64947
9882B633266j28973n6983P2685L9155Q3773J85245M2509j69841J62493J01679
9872B965008o194O7334L0456L862p6069j64322M6656j04423R4799J71242j42055
9861B886294p2445N9714K79366J99084Q7626k28476o5234R3658O4833N5078J79979
$$ plain form
9850 3539477 3625467 3571555 3608586 3540933 3616950 3731172 3656878 3782580 3927499 3858772 3865949
9839 3865949 4112309 4158288 4289744 4143115 4027115 4283801 4475917 4477331 4440081 4585150
9829 4585150 4506635 4601982 4659369 4727771 4778227 4748877 5065459 5247610 5296730 5461839 5567356
9818 5567356 5593412 5765767 5783189 5965455 5959775 5974435 6123448 6358763 6471558 6802581
9808 6802581 6904489 6961126 7014599 7201129 7127296 7267098 7534435 7741840 8054202 8408309
9798 8408309 8538963 8665482 8777166 9104391 9251130 9494155 9812821 9950380 9919744 10196151
9788 10196151 10774441 10828097 11255749 11494939 11673262 11937955 12271762 12542402 12814085 13217810
9778 13217810 13354274 13592611 14243798 14750824 14858623 15179115 15399770 15582040 16097102
$$ packed form
9850C539477Q5990n3912L7031o7653P6017J14222p4294J25702J44919o8727P177
9839C865949K46360M5979J31456j46629j16000K56686J92116J414l7250J45069
9829D585150p8515R5347N7387O8402N0456k9350L16582J82151M9120J65109J05517
9818E567356K6056J72355J7422J82266n680J4660J49013K35315J12795L31023
9808F802581J01908N6637N3473J86530p3833J39802K67337K07405L12362L54107
9798H408309J30654J26519J11684L27225J46739K43025L18666J37559l0636K76407
9788A0196151N78290N3656M27652K39190J78323K64693L33807K70640K71683M03725
9778A3217810J36464K38337O51187N07026J07799L20492K20655J82270N15062
$$ plain form
9769 16097102 16630719 16919696 17283339 17753947 18424990 19099652 19429672 19878131 20548275
9760 20548275 20995108 21576723 22399627 22973640 23708332 24285878 25018270 25710396 26554473
9751 26554473 27396184 28082990 29065833 29927634 30987630 32202548 33250323 34351844 35480600
9742 35480600 36881649 38318259 39596861 41014318 42661772 44442575 46491015 48489305
9734 48489305 50542966 53112066 55882997 58999278 62762070 67199112 71487448 74826450
9726 74826450 78064879 81703052 84997691 87613869 89268386 90459737 92293918 94541616
9718 94541616 96892871 99889836 104181222 110504367 119409566 131787982 147550198 167819378
9710 167819378 193685128 223594934 250000631 267192094 281262607 296416195 306364171
$$ packed form
9769A6097102N33617K88977L63643M70608O71043O74662L30020M48459O70144
9760B0548275M46833N81615Q22904N74013P34692N77546P32392O92126Q44077
9751B6554473Q41711O86806R82843Q61801J059996J214918J047775J101521J128756
9742C5480600J401049J436610J278602J417457J647454J780803K048440J998290
9734D8489305K053661K569100K770931L116281L762792M437042M288336L339002
9726G4826450L238429L638173L294639K616178J654517J191351J834181K247698
9718I4541616K351255K996965M291386O323145Q905199J2378416J5762216K0269180
9710A67819378K5865750K9909806K6405697J7191463J4070513J5153588R947976
$$ plain form
9703 306364171 307455142 297853395 280880232 266176677 250624546 226635661 198985653
9696 198985653 175813048 159476904 148847883 141927183 137263827 133822965 131612625 130356390
9688 130356390 129036236 126957997 124838257 122945548 122174514 121721068 121735140 123481429 127567441
9679 127567441 134252443 144434220 158385049 177647659 202870495 233328412 261461586
9672 261461586 279351736 292660804 307681542 318248348 318417206 305981460 284823469
9665 284823469 264980087 245369264 217148998 183881344 154289903 131194193 114132083
9658 114132083 101198531 91336235 83429393 77183491 71820269 67508995 63580951 60026728
9650 60026728 57172648 54429585 51808372 49230953 46673375 44227423 41632951 39385354
$$ packed form
9703C06364171J090971r601747j6973163j4703555j5552131k3988885k7650008
9696A98985653k3172605j6336144j0629021o920700m663356l440862k210340j256235
9688A30356390j320154k078239k119740j892709p71034m53446J4072J746289M086012
9679A27567441O685002J0181777J3950829J9262610K5222836L0457917K8133174
9672B61461586J7890150J3309068J5020738J0566806J68858j2435746k1157991
9665B84823469j9843382j9610823k8220266l3267654k9591441k3095710j7062110
9658A14132083j2933552r862296p906842o245902n363222m311274l928044l554223
9650F0026728k854080k743063k621213k577419k557578k445952k594472k247597
$$ plain form
9642 39385354 37380076 35448901 34120609 32881366 31646131 30378143 29498890 28735558
9634 28735558 27876871 27034371 26228282 25647909 24583134 23760677 22955345 22097431 21505511
9625 21505511 20755024 20249568 19691991 19270493 18987944 18731591 18680691 18410995 18022276 17210198
9615 17210198 16591898 16289563 16065899 15411160 15060813 14898747 14770765 14368596 14298198 14335018
9605 14335018 14385619 14419598 14276586 13875567 13261111 12557682 11952586 11407934 10956251 10479518
9595 10479518 10073173 9713603 9428083 9376623 9150544 9045622 8884871 8826583 8727946 8483288
9585 8483288 8294284 8133450 7744469 7591243 7639827 7475900 7160748 7076954 6885346 6851170
9575 6851170 6578464 6646683 6579099 6059737 5996419 6042621 6015895 6156915 6083914 6019073 5745887
$$ packed form
9642C9385354k005278j931175j328292j239243j235235j267988q79253p63332
9634B8735558q58687q42500q06089n80373j064775q22457q05332q57914n91920
9625B1505511p50487n05456n57577m21498k82549k56353n0900k69696l88719q12078
9615A7210198o18300l02335k23664o54739l50347j62066j27982m02169p0398L6820
9605A4335018N0601L3979j43012m01019o14456p03429o05096n44652m51683m76733
9595A0479518m06345l59570k85520n1460k26079j04922j60751n8288r8637k44658
9585H483288j89004j60834l88981j53226M8584j63927l15152q3794j91608l4176
9575F851170k72706O8219o7584n19362o3318M6202k6726J41020p3001o4841k73186
$$ plain form
9564 5745887 5545845 5531539 5529199 5437025 5056697 5082869 5023583 5002176 5033638 4992573 4948706
9553 4948706 4815088 4704275 4715022 4619412 4717436 4731722 4774246 4861930 4914951 4813711 4676077
9542 4676077 4482411 4289535 4371134 4498690 4339853 4255583 4311656 4023176 3886992 3850728
9532 3850728 3980239 4001369 4086777 4170924 4068066 4042270 3922594 3952202 4106121 4257579
9522 4257579 4139772 4049690 4153890 4206699 4376082 4494240 4514263 4525721 4498396 4385651
9512 4385651 4413033 4389803 4291005 4203080 3949204 3944082 3868157 3493986 3470110 3390991 3396306
9501 3396306 3486862 3522480 3455635 3340129 3196037 3271353 3477586 3367586 3415458 3373218 3391301
9490 3391301 3295151 3332933 3340475 3503732 3768719 3779244 3920207 3838550 3805554 3848107 3990457
$$ packed form
9564E745887k00042j4306k340r2174l80328K6172n9286k1407L1462m1065m3867
9553D948706j33618j10813J0747r5610R8024J4286M2524Q7684N3021j01240j37634
9542D676077j93666j92876Q1599J27556j58837q4270N6073k88480j36184l6264
9532C850728J29511K1130Q5408Q4147j02858k5796j19676K9608J53919J51458
9522D257579j17807r0082J04200N2809J69383J18158K0023J1458k7325j12745
9512D385651K7382k3230r8798q7925k53876n122p5925l74171k3876p9119N315
9501C396306R0556L5618o6845j15506j44092P5316K06233j10000M7872m2240J8083
9490C391301r6150L7782P542J63257K64987J0525J40963q1657l2996M2553J42350
$$ plain form
9479 3990457 4369242 4424811 4243748 4330586 4239306 4267624 4150668 4022888 3914929 3742980
9469 3742980 3637831 3403631 3338309 3298605 3119144 3028186 3089269 2748833 2593973 2592407 2813538
9458 2813538 2928165 2882103 2890253 2848801 2668608 2814168 2958680 3089775 3138209 2967600
9448 2967600 3493654 3626532 3877640 3996987 4149406 4426515 4597681 4641743 4627820 4580189
9438 4580189 4353879 3990154 3918548 3866307 3673370 3607658 3468759 3228658 3030629 3047358
9428 3047358 3016471 3061655 3069147 3055586 2989807 2998479 3043039 2992320 3006683 2896801 2857374 3042443
9416 3042443 2956977 2940108 3133104 3293660 3258488 3469642 3563130 3758076 3785055 3969117
9406 3969117 4467906 4388848 4443193 4646647 4604029 4624085 4698290 4805718 4680535 4191397
$$ packed form
9479C990457L78785N5569j81063Q6838r1280K8318j16956j27780j07959j71949
9469C742980j05149k34200o5322l9704j79461r0958O1083l40436j54860j566K21131
9458B813538J14627m6062Q150m1452j80193J45560J44512J31095M8434j70609
9448B967600N26054J32878K51108J19347J52419K77109J71166M4062j3923m7631
9438D580189k26310l63725p1606n2241j92937o5712j38899k40101j98029J6729
9428C047358l0887M5184P492j3561o5779Q672M4560n0719J4363j09882l9427J85069
9416C042443q5466j6869J92996J60556l5172K11154R3488J94946K6979J84062
9406C969117M98789p9058N4345K03454m2618K0056P4205J07428j25183m89138
$$ plain form
9396 4191397 4244930 4195764 4096431 4158098 4111202 4127597 4039276 4080046 4072149 3812807 3646076
9385 3646076 3618532 3657502 3701774 3479485 3328462 3312054 3325013 3232238 3360060 3326308 3356091
9374 3356091 3494182 3471376 3562466 3504189 3723625 3529366 3564097 3735157 3921859 3837082
9364 3837082 3629319 3696873 3819067 3764253 3836234 3912370 3896546 4076904 4190376 4220542 4333077
9353 4333077 4356647 4410364 4426526 4502311 4636722 4902248 5402985 5377520 5216945 5362101
9343 5362101 5412591 5574376 5451578 5520154 5645004 5652668 5712702 5449643 5436068 5297830 5275691
9332 5275691 5516439 5809740 5925085 6204841 6262310 6327656 6486214 6405132 6340674 6221465
9322 6221465 6247201 6289211 6334339 6480427 6482911 6543270 6470564 6686921 6584588 6757866 6960035
$$ packed form
9396D191397N3533m9166r9333O1667m6896J6395q8321M0770p897k59342j66731
9385C646076k7544L8970M4272k22289j51023j6408J2959r2775J27822l3752K9783
9374C356091J38091k2806R1090n8277K19436j94259L4731J71060J86702q4777
9364C837082k07763O7554J22194n4814P1981P6136j5824J80358J13472L0166J12535
9353D333077K3570N3717J6162P5785J34411K65526N00737k5465j60575J45156
9343E362101N0490J61785j22798O8576J24850P664O0034k63059j3575j38238k2139
9332E275691K40748K93301J15345K79756N7469O5346J58558q1082o4458j19209
9322F221465K5736M2010M5128J46088K484O0359p2706K16357j02333J73278K02169
$$ plain form
9311 6960035 7209937 7365278 7591580 7792390 7989807 7928870 7965769 8154057 8169579 8194274
9301 8194274 8319036 8347554 8389417 8526038 8680602 8628504 8526737 8372311 8531689 8670174
9291 8670174 8454133 8594884 8595915 8499950 8587998 8223381 7935893 7917739 8019882 8168012
9281 8168012 8215576 8094042 8004154 8128157 8195323 8462654 8396112 8373473 8441606 8908529 8859782
9270 8859782 8698313 8736669 8990735 9359622 9479401 9545672 9820664 9844254 10007189 9991132
9260 9991132 10007481 10114438 10008588 9792111 9647734 9824284 10155350 10284762 10266434 10109265
9250 10109265 10042477 10275119 10366017 10387446 10536717 10613010 10613533 10912487 10958280 11083990 11508144
9239 11508144 11660445 11638444 11991581 12303792 12413520 12289872 12134874 12450218 12477816 12634909
$$ packed form
9311F960035K49902J55341K26302K00810J97417o0937L6899J88288J5522K4695
9301H194274J24762K8518M1863J36621J54564n2098j01767j54426J59378J38485
9291H670174k16041J40751J031r5965Q8048l64617k87488j8154J02143J48130
9281H168012M7564j21534q9888J24003O7166K67331o6542k2639O8133M66923m8747
9270H859782j61469L8356K54066L68887J19779O6271K74992K3590J62935j6057
9260I991132J6349J06957j05850k16477j44377J76550L31066J29412j8328j57169
9250A0109265o6788K32642R0898K1429J49271P6293N23K98954M5793J25710M24154
9239A1508144J52301k2001L53137L12211J09728j23648j54998L15344K7598J57093
$$ plain form
9229 12634909 12950297 13119219 13354293 13772700 14211969 14265455 14359941 14603953 14750292 15165189
9219 15165189 15618091 16088865 16377201 16743622 17084936 17332641 17817399 18465586 19050428
9210 19050428 19544048 19784777 19961242 20345173 21121207 21740854 22285484 22763832 23222711
9201 23222711 23823693 24304951 24803478 25495854 26350109 27108369 27584155 28390596 29008018
9192 29008018 29785275 30685541 31577215 32670245 33845507 34910959 35880124 37448735 38975654
9183 38975654 40550204 42005585 43791108 45768425 47320261 48335524 49372908 50801695
9175 50801695 52316232 54140164 55577854 56969399 58996951 61801519 65226752 69299751
9167 69299751 74838632 81420034 89754555 99545342 110049472 118126295 119853613 118112555
$$ packed form
9229A2634909L15388J68922K35074M18407M39269N3486R4486K44012J46339M14897
9219A5165189M52902M70774K88336L66421L41314K47705M84758O48187N84842
9210A9050428M93620K40729J76465L83931P76034O19647N44630M78348M58879
9201B3222711O00982M81258M98527O92376Q54255P58260M75786Q06441O17422
9192B9008018P77257R00266Q91674J093030J175262J065452R69165J568611J526919
9183C8975654J574550J455381J785523J977317J551836J015263J037384J428787
9175E0801695J514537J823932J437690J391545K027552K804568L425233M072999
9167F9299751N538881O581402Q334521R790787J0504130Q076823J727318j741058
$$ plain form
9159 118112555 117595525 119903381 124166582 125051975 119719386 112139932 106117801 102454012
9151 102454012 100888962 100760784 101173964 102129805 103583504 105719884 108486603 111664336
9143 111664336 115778675 119305219 121733410 124378390 128395760 134097700 140991626 147975409
9135 147975409 155974227 166689655 179993999 193844564 204260148 211113396 220972365
9128 220972365 237134279 260223038 285743693 303212403 304156451 292959583 283065923
9121 283065923 282107417 288834514 291501582 278051782 255095861 234905175 221459236 214559101
9113 214559101 210631519 207797085 206367799 206202935 207349637 208564419 207924561 206529917
9105 206529917 206970729 210079434 215544764 222295661 230754017 242772390 258009028 276901549
$$ packed form
9159A18112555n17030K307856M263201Q85393n332589p579454o022131l663789
9151A02454012j565050j28178M13180R55841J453699K136380K766719L177733
9143A11664336M114339L526544K428191K644980M017370N701940O893926O983783
9135A47975409P998818J0715428J3304344J3850565J0415584O853248R858969
9128B20972365J6161914K3088759K5520655J7468710R44048j1196868r893660
9121B83065923r58506O727097K667068j3449800k2955921k0190686j3445939o900135
9113B14559101l927582k834434j429286j64864J146702J214782o39858j394644
9105B06529917M40812L108705N465330O750897Q458356J2018373J5236638J8892521
$$ plain form
9097 276901549 301559693 333617478 367849584 385919783 380606378 369007647 366067719
9090 366067719 373740504 379947748 366209636 335359516 305519938 284745148 274068728
9083 274068728 272432137 278652245 292802532 315277582 345100529 378141854 406595945
9076 406595945 427105249 444274246 459714376 469411658 474995638 478521559 472124140 454537774
9068 454537774 432628352 404969725 364789681 316836484 272339047 236183593 209112640
9061 209112640 188589059 172769686 160469788 150455304 142056154 135016682 129066268
9054 129066268 124097258 120093492 117057165 114611613 112744053 111617775 111605136 112926419
9046 112926419 115401941 119550327 125610013 134139889 145822350 158899351 170031328 176309339
$$ packed form
9097B76901549K4658144L2057785L4232106J8070199n313405j1598731k939928
9090C66067719P672785O207244j3738112l0850120k9839578k0774790j0676420
9083B74068728j636591O220108J4150287K2475050K9822947L3041325K8454091
9076D06595945K0509304J7168997J5440130R697282N583980L525921o397419j7586366
9068D54537774k1909422k7658627m0180044m7953197m4497437l6155454k7070953
9061B09112640k0523581j5819373j2299898j0014484q399150p039472n950414
9054A29066268m969010m003766l036327k445552j867560j126278j2639J321283
9046A12926419K475522M148386O059686Q529876J1682461J3077001J1131977O278011
$$ plain form
9038 176309339 178424255 178842861 176272935 169763653 162109826 154164566 145729176 137430710
9030 137430710 129483543 120101530 108991852 98061361 89142912 82235741 76947156 72714412
9022 72714412 69643086 67169527 65138200 63601030 62159118 60955916 59901938 58502280
9014 58502280 56922614 55405036 54043088 52652541 51692125 50879568 50170143 49779875 48994501
9005 48994501 48746665 48465166 48551121 48822056 48679246 48494055 48721081 48864381 49126132 49667185
8995 49667185 50081003 50513165 51101232 51835378 52462875 53189480 54093484 54804842 55651037
8986 55651037 56588182 57796821 59267010 60619182 62427549 64404937 66427348 68427045
8978 68427045 70423363 72677847 75221007 78352736 82286981 86970040 92543960 97613929
$$ packed form
9038A76309339K114916M18606k569926o509282p653827p945260q435390q298466
9030A37430710p947167r382013j1109678j0930491q918449o907171n288585m232744
9022G2714412l071326k473559k031327j537170j441912j203202j053978j399658
9014E8502280j579666j517578j361948j390547r60416q12557p09425l90268p85374
9005D8994501k47836k81499Q5955K70935j42810j85191K27026J43300K61751N41053
8995D9667185M13818M32162N88067P34146O27497P26605R04004P11358Q46195
8986E5651037R37145J208639J470189J352172J808367J977388K022411J999697
8978F8427045J996318K254484K543160L131729L934245M683059N573920N069969
$$ plain form
8970 97613929 101814944 106611932 113530566 123287381 136313963 153058964 174393262 199363870
8962 199363870 221627027 228743749 219303472 206951577 199685911 200429922 207408259 212988635
8954 212988635 205127444 185139247 163669989 146591895 134472239 126438234 121538967
8947 121538967 118608763 117672299 117892728 119464691 121794665 123986239 126083172 129075003
8939 129075003 134028531 141437570 151788264 164117454 178347292 195340569 216196383
8932 216196383 240523931 260795400 271656858 282671551 302567489 329199625 351160824
8925 351160824 353455267 331661991 298708395 271090923 254883289 245407285 229577497
8918 229577497 203883486 176870376 154023518 137139223 125303897 116461016 109928607
$$ packed form
8970I7613929M201015M796988O918634R756815J3026582J6745001K1334298K4970608
8962A99363870K2263157P116722r440277j2351895p265666P44011O978337N580376
8954B12988635p861191j9988197k1469258j7078094j2119656q034005m899267
8947A21538967k930204r36464K20429J571963K329974K191574K096933K991831
8939A29075003M953528P409039J0350694J2329190J4229838J6993277K0855814
8932B16196383K4327548K0271469J0861458J1014693J9895938K6632136K1961199
8925C51160824K294443k1793276l2953596k7617472j6207634r476004j5829788
8918B29577497k5694011k7013110k2846858j6884295j1835326q842881o532409
$$ plain form
8911 109928607 105213566 101812414 99851329 98579665 97060501 95281023 93806438 93513152
8903 93513152 94690485 98065973 103506466 111249403 121229606 133421184 146734558 153807759
8895 153807759 148118773 137251228 129145928 126477727 129058338 133509978 131633393 118572826
8887 118572826 101295909 85837097 74000559 65092527 58610111 53533159 49356452 46122103
8879 46122103 43189302 41016681 39033510 37270002 35701702 33885410 32361776 31024966
8871 31024966 29786717 28769482 27586519 26243772 24762230 23673615 22770158 21949551
8863 21949551 21206982 20517658 19877585 19100641 18571911 18050228 17306706 16855321 16363226
8854 16363226 15792660 15478557 15185415 14902642 14418999 13820042 13578475 13255759 13117065
$$ packed form
8911A09928607m715041l401152j961085j271664j519164j779478j474585k93286
8903I3513152J177333L375488N440493P742937R980203J2191578J3313374P073201
8895A53807759n688986j0867545q105300k668201K580611M451640j876585j3060567
8887A18572826j7276917j5458812j1836538q908032o482416n076952m176707l234349
8879D6122103k932801k172621j983171j763508j568300j816292j523634j336810
8871C1024966j238249j017235j182963j342747j481542j088615r03457q20607
8863B1949551p42569o89324o40073p76944n28730n21683p43522m51385m92095
8854A6363226n70566l14103k93142k82773m83643n98957k41567l22716j38694
$$ plain form
8845 13117065 12861025 12467674 12210313 12037402 11695681 11453071 11479788 11420640 11234595 11062406
8835 11062406 10819435 10709381 10220908 10021071 9890820 9575164 9295751 8986955 8915449 8827486
8825 8827486 8660424 8456581 8270944 8183616 8018285 7763840 7644252 7365222 7294979 7152738
8815 7152738 7110289 6990690 6979032 6958877 6779981 6777213 6646790 6574671 6586940 6360775 6460063
8804 6460063 6315661 6375375 6267449 6132786 6237513 6243088 6204002 6082099 5989723 6054120 5913686
8793 5913686 5962515 6063182 6075753 5838520 5685262 5817418 5877303 5749070 5699137 5586182
8783 5586182 5274075 5097437 4952410 5053204 4932370 4836061 4918229 4944311 4845641 4624985
8773 4624985 4463687 4584744 4504854 4322649 4442969 4685692 4692029 4662409 4495025 4394097
$$ packed form
8845A3117065k56040l93351k57361j72911l41721k42610K6717n9148j86045j72189
8835A1062406k42971j10054m88473j99837j30251l15656k79413l08796p1506q7963
8825H827486j67062k03843j85637q7328j65331k54445j19588k79030p0243j42241
8815G152738m2449j19599j1658k0155j78896k768j30423p2119J2269k26165R9288
8804F460063j44402N9714j07926j34663J04727N575l9086j21903r2376O4397j40434
8793E913686M8829J00667J2571k37233j53258J32156N9885j28233m9933j12955
8783E586182l12107j76638j45027J00794j20834r6309Q2168K6082r8670k20656
8773D624985j61298J21057p9890j82205J20320K42723O337k9620j67384j00928
$$ plain form
8763 4394097 4219377 4096358 4051860 4169112 4149654 4206690 4525238 4420914 4412296 4401813 4458360
8752 4458360 4563610 4479174 4299745 4265368 4059860 3793850 3700182 3608861 3558765 3436690
8742 3436690 3313518 3023019 3129489 3012140 3107683 3060512 3038556 2969344 2736694 2770641
8732 2770641 2633096 2749225 2631797 2761000 2810083 2721604 2817771 2893652 2970553 3165805
8722 3165805 3183666 3253253 3190128 3406234 3621048 3656326 3684953 3943652 3956263 3766647 3862336
8711 3862336 3794228 3626646 3474155 3039217 2914939 2700877 2632033 2472724 2229495 2203531
8701 2203531 2144309 2070985 2104744 2181162 1910035 1844559 2034161 2092400 1956756 1953859 1669080
8690 1669080 1866391 1816639 1805418 1817024 1920706 1892722 1789133 2066962 2310693 2343347
$$ packed form
8763D394097j74720j23019m4498J17252j9458N7036L18548j04324q618j0483N6547
8752D458360J05250q4436j79429l4377k05508k66010r3668r1321n0096j22075
8742C436690j23172k90499J06470j17349R5543m7171k1956o9212k32650L3947
8732B770641j37545J16129j17428J29203M9083q8479R6167P5881P6901J95252
8722C165805J7861O9587o3125K16106K14814L5278K8627K58699J2611j89616R5689
8711C862336o8108j67582j52491m34938j24278k14062o8844j59309k43229k5964
8701B203531n9222p3324L3759P6418k71127o5476J89602N8239j35644k897k84779
8690A669080J97311m9752j1221J1606J03682k7984j03589K77829K43731L2654
$$ plain form
8680 2343347 2617498 2640079 2604761 2792015 2792870 2680817 2473393 2494042 2487719 2492363 2325024
8669 2325024 2013158 1823382 1807795 1722581 1794255 1822639 1646246 1516304 1560317 1630402 1412506
8658 1412506 1517903 1432792 1354111 1355172 1152916 1110420 1156648 1057098 1009239 1186337 1182436
8647 1182436 1179433 1179843 1078129 1061942 1116495 981629 1044065 1220725 1237121 1127316 1239478
8636 1239478 999055 997427 1013593 1112033 1066786 974186 1162362 1092548 1205226 1073952 945358
8625 945358 892430 1041964 937837 934648 1092508 1134782 886454 846409 830974 787367 841658
8614 841658 749043 913692 1170079 1204838 1109222 1316082 1325411 1195860 1139747 1176283 1126276
8603 1126276 1213658 1511951 1466526 1593388 1758622 1773527 1918306 1858859 1739343 1721800
$$ packed form
8680B343347K74151K2581l5318J87254Q55j12053k07424K0649o323M644j67339
8669B325024l11866j89776j5587q5214P1674K8384j76393j29942M4013P0085k17896
8658A412506J05397q5111p8681J061k02256m2496M6228r9550m7859J77098l901
8647A182436l003M10j01714j6187N4553j34866O2436J76660J6396j09805J12162
8636A239478k40423j628J6166R8440m5247r2600J88176o9814J12678j31274j28594
8625I45358n2928J49534j04127l189J57860M2274k48328m0045j5435m3607N4291
8614H41658r2615J64649K56387L4759r5616K06860R329j29551n6113L6536n0007
8603A126276Q7382K98293m5425J26862J65234J4905J44779n9447j19516j7543
$$ plain form
8593 1721800 1472635 1493244 1687889 1588761 1427472 1343831 1258089 1402106 1487406 1624003
8583 1624003 1603048 903086 1145560 1107918 889599 1001594 957097 1079184 1215155 1299940
8573 1299940 1245928 1266408 1263492 1193713 1481477 1631863 1778004 1884420 1900850 2103893 2192100
8562 2192100 2224419 2133164 1969513 1711146 1550636 1444121 1557222 1445987 1344614 1239507
8552 1239507 1183899 975776 928146 828947 903864 1181215 1028049 1175798 879836 748659
8542 748659 895775 791730 816086 834970 929082 743692 771717 877699 1038948 1316985
8532 1316985 1112940 959693 1104823 1124597 1130922 1163694 1202803 1163650 1014972 699735 652884
8521 652884 645603 432224 308175 310616 358756 521674 526889 498205 454135 391902 577016
$$ packed form
8593A721800k49165K0609J94645r9128j61289q3641q5742J44017Q5300J36597
8583A624003k0955o99962K42474l7642k18319J11995m4497J22087J35971Q4785
8573A299940n4012K0480k916o9779K87764J50386J46141J06416J6430K03043Q8207
8562B192100L2319r1255j63651k58367j60510j06515J13101j11235j01373j05107
8552A239507n5608k08123m7630r9199P4917K77351j53166J47749k95962j31177
8542G48659J47116j04045K4356J8884R4112j85390K8025J05982J61249K78037
8532A316985k04045j53247J45130J9774O325L2772L9109l9153j48678l15237m6851
8521F52884p281k13379j24049K441M8140J62918N215k8684m4070o2233J85114
$$ plain form
8510 577016 462651 333923 149704 275959 382703 416219 373260 372282 183981 297665 443245
8499 443245 352844 379331 670963 901727 582214 508493 669037 542379 504301 260256
8489 260256 400406 360242 159175 270172 554051 501704 330180 506950 334284 203841
8479 203841 426833 390945 326674 357163 241377 199764 147660 183581 70661 154376 -61902
8468 -61902 27394 219653 166577 78413 121365 285507 243106 153344 385407 302560 293407
8457 293407 202048 110154 292575 118264 268391 483437 507381 538635 489010 506774 595244
8446 595244 561864 616028 460662 384211 490708 284894 251147 408504 585588 507795 455613
8435 455613 258069 252206 190861 383272 349081 274783 178266 17621 181002 69752 182741
$$ packed form
8510E77016j14365j28728j84219J26255J06744L3516m2959r78j88301J13684J45580
8499D43245r0401K6487K91632K30764l19513p3721J60544j26658l8078k44045
8489B60256J40150m0164k01067J10997K83879n2347j71524J76770j72666j30443
8479B03841K22992l5888o4271L0489j15786m1613n2104L5921j12920Q3715k16278
8468f1902Q9296J92259n3076q8164M2952J64142m2401q9762K32063q2847r153
8457B93407r1359r1894J82421j74311J50127K15046K3944L1254m9625J7764Q8470
8446E95244l3380N4164j55366p6451J06497k05814l3747J57357J77084p7793n2182
8435D55613j97544n863o1345J92411l4191p4298r6517j60645J63381j11250J12989
$$ plain form
8424 182741 120323 -11380 17958 14901 34552 126426 -106571 107267 212595 411384 470806
8413 470806 237162 154951 193791 349796 343859 332962 43070 132959 150389 -50273 -196979
8402 -196979 -94789 45855 38602 140586 69331 -137278 -25527 -63664 -106670 -114010 69549
8391 69549 103351 24995 64731 102241 16301 -108169 109842 108779 52826 106583 98926 204457
8379 204457 130506 -58160 96204 291291 187411 80930 30528 -92698 80847 211837
8369 211837 190334 -96282 -209018 -45024 -122298 -130392 -178604 -217084 -183146 -156617 -190513
8358 -190513 -227282 -269244 -92270 -165960 -70628 121700 54419 13834 -129135 -15396 -73205
8347 -73205 22950 -73027 105455 167470 67054 -247144 -142337 88749 156465 45169 113877
$$ packed form
8424A82741o2418j31703K9338l057J9651R1874k32997K13838J05328J98789N9422
8413D70806k33644q2211L8840J56005n937j0897k89892Q9889J7430k00662j46706
8402a96979J02190J40644p253J01984p1255k06609J11751l8137m3006p340J83559
8391F9549L3802p8356L9736L7510q5940j24470K18011j063n5953N3757p657J05531
8379B04457p3951j88666J54364J95087j03880j06481n0402j23226J73545J30990
8369B11837k1503k86616j12736J63994p7274q094m8212l8480L3938K6529l3896
8358a90513l6769m1962J76974p3690R5332J92328o7281m0585j42969J13739n7809
8347g3205R6155r5977J78482O2015j00416l14198J04807K31086O7716j11296O8708
$$ plain form
8336 113877 245915 35722 75594 49036 76332 151696 -11970 79692 17080 115605 198107
8325 198107 86735 46426 94722 72328 15174 -87010 -18524 -83362 -56917 159393 155370
8314 155370 59226 -130105 -86742 13948 160382 91371 16210 85959 166395 133796 8872
8303 8872 -78929 -894 -45155 25952 -104477 -100790 -18934 139060 92520 45802 -259021 -135525
8291 -135525 193424 156005 138748 132793 -28990 -58807 -169904 -39316 71734 -91603 10147
8280 10147 23131 171656 182768 -67471 -35176 3124 -21707 72020 12606 59662 -26990
8269 -26990 10205 -64314 -212658 -203566 -215048 -99615 -91442 72002 -72527 -137572 62269
8258 62269 2211 -176508 -232565 -100791 -97794 -272306 -212984 156345 56906 -47053 -96556
$$ packed form
8336A13877J32038k10193L9872k6558K7296P5364j63666R1662o2612R8525Q2502
8325A98107j11372m0309M8296k2394n7154j02184O8486o4838K6445K16310m023
8314A55370r6144j89331M3363J00690J46434o9011p5161O9749Q0436l2599j24924
8303H872q7801P8035m4261P1107j30429L687Q1856J57994m6540m6718l04823J23496
8291a35525L28949l7419j7257n955j61783k9817j11097J30588J11050j63337J01750
8280A0147J2984J48525J1112k50239L2295L8300k4831R3727n9414M7056q6652
8269b6990L7195p4519j48344R092j1482J15433Q173J63444j44529o5045J99841
8258F2269o0058j78719n6057J31774K997j74512N9322L69329r9439j03959m9503
$$ plain form
8247 -96556 -165899 -58410 -65561 -180212 -104864 -50191 43784 -209289 -304612 -87740 -105030
8236 -105030 4271 -23703 -181167 -231716 -396540 -441625 -114868 -28887 -55200 -153347 -215790
8225 -215790 -225825 -140652 -17397 -8209 -191423 -9141 91319 9690 -24361 9940 42261
8214 42261 -290399 -157063 -60007 -117308 -146251 -63249 -147165 -63852 -60560 -180966 -210821
8203 -210821 -150763 -134966 -203599 -116466 -341342 -445600 -515930 -389234 -495926 -310912 -606392
8192 -606392 -5747 711149 184960 73920 -76521 158444 219298 52436 49545 134682
8182 134682 127643 162695 164129 204074 174914 21640 87899 -58130 -197654 -135441 968
8171 968 -31836 120679 42057 -182057 -137116 -169323 -153886 -89805 -50673 -65709 -219220 -322335
$$ packed form
8247i6556o9343J07489p151j14651P5348N4673R3975k53073r5323K16872j7290
8236a05030J09301k7974j57464n0549j64824m5085L26757Q5981k6313r8147o2443
8225b15790j0035Q5173J23255R188j83214J82282J00460q1629l4051L4301L2321
8214D2261l32660J33336R7056n7301k8943Q3002q3916Q3313L292j20406k9855
8203b10821O0058J5797o8633Q7133k24876j04258p0330J26696j06692J85014k95480
8192f06392O00645P16896n26189j11040j50441K34965O0854j66862k891Q5137
8182A34682p039L5052J434L9945k9160j53274O6259j46029j39524O2213J36409
8171I68l2804J52515p8622k24114M4941l2207J5437O4081L9132j5036j53511j03115
$$ plain form
8159 -322335 -165935 -29172 83358 -68829 -80736 -86679 -94617 60644 106493 213857 240941
8148 240941 -5427 -22528 -111217 -98900 -92161 -11344 -148703 -118293 -53859 -12660 196205
8137 196205 116641 -3784 -12987 31816 -45729 -160818 -219251 -142996 -163115 -132609 20028
8126 20028 5240 -209039 44269 134742 32493 -60056 -85683 51303 -80140 -166478 -79261
8115 -79261 41719 66482 97225 -78553 -26786 -242110 -415841 -328300 -256926 -33762 -93064
8104 -93064 47724 -40379 -60102 179369 -13417 -205875 -226961 -182475 -205647 -149995 -221463
8093 -221463 -263422 -222620 -178364 -160178 -37171 103665 83768 -77148 -111959 -105241 -20437
8082 -20437 -27138 -59964 94592 -80818 -108170 -142189 -289281 -468325 -194669 -208110 -208510
$$ packed form
8159c22335J56400J36763J12530j52187j1907n943p938J55261M5849J07364K7084
8148B40941k46368j7101q8689J2317O739Q0817j37359L0410O4434M1199K08865
8137A96205p9564j20425r203M4803p7545j15089n8433P6255k0119L0506J52637
8126B0028j4788k14279K53308R0473j02249r2549k5627J36986j31443q6338Q7217
8115g9261J20980K4763L0743j75778N1767k15324j73731Q7541P1374K23164n9302
8104i3064J40788q8103j9723K39471j92786j92458k1086M4486k3172N5652p1468
8093b21463m1959M0802M4256J8186J23007J40836j9897j60916l4811O718Q4804
8082b0437o701l2826J54556j75410k7352l4019j47092j79044K73656j3441m00
$$ plain form
8071 -208510 5091 -28606 -79888 -276538 -142727 85995 -78357 -174548 -105703 -209187
8061 -209187 -187519 -266388 -272877 -437378 -236559 -68289 -36550 -238498 -120097 106572 -168078
8050 -168078 -187198 -39747 100200 22849 -129389 -144294 -19960 -22822 40140 -199811 -243728
8039 -243728 -241357 -159583 -114852 -239983 -289281 -27165 -81080 -109614 -48122 16344 7911 -145661
8027 -145661 -74738 24520 -178196 -151856 -184216 -171270 -26261 64563 3131 8633 48144
8016 48144 8588 -86032 8310 -40306 -161529 -247839 -223296 -441009 -469657 -320803 -264364
8005 -264364 -208003 -271416 -199292 -170492 -94990 -158850 -194048 -212080 -210401 -183128 -103032 -68518
7993 -68518 121402 22595 -79992 77716 46741 -205015 -197593 -188313 -374706 -241432 -107935
$$ packed form
8071b08510K13601l3697n1282j96650J33811K28722j64352r6191O8845j03484
8061b09187K1668p8869o489j64501K00819J68270L1739k01948J18401K26669k74650
8050a68078j9120J47451J39947p7351j52238j4905J24334k862O2962k39951m3917
8039b43728K371Q1774M4731j25131m9298K62116n3915k8534O1492O4466q433j53572
8027a45661P0923R9258k02716K6340l2360J2946J45009R0824o1432N502L9511
8016D8144l9556r4620R4342m8616j21223q6310K4543k17713k8648J48854N6439
8005b64364N6361o3413P2124K8800P5502o3860l5198j8032J679K7273Q0096L4514
7993f8518J89920r8807j02587J57708l0975k51756P422R280j86393J33274J33497
$$ plain form
7982 -107935 54788 69946 -151167 -45522 -29217 -41090 104991 239543 107500 9268
7972 9268 -210047 -152804 -96470 -80290 -166227 -121366 -54248 -84 -206178 -159573 -366848
7961 -366848 -387360 -302792 -419770 -342467 -252207 -184608 -86729 -67533 -69960 49004 2366
7950 2366 603 -223807 -248631 -236123 -228745 -152778 -141719 -130253 -198925 -141835 111125 73110
7938 73110 96147 17425 -84850 -233070 -374944 -215928 -59099 15032 -152137 -128290 -129521
7927 -129521 -198252 -229659 -243003 -256262 -67749 203230 92842 10902 -118772 -213815 -92464
7916 -92464 -143786 -158018 -289558 -305099 -171210 -233495 -253781 -155753 -148432 4785 100846
7905 100846 -125770 -134847 -190902 -282315 -384584 -143980 -130930 -237971 -96508 -99750 -159281
$$ packed form
7982a07935J62723J5158k21113J05645J6305j1873J46081J34552j32043r8232
7972I268k19315N7243N6334J6180q5937M4861O7118N4164k06094M6605k07275
7961c66848k0512Q4568j16978P7303R0260O7599R7879J9196k427J18964m6638
7950B366j763k24410k4824J2508P378P5967J1059J1466o8672N7090K52960l8015
7938G3110K3037p8722j02275j48220j41874J59016J56829P4131j67169K3847j231
7927a29521o8731l1407j3344j3259J88513K70979j10388q1940j29674r5043J21351
7916i2464n1322j4232j31540j5541J33889o2285k0286R8028P321J53217R6061
7905A00846k26616r077n6055r1413j02269K40604J3050j07041J41463l242n9531
$$ plain form
7894 -159281 -223950 22045 81439 38385 -113421 -119294 57986 28427 19301 -122751 -204321
7883 -204321 -144853 66533 -34420 -129560 -134149 -93202 -129804 5953 12068 -34096 -112960
7872 -112960 -170468 -275420 -292687 -211789 -271820 -130742 63607 -79497 -194452 -41143
7862 -41143 17016 52222 -246308 -341653 -222804 -75683 -1293 -64986 -159626 -200498 -131248
7851 -131248 -70206 -231007 -229578 -256530 -217553 -188393 -191343 -137729 -198525 -11720 -54856 -104521
7839 -104521 -78053 103344 133353 71624 85487 -86122 -75093 -76875 -19037 12175 -21841
7828 -21841 21888 -7658 -95909 -162647 -193062 -311268 -166248 -86752 -153241 -146688 -146050 -109955
7816 -109955 -35883 79312 3564 141755 119385 -37440 24136 39180 94052 53636 77227
$$ packed form
7894a59281o4669K45995N9394m3054j51806n873J77280k9559r126j42052q1570
7883b04321N9468K11386j00953r5140m589M0947l6602J35757O115m6164p8864
7872a12960n7508j04952j7267Q0898o0031J41078J94349j43104j14955J53309
7862d1143N8159L5206k98530r5345J18849J47121P4390o3693r4640m0872O9250
7851a31248O1042j60801J429k6952L8977K9160k950N3614o0796J86805m3136m9665
7839a04521K6468J81397L0009o1729J3863j71609J1029j782N7838L1212l4016
7828b1841M3729k9546q8251o6738l0415j18206J45020P9496o6489O553O38L6095
7816a09955P4072J15195p5748J38191k2370j56825O1576J5044N4872m0416K3591
$$ plain form
7805 77227 -30460 -297552 -221157 29880 -244613 -118826 9979 -4231 -157177 -156503 -50609
7794 -50609 -106154 -83331 -120922 -69308 -33110 45140 47984 98436 102980 103205 45362 -91901
7782 -91901 -281135 -276039 -152915 -248251 -187752 -27570 61625 -46054 -198535 -234747 -302517
7771 -302517 -156855 -140460 -205331 -244793 -158052 -293397 -185526 -149203 -195640 -181303 -186233
7760 -186233 -199688 -190018 -217511 -349456 -209005 -119047 -244906 -85992 -48173 -81739 -189737
7749 -189737 -326957 -337267 -68930 31892 -49769 -65650 -244536 -243991 -240328 -141557 -122874
7738 -122874 -110085 -49029 36690 -40306 51285 -92093 -256284 -132132 -172420 -34366 115149
7727 115149 -167144 -185352 -279190 -200811 180617 41259 42653 -52340 -85138 -68149 -6162
$$ packed form
7805G7227j07687k67092P6395K51037k74493J25787J28805j4210j52946O74J05894
7794e0609n5545K2823l7591N1614L6198P8250K844N0452M544K25n7843j37263
7782i1901j89234N096J23124r5336O0499J60182Q9195j07679j52481l6212o7770
7771c02517J45662J6395o4871l9462Q6741j35345J07871L6323m6437J4337m930
7760a86233j3455R670k7493j31945J40451Q9958j25859J58914L7819l3566j07998
7749a89737j37220j0310K68337J00822q1661j5881j78886N45L663R8771J8683
7738a22874J2789O1056Q5719p6996R1591j43378j64191J24152m0288J38054J49515
7727A15149k82293j8208r3838P8379L81428j39358J394r4993l2798J6989O1987
$$ plain form
7716 -6162 -24281 123559 192969 234415 128739 -53498 -246919 -86749 104730 -22789 22651
7705 22651 -61601 76124 112515 74379 -148603 -322953 -381172 -132524 -7528 -93830 -244926
7694 -244926 -350095 -248056 -161623 -183753 -16568 -44142 -276224 -129385 -24910 -99845
7684 -99845 -118592 -139579 -54536 -64083 -71378 4114 112804 -31226 -215249 -308588 -314431 -283164
7672 -283164 -473946 -360094 -253588 -141765 -78270 -153381 -133854 -94828 -101338 -14409 -166521
7661 -166521 -390749 -288987 -101684 -66574 -120073 -152881 -15011 -31785 -239543 -456131
7651 -456131 -318806 -269854 -318134 -202362 -105458 -39029 -210267 -274074 -228199 -35057 84981
7640 84981 -32735 -210370 -157366 -160650 -214489 6452 214608 1679 -104607 -225533 -139081
$$ packed form
7716f162j8119J47840O9410M1446j05676j82237j93421J60170J91479j27519M5440
7705B2651q4252J37725L6391l8136k22982j74350n8219K48648J24996q6302j51096
7694b44926j05169J02039Q6433k2130J67185k7574k32082J46839J04475p4935
7684i9845j8747k0987Q5043r547p295P5492J08690j44030j84023r3339n843L1267
7672b83164j90782J13852J06506J11823O3495p5111J9527L9026o510Q6929j52112
7661a66521k24228J01762J87303L5110n3499l2808J37870j6774k07758k16588
7651d56131J37325M8952m8280J15772R6904O6429j71238o3807M5875J93142J20038
7640H4981j17716j77635N3004l284n3839K20941K08156k12929j06286j20926Q6452
$$ plain form
7629 -139081 63161 -12060 -83579 -207869 -93713 -31419 59463 -1103 -52975 -54852 78007
7618 78007 149195 110333 -3086 -120578 -73556 5116 -44701 -23991 130720 27086 119254
7607 119254 277082 55050 28138 -82242 -305777 -332281 -219177 -232768 -304846 -251180 -89044
7596 -89044 130618 44404 48738 51209 96306 -131629 -319960 -115118 94130 -62230 -88019
7585 -88019 -14722 -54485 -106991 -7929 -126191 -1121 7734 -92792 140411 28337 -62403
7574 -62403 -6973 -24595 -64441 71503 -16979 -112324 11409 94195 1505 -64803 -127261
7563 -127261 -145326 -98406 -306203 -312686 -121273 -105535 -115507 103559 -30035 -261149 -167657
7552 -167657 -260592 -170011 -52613 -100787 -53261 1726 51317 102416 20404 -99348 -153594
$$ packed form
7629a39081K02242p5221p1519j24290J14156O2294R0882o0566n1872j877J32859
7618G8007P1188l8862j13419j17492M7022P8672m9817K0710J54711j03634R2168
7607A19254J57828k22032k6912j10380k23535k6504J13104j3591p2078N3666J62136
7596h9044K19662q6214M334K471M5097k27935j88331K04842K09248j56360k5789
7585h8019P3297l9763n2506R9062j18262J25070Q855j00526K33203j12074r0740
7574f2403N5430j7622l9846J35944q8482r5345J23733Q2786r2690o6308o2458
7563a27261j8065M6920k07797o483J91413J5738r972K19066j33594k31114R3492
7552a67657r2935R0581J17398m8174M7526N4987M9591N1099q2012j19752n4246
$$ plain form
7541 -153594 -136242 -93607 -175361 -269148 -262783 -189762 -315189 -239799 -83007 -207848 -88372
7530 -88372 211402 -13532 -1744 -87533 -145476 -146765 -154741 -107053 -167508 -226202 -271293 -89597
7518 -89597 115538 82115 128921 219791 -35255 -171727 -241440 14193 -201256 -153606 -137921
7507 -137921 -211067 -202394 -94143 -11207 24923 126204 16910 38812 50644 133137 248029
7496 248029 121990 45780 228360 85741 -13215 -74790 -58846 -33343 -222081 -122674 -113083
7485 -113083 97466 209946 48071 -31137 -162835 -120304 -58199 -119779 -90741 31923 73164
7474 73164 26611 164314 -87259 -84145 -81312 118919 70957 -37811 245149 88327 -95235
7463 -95235 -156272 97657 95300 -196981 -47457 66614 161876 208101 129885 123734 -116394
$$ packed form
7541a53594J7352M2635q1754r3787O365P3021j25427P5390J56792j24841J19476
7530h8372K99774k24934J1788q5789n7943j289p976M7688o0455n8694m5091J81696
7518h9597K05135l3423M6806R0870k55046j36472o9713K55633k15449M7650J5685
7507a37921p3146Q673J08251Q2936L6130J01281j09294K1902J1832Q2493J14892
7496B48029j26039p6210J82580j42619r8956o1575J5944K5503j88738R9407R591
7485a13083K10549J12480j61875p9208j31698M2531O2105o1580K9038J22664M1241
7474G3164m6553J37703k51573L114K833K00231m7962j08768K82960j56822j83562
7463i5235o1037K53929k357k92281J49524J14071R5262M6225p8216o151k40128
$$ plain form
7452 -116394 -178427 29086 -172973 -203031 -46159 -106913 21533 89612 28558 18078 -82858
7441 -82858 -31102 -186766 -113338 -127674 -186666 40490 23518 -57332 -115139 -67950 -259729
7430 -259729 -350790 -260240 -44468 18178 95568 194039 176699 360330 127895 55357 -40195
7419 -40195 -139364 206226 31481 90590 -5376 -117806 -121150 216877 252548 117188 -10496
7408 -10496 90406 -188359 -289901 -114750 124836 -16783 -17751 -144127 -261560 11222
7398 11222 62425 -73576 103688 -76157 -125413 -50963 38276 -74015 -299112 -169273 -499741
7387 -499741 -314840 -19977 -18053 -43553 -2218 -28831 -223953 -256104 -239911 -308988 -116934
7376 -116934 -93031 -121531 -148624 -29019 -112633 -182041 -183284 -153199 10087 76047 -113920
$$ packed form
7452a16394o2033K07513k02059l0058J56872o0754J28446O8079o1054j0480j00936
7441h2858N1756j55664P3428j4336n8992K27156j6972q0850n7807M7189j91779
7430b59729r1061R0550K15772O2646P7390R8471j7340J83631k32435p2538r5552
7419d0195r9169L45590j74745N9109r5966j12430l344L38027L5671j35360j27684
7408a0496J00902k78765j01542J75151K39586j41619r68j26376j17433K72782
7398A1222N1203j36001J77264j79845m9256P4450Q9239j12291k25097J29839l30468
7387d99741J84901K94863J924k5500M1335k6613j95122l2151J6193o9077J92054
7376a16934K3903k8500k7093J19605q3614o9408j243L0085J63286O5960j89967
$$ plain form
7365 -113920 166860 -107654 -114754 152678 82958 184956 130304 -254026 -323175 -324731 -279763
7354 -279763 -238734 -174664 -29654 -140809 -36631 29504 -3756 6397 -24293 -18791 -22741
7343 -22741 -10771 101578 71866 8744 9550 166015 -38990 -125826 -74486 -41801 -121395 -217911
7331 -217911 -12453 -46269 -96002 -156992 -162412 -96394 -215887 -154577 -114147 -21292 -25827 -61136
7319 -61136 94035 162243 112160 -244138 -204502 -7918 -45975 93140 197205 23192 -200874
7308 -200874 -479204 -352717 -50016 160277 60839 47634 79447 -104622 -90661 -132708 -280909
7297 -280909 -254607 -269440 -159106 -195991 -359575 -99092 -122873 -71512 54106 297683 238628
7286 238628 -6790 33464 -8132 -111926 -162207 -54496 -275295 -209879 -111196 66101 -74998
$$ packed form
7365a13920K80780k74514p100K67432o9720J01998n4652l84330o9149j556M4968
7354b79763M1029O4070J45010j11155J04178O6135l3260J0153l0690N502l950
7343b2741J1970J12349k9712o3122Q06J56465k05005q6836N1340L2685p9594r6516
7331b17911K05458l3816m9733o0990n420O6018j19493O1310M0430R2855m535l5309
7319f1136J55171O8208n0083l56298L9636J96584l8057J39115J04065j74013k24066
7308b00874k78330J26487L02701K10293r9438j3205L1813j84069J3961m2047j48201
7297b80909K6302j4833J10334l6885j63584K60483k3781N1361J25618K43577n9055
7286B38628k45418M0254m1596j03794n0281J07711k20799O5416R8683J77297j41099
$$ plain form
7275 -74998 -249220 -249923 -227306 -64902 -264030 -439308 -187250 62880 -85804 -174631 -145625
7264 -145625 -73332 -220450 -91396 38676 58441 -11991 -45253 -57006 47044 198524 36359
7253 36359 -105635 124397 141259 114619 -9871 -96989 46698 23668 243551 154460 118622
7242 118622 82346 -102940 24138 -71 -154228 -133982 -232994 -313082 -47291 -1804 -265230
7231 -265230 -228835 -101883 -68410 825 -96807 -148464 -320339 -153791 -122014 32236 220633
7220 220633 123216 225396 66660 149812 111214 161191 116294 -12202 -154055 -177298 -329261
7209 -329261 -329588 -215382 -158325 -40237 -97507 -105154 1002 34696 -141718 -16175 -59655
7198 -59655 -73629 -117937 -155297 -135538 -160244 -82936 -95634 -72136 -151948 -132034 -33002 -137016
$$ packed form
7275g4998j74222p03K2617J62404j99128j75278K52058K50130j48684q8827K9006
7264a45625P2293j47118J29054J30072J9765p0432l3262j1753J04050J51480j62165
7253C6359j41994K30032J6862k6640j24490q7118J43687k3030K19883q9091l5838
7242A18622l6276j85286J27078k4209j54157K0246r9012q0088K65791M5487k63426
7231b65230L6395J26952L3473O9235r7632n1657j71875J66548L1777J54250J88397
7220B20633r7417J02180j58736Q3152l8598M9977m4897j28496j41853k3243j51963
7209c29261l27J14206N7057J18088n7270p647J06156L3694j76414J25543m3480
7198e9655j3974m4308l7360J9759k4706P7308j2698K3498p9812J9914R9032j04014
$$ plain form
7186 -137016 -76970 -26528 164239 172608 224689 299333 322823 208896 104243 -69122 4797
7175 4797 32370 -139569 -331747 -392478 -406372 -213064 -104851 -115160 -119699 -104065 -98247 102187
7163 102187 -79025 -303655 48355 30518 86405 40676 56262 67579 -132578 -142116 69889
7152 69889 122797 334210 147887 -4584 -80115 51345 193404 102499 63874 47287 114518
7141 114518 24804 -92479 -80338 62983 21463 -68677 -179419 -45924 -35160 -153500 -20014
7130 -20014 141337 12391 164495 205882 6692 -14529 28888 5483 -164884 136348 163762
7119 163762 103378 227922 223909 -56091 25298 66224 52949 -11837 -164266 -127089 -17091
7108 -17091 -60706 -31047 -157008 -235862 -220170 -101515 -570 -180673 -74199 -33697 62965
$$ packed form
7186a37016O0046N0442J90767Q369N2081P4644K3490j13927j04653j73365P3919
7175D797K7573j71939j92178o0731j3894J93308J08213j0309m539J5634N818K00434
7163A02187j81212k24630L52010j7837N5887m5729J5586J1317k00157r538K12005
7152F9889N2908K11413j86323j52471p5531J31460J42059r0905l8625j6587O7231
7141A14518q9714j17283J2141J43321m1520r0140j10742J33495J0764j18340J33486
7130b0014J61351j28946J52104M1387j99190k1221M3417k3405j70367L01232K7414
7119A63762o0384J24544m013k80000Q1389M0926j3275o4786j52429L7177J09998
7108a7091m3615K9659j25961p8854J5692J18655J00945j80103J06474M0502R6662
$$ plain form
7097 62965 -104091 -314521 -114348 -155749 -173113 -113566 9701 7713 -57588 112181 137660
7086 137660 125853 49891 -9636 88445 88925 75776 -49882 -89881 -8681 -78995 -42511 111091
7074 111091 112078 -110801 -14233 56241 -208256 -298294 -122447 -85685 -125324 99632 152256
7063 152256 142515 181477 353512 351475 298422 216806 -105779 141260 136429 315550 163452
7052 163452 159614 92083 32313 236091 217366 198621 189698 356255 2229 -32560 53896
7041 53896 217502 -14854 21175 195411 114695 -142213 -61719 -74636 84926 409291 417228
7030 417228 305156 229589 368394 202472 15780 -48396 137291 168908 320945 414923
7020 414923 453266 415926 440424 630821 651240 599568 538358 234621 284621 168305 57114
$$ packed form
7097F2965j67056k10430K00173m1401j7364N9547J23267j988o5301J69769K5479
7086A37660j1807p5962n9527R8081M80j3149j25658l9999Q1200p0314L6484J53602
7074A11091R87k22879R6568P0474k64497r0038J75847L6762l9639K24956N2624
7063A52256r741L8962J72035k037n3053q1616l22585K47039m831J79121j52098
7052A63452l838o7531n9770K03778j8725j8745q923J66557l54026l4789Q6456
7041E3896J63606k32356L6029J74236q0716k56908Q0494j2917J59562L24365P937
7030D17228j12072p5567J38805j65922j86692o4176J85687L1617J52037R3978
7020D14923L8343l7340K4498J90397K0419n1672o1210l03737N0000j16316j11191
$$ plain form
7009 57114 77063 167409 -19164 -73517 104494 46042 107786 122556 84422 -18651 -8364
6998 -8364 98774 162016 12685 242906 402272 225662 44694 120536 224199 -25563
6988 -25563 80699 111176 335983 271103 142215 85685 8268 -117794 -53849 30646 127601
6977 127601 30252 -111804 33987 41025 92257 122950 219676 154983 118774 41244 824
6966 824 -28300 -249921 -228385 101789 234151 272306 146728 -38287 140811 222221 145874
6955 145874 -20021 -47608 31299 112075 90320 -140377 -133979 22137 185550 79366 1992
6944 1992 28545 192725 188179 -25421 17917 -142178 -171505 -7476 -116406 -203545 30062
6933 30062 2956 -65402 15150 -20487 -119434 -30696 -80272 -170979 174253 -69259 -78627 -158762
$$ packed form
7009E7114J9949R0346j86573n4353J78011n8452O1744J4770l8134j03073J0287
6998h364J07138O3242j49331K30221J59366j76610j80968P5842J03663k49762
6988b5563J06262L0477K24807o4880j28888n6530p7417j26062O3945Q4495R6955
6977A27601r7349j42056J45791P038N1232L0693R6726o4693l6209p7530m0420
6966H24k9124k21621K1536L30174J32362L8155j25578j85015J79098Q1410p6347
6955A45874j65895k7587P8907Q0776k1755k30697O398J56116J63413j06184p7374
6944A992K6553J64180m546k13600M3338j60095k9327J64029j08930q7139K33607
6933C0062k7106o8358Q0552l5637r8947Q8738m9576r0707L45232k43512r368q0135
$$ plain form
6921 -158762 43303 98477 200000 75348 -77156 -96198 71506 101539 214102 132895
6911 132895 -4810 165641 127753 66001 -20182 -152216 -150623 -44945 -80653 20034 -85864
6900 -85864 -26422 -78041 -152868 -184733 -59942 72822 -91204 23425 -36658 -130494 -59105
6889 -59105 -105220 51908 13429 19357 7348 139893 61690 -19172 -210164 -115694 430
6878 430 -4757 72458 18761 28094 3893 185372 246613 158743 247372 352052 244861 241190
6866 241190 108580 124429 61757 31937 -51451 -86771 -116124 -93695 -64965 -156485 11625
6855 11625 84956 124385 114388 -21463 -30025 -55091 -40621 212389 180687 221258 359376 354177
6843 354177 245905 361203 212004 104665 114050 150011 174980 144952 143571 61888 56736
$$ packed form
6921a58762K02065N5174J01523j24652j52504j9042J67704L0033J12563q1207
6911A32895j37705J70451l7888o1752q6183j32034J593J05678l5708J00687j05898
6900h5864N9442n1619p4827l1865J24791J32764j64026J14629o0083r3836P1389
6889e9105m6115J57128l8479N928j2009J32545p8203q0862j90992R4470J16124
6878D30n187P7215n3697R333k4201J81479O1241q7870Q8629J04680j07191l671
6866B41190j32610J5849o2672k9820q3388l5320k9353K2429K8730r1520J68110
6855A1625P3331L9429r997j35851q562k5066J4470K53010l1702M0571J38118n199
6843C54177j08272J15298j49199j07339R385L5961K4969l0028j381q1683n152
$$ plain form
6832 56736 129089 79087 250013 188099 21081 23947 16968 -187452 -96101 80705 280622
6821 280622 293184 148775 141028 184934 383858 439568 126051 65315 122529 72467 83261
6810 83261 220476 157526 -90004 8632 73961 90954 93108 235696 338088 374729 350803
6799 350803 214305 187934 42368 72613 174907 195566 77138 -46938 25422 -2225 76868
6788 76868 145050 187751 166084 241585 52679 32280 105903 159830 49658 77135 14129
6777 14129 197759 142656 263774 227117 59455 111520 136503 339633 210340 137852 -794
6766 -794 71689 276122 262665 200078 112674 202715 182332 245878 254442 238338 132905 90939
6754 90939 265252 292251 160298 36607 96900 37556 181271 395368 109640 38193 110380
$$ packed form
6832E6736P2353n0002J70926o1914j67018K866o979k04420R1351J76806J99917
6821B80622J2562j44409p747M3906J98924N5710l13517o0736N7214n0062J0794
6810H3261J37215o2950k47530R8636O5329J6993K154J42588J02392L6641k3926
6799C50803j36498k6371j45566L0245J02294K0659j18428j24076P2360k7647P9093
6788G6868O8182M2701k1667P5501j88906k0399P3623N3927j10172K7477o3006
6777A4129J83630n5103J21118l6657j67662N2065K4983K03130j29293p2488j38646
6766g94P2483K04433j3457o2587q7404R0041k0383O3546Q564j6104j05433m1966
6754I0939J74313K6999j31953j23691O0293n9344J43715K14097k85728p1447P2187
$$ plain form
6743 110380 82704 103572 152433 225571 374136 389153 476249 394673 102151 178707 278358
6732 278358 253834 221433 359936 452985 177518 103973 281927 204466 87909 26509 94485
6721 94485 143310 273070 275608 261687 363801 464968 428199 354338 363450 490553 472671
6710 472671 564128 624171 510734 602244 531735 496234 437404 227549 406027 360382 393583
6699 393583 427607 501420 646972 556588 608592 646733 436743 429419 542243 499852 561327
6688 561327 778679 754761 668500 652869 891753 805422 678323 508873 389615 477641 361127
6677 361127 190796 484582 559052 497462 586779 634270 490021 373019 574027 503295 288562
6666 288562 227138 485637 478068 432958 549626 786584 648657 806676 638830 631283 675495
$$ packed form
6743A10380k7676K0868M8861P3138J48565J5017Q7096q1576k92522P6556R9651
6732B78358k4524l2401J38503R3049k75467p3545J77954p7461j16557o1400O7976
6721I4485M8825J29760K538j3921J02114J01167l6769p3861R112J27103j7882
6710D72671R1457O0043j13437R1510p0509l5501n8830k09855J78478m5645L3201
6699C93583L4024P3813J45552r0384N2004L8141k09990p324J12824m2391O1475
6688E61327K17352k3918q6261j5631K38884q6331j27099j69450j19258Q8026j16514
6677C61127j70331K93786P4470o1590Q9317M7491j44249j17002K01008p0732k14733
6666B88562o1424K58499p569m5110J16668K36958j37927J58019j67846p547M4212
$$ plain form
6655 675495 653404 616566 697729 913098 953269 961568 769377 748950 742805 833253 868191 1039917
6643 1039917 1142385 1022651 1087016 1184247 1215743 1099989 982992 1057394 835002 873799
6633 873799 899789 818233 810434 938885 984737 949612 958582 1008369 1040620 1126695 1200386 1158414
6621 1158414 1163217 1293433 1321839 1330149 1439556 1315216 1552655 1806605 1795004 1718225 1629418
6610 1629418 1459984 1608290 1609525 1527229 1584327 1624211 1642798 1658741 1642710 1713943 1528847
6599 1528847 1531727 1633794 1714716 1975909 1967656 1979758 2087336 2447242 2506100 2672011 2831494
6588 2831494 2744427 2735878 2582537 2407139 2249039 1955351 1900073 1791004 1947711 1877852
6578 1877852 1704900 1679767 1700655 1642240 1617021 1841529 1953318 2025206 2001627 1907997 1959726
$$ packed form
6655F75495k2091l6838Q1163K15369M0171Q299j92191k0427o145R0448L4938J71726
6643A039917J02468j19734O4365R7231L1496j15754j16997P4402k22392L8797
6633H73799K5990q1556p799J28451M5852l5125Q970M9787L2251Q6075P3691m1972
6621A158414M803J30216K8406Q310J09407j24340K37439K53950j1601p6779q8807
6610A629418j69434J48306J235q2296N7098L9884J8587J5943j6031P1233j85096
6599A528847K880J02067Q0922K61193q253J2102J07578L59906N8858J65911J59483
6588B831494q7067q549j53341j75398j58100k93688n5278j09069J56707o9859
6578A877852j72952k5133K0888n8415k5219K24508J11789P1888k3579r3630N1729
$$ plain form
6567 1959726 2247223 2218856 2484634 2485095 2427305 2518794 2213613 2099774 1941867 1801291 1800547
6556 1800547 1719650 1778245 1819140 1667706 1683693 1701673 1597025 1676995 1579297 1538595 1619367
6545 1619367 1768874 1566322 1460182 1530235 1411433 1310889 1355996 1519266 1629891 1635129
6535 1635129 1475252 1441980 1513419 1486173 1688139 1680690 1789107 1817936 1852344 2004342 1968667
6524 1968667 1834913 1988111 2062526 1968693 2024519 2041276 2153618 2098424 1946231 1949213 2069920
6513 2069920 2053472 2188103 2214161 2184437 2147339 2261587 2372376 2317871 2197611 2425803
6503 2425803 2543638 2597554 2500441 2395803 2548733 2472485 2437489 2395426 2434419 2740235 2855596
6492 2855596 2944619 3098791 3184532 3240930 3190252 3219555 3141353 3421251 3366125 3222620 3298502
$$ packed form
6567A959726K87497k8367K65778M61n7790R1489l05181j13839j57907j40576p44
6556A800547q0897N8595M0895j51434J5987J7980j04648P9970r7698m0702Q0772
6545A619367J49507k02552j06140P0053j18802j00544M5107J63270J10625N238
6535A635129j59877l3272P1439k7246K01966p449J08417K8829L4408J51998l5675
6524A968667j33754J53198P4415r3833N5826J6757J12342n5194j52193K982J20707
6513B069920j6448J34631K6058k9724l7098J14248J10789n4505j20260K28192
6503B425803J17835N3916r7113j04638J52930p6248l4996m2063L8993L05816J15361
6492B855596Q9023J54172Q5741N6398n0678K9303p8202K79898n5126j43505P5882
$$ plain form
6481 3298502 3418124 3335033 3132381 3270819 3513882 3596633 3504931 3667890 3592603 3639285
6471 3639285 3741249 3841558 4004809 4048949 3928421 3997959 4114585 4275219 4301793 4204452
6461 4204452 4209140 4400077 4490255 4569253 4644123 4732771 4974635 5055110 5131424 5398694 5498110
6450 5498110 5619315 5482434 5480415 5611979 5690539 5504285 5530689 5690156 5861423 6112726
6440 6112726 5888499 5761215 6018684 6250518 6357762 6235134 6632149 6912998 6992912 7147871
6430 7147871 7278850 7351806 7629281 8036613 8248137 8532030 8777033 8922824 9175997 9436876
6420 9436876 9625627 10085901 10189715 10673484 11000873 11556294 12164586 12872407 13805668 14831386
6410 14831386 15845696 17265607 18940173 20987343 22803998 23778564 24394529 24123346 22950579
$$ packed form
6481C298502J19622q3091k02652J38438K43063Q2751r1702J62959p5287M6682
6471C639285J01964J00309J63251M4140j20528O9538J16626J60634K6574r7341
6461D204452M688J90937R0178P8998P4870Q8648K41864Q0475P6314K67270R9416
6450E498110J21205j36881k019J31564P8560j86254K6404J59467J71267K51303
6440F112726k24227j27284K57469K31834J07244j22628L97015K80849P9914J54959
6430G147871J30979P2956K77475M07332K11524K83893K45003J45791K53173K60879
6420I436876J88751M60274J03814M83769L27389N55421O08292P07821R33261J025718
6410A4831386J014310J419911J674566K047170J816655R74566O15965k71183j172767
$$ plain form
6401 22950579 21461270 20171143 19159679 18375993 18224234 18088636 17982777 17995357 18279161
6392 18279161 18789521 19203750 19799944 20530934 21514686 22524052 24154298 26226361 28238124
6383 28238124 31306596 34587936 38181210 42177634 44913720 45094376 43119282 39610148
6375 39610148 35782869 32657585 30063604 28378642 27159657 26326565 25528130 25130780 24886154
6366 24886154 24952057 25035878 25154068 25376411 25920537 26801550 27779993 28966652 30348417
6357 30348417 32178766 34265508 36474715 38368939 39687381 39701114 38860444 37337220 36031140
6348 36031140 34896064 34082081 33662988 33337082 33322217 33265888 33421151 33780881 34197718 34645722
6338 34645722 35181662 35995772 36585023 37442699 38385273 39102916 39974054 40694446 41960317
$$ packed form
6401B2950579j489309j290127j011464p83686j51759j35598j05859J2580K83804
6392A8279161N10360M14229N96194P30990R83752J009366J630246K072063K011763
6383B8238124L068472L281340L593274L996424K736086J80656j975094l509134
6375C9610148l827279l125284k593981j684962j218985q33092p98435l97350k44626
6366B4886154O5903Q3821J18190K22343N44126Q81013R78443J186659J381765
6357C0348417J830349K086742K209207J894224J318442J3733q40670j523224j306080
6348C6031140j135076q13983m19093l25906j4865n6329J55263L59730M16837M48004
6338C4645722N35940Q14110N89251Q57676R42574P17643Q71138P20392J265871
$$ plain form
6329 41960317 43277518 44481503 45847968 47321770 48861745 50553120 52671755 54764194
6321 54764194 57052385 59821474 62642325 66070382 70051077 74787039 80323849 86615395
6313 86615395 94210745 103070430 113847670 126894186 142382772 160143337 178903931
6306 178903931 194812293 202923646 200564383 189106523 173487096 158499686 146515983
6299 146515983 137883951 132015463 128498273 126124750 124938102 125589871 127904930 131971867
6291 131971867 138297715 146935423 158027807 172184402 190304103 212979433 240755457
6284 240755457 274234196 310702559 343672631 362705220 360706624 339696807 306753003
6277 306753003 268672698 232542327 202374814 179407544 162187659 149327583 140054718
$$ packed form
6329D1960317J317201J203985J366465J473802J539975J691375K118635K092439
6321E4764194K288191K769089K820851L428057L980695M735962N536810O291546
6313H6615395P595350Q859685J0777240J3046516J5488586J7760565J8760594
6306A78903931J5908362Q111353k359263j1457860j5619427j4987410j1983703
6299A46515983q632032n868488l517190k373523j186648O51769K315059M066937
6291A31971867O325848Q637708J1092384J4156595J8119701K2675330K7776024
6284B40755457L3478739L6468363L2970072J9032589j998596k1009817l2943804
6277C06753003l8080305l6130371l0167513k2967270j7219885j2860076r272865
$$ plain form
6270 140054718 132974249 128226219 125432957 124324306 125386452 128393339 133580317 140877228
6262 140877228 150369512 161881290 176172339 192767618 210597875 224579733 227975624
6255 227975624 217256138 195667026 169802617 145379504 125041260 109022074 96516954
6248 96516954 86445589 78383655 71485882 65698555 60577538 56074791 52412295 49264626
6240 49264626 46287781 43835547 41693302 39471854 37389078 35568640 33798678 32108495
6232 32108495 30575435 29262661 28156226 27024841 25852322 24836583 23831404 22966834
6224 22966834 22116460 21545875 20754025 20148544 19504974 18897828 18507142 18036016 17513789
6215 17513789 17031060 16430919 15834871 15206630 15049153 14605478 14141173 14008600 13697789
$$ packed form
6270A40054718p080469m748030k793262j108651J062146L006887N186978P296911
6262A40877228R492284J1511778J4291049J6595279J7830257J3981858L395891
6255B27975624j0719486k1589112k5864409k4423113k0338244j6019186j2505120
6248I6516954j0071365q061934o897773n787327n121017m502747l662496l147669
6240D9264626k976845k452234k142245k221448k082776j820438j769962j690183
6232C2108495j533060j312774j106435j131385j172519j015739j005179q64570
6224B2966834q50374n70585p91850o05481o43570o07146l90686m71126n22227
6215A7513789m82729o00141n96048o28241j57477m43675m64305j32573l10811
$$ plain form
6206 13697789 13386124 13076545 12731947 12436336 12414912 12284867 12024057 11836001 11433795 11258534
6196 11258534 11245017 11100495 10810980 10671172 10344060 9958405 9684314 9578817 9424980 9069893
6186 9069893 8814290 8659848 8510497 8425760 8360786 8433022 8267487 8026638 8097302 7946687
6176 7946687 7803172 7761701 7659696 7674616 7551938 7515507 7307725 7101139 7231309 7037311
6166 7037311 6830527 6749023 6623198 6547193 6417245 6179901 6264687 6345968 6047894 5943115
6156 5943115 5974369 5756633 5652343 5583742 5418920 5202429 5120346 5087039 5176769 5489511
6146 5489511 5226216 5124162 5149065 5116736 4843194 4795554 4908607 4705650 4553724 4458966
6136 4458966 4421641 4421947 4473070 4282736 4339115 4161514 4144099 4063815 4118937 4147850 3981347
$$ packed form
6206A3697789l11665l09579l44598k95611k1424j30045k60810j88056m02206j75261
6196A1258534j3517j44522k89515j39808l27112l85655k74091j05497j53837l55087
6186I069893k55603j54442j49351q4737o4974P2236j65535k40849P0664j50615
6176G946687j43515m1471j02005J4920j22678l6431k07782k06586J30170j93998
6166G037311k06784q1504j25825p6005j29948k37344Q4786Q1281k98074j04779
6156E943115L1254k17736j04290o8601j64822k16491q2083l3307Q9730L12742
6146E489511k63295j02054K4903l2329k73542m7640J13053k02957j51926r4758
6136D458966l7325L06N1123j90334N6379j77601j7415q0284N5122K8913j66503
$$ plain form
6125 3981347 4096617 4066600 4017536 3975049 3982065 3936106 3880875 3740940 3572632 3353472 3400375
6114 3400375 3478253 3531656 3450739 3428900 3534376 3458421 3414287 3326238 3500696 3342630 3168612
6103 3168612 3307153 3384587 3377325 3371305 3280659 3091869 3079421 3225686 3235161 3260701 3342780
6092 3342780 3272038 3192376 3151719 3128027 3108952 2977582 3154680 3122129 3105874 3012109 3147455
6081 3147455 3140032 3454070 3466943 3101837 2984467 2957711 3064060 3092515 3118008 3079457 3169584
6070 3169584 3294555 3082987 2961097 3038202 3064834 3348401 3493677 3556865 3303986 3131633
6060 3131633 3348375 3261807 3201346 3287996 3512472 3657812 3585693 3455337 3359919 3330086 3377991
6049 3377991 3347230 3386757 3394179 3452289 3440317 3303789 3392447 3665597 3845636 3704949 3759752
$$ packed form
6125C981347J15270l0017m9064m2487P016m5959n5231j39935j68308k19160M6903
6114C400375P7878N3403q0917k1839J05476p5955m4134q8049J74458j58066j74018
6103C168612J38541P7434p262o020r0646j88790j2448J46265R475K5540Q2079
6092C342780p0742p9662m0657k3692j9075j31370J77098l2551j6255r3765J35346
6081C147455p423L14038J2873l65106j17370k6756J06349K8455K5493l8551R0127
6070C169584J24971k11568j21890P7105K6632K83567J45276O3188k52879j72353
6060C131633K16742q6568o0461Q6650K24476J45340p2119j30356r5418k9833M7905
6049C377991l0761L9527P422N8110j1972j36528Q8658K73150J80039j40687N4803
$$ plain form
6038 3759752 3673312 3505501 3520820 3641017 3722790 3636622 3805618 3949139 4040383 3923139
6028 3923139 3758977 3874104 4050234 4078820 3897347 3964455 4367245 4347625 4309688 4433122
$$ packed form
6038C759752q6440j67811J5319J20197Q1773q6168J68996J43521R1244j17244
6028C923139j64162J15127J76130K8586j81473O7108M02790j9620l7937J23434
$$ [...]
##END NTUPLES=NMR SPECTRUM
##END=
