##TITLE=1H_CA-9243-3
 CDCl3
 8sc, 
 14.2.2024
##JCAMPDX= 6.0         $$ Bruker NMR JCAMP-DX V2.0
##DATA TYPE= NMR SPECTRUM
##DATA CLASS= NTUPLES
##ORIGIN= UXNMR, Bruker Analytische Messtechnik GmbH
##OWNER= root
$$ XWIN-NMR		Version 3.5
$$ Wed Feb 14 16:05:36 2024 Russian Standard Time (UT+4h)  she@DPX200
##.OBSERVE FREQUENCY= 200.1313
##.OBSERVE NUCLEUS= ^1H
##.ACQUISITION MODE= SIMULTANEOUS
##.ACQUISITION SCHEME= undefined
##.AVERAGES= 9
##.DIGITISER RES= 18
##SPECTROMETER/DATA SYSTEM= spect
##.PULSE SEQUENCE= zg30
##.SOLVENT NAME= CDCl3
##.SHIFT REFERENCE= (INTERNAL, CDCl3, 0, 15.5331)
##AUDIT TRAIL= $$ (NUMBER, WHEN, WHO, WHERE, WHAT)
$$ ##TITLE= Audit trail, XWIN-NMR		Version 3.5
$$ ##JCAMPDX= 5.01
$$ ##ORIGIN= Bruker BioSpin GmbH
$$ ##OWNER= she
$$ F:/spectra/data/she/nmr/H-F/1/pdata/1/auditp.txt
$$ ##AUDIT TRAIL=  $$ (NUMBER, WHEN, WHO, WHERE, WHAT)
(   1,<2024-02-14 16:04:12.85 +0400>,<she>,<DPX200>,
      <created by zg, POWCHK disabled, PULCHK disabled
       terminated by command 'halt'
       configuration hash MD5:
       00 E9 B6 7A A2 85 ED C7 34 08 36 98 17 FE 4E 26
       data hash MD5: 16K
       2A 2A 96 5A 9F 08 C0 2D 60 97 C6 14 5B 55 E7 F4>)
(   2,<2024-02-14 16:04:18.17 +0400>,<she>,<DPX200>,
      <Start of raw data processing
       efp BC_mod = 2 LB = 0.24 FT_mod = 6 PKNL = 1 PHC0 = -24949.12 PHC1 = 9.852645 SI = 16K 
       data hash MD5: 16K
       66 BF F7 93 82 61 08 3B 83 FB C9 5C 54 66 B0 70>)
(   3,<2024-02-14 16:04:41.92 +0400>,<she>,<DPX200>,
      <pk PHC0 = 3.316852 PHC1 = -1.4 
       data hash MD5: 16K
       BA 23 72 80 0A 2D 36 67 D1 67 7A 96 B9 B6 E4 AD>)
(   4,<2024-02-14 16:04:46.12 +0400>,<she>,<DPX200>,
      <abs ABSG = 5 
       data hash MD5: 16K
       55 3D 66 5F EC 77 4E 03 72 A4 EE D7 5B 85 1E 8A>)
$$ ##END=
$$ 
$$ hash MD5
$$ 4C 06 47 04 B4 09 11 E5 2C B4 86 CB 3C 71 BB 81
##$RELAX= 
##$RELAX= 
##$RELAX= 
##$RELAX= 
##$RELAX= 
##$RELAX= 
$$ Bruker specific parameters
$$ --------------------------
##$DU= <F:/spectra>
##$EXPNO= 1
##$NAME= <H-F>
##$PROCNO= 1
##$TYPE= <nmr>
##$USER= <she>
##$AMP= (0..31)
100 100 100 100 100 100 100 100 100 100 100 100 100 100 100 100 100 100 
100 100 100 100 100 100 100 100 100 100 100 100 100 100 
##$AQSEQ= 0
##$AQ_mod= 1
##$AUNM= <au_zg>
##$AUTOPOS= <>
##$BF1= 200.13
##$BF2= 200.13
##$BF3= 200.13
##$BF4= 200.13
##$BF5= 200.13
##$BF6= 200.13
##$BF7= 200.13
##$BF8= 200.13
##$BYTORDA= 1
##$CFDGTYP= 0
##$CFRGTYP= 5
##$CHEMSTR= <none>
##$CNST= (0..31)
1 1 145 1 1 1 1 1 1 1 1 1 1 1 1 1 1 1 1 1 1 1 1 1 1 1 1 1 1 1 1 1 
##$CPDPRG= <>
##$CPDPRG1= <>
##$CPDPRG2= <>
##$CPDPRG3= <>
##$CPDPRG4= <mlev>
##$CPDPRG5= <mlev>
##$CPDPRG6= <mlev>
##$CPDPRG7= <mlev>
##$CPDPRG8= <mlev>
##$CPDPRGB= <>
##$CPDPRGT= <>
##$D= (0..31)
0 1.2 0 0 0 0 0 0 0 0.06 0 0.03 0 0 0 0 0.0002 0 0 0 0 0 0 0 0 0 0 0 0 
0 0 0 
##$DATE= 1707912252
##$DBL= (0..7)
120 120 120 120 120 120 120 120 
##$DBP= (0..7)
150 150 150 150 150 150 150 150 
##$DBP07= 0
##$DBPNAM0= <>
##$DBPNAM1= <>
##$DBPNAM2= <>
$$ [...]
##$SUBNAM3= <"">
##$SUBNAM4= <"">
##$SUBNAM5= <"">
##$SUBNAM6= <"">
##$SUBNAM7= <"">
##$SUBNAM8= <"">
##$SUBNAM9= <"">
##$SW= 18.0517328524113
##$SWIBOX= (0..15)
0 0 2 0 0 0 0 0 0 0 0 0 0 0 0 0 
##$SW_h= 3612.71676300578
##$TD= 16384
##$TD0= 1
##$TE= 0
##$TE2= 300
##$TE3= 300
##$TEG= 300
##$TL= (0..7)
0 120 120 120 120 120 120 120 
##$TP= (0..7)
150 150 150 150 150 150 150 150 
##$TP07= 0
##$TPNAME0= <>
##$TPNAME1= <>
##$TPNAME2= <>
##$TPNAME3= <>
##$TPNAME4= <>
##$TPNAME5= <>
##$TPNAME6= <>
##$TPNAME7= <>
##$TPOAL= (0..7)
0.5 0.5 0.5 0.5 0.5 0.5 0.5 0.5 
##$TPOFFS= (0..7)
0 0 0 0 0 0 0 0 
##$TUNHIN= 0
##$TUNHOUT= 0
##$TUNXOUT= 0
##$USERA1= <user>
##$USERA2= <user>
##$USERA3= <user>
##$USERA4= <user>
##$USERA5= <user>
##$V9= 5
##$VALIST= <valist>
##$VCLIST= <CCCCCCCCCCCCCCC>
##$VD= 0
##$VDLIST= <DDDDDDDDDDDDDDD>
##$VPLIST= <PPPPPPPPPPPPPPP>
##$VTLIST= <TTTTTTTTTTTTTTT>
##$WBST= 1024
##$WBSW= 4
##$XGAIN= (0..3)
0 0 0 0 
##$XL= 0
##$YL= 0
##$YMAX_a= 80607
##$YMIN_a= -119514
##$ZGOPTNS= <>
##$ZL1= 120
##$ZL2= 120
##$ZL3= 120
##$ZL4= 120
##$ABSF1= 15.57171
##$ABSF2= -2.480142
##$ABSG= 5
##$ABSL= 3
##$ALPHA= 0
##$AQORDER= 0
##$ASSFAC= 0
##$ASSFACI= 0
##$ASSFACX= 0
##$ASSWID= 0
##$AUNMP= <proc_1d>
##$AZFE= 0.1
##$AZFW= 0.1
##$BCFW= 0
##$BC_mod= 2
##$BYTORDP= 0
##$COROFFS= 0
##$CY= -3
##$DATMOD= 1
##$DC= 0
##$DFILT= <>
##$DTYPP= 0
##$F1P= 0
##$F2P= 0
##$FCOR= 1
##$FTSIZE= 16384
##$FT_mod= 6
##$GAMMA= 0
##$GB= 0
##$INTBC= 1
##$INTSCL= 3.70164e-10
##$ISEN= 128
##$LB= 0.24
##$LEV0= 0
##$LPBIN= 0
##$MAXI= 10000
##$MC2= 0
##$MEAN= 0
##$ME_mod= 0
##$MI= 1.114404
##$NCOEF= 0
##$NC_proc= -8
##$NLEV= 6
##$NOISF1= 3.799351
##$NOISF2= 2.8
##$NSP= 0
##$NTH_PI= 0
##$NZP= 0
##$OFFSET= 15.53314
##$PC= 1
##$PHC0= -24945.8
##$PHC1= 8.452645
##$PH_mod= 1
##$PKNL= yes
##$PPARMOD= 0
##$PSCAL= 0
##$PSIGN= 0
##$REVERSE= no
##$SF= 200.129997711178
##$SI= 16384
##$SIGF1= 3
##$SIGF2= 2
##$SINO= 5.538805
##$SIOLD= 16384
##$SREGLST= <1H.CDCl3>
##$SSB= 0
##$STSI= 16384
##$STSR= 0
##$SW_p= 3612.71676300578
##$SYMM= 0
##$S_DEV= 0
##$TDeff= 16384
##$TDoff= 0
##$TI= <>
##$TILT= no
##$TM1= 0
##$TM2= 0
##$TOPLEV= 0
##$USERP1= <user>
##$USERP2= <user>
##$USERP3= <user>
##$USERP4= <user>
##$USERP5= <user>
##$WDW= 1
##$XDIM= 16384
##$YMAX_p= 349026937
##$YMIN_p= -1330773
$$ End of Bruker specific parameters
$$ ---------------------------------
##NTUPLES= NMR SPECTRUM
##VAR_NAME=  FREQUENCY,     SPECTRUM/REAL,   SPECTRUM/IMAG
##SYMBOL=    X,             R,               I
##VAR_TYPE=  INDEPENDENT,   DEPENDENT,       DEPENDENT
##VAR_FORM=  AFFN,          ASDF,            ASDF
##VAR_DIM=   16384,         16384,           16384
##UNITS=     HZ,            ARBITRARY UNITS, ARBITRARY UNITS
##FACTOR=    0.220516191357247, 1,           1
##FIRST=     3108.64730917015, 0,            0
##LAST=      -504.069453835626, 0,           0
##MIN=       -504.069453835626, -1330773,    0
##MAX=       3108.64730917015, 349026937,    0
$$ Real data points
##PAGE= N=1
##DATA TABLE= (X++(R..R)), XYDATA
$$ [...]
$$ plain form
12548 -22032 43915 190625 541046 686567 266375 -25190 33657 -209687 -410113 -550499
12538 -550499 -79829 158985 330834 81812 -667001 -481912 -422815 -311968 -318539 138418
12528 138418 -88826 -208149 -242184 157611 524249 402397 22617 -9609 175766 116696
12518 116696 -62619 -354111 -299148 134432 -61195 25464 220307 149495 -350533 -364112
12508 -364112 64094 -261556 -476136 -130285 -235821 -248938 -76572 -84668 -184836 -180600
12498 -180600 422992 488913 462330 379599 219455 -60112 394896 297312 -232445 -440850
12488 -440850 -427657 -563657 -483464 -460860 -297660 7655 -203063 -256469 -481580 -235829
12478 -235829 21125 596385 526968 504575 494684 -96062 206578 484507 188104 343132
$$ packed form
12548b2032O5947J46710L50421J45521m20192k91565N8847k43344k00426j40386
12538e50499M70670K38814J71849k49022p48813J85089N9097J10847o571M56957
12528A38418k27244j19323l4035L99795L66638j21852l79780l2226J85375n9070
12518A16696j79315k91492N4963M33580j95627Q6659J94843p0812n00028j3579
12508c64112M28206l25650k14580L45851j05536j3117J72366q096j00168M236
12498a80600O03592O5921k6583q2731j60144k79567M55008r7584n29757k08405
12488d40850J3193j36000Q0193K2604J63200L05315k10718n3406k25111K45751
12478b35829K56954N75260o9417k2393r891n90746L02640K77929k96403J55028
$$ plain form
12468 343132 312353 247036 714575 572407 161952 72675 55181 -70053 -131042 81247
12458 81247 238325 -57238 -232441 -374657 -2719 13407 -36666 -164324 -220453 22037
12448 22037 -165672 -374366 -556375 -495560 -685517 -441250 131778 368556 196248 631558
12438 631558 812830 302051 -26103 -251022 -179147 -57503 -165780 -627682 -537041 -143594
12428 -143594 64890 -154346 -140860 -28941 -53641 69762 -175039 8401 -5547 -365247
12418 -365247 36238 1567 -19178 127237 572687 601676 321069 823024 544035 -127845
12408 -127845 -172939 -118571 -55739 105486 116501 108393 139703 -49042 -48684 -206822 161245
12397 161245 -12773 -767825 -760046 -554836 -511253 -485847 -141289 -11555 -257815 71285
$$ packed form
12468C43132l0779o5317M67539j42168m10455q9277j7494j25234o0989K12289
12458H1247J57078k95563j75203j42216L71938J6126n0073j27658n6129K42490
12448B2037j87709k08694j82009O0815j89957K44267N73028K36778j72308M35310
12438F31558J81272n10779l28154k24919P1875J21644j08277m61902R0641L93447
12428a43594K08484k19236J3486J11919k4700J23403k44801J83440j3948l59700
12418c65247M01485l4671k0745J46415M45450K8989k80607N01955k78989o71880
12408a27845m5094N4368O2832J61225J1015q108L1310j88745L58j58138L68067
12397A61245j74018p55052P779K05210M3583K5406L44558J29734k46260L29100
$$ plain form
12387 71285 16831 65664 175398 170298 -132647 32561 -499654 -809755 -304081 108932
12377 108932 494729 512162 428328 333924 484718 252932 101184 57584 -102801 -343803
12367 -343803 -615806 -214218 -128238 -312091 -42368 -141673 -233932 10379 -32364 -402385
12357 -402385 -528633 -199911 -78331 -20847 290417 263873 445584 138518 -145625 75345
12347 75345 -149237 -141949 255583 -55510 199009 -152209 -86089 107844 -82186 -550707
12337 -550707 -498708 -867966 -637373 -64467 -454119 -599325 -11776 168482 33477 202413
12327 202413 81527 -26910 -272652 -211512 -65796 -446437 -145599 24956 345720 74393
12317 74393 92712 246758 503532 349388 217356 205315 -229893 -159399 100693 -236360
$$ packed form
12387G1285n4454M8833J09734n100l02945J65208n32215l10101N05674M13013
12377A08932L85797J7433q3834r4404J50794k31786j51748m3600j60385k41002
12367c43803k72003M01588Q5980j83853K69723r9305r2259K44311m2743l70021
12357d02385j26248L28722J21580N7484L11264k6544J81711l07066k84143K20970
12347G5345k24582P288L97532l11093K54519l51218O6120J93933j90030m68521
12337e50707N1999l69258K30593N72906l89652j45206N87549J80258j35005J68936
12327B02413j20886j08437k45742O1140J45716l80641L00838J70555L20764k71327
12317G4393J8319J54046K56774j54144j32032j2041m35208P0494K60092l37053
$$ plain form
12307 -236360 -95083 69232 -10088 -294243 -339651 -214600 -355639 -88871 -99283 280660
12297 280660 473115 304706 619120 334517 -14001 691160 690801 554285 62060 152635
12287 152635 5772 -170170 -399811 -476421 -213283 -414204 -553103 -4390 -48058 256237
12277 256237 150936 505706 446301 172398 159087 425080 462952 73349 402070 -189940
12267 -189940 -8483 272928 -430652 -137147 -320282 196453 -178788 -352940 -172308 -412869
12257 -412869 -723528 -403948 -400331 -536544 2175 -111090 -385059 -199657 9875 374450
12247 374450 423340 -133021 165414 395286 258450 65997 323191 -170258 -65884 413269
12237 413269 42502 -318759 -530804 24520 113766 -397780 59462 -233890 -351564 105514
$$ packed form
12307b36360J41277J64315p9320k84155m5408J25051j41039K66768j0412L79943
12297B80660J92455j68409L14414k84603l48518P05161l59j36516m92225R0575
12287A52635j46863j75942k29641p6610K63138k00921j38899N48713m3668L04295
12277B56237j05301L54770n9405k73903j3311K65993L7872l89603L28721n92010
12267a89940J81457K81411p03580K93505j83135N16735l75241j74152J80632k40561
12257d12869l10659L19580L617j36213N38719j13265k73969J85402K09532L64575
12247C74450M8890n56361K98435K29872j36836j92453K57194m93449J04374M79153
12237D13269l70767l61261k12045N55324Q9246n11546M57242k93352j17674M57078
$$ plain form
12227 105514 91156 -67930 131155 539289 930525 717134 252522 -191407 -36654 294320
12217 294320 302871 -345170 -200334 -41480 36291 102386 148619 -170289 -555325 -465174 -287532
12206 -287532 296035 -67293 -9691 295347 -394223 -342619 93379 -101766 -389782 -444551
12196 -444551 -192979 -334221 -554670 -63959 -281390 -373243 262455 243542 572883 135382
12186 135382 -180427 -278712 -315322 -305262 -258035 134 477441 478556 179089 215806 -11002
12175 -11002 108786 -141955 -425913 -262100 -356075 -340147 -243922 -27390 87710 -112827
12165 -112827 -390268 76888 695308 428392 181037 407816 220745 94193 -67189 -65998
12155 -65998 104128 53529 55640 79723 291597 12031 137900 2337 -734098 -123168
$$ packed form
12227A05514j4358j59086J99085M08134L91236k13391m64612m43929J54753L30974
12217B94320Q551o48041J44836J58854P7771O6095M6233l18908l85036R0151J77642
12206b87532N83567l63328N7602L05038o89570N1604M35998j95145k88016n4769
12196d44551K51572j41242k20449M90711k17431r1853O35698j8913L29341m37501
12186A35382l15809r8285l6610J0060M7227K58169M77307J115k99467L6717k26808
12175a1002J19788k50741k83958J63813r3975J5928R6225K16532J15100k00537
12165a12827k77441M67156O18420k66916k47355K26779j87071j26552j61382J191
12155f5998J70126n0599K111K4083K11874k79566J25869j35563p36435O10930
$$ plain form
12145 -123168 535457 524895 422463 65773 326928 -134889 87728 -197490 -192600 -186446
12135 -186446 9043 157278 80605 -259123 -326891 673351 306488 436075 482578 289415
12125 289415 561235 397277 49507 393613 277169 -237783 -72246 -33509 315239 470222
12115 470222 8194 390828 880702 493138 319584 449512 197181 -30968 -60262 130576
12105 130576 165673 105810 -85033 -744001 -595624 -241157 225558 781733 566185 329390
12095 329390 -369943 -480229 -586234 -821258 -776919 -166799 -247118 -565940 126653 300648
12085 300648 87756 257461 277808 578549 382500 145816 312980 -136103 202523 46037
12075 46037 -75168 -269863 370047 303191 59699 115464 177971 -15755 -152226 339850
$$ packed form
12145a23168O58625j0562j02432l56690K61155m61817K22617k85218M890O154
12135a86446J95489J48235p6673l39728o7768J000242l66863J29587M6503j93163
12125B89415K71820j63958l47770L44106j16444n14952J65537L8737L48748J54983
12115D70222m62028L82634M89874l87564j73554J29928k52331k28149k9294J90838
12105A30576L5097n9863j90843o58968J48377L54467M66715N56175k15548k36795
12095C29390o99333j10286j06005k35024M4339O10120q0319l18822O92593J73995
12085C00648k12892J69705K0347L00741j96049k36684J67164m49083L38626j56486
12075D6037j21205j94695O39910o6856k43492N5765O2507j93726j36471M92076
$$ plain form
12065 339850 484701 273530 39455 -114556 16689 -26940 32505 257744 439584 -197263
12055 -197263 -247247 -58258 -406922 236220 424506 394652 532198 628640 -109408 -12223
12045 -12223 172900 710182 350605 45793 -104612 -334977 -231842 -181727 -34566 -105020
12035 -105020 274290 377937 205900 348691 -181192 -226588 112879 266162 292730 -408
12025 -408 -254243 -43103 -181963 -50049 4567 86046 -46314 -235048 -55612 229403
12015 229403 340249 249276 -21174 170806 14568 199574 496738 -39187 22950 123190
12005 123190 52316 171563 183196 298444 586826 402185 644873 709344 436672 283959
11995 283959 393788 629844 111115 -255133 146808 -13930 -276343 209057 467914 124745
$$ packed form
12065C39850J44851k11171k34075j54011J31245m3629N9445K25239J81840o36847
12055a97263m9984J88989l48664O43142J88286k9854J37546R6442p38048R7185
12045a2223J85123N37282l59577l04812j50405k30365J03135N0115J47161p0454
12035a05020L79310J03647j72037J42791n29883m5396L39467J53283K6568k93138
12025d08k53835K11140j38860J31914N4616Q1479j32360j88734J79436K85015
12015B29403J10846r0973k70450J91980j56238J85006K97164n35925O2137J00240
12005A23190p0874J19247J1633J15248K88382j84641K42688O4471k72672j52713
11995B83959J09829K36056n18729l66248M01941j60738k62413M85400K58857l43169
$$ plain form
11985 124745 348972 -121024 -639898 -23364 -304833 -592763 517044 845768 326177
11976 326177 57469 253100 583467 219350 -81383 541309 -58807 -247761 465443 263832
11966 263832 154779 403434 386584 330672 125468 422459 97440 -276058 -417058 -55632
11956 -55632 144406 327299 74824 -220269 142654 178849 675022 357939 -53231 -56835
11946 -56835 165108 472287 300266 -79196 -191362 279711 920947 610347 440379 364850
11936 364850 56570 -68049 -151639 9253 -7055 252398 845818 801383 481167 348506
11926 348506 152308 -159399 -74377 393594 209219 -267479 -71820 10726 -184360 -43535
11916 -43535 7751 -15587 312261 105885 -538056 -228759 -180476 -70932 136328 320845
$$ packed form
11985A24745K24227m69996n18874O16534k81469k87930J109807L28724n19591
11976C26177k68708J95631L30367l64117l00733O22692o00116j88954P13204k01611
11966B63832j09053K48655j6850n5912k05204K96991l25019l73498j41000L61426
11956e5632K00038J82893k52475k95093L62923L6195M96173l17083m11170l604
11946e6835K21943L07179j72021l79462j12166M71073O41236l10600j69968p5529
11936C64850l08280j24619q3590J60892j6308K59453N93420m4435l20216j32661
11926C48506j96198l11707Q5022M67971j84375m76698J95659Q2546j95086J40825
11916d3535N1286k3338L27848k06376o43941L09297M8283J09544K07260J84517
$$ plain form
11906 320845 381578 222161 487414 981335 869197 757931 598258 345074 130028 376742
11896 376742 281260 87308 47150 248055 590652 237644 184991 342580 371633 285645
11886 285645 -146770 -136775 84116 287578 627894 2910 -157110 90437 131146 368441
11876 368441 331034 492718 318907 135854 -114188 -812791 -602669 -276121 134454 -217937
11866 -217937 -408707 169875 -291750 -387431 54151 162814 -118210 -293245 -295074 -32132
11856 -32132 555500 621958 673370 505508 162882 -237020 -333502 -61642 144388 284265
11846 284265 609674 336561 591666 550972 330684 226410 207659 95300 -206363 89725
11836 89725 196826 -36479 109384 -39114 -351928 -184719 120691 311777 483893 375180
$$ packed form
11906C20845O0733j59417K65253M93921j12138j11266j59673k53184k15046K46714
11896C76742r5482j93952m0158K00905L42597l53008n2653J57589K9053q5988
11886B85645m32415R995K20891K03462L40316o24984j60020K47547M0709K37295
11876C68441l7407J61684j73811j83053k50042o98603K10122L26548M10575l52391
11866b17937j90770N78582m61625r5681M41582J08663k81024j75035j829K62942
11856c2132N87632O6458N1412j67862l42626l99902r6482K71860K06030J39877
11846B84265L25409k73113K55105m0694k20288j04274j8751j12359l01663K96088
11836H9725J07101k33305J45863j48498l12814J67209L05410J91086J72116j08713
$$ plain form
11826 375180 175767 -345339 -371403 -245841 -320410 238535 441544 139657 -62594 514583
11816 514583 483929 331851 228410 13863 269235 -64036 -82650 -1373 78134 -360128
11806 -360128 -206896 -261484 -36479 5941 259293 -2462 -165340 180417 18231 -460528
11796 -460528 -469291 -555424 -575777 -166408 215003 444343 11103 335084 490051 679183
11786 679183 223442 -145697 -489906 -286277 -458444 203233 16539 404439 785398 575921
11776 575921 517996 -28466 396279 701224 67316 -475484 -383551 -83253 -466854 -89505
11766 -89505 189798 95681 413618 249405 115661 243348 225454 185525 446253 635231
11756 635231 773190 469433 661135 520001 49758 462240 939833 790963 419624 861454
$$ packed form
11826C75180j99413n21106k6064J25562p4569N58945K03009l01887k02251N77177
11816E14583l0654j52078j03441k14547K55372l33271j8614Q1277P9507m38262
11806c60128J53232n4588K25005M2420K53352k61755j62878L45757j62186m78759
11796d60528q763q6133k0353M09369L81411K29340m33240L23981J54967J89132
11786F79183m55741l69139l44209K03629j72167O61677j86694L87900L80959k09477
11776E75921n7925n46462M24745L04945o33908n42800R1933L00298l83601L77349
11766h9505K79303r4117L17937j64213j33744J27687j7894l9929K60728J88978
11756F35231J37959l03757J91702j41134m70243M12482M77593j48870l71339M41830
$$ plain form
11746 861454 632524 649038 1020277 682847 310617 43475 424244 571751 328534 384560
11736 384560 46614 -311346 369160 291250 333664 420348 450968 504750 354312 138093
11726 138093 -82619 -223011 -105791 -313424 -264865 -12680 90326 240341 391976 118793
11716 118793 184984 321266 -31213 2986 36568 208335 257537 681692 332589 397656
11706 397656 690223 518927 104581 -122364 396306 525094 310745 423262 139332 643361
11696 643361 553570 394417 451287 560444 723436 99251 195215 352618 -6514 -170288
11686 -170288 -114551 265451 185822 10256 388628 425366 296694 -31510 239442 390681
11676 390681 550394 659174 185046 27512 352223 431735 467706 121267 361492 289331
$$ packed form
11746H61454k28930J6514L71239l37430l72230k67142L80769J47507k43217N6026
11736C84560l37946l57960O80506p7910M2414Q6684L0620N3782j50438k16219
11726A38093k20712j40392J17220k07633M8559K52185J03006J50015J51635k73183
11716A18793O6191J36282l52479L4199L3582J71767M9202M24155l49103O5067
11706C97656K92567j71296m14346k26945N18670J28788k14349J12517k83930N04029
11696F43361q9791j59153N6870J09157J62992o24185R5964J57403l59132j63774
11686a70288N5737L80002p9629j75566L78372L6738j28672l28204K70952J51239
11676C90681J59713J08780m74128j57534L24711P9512L5971l46439K40225p2161
$$ plain form
11666 289331 199054 400758 458276 702226 504073 364132 396318 549708 752253 464523
11656 464523 124221 541774 486133 296154 371773 525146 553524 247407 -152025 -172719
11646 -172719 20210 -54968 101001 96463 72827 92336 146326 453610 484394 367237 250370
11635 250370 357512 -87992 -263898 43216 757576 1161669 977254 1153661 597197 626632
11625 626632 428610 421535 737287 477542 484112 908345 720666 257731 245606 121517
11615 121517 47380 227521 361785 1007828 928839 851258 792835 783653 482008 373660 501517
11604 501517 637706 905501 462131 140942 -125653 332218 618091 369505 1155691 1329913
11594 1329913 623397 499272 759501 1137531 1078742 771695 972776 945705 1007576 965189
$$ packed form
11666B89331r0277K01704N7518K43950j98153j39941L2186J53390K02545k87730
11656D64523l40302M17553n5641j89979P5619J53373K8378l06117l99432k0694
11646a72719J92929p5178J55969m538k3636J9509N3990L07284L0784j17157j16867
11635B50370J07142m45504j75906L07114P14360M04093j84415J76407n56464K9435
11625F26632j98022p075L15752k59745O570M24233j87679m62935j2125j24089
11615A21517p4137J80141J34264O46043p8989p7581n8423r182l01645j08348J27857
11604E01517J36189K67795m43370l21189k66595M57871K85873k48586P86186J74222
11594A329913p06516j24125K60229L78030n8789l07047K01081k7071O1871m2387
$$ plain form
11584 965189 459936 205357 -234244 423228 880621 1086156 1196512 1428352 913191 612361
11574 612361 882347 1153342 994276 985723 937468 684403 957129 570117 870253 987717
11564 987717 625804 625873 644632 670107 928118 1203127 970437 1005035 1211132 1273206 1233324
11553 1233324 1303062 954037 915030 1085927 1323743 1556649 1599088 1651078 1035513 922225
11543 922225 1197233 1150258 845361 797186 991436 1651335 1573964 1567197 2140666 1557470
11533 1557470 1543781 1623916 1057117 1442498 1827726 2268224 1916009 1541448 1644682 1639852
11523 1639852 1414773 1459105 1582374 1356469 1492093 1304420 1447916 2010417 2203567 2186153
11513 2186153 1762542 1584570 1362576 1709608 1599726 2149904 2528682 1662208 1867246
$$ packed form
11584I65189n05253k54579m39601O57472M57393K05535J10356K31840n15161l00830
11574F12361K69986K70995j59066q553m8255k53065K72726l87012L00136J17464
11564I87717l61913O9J8759K5475K58011K75009k32690L4598K06097O2074l9882
11553A233324O9738l49025l9007J70897K37816K32906M2439N1990o15565j13288
11543I22225K75008m6975l04897m8175J94250O59899p7371o767N73469n83196
11533A557470j3689Q0135n66799L85381L85228M40498l52215l74561J03234m830
11523A639852k25079M4332J23269k25905J35624j87673J43496N62501J93150j7414
11513B186153m23611j77972k21994L47032j09882N50178L78778q66474K05038
$$ plain form
11504 1867246 1515754 1242151 1303104 1656522 1097890 1420773 1505537 1817793 1686552 1521299
11494 1521299 1840065 2221919 2251807 2001657 1595864 1541059 1534828 1477489 1883733 1780291
11484 1780291 1909294 1890075 1995360 1786512 1862162 2260686 2118539 2212178 2230048 2528968
11474 2528968 2114563 2167682 2254843 2317481 2422790 2313978 2663773 2128713 2559150 2497811
11464 2497811 2283360 2612579 2791195 2560765 2836358 3014992 2834911 2821302 3096612 2419811
11454 2419811 2657736 3071284 2895490 3158858 3210677 3002061 3147338 3314479 3627987 2938020
11444 2938020 2989740 3646305 3399793 3198768 3349259 3633936 3163158 3095227 3948344 3969842
11434 3969842 3994107 4160329 4208510 3880312 3822261 4557524 4388383 4483674 4660433 4698735
$$ packed form
11504A867246l51492k73603O0953L53418n58632L22883Q4764L12256j31241j65253
11494A521299L18766L81854K9888k50150m05793n4805o231n7339M06244j03442
11484A780291J29003j9219J05285k08848P5650L98524j42147R3639J7870K98920
11474B528968m14405N3119Q7161O2638J05309j08812L49795n35060M30437o1339
11464B497811k14451L29219J78616k30430K75593J78634j80081j3609K75310o76801
11454B419811K37925M13548j75794K63368N1819k08616J45277J67141L13508o89967
11444B938020N1720O56565k46512k01025J50491K84677m70778o7931Q53117K1498
11434C969842K4265J66222M8181l28198n8051P35263j69141R5291J76759L8302
$$ plain form
11424 4698735 4760186 4914021 5100144 5114525 4856041 5078134 4710050 4551175 5004147 5321037
11414 5321037 5469545 5672481 5593158 5653164 6391959 6543628 6739548 6207775 6515926 7078369
11404 7078369 6855830 7222178 6819614 7388998 7716877 7335876 7004127 7311671 7854137
11395 7854137 7696370 7822672 8609677 8730477 8226680 8771121 9363513 9319410 9470864 10012571
11385 10012571 10474844 10631402 10228112 10267182 11146844 11442988 11585400 11423151 11715078
11376 11715078 12097498 12514782 12936370 12835570 12801534 13258973 13635053 13895049 14673755
11367 14673755 15150809 15127830 15416959 15675815 16081400 16493062 16981088 17129288 17826195
11358 17826195 18679931 19441369 19983099 20618816 21314773 21904161 23105295 23993459 24441046
$$ packed form
11424D698735O1451J53835J86123J4381k58484K22093l68084j58875M52972L16890
11414E321037J48508K02936p9323O0006P38795J51669J95920n31773L08151N62443
11404G078369k22539L66348m02564N69384L27879l81001l31749L07544N42466
11395G854137j57767J26302P87005J20800n03797N44441N92392m4103J51454N41707
11385A0012571M62273J56558m03290L9070Q79662K96144J42412j62249K91927
11376A1715078L82420M17284M21588j00800l4036M57439L76080K59996P78706
11367A4673755M77054k2979K89129K58856M05585M11662M88026J48200O96907
11358A7826195Q53736P61438N41730O35717O95957N89388J201134Q88164M47587
$$ plain form
11349 24441046 24931617 25881536 26422224 27578602 28129239 28861399 29434482 30734034 32060869
11340 32060869 33126912 34238736 35248629 36390299 37634134 38804205 40471768 41738956
11332 41738956 43503654 44782720 46218341 47879548 49640658 51216660 52693362 54500923
11324 54500923 56472703 58802103 60046648 62054352 63657887 65548377 67397997 68624979
11316 68624979 69412567 69421333 69834322 70601086 70588393 70701478 70738240 69670449 68944440 67596266
11306 67596266 65702168 64241006 62773830 60843331 58970622 57399650 55209445 52655166
11298 52655166 51238118 49707305 47713451 46346941 44380710 42357073 40471887 38775513
11290 38775513 37608076 36392315 34690011 33459965 32490582 30804749 29032852 28451495
$$ packed form
11349B4441046M90571R49919N40688J156378N50637P32160N73083J299552J326835
11340C2060869J066043J111824J009893J141670J243835J170071J667563J267188
11332D1738956J764698J279066J435621J661207J761110J576002J476702J807561
11324E4500923J971780K329400J244545K007704J603535J890490J849620J226982
11316F8624979P87588Q766M12989P66764j2693J13085L6762j067791p26009j348174
11306F7596266j894098j461162j467176j930499j872709j570972k190205k554279
11298E2655166j417048j530813j993854j366510j966231k023637j885186j696374
11290C8775513j167437j215761j702304j230046r69383j685833j771897n81357
$$ plain form
11282 28451495 28147636 26974307 25908262 24943285 24003569 23434456 22620250 22128696 20814777
11273 20814777 20370961 19663183 19015234 18723992 18242377 17425228 16712597 16334968 15818516
11264 15818516 15739631 15325318 15267118 15102391 14098895 13490243 13274041 12938842 12533132
11255 12533132 12535757 11894848 11451085 11217750 10791798 10830932 10723855 10172587 10180655 9830193
11245 9830193 9341189 9366582 9252735 9102555 8517271 8102015 7743780 7850691 8475971 8298471
11235 8298471 7729896 7638603 7256934 7572855 7283229 6973799 6794277 7150963 6243812 5939273
11225 5939273 6136827 6065931 6081108 5646246 5998635 5855446 5320741 5398471 5502013 5321756
11215 5321756 5635214 5066203 4811867 4565909 4563389 4722811 4849809 4663924 4736470 4716953
$$ packed form
11282B8451495l03859j173329j066045r64977r39716n69113q14206m91554j313919
11273B0814777m43816p07778o47949k91242m81615q17149p12631l77629n16452
11264A5818516p8885m14313n8200j64727j003496o08652k16202l35199m05710
11255A2533132K625o40909m43763k33335m25952L9134j07077n51268Q068l50462
11245I830193m89004K5393j13847j50180n85284m15256l58235J06911O25280j77500
11235H298471n68575r1293l81669L15921k89626l09430j79522L56686r07151l04539
11225E939273J97554p0896J5177m34862L52389j43189n34705P7730J03542j80257
11215E321756L13458n69011k54336k45958k520J59422J26998j85885P2546j9517
$$ plain form
11205 4716953 4332151 3954501 4374457 4105543 3859441 4275617 4101401 3694245 3528837
11196 3528837 3556090 3664038 3423560 3194567 3876560 3866795 4079985 4241632 3945758 3041627
11186 3041627 2726449 2779510 2687137 2575919 2976193 3187326 2943274 2965338 2575690 2437890
11176 2437890 2574992 3147395 2743226 2399514 2739021 2749913 3104476 2814299 2919441 2777572
11166 2777572 2631180 2619513 2817289 2547276 2521485 2332273 2496916 2708324 2414667 2460633
11156 2460633 3018478 2996244 3309720 3084873 3114095 3100339 2717889 3019204 2927270 2815743
11146 2815743 2462512 2501634 2619835 2541750 2204677 2847667 2493526 2250298 2558564 2927702
11136 2927702 3229233 2994466 2928765 3425908 2818739 2565694 2499911 2243926 2500761 2249657
$$ packed form
11205D716953l84802l77650M19956k68914k46102M16176j74216m07156j65408
11196C528837K7253J07948k40478k28993O81993r765K13190J61647k95874r04131
11186C041627l15178N3061r2373j11218M00274K11133k44052K2064l89648j37800
11176B437890J37102N72403m04169l43712L39507J0892L54563k90177J05142j41869
11166B777572j46392j1667J97776k70013k5791j89212J64643K11408k93657M5966
11156B460633N57845k2234L13476k24847K9222j3756l82450L01315r1934j11527
11146B815743l53231L9122J18201p8085l37073O42990l54141k43228L08266L69138
11136B927702L01531k34767o5701M97143o07169k53045o5783k55985K56835k51104
$$ plain form
11126 2249657 2007019 1871210 2110914 2710280 2600621 2313589 2355737 1895538 2560431 2522622
11116 2522622 2442224 2354315 2605113 2313871 2426431 2413307 2478868 2532828 2429498 2232981
11106 2232981 1902884 1938025 2281441 2923581 2642383 2617063 2558925 2255226 2612560 3049322
11096 3049322 2718359 2340988 2496909 3103283 2842480 2776483 2507112 2862416 2643229 2823591
11086 2823591 2854265 2221704 2847051 3262135 3048195 3116849 2871869 2734117 2676201 3115626
11076 3115626 2836217 3217968 3772165 3309092 3216053 3322815 3641673 3137523 3351748 3471568
11066 3471568 3330187 3573165 4062354 3865291 3390866 3705684 3504824 3873314 4093953
11057 4093953 4202004 4050158 4016365 4305333 4294915 4390343 4384748 3922522 4262205 4214968
$$ packed form
11126B249657k42638j35809K39704N99366j09659k87032M2148m60199O64893l7809
11116B522622q0398q7909K50798k91242J12560j3124O5561N3960j03330j96517
11106B232981l30097L5141L43416O42140k81198k5320n8138l03699L57334M36762
11096C049322l30963l77371J55921O06374k60803o5997k69371L55304k19187J80362
11086B823591L0674o32561O25347M15084k13940O8654k44980j37752n7916M39425
11076C115626k79409L81751N54197m63073r3039J06762L18858n04150K14225J19820
11066C471568j41381K42978M89189j97063m74425L14818k00860L68490K20639
11057D093953J08051j51846l3793K88968j0418R5428n595m62226L39683m7237
$$ plain form
11047 4214968 4723422 5344619 5049450 4905532 5077631 5255381 5469170 6319771 6483291
11038 6483291 6577111 6529149 6696646 6942020 6692165 6866338 6796002 6638152 6955431 7312410
11028 7312410 7517730 7805142 8516939 8664382 8813652 8852359 9231196 9976287 10373175 10776309
11018 10776309 10575438 10299660 10694300 11528745 12527312 12515670 12475931 13186489 13044522 13486257
11008 13486257 14071701 14238523 14376563 14449881 14383287 14428594 14968056 15182291 15169125 15282877
10998 15282877 15417068 15227805 15241601 14974600 14777618 14575140 14077881 13976979 13397245
10989 13397245 13307720 12791149 12443584 12458156 11846523 11062017 10656998 10385405 9878357 9975483
10979 9975483 9908438 9323530 9066183 9542967 9069145 8490908 7952060 7048469 7256139 7556431
$$ packed form
11047D214968N08454O21197k95169j43918J72099J77750K13789Q50601J63520
11038F483291R3820m7962J67497K45374k49855J74173p0336j57850L17279L56979
11028G312410K05320K87412P11797J47443J49270L8707L78837P45091L96888M03134
11018A0776309k00871k75778L94640Q34445R98567j1642l9739P10558j41967M41735
11008A3486257N85444J66822J38040P3318o6594M5307N39462K14235j3166J13752
10998A5282877J34191j89263J3796k67001j96982k02478m97259j00902n79734
10989A3397245q9525n16571l47565J4572o11633p84506m05019k71593n07048R7126
10979I975483o7045n84908k57347M76784m73822n78237n38848r03591K07670L00292
$$ plain form
10969 7556431 7373015 7052190 6509905 6367297 5738050 5647821 5970856 6098181 5837139 5234448
10959 5234448 4971614 5169962 4585221 4728785 4716673 4165732 3936859 4203728 4075260 4538661
10949 4538661 4245042 3991567 3660708 3430132 3278637 3560841 3347151 3180688 3296873
10940 3296873 3060289 3319124 3055423 2643506 2793243 2981263 3027150 3292180 3215213 2986834
10930 2986834 2477295 1909894 2288729 2440167 2561504 2315398 2590612 2613775 1883148 1781871
10920 1781871 1697483 2206914 2048482 1826277 1645007 1734255 1978644 2054169 1614409 1732741
10910 1732741 1804989 1983590 2152800 2340493 1996195 1807282 1682147 1861702 1658494 1539473
10900 1539473 1777001 1601624 1517965 1726580 1609327 1435420 1007537 1142275 1085821 1243001
$$ packed form
10969G556431j83416l20825n42285j42608o29247r0229L23035J27325k61042o02691
10959E234448k62834J98348n84741J43564j2112n50941k28873K66869j28468M63401
10949D538661k93619k53475l30859k30576j51495K82204k13690j66463J16185
10940C296873k36584K58835k63701m11917J49737J88020M5887K65030p6967k28379
10930B986834n09539n67401L78835J51438J21337k46106K75214K3163p30627j01277
10920A781871q4388N09431j58432k22205j81270Q9248K44389P5525m39760J18332
10910A732741P2248J78601J69210J87693l44298j88913j25135J79555k03208j19021
10900A539473K37528j75377q3659K08615j17253j73907m27883J34738n6454J57180
$$ plain form
10890 1243001 1750230 1674446 987587 820045 1200659 1390754 1449339 1629051 1654287 1366724
10880 1366724 1576298 1922068 1630751 1262005 1057230 726370 760044 1148646 1525056 1546785
10870 1546785 1314922 1515982 1282530 1411318 1455327 1313534 1105300 708794 1255924 1374862
10860 1374862 1315470 1410568 1558493 1547386 1307851 1040126 785036 910919 860536 1016305
10850 1016305 1528329 1426548 1241691 1099814 1047165 934113 692014 1213136 1541939 1095057
10840 1095057 953039 1691329 1553736 1500160 1190809 760363 754535 1312337 1034758 1299854
10830 1299854 1022953 720798 818106 423011 817562 861165 1248684 999818 1032972 1190441
10820 1190441 1047966 718002 433916 408379 792201 1099852 1529416 1398278 1480166 1482997
$$ packed form
10890A243001N07229p5784o86859j67542L80614J90095N8585J79712K5236k87563
10880A366724K09574L45770k91317l68746k04775l30860L3674L88602L76410K1729
10870A546785k31863K01060k33452J28788M4009j41793k08234l96506N47130J18938
10860A374862n9392R5098J47925j1107k39535k67725k55090J25883n0383J55769
10850A016305N12024j01781j84857j41877n2649j13052k42099N21122L28803m46882
10840A095057j42018P38290j37593n3576l09351m30446n828N57802k77579K65096
10830A299854k76901l02155R7308l95095L94551M3603L87519k48866L3154J57469
10820A190441j42475l29964k84086k5537L83822L07651M29564j31138Q1888K831
$$ plain form
10810 1482997 1249543 1332530 1386891 1631532 1801146 1484269 853516 921516 1011648 1235937
10800 1235937 1433306 1193351 1446239 1887460 1696638 1085037 1277377 1012720 1336449
10791 1336449 1161754 1129915 1427954 1501379 1456280 1602168 1309860 1309292 1267510 1285065 1338967
10780 1338967 1480241 2019416 2229584 1827271 1755027 1685542 1036626 992727 1330075 1676923
10770 1676923 1968829 2111145 2397726 2052065 1880698 1786319 2035198 1951194 1675867 2043692
10760 2043692 1769406 1642732 2403779 2590452 2109195 2319471 2239234 2204797 2416187 2343125
10750 2343125 2517251 2744238 2708079 2985109 2908167 2662684 2630292 2529417 2968537 3188922
10740 3188922 2990678 3190034 3360098 3681293 3945632 3772402 3989320 3881916 3487345
$$ packed form
10810A482997k33454Q2987N4361K44641J69614l16877o30753O8000R0132K24289
10800A235937J97369k39955K52888M41221j90822o11601J92340k64657L23729
10791A336449j74695l1839K98039P3425m5099J45888k92308n68m1782J7555N3902
10780A338967J41274N39175K10168m02313p2244o9485o48916m3899L37348L46848
10770A676923K91906J42316K86581l45661j71367r4379K48879q4004k75327L67825
10760B043692k74286j26674P61047J86673m81257K10276q0237l4437K11390p3062
10750B343125J74126K26987l6159K77030p6942k45483l2392j00875M39120K20385
10740C188922j98244J99356J70064L21195K64339j73230K16918j07404l94571
$$ plain form
10731 3487345 3657187 3986435 4864835 4935917 4770330 4004804 4029507 5143225 5314423 5355072
10721 5355072 5703216 5627086 5472995 5539666 5461373 5629035 5956980 5936415 6255298 6219485
10711 6219485 6628005 6879376 7152601 7005945 6827957 6931555 7518280 7985766 7698958
10702 7698958 7703664 7952307 7975564 8078372 7550764 7744591 8325918 7859331 7894580 7893462
10692 7893462 7546734 7505385 7316651 7105980 7357159 6862468 6717557 6778625 6813281 6780219
10682 6780219 6317700 6128690 5724571 5437111 6091367 5938808 5467507 5485086 5079162 5054256
10672 5054256 5179956 4976249 4829632 4597994 4501080 4095164 3694402 3636215 4031852 3960847
10662 3960847 3559483 3754115 3621298 3325299 3119082 3052753 2727900 3213568 3246953 3238911
$$ packed form
10731C487345J69842L29248Q78400P1082j65587p65526K4703J113718J71198M0649
10721E355072L48144p6130j54091O6671p8293J67662L27945k0565L18883l5813
10711F219485M08520K51371K73225j46656j77988J03598N86725M67486k86808
10702G698958M706K48643K3257J02808n27608J93827N81327m66587L5249j118
10692G893462l46728m1349j88734k10671K51179m94691j44911O1068L4656l3062
10682F780219m62519j89010m04119k87460O54256j52559m71301J7579m05924k4906
10672E054256J25700k03707j46617k31638r6914m05916m00762n8187L95637p1005
10662C960847m01364J94632j32817k95999k06217o6329l24853M85668L3385q042
$$ plain form
10652 3238911 2912175 2774208 2130543 1802437 2046454 2029351 2126357 1902701 2182049 2179806
10642 2179806 2162210 2520961 2256120 1663193 1716610 1654949 1483794 1546492 2054619 2136994
10632 2136994 2137717 1895324 1517811 1369808 2036063 1843550 1695004 1226004 1537793 1838212
10622 1838212 1286978 1301930 1419852 1444121 1307193 1642675 1346258 993881 1019788 667372
10612 667372 835895 998251 993530 1386293 899256 700257 856451 919990 1051722 745984
10602 745984 801992 870042 350067 -57906 326687 1033139 1212813 1125900 940105 1347178
10592 1347178 1699294 1369121 907002 845282 795500 1263127 1413916 1270025 1043403 1175038
10582 1175038 655819 541833 852682 781753 1106878 911412 762385 715169 500052 787372
$$ packed form
10652C238911l26736j37967o43665l28106K44017j7103R7006k23656K79348k243
10642B179806j7596L58751k64841n92927N3417o1661j71155O2698N08127Q2375
10632B136994P23k42393l77513j48003O66255j92513j48546m69000L11789L00419
10622A838212n51234J4952J17922K4269j36928L35482k96417l52377K5907l52416
10612F67372J68523J62356m721L92763m87037j98999J56194O3539J31732l05738
10602G45984N6008O8050n19975m07973L84593P06452J79674q6913j85795M07073
10592A347178L52116l30173m62119o1720m9782M67627J50789j43891k26622J31635
10582A175038n19219j13986L10849p0929L25125j95466j49027m7216k15117K87320
$$ plain form
10572 787372 780609 689672 787166 732438 1089384 885492 635134 405080 473817 165328 111166
10561 111166 474359 919472 954607 1196166 976060 1051115 939954 931658 1297072 1066176
10551 1066176 628328 448971 -2287 31776 650820 764606 457264 691845 762074 876849
10541 876849 442310 207856 461133 524655 393276 426878 414045 -369075 -12034 277322
10531 277322 954831 1429415 1371695 1153153 726482 629425 499589 797661 546745 323454
10521 323454 324829 613173 722456 756774 301168 18649 631733 442477 803572 949786
10511 949786 675086 422953 558149 711321 634797 680141 979395 884690 626750 563946
10501 563946 551548 612276 606050 233792 452422 360498 771072 914419 243408 -32818
$$ packed form
10572G87372o763r0937R7494n4728L56946k03892k50358k30054O8737l08489n4162
10561A11166L63193M45113L5135K41559k20106P5055j11161q296L65414k30896
10551A066176m37848j79357m51258L4063O19044J13786l07342K34581P0229J14775
10541H76849m34539k34454K53277O3522j31379L3602j2833p83120L57041K89356
10531B77322O77509M74584n7720k18542m26671r7057j29836K98072k50916k23291
10521C23454J375K88344J09283L4318m55606k82519O13084j89256L61095J46214
10511I49786k74700k52133J35196J53172p6524M5344K99254r4705k57940o2804
10501E63946j2398O0728o226l72258K18630r1924M10574J43347o71011k76226
$$ plain form
10491 -32818 370330 391684 613341 894843 680265 541096 581573 631302 858137 600547
10481 600547 298443 -40095 -83598 269500 312204 502460 167215 531238 327818 321616
10471 321616 390745 813310 926663 827264 972898 351385 36470 136849 629393 179584
10461 179584 430166 265406 238006 315269 355083 291956 473144 646316 511190 260717
10451 260717 -128194 163413 512187 361723 -13543 -16882 -269175 -146943 515542 854201
10441 854201 381107 442204 778254 304709 235380 624797 448998 402051 341640 483072
10431 483072 841800 973392 574295 371451 304295 95189 27346 271088 422146 224173
10421 224173 77888 515249 415995 132659 81045 -84691 -91760 -26259 -193670 -62877
$$ packed form
10491c2818M03148K1354K21657K81502k14578j39169M0477M9729K26835k57590
10481F00547l02104l38538m3503L53098M2704J90256l35245L64023k03420o202
10471C21616O9129M22565J13353r9399J45634o21513l14915J00379M92544m49809
10461A79584K50582j64760k7400P7263L9814o3127J81188J73172j35126k50473
10451B60717l88911K91607L48774j50464l75266l339k52293J22232O62485L38659
10441H54201m73094O1097L36050m73545o9329L89417j75799m6947o0411J41432
10431D83072L58728J31592l99097k02844o7156k09106o7843K43742J51058j97973
10421B24173j46285M37361r9254k83336n1614j65736p069O5501j67411J30793
$$ plain form
10411 -62877 299542 300317 471506 686821 363644 87799 -296 -227232 303430 808618
10401 808618 631535 547518 657471 801307 702386 597381 377755 39816 173577 143768
10391 143768 295890 295300 269371 691515 50890 173149 197233 287740 100587 -88954 -164063
10380 -164063 -1784 462433 485408 531500 510240 477079 421650 939732 628687 -225496
10370 -225496 422483 386484 340012 573260 636124 749631 758756 1059299 723613 384633
10360 384633 208053 230110 356380 461791 375458 312471 136618 128789 228029 182836 642484
10349 642484 461915 176640 553059 354773 643640 573164 192850 -230937 226555 371154
10339 371154 -104220 517740 956750 493244 203995 45259 17779 525110 583483 220727
$$ packed form
10411f2877L62419P75J71189K15315l23177k75845q8095k26936N30662N05188
10401H08618j77083q4017J09953J43836r8921j05005k19626l37939J33761k9809
10391A43768J52122n90k5929M22144o40625J22259K4084R0507j87153j89541p5109
10380a64063J62279M64217K2975M6092k1260l3161n5429N18082l11045q54183
10370b25496O47979l5999m6472K33248O2864J13507R125L00543l35686l38980
10360C84633j76580K2057J26270J05411q6333o2987j75853p829R9240m5193M59648
10349F42484j80569k85275L76419j98286K88867p0476l80314m23787M57492J44599
10339C71154m75374O21960M39010m63506k89249j58736k7480N07331N8373l62756
$$ plain form
10329 220727 536799 1491366 1417199 932801 659014 295570 417193 548379 585741 357398
10319 357398 339401 615310 199385 472415 538870 350300 463300 147204 164665 470070
10309 470070 721572 477962 400964 322511 770510 446281 191691 186502 187787 535617 252745
10298 252745 -255201 -235247 -74402 -131847 -114803 295900 -84358 78344 258287 154158
10288 154158 48196 326065 797780 552854 727207 561219 506230 495796 816857 802080
10278 802080 688041 720824 760711 691544 605338 605092 542929 887780 725270 -54074 -130670
10267 -130670 193992 212060 372457 496402 205855 319352 303249 228860 915119 927520
10257 927520 471056 421561 406927 487930 531677 725353 1312271 833301 558120 587138
$$ packed form
10329B20727L16072R54567p4167m84398k73787l63444J21623J31186L7362k28343
10319C57398j7997K75909m15925K73030O6455j88570J13000l16096J7461L05405
10309D70070K51502k43610p6998p8453M47999l24229k54590n189J285L47830k82872
10298B52745n07946J9954J60845n7445J7044M10703l80258J62702J79943j04129
10288A54158j05962K77869M71715k44926J74353j65988n4989j0434L21061j4777
10278H02080j14039L2783L9887o9167q6206k46o2163L44851j62510p79344p6596
10267a30670L24662J8068J60397J23945k90547J13497j6103p4389O86259J2401
10257I27520m56464m9495j4634Q1003M3747J93676N86918m78970k75181K9018
$$ plain form
10247 587138 464314 748975 699191 542646 577044 788901 707210 712643 712051 913171 1001269
10236 1001269 1097084 338924 353770 534741 852606 1407003 1421428 923675 547945 518680
10226 518680 674190 576368 851610 872135 757206 1406008 1660763 1432437 1424317 1337544
10216 1337544 1226498 1096090 1301025 1457653 1108846 1680037 2291715 1984098 1938868 2407646
10206 2407646 1940653 1687155 2076833 2263602 2039432 1955991 1983459 2098437 1765141 1614256
10196 1614256 1785342 1470752 1446629 1500889 1663240 1438242 1864744 1666596 1442752 1316723
10186 1316723 1068223 1158609 975427 1314815 1023461 658240 615634 853940 874374 1159685
10176 1159685 1283908 1590770 1431264 1870171 1937133 1553084 956234 1016416 1161779 1373256
$$ packed form
10247E87138j22824K84661m9784j56545L4398K11857q1691N433n92K01120Q8098
10236A001269R5815p58160J4846J80971L17865N54397J4425m97753l75730k9265
10226E18680J55510r7822K75242K0525j14929O48802K54755k28326q120q6773
10216A337544j11046j30408K04935J56628l48807N71191O11678l07617m5230M68778
10206B407646m66993k53498L89678J86769k24170q3441K7468J14978l33296j50885
10196A614256J71086l14590k4123N4260J62351k24998M26502j98148k23844j26029
10186A316723k48500R0386j83182L39388k91354l65221m2606K38306K0434K85311
10176A159685J24223L06862j59506M38907O6962l84049n96850O0182J45363K11477
$$ plain form
10166 1373256 1521620 1243046 1457102 1058483 952915 718365 519954 714747 1097111
10157 1097111 1214216 1123487 1534423 1904503 1415068 1749158 1938874 1502139 2126357 2047919
10147 2047919 1557827 1469156 1865036 1863477 2307165 2089687 1898746 1810985 2041833 2207495
10137 2207495 2115475 2151059 2311539 2125762 1510006 1996665 2187999 2215322 2210316 2140137
10127 2140137 2647044 2836500 2025628 1999738 1951611 1938814 1946524 2258506 2156960 2197888
10117 2197888 2580534 2388566 2139775 2286147 2797674 3040415 2170997 2317160 2251184 2602656
10107 2602656 2997943 2807767 2742347 2990932 3430124 3251898 3226867 3505362 3552711 3708979
10097 3708979 3876819 4069680 4397912 4128670 4426621 4429202 4305222 4771160 4795189 5205483
$$ packed form
10166A373256J48364k78574K14056l98619j05568k34550j98411J94793L82364
10157A097111J17105r0729M10936L70080m89435L34090J89716m36735O24218p8438
10147B047919m90092q8671L95880j559M43688k17478j90941q7761K30848J65662
10137B207495r2020L5584J60480j85777o15756M86659J91334K7323n006p0179
10127B140137N06907J89456q10872k5890m8127j2797P710L11982j01546M0928
10117B197888L82646j91968k48791J46372N11527K42741q69418J46163o5976L51472
10107B602656L95287j90176o5420K48585M39192j78226k5031K78495M7349J56268
10097C708979J67840J92861L28232k69242K97951K581j23980M65938K4029M10294
$$ plain form
10087 5205483 5205727 5265770 5762383 6346665 6562239 6361453 6725505 7082582 7230556 6905646
10077 6905646 6862863 7467094 7902411 7897428 7839295 7608211 7577258 7258923 6627796 6629071 6788843
10066 6788843 6972212 6772643 6072442 6332810 6015857 5184971 4895563 5241692 4950617
10057 4950617 4904825 4185724 4254997 4510273 4172390 3765056 3029791 3154298 3210236 3153454
10047 3153454 3378373 3654321 3077595 3308262 3267264 3056283 2688298 2442737 2178148 2221728
10037 2221728 2507323 2354491 2530401 2824853 2909527 2825434 2622543 2382052 2196282 2170833
10027 2170833 2221500 1739897 2093928 2430488 2555120 2187956 2096060 2207946 2230461 2129737
10017 2129737 1773592 1893352 2158419 2118731 1922195 2466422 2780192 3040038 3080229 3350980
$$ packed form
10087E205483K44O0043M96613N84282K15574k00786L64052L57077J47974l24910
10077F905646m2783O04231M35317m983n8133k31084l0953l18335o31127J275J59772
10066F788843J83369j99569p00201K60368l16953q30886k89408L46129k91075
10057D950617m5792p19101O9273K55276l37883m07334p35265J24507N5938n6782
10047C153454K24919K75948n76726K30667m0998k10981l67985k45561k64589M3580
10037B221728K85595j52832J75910K94452Q4674q4093k02891k40491j85770k5449
10027B170833N0667m81603L54031L36560J24632l67164r1896J11886K2515j00724
10017B129737l56145J19760K65067l9688j96536N44227L13770K59846M0191K70751
$$ plain form
10007 3350980 3546991 3119961 2910225 2644348 2566425 2832776 2782902 2765463 2480983 2862703
9997 2862703 2904967 2278667 2547004 1942882 1732747 1775440 1043750 1047468 1099128 1295287
9987 1295287 1160075 1250070 1575422 1741973 2157494 1459080 1484362 1399711 1501108 1567097
9977 1567097 983350 1192459 1275448 1230938 1190577 1255561 1103370 1270753 1113868 1280435
9967 1280435 1415705 1259940 913647 984076 1007455 1160354 1374981 1051314 1294040 1601501
9957 1601501 1374373 940948 1206674 1165137 1156955 1240566 1364447 1511013 1694188 1749785
9947 1749785 1910565 1895894 1437295 1611185 2026504 1864311 2168027 1894048 1581474 1574863
9937 1574863 1356685 1318377 825583 1278285 1526569 1559798 1586499 1410517 1616291 1919555
$$ packed form
10007C350980J96011m27030k09736k65877p7923K66351m9874j7439k84480L81720
9997B862703M2264o26300K68337o04122k10135M2693p31690L718N1660J96159
9987A295287j35212Q9995L25352J66551M15521o98414K5282q4651J01397O5989
9977A567097n83747K09109Q2989m4510m0361O4984j52191J67383j56885J66567
9967A280435J35270j55765l46293P0429K3379J52899K14627l23667K42726L07461
9957A601501k27128m33425K65726m1537q182Q3611J23881J46566J83175N5597
9947A749785J60780j4671m58599J73890M15319j62193L03716k73979l12574o611
9937A574863k18178l8308m92794M52702K48284L3229K6701j75982K05774L03264
$$ plain form
9927 1919555 2287197 2362154 2706682 2464737 2402656 2507958 2939606 3491355 3607707 3506275
9917 3506275 3018285 2844290 2720590 2807271 2668827 2664851 2632196 2346952 2395695 2047319
9907 2047319 2035960 1899918 1961915 1305666 1518104 2209524 2053754 1932064 1997616 1976714
9897 1976714 1764415 1663509 1780357 1597197 1218243 1495373 1203177 1741586 1562233 979965
9887 979965 831239 1494393 1801454 1899429 2167161 2221695 1632839 1530411 1729653 1405851
9877 1405851 1640634 2083190 1954256 2149648 2615219 2008208 1764549 1777853 1523687 1199734
9867 1199734 1670780 1989158 1863190 2193494 2104070 1938926 2037534 1923672 1965967 2147615
9857 2147615 1695421 1806557 1761611 1908575 1874885 1993343 2709041 2564829 2627473 2898604
$$ packed form
9927A919555L67642P4957L44528k41945o2081J05302M31648N51749J16352j01432
9917C506275m87990j73995j23700Q6681j38444l976l2655k85244M8743l48376
9907B047319j1359j36042O1997o56249K12438O91420j55770j21690O5552k0902
9897A976714k12299j00906J16848j83160l78954K77130k92196N38409j79353n82268
9887I79965j48726O63154L07061R7975K67732N4534n88856j02428J99242l23802
9877A405851K34783M42556j28934J95392M65571o07011k43659J3304k54166l23953
9867A199734M71046L18378j25968L30304q9424j65144R8608j13862M2295J81648
9857B147615m52194J11136m4946J46964l3690J18458P15698j44212O2644K71131
$$ plain form
9847 2898604 2581948 1869720 2063439 1837153 1418365 1636664 1389888 1832935 1988987 1769052
9837 1769052 1924442 1853415 1640895 1572361 1733694 1848685 1645746 1940408 2027909 2195507
9827 2195507 2558045 2467386 2555969 2394855 2196481 2501355 2926643 2944293 2877226 2591994
9817 2591994 2657431 2646440 2769819 2982502 2756377 2761361 2862516 2844563 2679992 2533837
9807 2533837 2852545 2973380 3354562 3188790 2682174 2886377 3075484 2797419 3046338 2990814
9797 2990814 3298086 3055042 3435053 3160692 2975572 3450828 3582248 3290180 3281411 3410195
9787 3410195 3484090 3613146 3075355 3612596 3723437 3922697 3962025 3834266 3927293 4559040
9777 4559040 4718339 4448086 4462705 4396624 4363258 4598964 4402539 4656624 4928395 4924144
$$ packed form
9847B898604l16656p12228J93719k26286m18788K18299k46776M43047J56052k19935
9837A769052J55390p1027k12520o8534J61333J14991k02939K94662Q7501J67598
9827B195507L62538r0659Q8583j61114j98374L04874M25288J7650o7067k85232
9817B591994O5437j0991J23379K12683k26125M984J01155j7953j64571j46155
9807B533837L18708J20835L81182j65772n06616K04203J89107k78065K48919n5524
9797B990814L07272k43044L80011k74361j85120M75256J31420k92068q769J28784
9787C410195P3895J29056n37791N37241J10841J99260L9328j27759R3027O31747
9777D559040J59299k70253J4619o6081l3366K35706j96425K54085K71771m251
$$ plain form
9767 4924144 5180233 5531046 5339824 5415323 5446740 5880794 5324393 5387537 5477774 5795809
9757 5795809 6206302 6275258 6935415 7117254 6969862 7068701 7452300 7017929 6662622 6643578
9747 6643578 7094798 6957523 7048252 7026796 7666682 7935607 8137102 7974435 8093589 8148871
9737 8148871 8449949 9172305 8877687 9220675 9508729 9546386 9996680 10685300 11328599 11400981
9727 11400981 11420771 11949052 12455101 11970372 12151746 12976771 13631364 14099070 14215559 14507820
9717 14507820 14497776 14735736 15822259 16208501 16269186 17077507 18172914 18929034 19321142
9708 19321142 20215999 20718954 21211722 22199837 23207958 24074563 25335320 27192246 28816813
9699 28816813 30647723 33036180 36046956 39377530 43549614 47342188 49642431 51372582
$$ packed form
9767D924144K56089L50813j91222P5499L1417M34054n56401O3144R0237L18035
9757E795809M10493O8956O60157J81839j47392R8839L83599m34371l55307j9044
9747F643578M51220j37275R0729k1456O39886K68925K01495j62667J19154N5282
9737H148871L01078P22356k94618L42988K88054L7657M50294O88620O43299P2382
9727A1400981J9790N28281N06049m84729J81374Q25025O54593M67706J16489K92261
9717A4507820j0044K37960J086523L86242O0685Q08321J095407P56120L92108
9708A9321142Q94857N02955M92768R88115J008121Q66605J260757J856926J624567
9699B8816813J830910K388457L010776L330574M172084L792574K300243J730151
$$ plain form
9691 51372582 52154835 51912977 52039314 51784343 52308738 53364158 54497207 55441386 54769888
9682 54769888 53543627 50959168 47638817 45009211 42499953 40632347 40112116 39690800
9674 39690800 39323904 39106731 39685422 40175793 41138047 42048327 42404208 43151202 44289392
9665 44289392 44817433 45585383 47263467 48574743 49436203 51178448 53193922 54964226 56725157
9656 56725157 58926654 61543680 63762036 66428878 69294654 72164456 75543309 79856197
9648 79856197 84761341 90554828 97868527 105612599 114353696 125033024 138381625 153679039
9640 153679039 172418642 196814061 224849825 252761819 278327569 298441968 309100689
9633 309100689 309387694 304529363 299529979 297023527 300787632 307645587 313061174 313297004
$$ packed form
9691E1372582P82253k41858J26337k54971N24395J055420J133049R44179o71498
9682E4769888j226261k584459l320351k629606k509258j867606n20231m21316
9674C9690800l66896k17173N78691M90371R62254R10280L55881P46994J138190
9665D4289392N28041P67950J678084J311276Q61460J742245K015474J770304J760931
9656E6725157K201497K617026K218356K666842K865776K869802L378853M312888
9648G9856197M905144N793487P313699P744072Q741097J0679328J3348601J5297414
9640A53679039J8739603K4395419K8035764K7911994K5565750K0114399J0658721
9633C09100689K87005m858331m999384k506452L764105O857955N415587K35830
$$ plain form
9625 313297004 303525425 282426993 254218188 224209781 194653080 169407749 148288135
9618 148288135 132040331 119400734 108929462 99475373 92167784 86127320 80908052 76966802
9610 76966802 72914752 69565252 66649437 63770319 61541016 59746317 57717657 56095435
9602 56095435 54654416 53753755 52514973 52177931 51643831 51328165 51848711 52152869 52865632
9593 52865632 54063462 54790394 56112734 56616740 56821826 56230686 55334564 54446018 52868236
9584 52868236 50820102 48473311 45891906 43663279 41486539 39690080 38487423 37899123
9576 37899123 37302092 36780504 36827516 37090026 37401929 38757358 39833034 40469198 41838783
9567 41838783 43488494 44556605 45111625 44848136 44525754 44361633 42851708 41010309 38265500
$$ packed form
9625C13297004r771579k1098432k8208805l0008407k9556701k5245331k1119614
9618A48288135j6247804j2639597j0471272r454089p307589o040464n219268l941250
9610G6966802m052050l349500k915815k879118k229303j794699k028660j622222
9602E6095435j441019r00661j238782l37042n34100l15666N20546L04158P12763
9593E2865632J197830P26932J322340N04006K05086n91140q96122q88546j577782
9584E2868236k048134k346791k581405k228627k176740j796459j202657n88300
9576C7899123n97031n21588M7012K62510L11903J355429J075676O36164J369585
9567D1838783J649711J068111N55020k63489l22382j64121j509925j841399k744809
$$ plain form
9558 38265500 36453142 34891557 33031884 31555993 30420891 29691905 29280672 29035064 29206430
9549 29206430 29687286 30939695 31194214 32036545 33317852 35235486 38596439 41408491 44303828
9540 44303828 46492922 48343351 49367700 49172557 49763722 51309786 53227249 55627064
9532 55627064 56236782 56131566 54852654 52119971 48708829 45996336 42969863 39882912
9524 39882912 36914639 33980221 31286791 28454940 26091610 24014913 22443212 20700180
9516 20700180 19420496 18160927 16618434 15588766 14926044 14070535 13519760 13343115 13235328
9507 13235328 12537222 12423682 11835863 10760616 10573426 10407557 10355743 10159789 9655036
9498 9655036 9306608 8961697 8544542 8703279 8584164 8545076 8202155 7598225 7416711 7276580
$$ packed form
9558C8265500j812358j561585j859673j475891j135102p28986m11233k45608J71366
9549B9206430M80856J252409K54519Q42331J281307J917634L360953K812052K895337
9540D4303828K189094J850429J024349j95143N91165J546064J917463K399815
9532E5627064O09718j05216j278912k732683l411142k712493l026473l086951
9524C9882912k968273k934418k693430k831851k363330k076697j571701j743032
9516B0700180j279684j259569j542493j029668o62722q55509n50775j76645j07787
9507A3235328o98106j13540n87819j075247j87190j65869n1814j95954n04753
9498I655036l48428l44911m17155J58737j19115l9088l42921o03930j81514j40131
$$ plain form
9488 7276580 6473905 6635375 7136295 7187726 7497570 6916778 6415393 6759208 6506885 6516040
9478 6516040 5889859 5385834 6271227 6003833 6050116 5911785 5725537 5632897 6188547 6299081
9468 6299081 6338904 5778578 5839460 5698919 5597959 5564612 5357072 5249534 5232528 5256860
9458 5256860 5504135 5445444 5178451 4561054 4445864 4413487 4259950 4576851 4238523 3779060
9448 3779060 3824912 3673299 3719010 3794153 4346077 3982867 4030633 4137952 4128462 4200202 4119211
9437 4119211 4068190 3677403 4572980 4728485 4680367 4034809 4796301 4744483 4154577 3949826
9427 3949826 4232955 4106564 3720952 3850327 4401895 4361369 4117988 4099200 4136119 3652132
9417 3652132 3706400 3937870 3482151 3632254 3588320 3511599 3156571 3036473 3256305 3402762
$$ packed form
9488G276580q02675J61470N00920N1431L09844n80792n01385L43815k52323R155
9478F516040o26181n04025Q85393k67394M6283j38331j86248r2640N55650J10534
9468F299081L9823n60326O0882j40541j00960l3347k07540j07538j7006K4332
9458E256860K47275n8691k66993o17397j15190l2377j53537L16901l38328m59463
9448C779060M5852j51613M5711P5143N51924l63210M7766J07319r490P1740q0991
9437D119211n1021l90787Q95577J55505m8118o45558P61492n1818n89906k04751
9427C949826K83129j26391l85612J29375N51568m0526k43381j8788L6919m83987
9417C652132N4268K31470m55719J50103m3934p6721l55028j20098K19832J46457
$$ plain form
9407 3402762 3501079 3250607 3291537 3433517 3910615 3974901 3891188 4185352 3655298 3139754
9397 3139754 3884991 4004440 3789955 3452310 3642704 3694174 3573588 3884460 3847263 4165159
9387 4165159 3942286 4088848 3962559 3804826 4080489 3569450 3214948 3872400 4346015 4038524
9377 4038524 3634945 3898918 4287252 4511131 5077461 5120304 5144220 5434631 5621315 6164437
9367 6164437 5932091 5651066 5178153 4830516 4688934 4158438 4379156 4420834 4176977 4667369
9357 4667369 4345247 4452125 4219462 4191891 4083703 4004380 4567399 4730456 4499434 4662666
9347 4662666 5253817 4873499 5185462 5454542 5251878 5382606 6092140 5982207 5558193 5543010
9337 5543010 5744416 5776325 6301253 6597440 6335417 5919213 6279276 6357552 6155916 5704653
$$ packed form
9407C402762R8317k50472M0930J41980M77098O4286q3713K94164n30054n15544
9397C139754P45237J19449k14485l37645J90394N1470j20586L10872l7197L17896
9387D165159k22873J46562j26289j57733K75663n11039l54502O57452M73615l07491
9377D038524m03579K63973L88334K23879N66330M2843K3916K90411J86684N43122
9367F164437k32346k81025m72913l47637j41582n30496K20718M1678k43857M90392
9357D667369l22122J06878k32663k7571j08188p9323N63019J63057k31022J63232
9347D662666N91151l80318L11963K69080k02664J30728P09534j09933m24014j5183
9337E543010K01406L1909N24928K96187k62023m16204L60063P8276k01636m51263
$$ plain form
9327 5704653 5830717 6208825 6425557 6589792 6027619 6110592 6451815 6467999 6565230 6983907
9317 6983907 6765213 6879822 6953293 7568665 8071785 8595176 8609105 8481835 8387032 8411608
9307 8411608 8711778 8737662 8989399 9288645 9683037 9721850 9941269 10021063 11103575 11892079
9297 11892079 12593753 13914388 14934637 15894219 17224225 19345212 21865205 24811164
9289 24811164 28592238 33097053 35896531 35238743 32352323 29495685 28784099 29344600 31208451
9280 31208451 33746109 33335797 30044304 25567979 21941168 18854850 16718844 15422988
9272 15422988 14153183 13541938 12951990 12261846 11578198 11022434 11308032 11407296 10617093
9263 10617093 10206875 10206874 10655362 10901150 10639003 9978932 9396195 9139284 9819811 9921854
$$ packed form
9327E704653J26064L78108K16732J64235n62173Q2973L41223J6184R7231M18677
9317F983907k18694J14609P3471O15372N03120N23391J3929j27270r4803K4576
9307H411608L00170K5884K51737K99246L94392L8813K19419P9794J082512P88504
9297A1892079P01674J320635J020249R59582J330006K120987K519993K945959
9289B4811164L781074M504815K799478o57788k886420k856638p11586N60501J863851
9280C1208451K537658m10312l291493m476325l626811l086318k136006j295856
9272A5422988j269805o11245n89948o90144o83648n55764K85598R9264p90203
9263A0617093m10218jM48488K45788k62147o60071n82737k56911O80527J02043
$$ plain form
9253 9921854 10014569 10289148 10636539 11118868 11177589 11325944 10711880 10333681 9805618 9936509
9243 9936509 9877000 9598286 9676769 10056767 9789512 9398044 8660842 7998353 7601510 7763930
9233 7763930 7966484 8127289 7825538 7218053 6661967 7209708 7436848 7329202 7135599 6966551
9223 6966551 6473611 6466575 7123087 6679556 6142457 6206329 6814640 7082695 6841170 7032841
9213 7032841 6894595 6725906 7424763 6972356 6607506 7294368 7238972 7168243 7205110 6630670
9203 6630670 6843828 7463979 7412511 7233192 7421396 7429784 7906425 7731124 7998073 7874318
9193 7874318 7970104 7917156 8302376 8340257 8312517 8629839 8867051 8507198 8506889 9086235 9594941
9182 9594941 9333880 9198276 9503550 9832670 10174732 10023756 9876506 10424658 10483149 10879454
$$ packed form
9253I921854R2715K74579L47391M82329N8721J48355o14064l78199n28063J30891
9243I936509n9509k78714P8483L79998k67255l91468p37202o62489l96843J62420
9233G763930K02554J60805l01751o07485n56086N47741K27140j07646j93603j69048
9223F966551m92940p036O56512m43531n37099O3872O08311K68055k41525J91671
9213G032841j38246j68689O98857m52407l64850O86862n5396p0729L6867n74440
9203F630670K13158O20151n1468j79319J88204Q388M76641j75301K66949j23755
9193G874318R5786n2948L85220L7881k7740L17322K37212l59853l09N79346N08706
9182I594941k61061j35604L05274L29120L42062j50976j47250N48152N8491L96305
$$ plain form
9172 10879454 10759411 11037029 11732982 11729804 12101580 12229591 12501190 12192778 12267322 12254190
9162 12254190 12602183 12933437 13239948 13450957 13200933 14071989 14387677 14612133 15350099
9153 15350099 15061252 15567754 15655360 15859617 16262512 17061372 17525757 17752516 17667060 18170791
9143 18170791 19056146 19529994 19682963 20633933 20908430 20981204 21943990 22522824 22798666 23659814
9133 23659814 24407938 24923934 25512425 25612134 26415573 27197194 28405082 29659312 30487732
9124 30487732 30998224 31665858 32465803 33299926 34425358 35241058 36568430 37663239 38456993
9115 38456993 40149972 41165005 42319703 44175842 45726692 47799083 50451474 52803588
9107 52803588 55300053 58247066 61801442 65915982 71164744 76409785 82959027 91209424
$$ packed form
9172A0879454j20043K77618O95953l178L71776J28011K71599l08412P4544j3132
9162A2254190L47993L31254L06511K11009k50024Q71056L15688K24456P37966
9153A5350099k88847N06502Q7606K04257M02895P98860M64385K26759q5456N03731
9143A8170791Q85355M73848J52969R50970K74497P2774R62786N78834K75842Q61148
9133B3659814P48124N15996N88491R9709Q03439P81621J207888J254230Q28420
9124C0487732N10492O67634P99945Q34123J125432Q15700J327372J094809P93754
9115C8456993J692979J015033J154698J856139J550850K072391K652391K352114
9107E2803588K496465K947013L554376M114540N248762N245041O549242Q250397
$$ plain form
9099 91209424 101875276 114924268 130663353 147698081 158953175 158640845 149367481 140246874
9091 140246874 136048236 136910729 142307541 151263233 161077319 164661745 156909921 142743991
9083 142743991 129967146 121094695 114836213 109779537 105938010 102752127 100774032 100247649
9075 100247649 101007617 102266394 103775769 105990902 107585545 108020488 109106028 111487127
9067 111487127 114933741 119055212 124502266 130832464 138059688 146912747 158152697 172588797
9059 172588797 191732786 216231901 241768275 259873802 259658091 244038566 227319568
9052 227319568 218261802 218312966 227096677 242684698 260028505 266766139 255494180 232707614
9044 232707614 212344203 200297613 194616627 192781339 191763209 189750594 186603226 183867843
$$ packed form
9099I1209424J0665852J3048992J5739085J7034728J1255094l12330r273364r120607
9091A40246874m198638Q62493N396812Q955692R814086L584426p751824j4165930
9083A42743991j2776845q872451o258482n056676l841527l185883j978095n26383
9075A00247649P59968J258777J509375K215133J594643M34943J085540K381099
9067A11487127L446614M121471N447054O330198P227224Q853059J1239950J4436100
9059A72588797J9143989K4499115K5536374J8105527k15711j5619525j6718998
9052B27319568r057766N1164Q783711J5588021J7343807O737634j1271959k2786566
9044B32707614k0363411j2046590n680986j835288j018130k012615l147368k735383
$$ plain form
9036 183867843 184002470 185248121 183576038 179262769 173689700 167951673 162011832 155900377
9028 155900377 150898103 146314732 141101736 133937391 125240560 117114518 108851878 100994573
9020 100994573 95191437 91144128 88434684 86583638 86285533 86626902 86603914 85084107 82351021
9011 82351021 80434283 79835216 78544070 76499125 74320841 72177363 71204499 71214050 72150459
9002 72150459 73690287 74044417 73350446 71898756 70909259 70746101 70813292 69479917 66286985
8993 66286985 63151456 59908966 57371804 55921695 54955853 53984446 53599001 52784457 52301557
8984 52301557 52405853 52247939 52858002 53696195 54138236 54748890 55877546 56815082 57547955
8975 57547955 58383158 59304439 60139941 60927589 62002699 62826836 63931460 65353364 67446654
$$ packed form
9036A83867843J34627J245651j672083m313269n573069n738027n939841o111455
9028A55900377n002274m583371n212996p164345q696831q126042q262640p857305
9020A00994573n803136m047309k709444j851046k98105L41369k2988j519807k733086
9011H2351021j916738n99067j291146k044945k178284k143478r72864R551R36409
9002G2150459J539828L54130o93971j451690r89497j63158O7191j333375l192932
8993F6286985l135529l242490k537162j450109r65842r71407l85445q14544m82900
8984E2301557J04296j57914O10063Q38193M42041O10654J128656R37536P32873
8975E7547955Q35203R21281Q35502P87648J075110Q24137J104624J421904K093290
$$ plain form
8966 67446654 70276367 72747828 74332513 75822909 77532921 79594394 81854920 84615817
8958 84615817 87115611 89810853 93679292 98218874 103347547 109791409 117958394 127850909
8950 127850909 140334680 155491887 172495585 191043287 211484278 234685276 262228405
8943 262228405 293846073 325643472 347099181 349026937 334048605 303592513 263053662
8936 263053662 225814854 197387955 178313442 165894181 157800054 154541084 156122492
8929 156122492 161361718 172028268 186349562 196355841 189666081 166915556 143862457
8922 143862457 127073904 116036432 108992055 104136028 100882730 99266017 98332944 98059446
8914 98059446 98775382 100966688 103944246 108538989 114736308 122183395 131136912 141547818
$$ packed form
8966F7446654K829713K471461J584685J490396J710012K061473K260526K760897
8958H4615817K499794K695242L868439M539582N128673O443862Q166985R892515
8950A27850909J2483771J5157207J7003698J8547702K0440991K3200998K7543129
8943B62228405L1617668L1797399K1455709J927756j4978332l0456092m0538851
8936B63053662l7238808k8426899j9074513j2419261q094127l258970J581408
8929A56122492N239226J0666550J4321294J0006279o689760k2750525k3053099
8922A43862457j6788553j1037472p044377m856027l253298j616713r33073k73498
8914I8059446P15936K191306K977558M594743O197319P447087Q953517J0410906
$$ plain form
8906 141547818 153812896 168360446 185729891 203882257 216215892 216653763 206502207
8899 206502207 187239659 160837089 135117967 115296428 100038038 88980550 80790036
8892 80790036 74819761 69745590 65124173 61731774 58597963 55365095 52925787 50674278
8884 50674278 49015082 47897237 46005830 44766048 43239814 42394843 41357250 40172297
8876 40172297 39173874 38668120 37921232 36613289 36150756 36402440 36174696 37166775 38173025
8867 38173025 38955092 40666978 42711862 44946625 46659201 47826517 47653463 45040863
8859 45040863 42431790 40729632 39928356 40304646 41288085 42659497 44174497 43450182 41694323
8850 41694323 39760228 37060963 34415101 32642773 31842235 30508548 30611458 31167731 31275614
$$ packed form
8906A41547818J2265078J4547550J7369445J8152366J2333635M37871j0151556
8899B06502207j9262548k6402570k5719122j9821539j5258390j1057488q190514
8892H0790036n970275n074171m621417l392399l133811l232868k439308k251509
8884E0674278j659196j117845j891407j239782j526234q44971j037593j184953
8876D0172297r98423n05754p46888j307943m62533K51684k27744R92079J006250
8867C8173025P82067J711886K044884K234763J712576J167316j73054k612600
8859D5040863k609073j702158q01276L76290R83439J371412J515000p24315j755859
8850D1694323j934095k699265k645862j772328q00538j333687J02910N56273J07883
$$ plain form
8841 31275614 31717190 32815828 33702558 34662813 35030382 35324548 35820085 36951406 38663742
8832 38663742 40098605 40698754 42098615 43819416 46968470 50019220 50447116 48951632
8824 48951632 46223384 42707825 39143917 37195491 36689198 36996800 36691243 35710665 34030478
8815 34030478 31648387 28977707 26494682 24923530 23630755 22278640 21743043 21247657
8807 21247657 21111873 21223897 21683013 22651089 23529030 24223724 24115176 24491486 24617561
8798 24617561 24516573 25037665 24581538 23738416 22989283 22878630 23698735 24382086 24196358
8789 24196358 23182509 22077267 19529344 17136980 15263557 13982148 12634114 12313229
8781 12313229 11883784 10726650 10517607 10239202 9736948 9199878 8862620 8963975 8311307
$$ packed form
8841C1275614M41576J098638Q86730R60255L67569K94166M95537J131321J712336
8832C8663742J434863O00149J399861J720801L149054L050750M27896j495484
8824D8951632k728248l515559l563908j948426n06293L07602l05557r80578j680187
8815C4030478k382091k670680k483025j571152j292775j352115n35597m95386
8807B1247657j35784J12024M59116R68076Q77941O94694j08548L76310J26075
8798B4617561j00988N21092m56127q43122p49133j10653Q20105O83351j85728
8789B4196358j013849j105242k547923k392364j873423j281409j348034l20885
8781A2313229m29445j157134k09043k78405n02254n37070l37258J01355o52668
$$ plain form
8772 8311307 8012391 7732080 7815377 8237982 8128144 7604130 7198881 7186645 7005700 6316411
8762 6316411 5945964 6069315 5932301 5345353 5292349 5509521 5227350 5138793 5487330 5283951
8752 5283951 4884568 4771643 4954239 4820779 4622883 4535588 4519401 4424970 4210409 4336626
8742 4336626 4335247 4447745 4267450 4099949 3932408 4383760 4374349 4187472 4104380 3974558
8732 3974558 3954750 4075965 4052855 4199195 3844369 3557490 3846102 4240514 3924407 3713219
8722 3713219 3739600 3254068 3730773 3881042 3455819 3689071 3525012 3692310 3596031 3854795
8712 3854795 4057904 3976225 3676488 3774974 2878145 2779223 3491267 3658197 3410551 3019423
8702 3019423 3381688 3344431 3355878 3680226 3076039 3283244 2881480 3051962 3193554 2901305
$$ packed form
8772H311307k98916k80311Q3297M22605j09838n24014m05249j2236j80945o89289
8762F316411l70447J23351j37014n86948n3004K17172k82171q8557L48537k03379
8752E283951l99383j12925J82596j33460j97896q7295j6187r4431k14561J26217
8742D336626j379J12498j80295j67501j67541M51352r411j86877q3092j29822
8732C974558j9808J21215k3110J46340l54826k86879K88612L94412l16107k11188
8722C713219K6381m85532M76705J50269m25223K33252j64059J67298r6279K58764
8712C854795K03109q1679k99737R8486q96829r8922P12044J66930k47646l91128
8702C019423L62265l7257J1447L24348o04187K07205m01764J70482J41592k92249
$$ plain form
8692 2901305 2911459 2788794 2852474 2918920 2736388 2611655 2612280 3103652 2966794 2656483 2304053
8681 2304053 2413668 2619058 2328121 2794740 3036831 2616364 2641990 3067847 2853270 2785354
8671 2785354 2698051 2571603 2222624 2203895 2192345 2458962 2482275 2671374 3155723 2725703
8661 2725703 1962401 1830493 2205321 1787947 1552084 1734413 1501909 1864990 1847900 2092255
8651 2092255 2073849 1905459 1224309 1346001 1650183 1636852 1775614 1824419 2016697 1626484
8641 1626484 1767092 1932316 1893838 1811644 1375905 1536331 1643304 1060695 1083540 1662872
8631 1662872 1540185 1476736 1273576 1318685 846438 1060217 922477 1003424 1006206 948691 973004
8620 973004 1266644 1142006 1237277 1084042 653962 841076 962622 1059101 667939 725198
$$ packed form
8692B901305J0154j22665O3680O6446j82532j24733O25M91372j36858l10311l52430
8681B304053J09615K05390k90937M66619K42091m20467K5626M25857k14577o7916
8671B785354q7303j26448l48979j8729j1550K66617K3313J89099M84349m30020
8661B725703p63302j31908L74828m17374k35863J82329k32504L63081j7090K44355
8651B092255j8406j68390o81150J21692L04182j3331J38762M8805J92278l90213
8641A626484J40608J65224l8478q2194m35739J60426J06973n82609K2845N79332
8631A662872j22687o3449k03160M5109m72247K13779j37740Q0947K782n7515K4313
8620I73004K93640j24638R5271j53235m30080J87114J21546R6479l91162N7259
$$ plain form
8610 725198 1012114 884847 1214713 1467726 1132342 1323901 1341472 1150122 1560052 1237608
8600 1237608 1108202 543674 411917 249433 -324351 264497 685808 671523 851256 1745330
8590 1745330 1835111 1249502 1087038 913775 1221754 1232878 1116294 1219361 1281887 1767939
8580 1767939 1427759 1736309 1780940 1925406 1974619 1808114 2062570 2164740 1733799 1988811
8570 1988811 1949377 1539459 1267386 1031407 1143845 1315025 1397635 965678 424118 903374
8560 903374 1775953 1771347 1612059 1755513 1427708 1267000 1275788 1008936 492093 299016
8550 299016 529474 939097 701551 405468 709618 1059557 875554 1235366 1514434 1348569
8540 1348569 1329489 1478958 1401246 599793 1068552 1615558 1653595 1798846 2173436 2114597
$$ packed form
8610G25198K86916j27267L29866K53013l35384J91559J7571j91350M09930l22444
8600A237608j29406n64528j31757j62484n73784N88848M21311j4285J79733Q94074
8590A745330Q9781n85609j62464j73263L07979J1124j16584J03067O2526M86052
8580A767939l40180L08550M4631J44466M9213j66505K54456J02170m30941K55012
8570A988811l9434m09918k72073k35979J12438J71180Q2610m31957n41560M79256
8560I03374Q72579m606j59288J43454l27805j60708Q788k66852n16843j93077
8550B99016K30458M09623k37546k96083L04150L49939j84003L59812K79068j65865
8540A348569j9080J49469p7712q01453M68759N47006L8037J45251L74590n8839
$$ plain form
8530 2114597 1688948 1239201 1227608 721344 981237 1214982 731986 1088769 1236696 1062923
8520 1062923 857572 599421 555263 60213 220360 773811 877556 456880 390264 373334
8510 373334 562977 847561 810647 930829 464211 611086 825164 574882 417642 729306
8500 729306 11309 49205 362469 230996 282669 197660 328287 703361 496111 566475
8490 566475 565650 878781 628698 430400 637348 406400 656556 934122 531833 461557
8480 461557 512258 463085 855850 777436 721130 324763 408431 560696 -25913 39351 471384
8469 471384 1018853 679353 -214797 -97336 376443 409718 550875 649771 491417 456569
8459 456569 778045 640191 740434 955822 802220 786913 743457 966182 744763 530238
$$ packed form
8530B114597m25649m49747j1593n06264K59893K33745m82996L56783J47927j73773
8520A062923k05351k58151m4158m95050J60147N53451J03745m20676o6616j6930
8510C73334J89643K84584l6914J20182m66618J46875K14078k50282j57240L11664
8500G29306p17997L7896L13264j31473N1673q5009J30627L75074k07250P0364
8490E66475q25L13131k50083j98298K06948k30948K50156K77566m02289p0276
8480D61557N0701m9173L92765p8414n6306l96367Q3668J52265n86609O5264M32033
8469D71384N47469l39500q94150J17461M73779L3275J41157R8896j58354l4848
8459D56569L21476j37854J00243K15388j53602j5307m3456K22725k21419k14525
$$ plain form
8449 530238 750893 1022663 1121589 521257 532266 649217 595793 886685 828908 814770 554039
8438 554039 449263 245663 124430 431151 347950 402338 592425 607683 484541 -39503
8428 -39503 218902 557054 485111 756511 864545 216664 165046 351265 258082 210422 370479
8417 370479 -56165 -210841 304269 340512 195552 427474 440566 383888 215179 225467
8407 225467 77469 -458172 -284990 232029 -217158 -491165 -111903 -208232 -296506 -355165
8397 -355165 65317 110632 -115030 707766 561637 -259270 54790 414230 -29902 97887
8387 97887 -1738 272722 308417 132281 416241 303354 -73537 -268600 170956 9729
8377 9729 -340572 -26284 -78875 -653302 -498089 189448 58271 80575 422777 138973
$$ packed form
8449E30238K20655K71770R8926o00332J1009J16951n3424K90892n7777j4138k60731
8438E54039j04776k03600j21233L06721q3201N4388J90087J5258j23142n24044
8428c9503K58405L38152p1943K71400J08034o47881n1618J86219r3183m7660J60057
8417C70479m26644j54676N15110L6243j44960K31922J3092n6678j68709J0288
8407B25467j47998n35641J73182N17019m49187k74007L79262r6329q8274n8659
8397c55165M20482M5315k25662Q22796j46129q20907L14060L59440m44132J27789
8387I7887r9625K74460L5695j76136K83960j12887l76891j95063M39556j61227
8377I729l50301L14288n2591n74427J55213O87537j31177K2304L42202k83804
$$ plain form
8367 138973 -274810 -238330 246961 158838 289196 49788 -201209 31775 572299 652021
8357 652021 -171056 -118880 51790 343732 123034 259297 646182 195998 32652 272538
8347 272538 -41607 -264853 -129564 273367 15378 -106572 -193247 -728691 -555236 -298314
8337 -298314 -108232 -76974 93526 348873 -63642 -28420 -44933 -367019 -408821 115159
8327 115159 152427 121623 428271 -63929 -379472 -589881 -284140 41016 -123132 295552
8317 295552 274791 -167767 -38565 -109644 226800 -2686 12758 90348 -176760 -397785
8307 -397785 -347313 -178409 -17841 -166729 -7725 -145609 -157107 -51276 113657 239505
8297 239505 197383 270713 576198 549259 503116 -84469 -36070 254016 99027 -12693 132681
$$ packed form
8367A38973m13783L6480M85291q8123J30358k39408k50997K32984N40524P9722
8357F52021q23077N2176J70670K91942k20698J36263L86885m50184j63346K39886
8347B72538l14145k23246J35289M02931k57989j21950q6675n35444J73455K56922
8337b98314J90082L1258J70500K55347m12515L5222j6513l22086m1802N23980
8327A15159L7268l0804L06648m92200l15543k10409L05741L25156j64148M18684
8317B95552k0761m42558J29202p1079L36444k29486J5444P7590k67108k21025
8307c97785N0472J68904J60568j48888J59004j37884j1498J05831J64933J25848
8297B39505m2122P3330L05485k6939m6143n87585M8399K90086j54989j11720J45374
$$ plain form
8286 132681 344425 -426207 -312790 -152724 -383940 65748 -173173 41409 145244 -234419
8276 -234419 118860 316871 728172 435023 262510 -11664 -368136 -337332 110832 97771
8266 97771 -3034 324798 191673 -118606 -152560 -116883 -414964 -253535 -430079 -330167
8256 -330167 -241913 117399 -72962 -237322 74886 -399216 -556838 -408577 -246595 -307520
8246 -307520 149475 359382 265687 -11087 -349345 123899 122437 -11251 -121594 -139203
8236 -139203 64773 287832 442800 94840 -174603 109365 -257648 -273369 -36825 15524
8226 15524 -825956 -696906 -219786 310789 584948 356071 262308 290542 -174110 -307803
8216 -307803 -318577 -499516 -344971 11085 -306552 -739265 -377355 -308925 -62574 -507941
$$ packed form
8286A32681K11744p70632J13417J60066k31216M49688k38921K14582J03835l79663
8276b34419L53279J98011M11301k93149j72513k74174l56472L0804M48164j3061
8266I7771j00805L27832j33125l10279l3954L5677k98081J61429j76544R9912
8256c30167Q8254L59312j90361j64360L12208m74102j57622J48261J61982o0925
8246c07520M56995K09907r3695k76774l38258M73244j462j33688j10343j7609
8236a39203K03976K23059J54968l47960k69443K83968l67013j5721K36544N2349
8226A5524q41480J29050M77120N30575K74159k28877r3763K8234m64652j33693
8216c07803j0774j80939J54545L56056l17637m32713L61910O8430K46351m45367
$$ plain form
8206 -507941 16028 59843 114126 507628 754479 89481 -26643 -520337 -883563 -611528
8196 -611528 -579346 -567853 -597461 -681958 3130630 2449419 420219 444126 244105 58668
8186 58668 -146128 369730 289640 190497 88246 -91459 -66046 352334 611121 385485
8176 385485 95514 388192 -180403 -10203 88197 -1643 94939 305812 298307 85525 -591921
8165 -591921 -461684 -451375 -284723 -510887 33569 28123 152572 265468 661494 204067
8155 204067 -378592 239879 363935 575065 904939 674447 180273 45502 148699 -137105
8145 -137105 -175609 153469 -291451 -316481 -210321 -203844 233408 224792 245394 139559 -242252
8134 -242252 422281 98272 -101755 -133674 577829 867004 467022 541453 411576 460611
$$ packed form
8206e07941N23969M3815N4283L93502K46851o64998j16124m93694l63226K72035
8196f11528L2182J1493k9608q4497L812588o81211k029200K3907k00021j85437
8186E8668k04796N15858q0090r9143j02251j79705K5413M18380K58787k25636
8176C85485k89971K92678n68595J70200R8400q9840R6582K10873p505k12782o77446
8165e91921J30237J0309J66652k26164N44456n446J24449J12896L96026m57427
8155B04067n82659O18471J24056K11130L29874k30492m94174j34771J03197k85804
8145a37105l8504L29078m44920k5030J06160O477M37252q616K0602j05835l81811
8134b42252O64533l24009k00027l1919P11503K89175l99982P4431j29877M9035
$$ plain form
8124 460611 258824 333025 585479 -274967 -148636 240888 9541 44638 65634 -122242
8114 -122242 10337 256394 118647 97005 224754 201300 -118261 59229 131762 -150722
8104 -150722 68673 370918 201281 -28839 33539 324190 85659 -190209 33901 245103
8094 245103 136293 26990 -19532 -167407 289286 328415 173581 -194296 -402482 -436107
8084 -436107 -239772 152138 70922 10628 25320 -51322 116044 8442 -113783 -283883
8074 -283883 -330649 -376246 -384273 -335246 -472965 6231 255234 176318 308152 191391 108946
8063 108946 150381 -577882 -133173 337254 83518 -159899 376520 450279 476244 327059
8053 327059 547196 -11984 16653 298642 -136739 109698 -178037 -452396 -377669 -676299
$$ packed form
8124D60611k01787P4201K52454q60446J26331L89524k31347L5097K0996j87876
8114a22242J32579K46057j37747k1642J27749k3454l19561J77490P2533k82484
8104a50722K19395L02245j69637k30120O2378K90651k38531k75868K24110K11202
8094B45103j08810j09303m6522j47875M56693L9129j54834l67877k08186l3625
8084d36107J96335L91910q1216o0294J4692p6642J67366j07602j22225j70100
8074b83883m6766m5597q027M9027j37719M79196K49003p8916J31834j16761q2445
8063A08946M1435p28263M44709M70427k53736k43417N36419P3759K5965j49185
8053C27059K20137n59180K8637K81989m35381K46437k87735k74359P4727k98630
$$ plain form
8043 -676299 -398031 -548321 -502401 -161730 134832 202949 -316616 -537346 144750 -184179
8033 -184179 -251111 -234006 33556 -7229 -156613 -426491 -325347 155126 -181754 63223
8023 63223 66508 171463 -61783 -231569 -63739 -278244 -188223 82946 154344 -81140 -369376
8012 -369376 192606 125425 -426061 -342295 -165371 -140878 -246933 -430059 -402658 -442890 -273558
8001 -273558 -283023 -255321 -340052 297061 358923 143453 -53789 -15529 -189130 -201540 -74424
7990 -74424 242084 261664 106236 149114 225725 87420 309849 -104944 -29214 -162659 -518101
7979 -518101 -423161 243153 533226 371879 -104551 -123883 190723 136644 184083 387750
7969 387750 507993 529468 59226 -159693 79075 587221 321820 -274818 16290 -163782
$$ packed form
8043f76299K78268j50290M5920L40671K96562O8117n19565k20730O82096l28929
8033a84179o6932J7105K67562m0785j49384k69878J01144M80473l36880K44977
8023F3223L285J04955k33246j69786J67830k14505R0021K71169P1398k35484k88236
8012c69376N61982o7181n51486Q3766J76924K4493j06055j83126K7401m0232J69332
8001b73558r465K7702q4731O37113O1862k15470j97242L8260j73601j2410J27116
7990g4424L16508J9580j55428M2878P6611j38305K22429m14793P5730j33445l55442
7979e18101R4940O66314K90073j61347m76430j9332L14606n4079M7439K03667
7969C87750J20243K1475m70242k18919K38768N08146k65401n96638K91108j80072
$$ plain form
7959 -163782 -195413 35834 102198 -222600 -468806 -152532 343263 -157081 -314046 -187905
7949 -187905 -207154 -151458 364492 580768 220021 354562 128428 -245435 -496244 -601806
7939 -601806 -913621 -1095882 -201653 -14759 2144 -243995 -145859 -182560 -211654 -186410 12334
7928 12334 -71259 -720124 -396939 -109986 104213 100307 79422 219938 -10245 -135083 203667
7917 203667 -123018 -521728 -140553 -199434 -137507 -340253 -530089 -207528 -308262 -46134
7907 -46134 -241324 -445646 -442206 -265136 -85389 30499 347907 -238478 -35180 51239
7897 51239 -39615 -197610 -146010 110695 33906 -304819 -362720 -131289 -199236 -99037 -466426
7886 -466426 -638353 -470736 -541939 -336641 -217711 -363705 -588273 -716795 -484667 -270106
$$ packed form
7959a63782l1631K31247O6364l24798k46206L16274M95795n00344j56965J26141
7949a87905j9249N5696N15950K16276l60747J34541k26134l73863k50809j05562
7939f01806l11815j82261Q94229J86894J6903k46139R8136l6701k9094K5244J98744
7928A2334q3593o48865L23185K86953K14199l906k0885J40516k30183j24838L38750
7917B03667l26685l98710L81175n8881O1927k02746j89836L22561j00734K62128
7907d6134j95190k04322L440J77070J79747J15888L17408n86385K03298Q6419
7897E1239r0854j57995N1600K56705p6789l38725n7901K31431o7947J00199l67389
7886d66426j71927J67617p1203K05298J18930j45994k24568j28522K32128K14561
$$ plain form
7876 -270106 -367698 -186739 -86806 -251771 -29475 129412 265726 220582 -44284 30954
7866 30954 364136 -44550 -412741 -123041 218839 169100 49800 -407382 -91554 313293
7856 313293 3750 137093 53700 -451963 5755 124730 -329659 133250 123272 320873
7846 320873 274614 125560 -150700 129869 -192511 -59235 186901 527184 542619 378749
7836 378749 126974 227292 6045 -21335 1115 -470936 -432603 -696879 -318418 -265775
7826 -265775 -435028 -253240 29969 -319893 -751075 -340267 -417090 -558263 -637961 -465817
7816 -465817 -26537 165489 372434 352719 215614 -350953 -289901 12759 -73113 -433686
7806 -433686 -227311 178790 382059 542772 284299 149447 1011571 789951 321908 -251462
$$ packed form
7876b70106r7592J80959R9933j64965K22296J58887J36314m5144k64866P5238
7866C0954L33182m08686l68191K89700L41880m9739j19300m57182L15828M04847
7856C13293l09543J33343q3393n05663M57718J18975m54389M62909r978J97601
7846C20873m6259j49054k76260K80569l22380J33276K46136L40283J5435j63870
7836C78749k51775J00318k21247k7380K2450m72051L8333k64276L78461N2643
7826b65775j69253J81788K83209l49862m31182M10808p6823j41173p9698J72144
7816d65817M39280J92026K06945j9715j37105n66567O1052L02660q5872l60573
7806d33686K06375M06101K03269J60713k58473j34852Q62124k21620m68043n73370
$$ plain form
7796 -251462 -82917 212743 143595 -253762 -319951 -257076 -124170 -2718 -89180 -38597 -444741
7785 -444741 -334456 -3305 -53288 87616 -198519 -482596 -282704 -41117 197175 104988
7775 104988 32809 -108425 -48818 -64903 -597316 -232036 249837 52584 -176353 44386
7765 44386 334493 -140909 -183283 -369425 -145813 -208558 -551641 -780625 -430796 -172901
7755 -172901 -258864 -417668 -378077 -321180 -304907 -43766 -308728 142525 139211 167844 457809
7744 457809 363527 68069 10229 254796 -115805 -229317 -218393 -285397 -145873 -253217
7734 -253217 -271959 -72751 -256910 -283808 -145899 -268147 -8265 -14965 -42702 -142973 -335688
7723 -335688 -439677 -330618 -83760 -139939 -40418 121098 65232 315668 -15480 -43769
$$ packed form
7796b51462J68545K95660o9148l97357o6189O2875J32906J21452q6462N0583m06144
7785d44741J10285L31151m9983J40904k86135k84077J99892K41587K38292r2187
7775A04988p2179j41234N9607j6085n32413L65280M81873j97253k28937K20739
7765D4386K90107m75402m2374j86142K23612o2745l43083k28984L49829K57895
7755a72901q5963j58804L9591N6897J6273K61141k64962M51253l314K8633K89965
7744D57809r4282k95458n7840K44567l70601j13512J0924o7004J39524j07344
7734b53217j8742J99208j84159k6898J37909j22248K59882o700k7737j00271j92715
7723c35688j03989J09059K46858n6179R9521J61516n5866K50436l31148k8289
$$ plain form
7713 -43769 -125043 39730 364220 -3685 -32336 -376829 -504391 50268 379491 155526
7703 155526 -144487 -241128 300798 33885 -212626 -48035 -3499 -144980 227852 74584
7693 74584 349015 590105 -370218 -83110 -181293 -527852 -44586 140352 -34436 -333145
7683 -333145 -279753 -64399 -181351 -511799 -222317 -132161 -162785 299939 432972 -64629
7673 -64629 174251 788928 279811 334159 223813 -182468 -124503 36588 25817 386654
7663 386654 499047 789811 607290 -179944 -368311 -560916 59536 -233572 189100 570193
7653 570193 -67524 -264422 -191993 -224580 47673 233612 -281011 -198940 -32439 -610512
7643 -610512 -128169 175137 -52495 68756 164940 474718 270669 -206467 -199470 -128296
$$ packed form
7713d3769q1274J64773L24490l67905k8651l44493j27562N54659L29223k23965
7703A55526l00013r6641N41926k66913k46511J64591M4536j41481L72832j53268
7693G4584K74431K41090r60323K87108r8183l46559M83266J84938j74788k98709
7683c33145N3392K15354j16952l30448K89482R0156l0624M62724J33033m97601
7673f4629K38880O14677n09117N4348j10346m06281N7965J61091j0771L60837
7663C86654J12393K90764j82521p87234j88367j92605O20452k93108M22672L81093
7653E70193o37717j96898P2429l2587K72253J85939n14623Q2071J66501n78073
7643f10512M82343L03306k27632J21251R6184L09778k04049m77136O997P1174
$$ plain form
7633 -128296 -248595 -22173 -27519 -117158 -449152 -687713 -932898 -761724 -488074 -231436
7623 -231436 -663794 -237760 -190780 -419655 -613503 -193045 -73265 -374963 -131240 -157629
7613 -157629 61851 72361 -110317 -254906 -24463 -337732 -756967 -933256 -327182 40524
7603 40524 -421443 -466390 -740565 -166752 170062 111548 130046 -93452 203228 181793 369262
7592 369262 490267 171670 195843 418610 153446 238847 146161 -54611 66385 342059
7582 342059 -131829 -350166 -9974 350488 -325100 -486095 -264371 79891 175010 164540
7572 164540 93403 -62348 -420768 -424995 -57625 42234 267761 328632 59411 230905 -7570
7561 -7570 203212 312971 151627 274928 312719 67692 148880 35170 -441066 -356562 -222365
$$ packed form
7633a28296j20299K26422n346q9639l31994k38561k45185J71174K73650K56638
7623b31436m32358M26034M6980k28875j93848M20458J19780l01698K43723k6389
7613a57629K19480J0510j82678j44589K30443l13269m19235j76289O06074L67706
7603D0524m61967m4947k74175N73813L36814n8514J8498k23498K96680k1435J87469
7592C69262J21005l18597K4173K22767k65164Q5401r2686k00772J20996K75674
7582C42059m73888k18337L40192L60462o75588j60995K21724L44262R5119j0470
7572A64540p1137j55751l58420m227L67370R9859K25527O0871k69221J71494k38475
7561g570K10782J09759j61344J23301L7791k45027Q1188j13710m76236Q4504J34197
$$ plain form
7550 -222365 -59159 109133 474175 365743 -10218 292848 154595 -261993 286584 49878
7540 49878 -17321 130606 95445 -74293 -193669 -146067 198308 -60336 -252877 -333734 -456860
7529 -456860 -738801 -582283 -372323 -221111 -377979 -460364 -195497 -253672 43101 208852
7519 208852 -196998 19225 99343 -240700 -435478 -24123 -3694 78598 -147107 210599
7509 210599 -1740 303356 299868 -126633 -285173 86473 -268066 -377560 -301340 -171246
7499 -171246 159795 -67101 278984 -3525 142330 70594 228275 -192227 5247 325803
7489 325803 86795 -48522 -283269 -213014 -393562 121142 48114 179151 -176805 -174239
7479 -174239 487656 -217646 233795 156951 -72917 9822 -220630 -172706 152995 -104420
$$ packed form
7550b22365J63206J68292L65042j08432l75961L03066j38253m16588N48577k36706
7540D9878o7199J47927l5161j69738j19376M7602L44375k58644j92541q0857j23126
7529d56860k81941J56518K09960J51212j56868q2385K64867n8175K96773J65751
7519B08852m05850K16223Q0118l40043j94778M11355K0429Q2292k25705L57706
7509B10599k12339L05096l488m26501j58540L71646l54539j09494P6220J30094
7499a71246L31041k26896L46085k82509J45855p1736J57681m20502J97474L20556
7489C25803k39008j35317k34747P0255j80548N14704p3028J31037l55956K566
7479a74239O61895p05302M51441p6844k29868Q2739k30452M7924L25701k57415
$$ plain form
7469 -104420 -127998 8914 213214 -124063 -192896 -234769 -419747 -545367 -91910 555176
7459 555176 185330 149077 -326816 -769564 -368141 -33201 194449 445 -284817 -376203
7449 -376203 -27948 -55127 -128172 -407615 -499886 -532041 -304373 -40742 -227283 -127505 -300643
7438 -300643 -331417 -573479 -510963 -329237 -766435 -460561 -84282 -139626 167850 275214
7428 275214 359924 -154278 -433986 -468284 -488463 -569814 -613947 -779682 -659577 -417714 -460450
7417 -460450 -155260 -498600 -101491 83654 -133028 -339054 -789262 -508885 172998 -194633
7407 -194633 -341186 -125851 269198 -153831 230826 220378 -141452 17484 -161409 -720819
7397 -720819 -808273 -589814 -53072 -294911 -574453 -279176 100347 311198 -179011 -216899
$$ packed form
7469a04420k3578J36912K04300l37277o8833m1873j84978j25620M53457O47086
7459E55176l69846l6253m75893m42748M01423L34940K27650j94004k85262r1386
7449c76203L48255k7179p3045k79443r2271l2155K27668K63631j86541R9778j73138
7438c00643l0774k42062O2516J81726m37198L05874L76279n5344L07476J07364
7428B75214Q4710n14202k79708l4298k0179q1351m4133j65735J20105K41863m2736
7417d60450L05190l43340L97109J85145k16682k06026m50208K80377O81883l67631
7407a94633j46553K15335L95049m23029L84657j0448l61830J58936j78893n59410
7397g20819q7454K18459N36742k41839k79542K95277L79523K10851m90209l7888
$$ plain form
7387 -216899 -132459 -48630 251727 -133892 -613366 -88366 172204 -13515 365724 595326
7377 595326 -17003 -279716 -213253 -182611 -582220 8924 -63247 76352 124550 5073
7367 5073 -366628 -602035 -149526 174787 178059 231735 120645 516147 662887 533919 -193543
7356 -193543 54516 235686 -6272 94967 186453 233536 184841 169522 320161 184570
7346 184570 -163349 -86646 -27091 -496431 -400624 -291038 72734 -23593 -379475 -349956 -668657
7335 -668657 -557870 -136545 236681 96097 8751 -232232 -341209 -56848 -173254 -119325
7325 -119325 -65157 -222312 567966 -6149 -905870 -178012 503809 -191501 -747300 -597922
7315 -597922 -54150 -256494 -641629 -413551 36890 -193577 -542638 -259586 -119139 41585
$$ packed form
7387b16899Q4440Q3829L00357l85619m79474N25000K60570j85719L79239K29602
7377E95326o12329k62713O6463L0642l99609N91144p2171J39599M8198j19477
7367E073l71701k35407M52509L24313L272N3676j11090L95502J46740j28968p27462
7356a93543K48059J81170k41958J01239R1486M7083m8695j5319J50639j35591
7346A84570l47919P6703N9555m69340R5807J09586L63772r6327l55882K9519l18701
7335f68657J10787M21325L73226j40584q7346k40983j08977K84361j16406N3929
7325a19325N4168j57155P90278n74115q99721P27858O81821o95310n55799J49378
7315e97922N43772k02344l85135K28078M50441k30467l49061K83052J40447J60724
$$ plain form
7305 41585 421707 497462 269843 461598 85390 384781 222073 -365442 -150825 -304707
7295 -304707 68274 136068 178563 262723 -173105 -521769 -401748 -165021 -617015 -686842
7285 -686842 -454503 -193485 -227012 75284 -78165 -50998 -160146 42437 -18939 27776
7275 27776 313953 -68851 -166449 -314153 -151151 -150032 -71667 -90969 189489 45495 -2215
7264 -2215 -48643 -46005 -169179 441995 267409 60709 94291 -197883 -657934 -108348 -521851
7253 -521851 -936035 -418622 -246564 -24656 -167624 -651435 -299287 -215558 -186962 88768
7243 88768 100397 -57361 -78111 244367 244159 -314684 -417650 -11076 78142 -22637 188849
7232 188849 204683 13098 -297562 -268557 -311330 -489637 93455 -100081 -22237 160178
$$ packed form
7305D1585L80122P5755k27619J91755l76208K99391j62708n87515K14617j53882
7295c04707L72981O7794M2495Q4160m35828l48664J20021K36727m51994o9827
7285f86842K32339K61018l3527L02296j53449K7167j09148K02583o1376M6715
7275B7776K86177l82804r7598j47704J63002J119P8365j9302K80458j43994m7710
7264b215m6428K638j23174O11174j74586k06700L3582k92174m60051N49586m13503
7253e21851m14184N17413J72058K21908j42968m83811L52148Q3729K8596K75730
7243H8768J1629j57758k0750L22478k08n58843j02966M06574Q9218j00779K11486
7232A88849J5834j91585l10660K9005m2773j78307N83092j93536P7844J82415
$$ plain form
7222 160178 614026 -8179 -163259 495131 241098 -337545 -277477 -14275 -59025 -261675
7212 -261675 -332456 -327330 -369966 -19058 202619 -238575 -315821 151326 515903 276441 215857
7201 215857 143345 -257866 -273361 109667 -38420 -61860 -149114 17189 4879 -205388 -587495
7190 -587495 -609700 -276322 -344200 -9436 39345 120148 499874 485723 -598361 -964987
7180 -964987 -582482 -50037 -146205 -23386 287214 328643 699807 671575 404726 -264816
7170 -264816 -225993 -571044 152481 203699 166811 -168327 -496497 -329498 -469099 -547411
7160 -547411 17376 248920 -381083 -456742 -168540 11645 -273090 -451331 -114496 417978
7150 417978 -42164 53933 -202626 266132 -193560 -458731 303760 446777 107567 200946
$$ packed form
7222A60178M53848o22205j55080O58390k54033n78643O0068K63202m4750k02650
7212b61675p0781N126m2636L50908K21677m41194p7246M67147L64577k39462o0584
7201B15857p2512m01211j5495L83028j48087k3440q7254J66303j2310k10267l82107
7190e87495k2205L33378o7878L34764M8781Q0803L79726j4151j084084l66626
7180i64987L82505N32445r6168J22819L10600M1429L71164k8232k66849o69542
7170b64816L8823l45051P23525N1218l6888l35138l28170J66999j39601p8312
7160e47411N64787K31544o30003p5659K88202J80185k84735j78241L36835N32474
7150D17978m60142R6097k56559M68758m59692k65171P62491J43017l39210R3379
$$ plain form
7140 200946 -26187 124876 368766 331910 251867 -423778 -579429 -263704 178551 9724
7130 9724 66700 102096 166590 -326914 -499885 -345585 -231290 -300285 29867 -256512 -263806
7119 -263806 -187191 -299736 -350200 -387914 -360622 -540068 -459219 58551 522519 390990 508558
7108 508558 306412 -177482 262477 -7981 -644596 -272435 -440571 -167288 -66245 99061
7098 99061 -375500 -324921 -53772 -242054 98384 -149827 -330780 274493 411239 375812
7088 375812 92722 188753 376314 238995 182358 111198 -5045 151827 366498 116640
7078 116640 234205 -179293 -349057 -271059 -292917 -71544 353644 101814 -429500 -590386
7068 -590386 -426271 311429 480840 64099 -499020 -350700 -589707 -239909 -268176 -376343
$$ packed form
7140B00946k27133J51063K43890l6856q0043o75645j55651L15725M42255j68827
7130I724N6976L5396O4494m93504j72971J54300J14295o8995L30152k86379p294
7119b63806P6615j12545n0464l7714K7292j79446Q0849N17770M63968j31529J17568
7108E08558k02146m83894M39959k70458o36615L72161j68136K73283J01043J65306
7098I9061m74561N0579K71149j88282L40438k48211j80953O05273J36746l5427
7088C75812k83090R6031J87561j37319n6637p1160j16243J56872K14671k49858
7078A16640J17565m13498j69764P7998k1858K21373M25188k51830n31314j60886
7068e90386J64115P37700J69411m16741n63119J48320k39007L49798k8267j08167
$$ plain form
7058 -376343 194148 386547 -7852 40565 136100 294646 268372 196141 89608 420990
7048 420990 305422 132731 336114 323168 282674 404013 44127 -232682 -323459 -342774
7038 -342774 -344640 -163144 307296 -35326 -149340 -503622 -308141 -392119 -294254 -144527
7028 -144527 2909 -91584 -255829 -36552 110554 -131668 -150452 -298278 -80102 -280066
7018 -280066 214571 105986 111490 186354 478492 411974 694923 720798 766405 752045 257158
7007 257158 356463 466198 566524 80339 216145 -360015 -230636 194558 189605 -156134
6997 -156134 -589601 -438889 -309052 -819721 -735795 -361351 -427542 -665300 -491318 95599
6987 95599 120753 52950 111543 153526 630059 520524 661852 631701 462471 485707 737564
$$ packed form
7058c76343N70491J92399l94399M8417R5535J58546k6274p2231j06533L31382
7048D20990j15568j72691K03383j2946m0494J21339l59886k76809r0777j9315
7038c42774j866J81496M70440l42622j14014l54282J95481q3978R7865J49727
7028a44527J47436r4493j64245K19277J47106k42222j8784j47826K18176j99964
7018b80066M94637j08585N504P4864K92138o6518K82949K5875M5607j4360m94887
7007B57158R9305J09735J00326m86185J35806n76160J29379M25194m953l45739
6997a56134m33467J50712J29837n10669Q3926L74444o6191k37758J73982N86917
6987I5599K5154o7803N8593M1983M76533j09535J41328l0151j69230K3236K51857
$$ plain form
6976 737564 1197632 1430805 806096 100367 683792 626355 486907 241569 340718 404816
6966 404816 55908 26401 329450 -122161 -35047 88553 -17539 361641 469680 4906
6956 4906 297103 45259 -318783 -380609 -464862 -186750 -356334 427558 442377 229829 -100622
6945 -100622 -121726 -14421 -179825 169945 127849 144203 359716 227371 -289819 -265216
6935 -265216 -16909 -227166 -97901 58370 42314 -61417 -377645 -809066 -675235 -442743
6925 -442743 -243441 -364329 -218784 -523105 -411658 -221831 -174207 28338 351905 668036
6915 668036 517071 266410 190773 149822 -166114 -158097 -474008 -429022 -181988 -428652 -414466
6904 -414466 -624230 -235562 296107 364499 505388 -457174 -523457 -232840 186414 465953
$$ packed form
6976G37564M60068K33173o24709p05729N83425n7437j39448k45338R9149O4098
6966D04816l48908k9507L03049m51611Q7114J23600j06092L79180J08039m64774
6956D906K92197k51844l64042o1826q4253K78112j69584P83892J4819k12548l30451
6945a00622k1104J07305j65404L49770m2096J6354K15513j32345n17190K4603
6935b65216K48307k10257J29265J56271j6056j03731l16228m31421J33831K32492
6925d42743J99302j20888J45545l04321J11447J89827M7624K02545L23567L16131
6915F68036j50965k50661p5637m0951l15936Q017l15911M4986K47034k46664J4186
6904d14466k09764L88668N31669O8392J40889r62562o6283K90617M19254K79539
$$ plain form
6894 465953 436522 491723 109932 10915 -163834 153271 218831 -232778 -261567 -330927 -233388
6883 -233388 -172092 -81332 32376 143669 224591 -109817 -386065 -485960 -282601 -189984 -165475
6872 -165475 240315 302749 77652 185126 180280 -86896 -242978 146333 -46486 -209539
6862 -209539 248527 260355 -25893 -290595 119729 -168323 -403509 -301114 -1025 264404
6852 264404 -26495 -102118 -132557 189933 -224626 -277258 60401 -152216 -263441 102491
6842 102491 16624 289680 253327 -138944 188463 145222 135825 -1032 -168281 -397241 -242295
6831 -242295 -131946 -318480 -216829 -201566 -145209 -519305 -436602 80533 -278650 -301927
6821 -301927 153407 167120 290090 -36740 -309745 -60474 396910 -29880 -101098 -59555
$$ packed form
6894D65953k9431N5201l81791r9017j74749L17105O5560m51609k8789o9360R7539
6883b33388O1296R0760J13708J11293Q0922l34408k76248r9895K03359R2617K4509
6872a65475M05790O2434k25097J07474m846k67176j56082L89311j92819j63053
6862b09539M58066J1828k86248k64702M10324k88052k35186J02395L00089K65429
6852B64404k90899p5623l0439L22490m14559n2632L37659k12617j11225L65932
6842A02491q5867K73056l6353l92271L27407m3241r397j36857j67249k28960J54946
6831b42295J10349j86534J01651J5263N6357l74096Q2703N17135l59183k3277
6821c01927M55334J3713J22970l26830k73005K49271M57384m26790p1218M1543
$$ plain form
6811 -59555 34269 555481 484908 244735 27391 79099 113329 45969 9685 212447 -2553
6800 -2553 -112572 179624 -78373 -443052 -8832 168315 -306258 155551 528501 213905
6790 213905 -275648 -341590 13729 323371 215739 186175 316544 358234 35737 -302385
6780 -302385 -162535 -328440 -272690 -168897 62105 -8126 -280755 -482612 -99813 -228027
6770 -228027 -79843 -8246 398156 204657 -462205 -452224 -24586 128102 281004 13080
6760 13080 -83267 -360469 -190391 -274098 6591 177312 74468 -164457 -245842 -196376 -499189
6749 -499189 99733 11314 -498226 -197784 -123964 -102770 83368 -157349 -361706 -587496
6739 -587496 -236489 -80890 15999 -501467 -302416 -77300 99773 -49298 -428395 -331861
$$ packed form
6811e9555R3824N21212p0573k40173k17344N1708L4230o7360l6284K02762k15000
6800b553j10019K92196k57997l64679M34220J77147m74573M61809L72950l14596
6790B13905m89553o5942L55319L09642j07632k9564J30369M1690l22497l38122
6780c02385J39850j65905N5750J03793K31002p0231k72629k01857L82799j28214
6770b28027J48184P1597M06402j93499o66862R981M27638J52688J52902k67924
6760A3080r6347k77202J70078q3707K80689J70721j02844k38925q1385M9466l02813
6749d99189N98922q8419n09540L00442P3820K1194J86138k40717k04357k25790
6739e87496L51007J55599R6889n17466J99051K25116J77073j49071l79097R6534
$$ plain form
6729 -331861 -305833 -262039 337061 508074 84394 -487822 -258427 -404693 -351375 -110729
$$ packed form
6729c31861K6028M3794N99100J71013m23680n72216K29395j46266N3318K40646
$$ [...]
##END NTUPLES=NMR SPECTRUM
##END=
