##TITLE=1H_CA-9243-2
 CDCl3
 8 sc, 
 14.2.2024
##JCAMPDX= 6.0         $$ Bruker NMR JCAMP-DX V2.0
##DATA TYPE= NMR SPECTRUM
##DATA CLASS= NTUPLES
##ORIGIN= UXNMR, Bruker Analytische Messtechnik GmbH
##OWNER= root
$$ XWIN-NMR		Version 3.5
$$ Wed Feb 14 13:47:34 2024 Russian Standard Time (UT+4h)  she@DPX200
##.OBSERVE FREQUENCY= 200.1313
##.OBSERVE NUCLEUS= ^1H
##.ACQUISITION MODE= SIMULTANEOUS
##.ACQUISITION SCHEME= undefined
##.AVERAGES= 8
##.DIGITISER RES= 18
##SPECTROMETER/DATA SYSTEM= spect
##.PULSE SEQUENCE= zg30
##.SOLVENT NAME= CDCl3
##.SHIFT REFERENCE= (INTERNAL, CDCl3, 0, 15.5717)
##AUDIT TRAIL= $$ (NUMBER, WHEN, WHO, WHERE, WHAT)
$$ ##TITLE= Audit trail, XWIN-NMR		Version 3.5
$$ ##JCAMPDX= 5.01
$$ ##ORIGIN= Bruker BioSpin GmbH
$$ ##OWNER= she
$$ F:/spectra/data/she/nmr/H-F/1/pdata/1/auditp.txt
$$ ##AUDIT TRAIL=  $$ (NUMBER, WHEN, WHO, WHERE, WHAT)
(   1,<2024-02-14 13:46:07.15 +0400>,<she>,<DPX200>,
      <created by zg, POWCHK disabled, PULCHK disabled
       configuration hash MD5:
       00 E9 B6 7A A2 85 ED C7 34 08 36 98 17 FE 4E 26
       data hash MD5: 16K
       E7 1B 66 27 AB 13 D5 F6 DA 7D EE 10 FA A1 84 F5>)
(   2,<2024-02-14 13:46:22.00 +0400>,<she>,<DPX200>,
      <Start of raw data processing
       efp BC_mod = 2 LB = 0.24 FT_mod = 6 PKNL = 1 PHC0 = -24952.98 PHC1 = 19.85264 SI = 16K 
       data hash MD5: 16K
       7F DB 5D 5F 53 B1 E4 83 D2 31 AE AA BA DD F4 26>)
(   3,<2024-02-14 13:46:40.06 +0400>,<she>,<DPX200>,
      <pk PHC0 = 6.618706 PHC1 = -11.6 
       data hash MD5: 16K
       0D 6C 97 12 4C 24 9F 44 27 F4 A9 8A 6C E0 04 D9>)
(   4,<2024-02-14 13:46:44.43 +0400>,<she>,<DPX200>,
      <abs ABSG = 5 
       data hash MD5: 16K
       E7 D2 A1 89 27 D0 8B 43 26 16 B7 C6 14 3C 1B 50>)
$$ ##END=
$$ 
$$ hash MD5
$$ EC 85 78 AA EC 60 81 02 A6 38 EB D8 0B FF EF E9
##$RELAX= 
##$RELAX= 
##$RELAX= 
##$RELAX= 
##$RELAX= 
##$RELAX= 
$$ Bruker specific parameters
$$ --------------------------
##$DU= <F:/spectra>
##$EXPNO= 1
##$NAME= <H-F>
##$PROCNO= 1
##$TYPE= <nmr>
##$USER= <she>
##$AMP= (0..31)
100 100 100 100 100 100 100 100 100 100 100 100 100 100 100 100 100 100 
100 100 100 100 100 100 100 100 100 100 100 100 100 100 
##$AQSEQ= 0
##$AQ_mod= 1
##$AUNM= <au_zg>
##$AUTOPOS= <>
##$BF1= 200.13
##$BF2= 200.13
##$BF3= 200.13
##$BF4= 200.13
##$BF5= 200.13
##$BF6= 200.13
##$BF7= 200.13
##$BF8= 200.13
##$BYTORDA= 1
##$CFDGTYP= 0
##$CFRGTYP= 5
##$CHEMSTR= <none>
##$CNST= (0..31)
1 1 145 1 1 1 1 1 1 1 1 1 1 1 1 1 1 1 1 1 1 1 1 1 1 1 1 1 1 1 1 1 
##$CPDPRG= <>
##$CPDPRG1= <>
##$CPDPRG2= <>
##$CPDPRG3= <>
##$CPDPRG4= <mlev>
##$CPDPRG5= <mlev>
##$CPDPRG6= <mlev>
##$CPDPRG7= <mlev>
##$CPDPRG8= <mlev>
##$CPDPRGB= <>
##$CPDPRGT= <>
##$D= (0..31)
0 1.2 0 0 0 0 0 0 0 0.06 0 0.03 0 0 0 0 0.0002 0 0 0 0 0 0 0 0 0 0 0 0 
0 0 0 
##$DATE= 1707903966
##$DBL= (0..7)
120 120 120 120 120 120 120 120 
##$DBP= (0..7)
150 150 150 150 150 150 150 150 
##$DBP07= 0
##$DBPNAM0= <>
##$DBPNAM1= <>
##$DBPNAM2= <>
##$DBPNAM3= <>
##$DBPNAM4= <>
$$ [...]
##$SUBNAM3= <"">
##$SUBNAM4= <"">
##$SUBNAM5= <"">
##$SUBNAM6= <"">
##$SUBNAM7= <"">
##$SUBNAM8= <"">
##$SUBNAM9= <"">
##$SW= 18.0517328524113
##$SWIBOX= (0..15)
0 0 2 0 0 0 0 0 0 0 0 0 0 0 0 0 
##$SW_h= 3612.71676300578
##$TD= 16384
##$TD0= 1
##$TE= 0
##$TE2= 300
##$TE3= 300
##$TEG= 300
##$TL= (0..7)
0 120 120 120 120 120 120 120 
##$TP= (0..7)
150 150 150 150 150 150 150 150 
##$TP07= 0
##$TPNAME0= <>
##$TPNAME1= <>
##$TPNAME2= <>
##$TPNAME3= <>
##$TPNAME4= <>
##$TPNAME5= <>
##$TPNAME6= <>
##$TPNAME7= <>
##$TPOAL= (0..7)
0.5 0.5 0.5 0.5 0.5 0.5 0.5 0.5 
##$TPOFFS= (0..7)
0 0 0 0 0 0 0 0 
##$TUNHIN= 0
##$TUNHOUT= 0
##$TUNXOUT= 0
##$USERA1= <user>
##$USERA2= <user>
##$USERA3= <user>
##$USERA4= <user>
##$USERA5= <user>
##$V9= 5
##$VALIST= <valist>
##$VCLIST= <CCCCCCCCCCCCCCC>
##$VD= 0
##$VDLIST= <DDDDDDDDDDDDDDD>
##$VPLIST= <PPPPPPPPPPPPPPP>
##$VTLIST= <TTTTTTTTTTTTTTT>
##$WBST= 1024
##$WBSW= 4
##$XGAIN= (0..3)
0 0 0 0 
##$XL= 0
##$YL= 0
##$YMAX_a= 115819
##$YMIN_a= -169008
##$ZGOPTNS= <>
##$ZL1= 120
##$ZL2= 120
##$ZL3= 120
##$ZL4= 120
##$ABSF1= 15.45821
##$ABSF2= -2.593639
##$ABSG= 5
##$ABSL= 3
##$ALPHA= 0
##$AQORDER= 0
##$ASSFAC= 0
##$ASSFACI= 0
##$ASSFACX= 0
##$ASSWID= 0
##$AUNMP= <proc_1d>
##$AZFE= 0.1
##$AZFW= 0.1
##$BCFW= 0
##$BC_mod= 2
##$BYTORDP= 0
##$COROFFS= 0
##$CY= -3
##$DATMOD= 1
##$DC= 0
##$DFILT= <>
##$DTYPP= 0
##$F1P= 0
##$F2P= 0
##$FCOR= 1
##$FTSIZE= 16384
##$FT_mod= 6
##$GAMMA= 0
##$GB= 0
##$INTBC= 1
##$INTSCL= 3.70164e-10
##$ISEN= 128
##$LB= 0.24
##$LEV0= 0
##$LPBIN= 0
##$MAXI= 10000
##$MC2= 0
##$MEAN= 0
##$ME_mod= 0
##$MI= 1.114404
##$NCOEF= 0
##$NC_proc= -8
##$NLEV= 6
##$NOISF1= 3.799351
##$NOISF2= 2.8
##$NSP= 0
##$NTH_PI= 0
##$NZP= 0
##$OFFSET= 15.5717
##$PC= 1
##$PHC0= -24946.36
##$PHC1= 8.25264
##$PH_mod= 1
##$PKNL= yes
##$PPARMOD= 0
##$PSCAL= 0
##$PSIGN= 0
##$REVERSE= no
##$SF= 200.129989992602
##$SI= 16384
##$SIGF1= 3
##$SIGF2= 2
##$SINO= 5.538805
##$SIOLD= 16384
##$SREGLST= <1H.CDCl3>
##$SSB= 0
##$STSI= 16384
##$STSR= 0
##$SW_p= 3612.71676300578
##$SYMM= 0
##$S_DEV= 0
##$TDeff= 16384
##$TDoff= 0
##$TI= <>
##$TILT= no
##$TM1= 0
##$TM2= 0
##$TOPLEV= 0
##$USERP1= <user>
##$USERP2= <user>
##$USERP3= <user>
##$USERP4= <user>
##$USERP5= <user>
##$WDW= 1
##$XDIM= 16384
##$YMAX_p= 435358998
##$YMIN_p= -2308465
$$ End of Bruker specific parameters
$$ ---------------------------------
##NTUPLES= NMR SPECTRUM
##VAR_NAME=  FREQUENCY,     SPECTRUM/REAL,   SPECTRUM/IMAG
##SYMBOL=    X,             R,               I
##VAR_TYPE=  INDEPENDENT,   DEPENDENT,       DEPENDENT
##VAR_FORM=  AFFN,          ASDF,            ASDF
##VAR_DIM=   16384,         16384,           16384
##UNITS=     HZ,            ARBITRARY UNITS, ARBITRARY UNITS
##FACTOR=    0.220516191357247, 1,           1
##FIRST=     3116.36418440637, 0,            0
##LAST=      -496.35257859941, 0,            0
##MIN=       -496.35257859941, -2308465,     0
##MAX=       3116.36418440637, 435358998,    0
$$ Real data points
##PAGE= N=1
##DATA TABLE= (X++(R..R)), XYDATA
$$ [...]
$$ plain form
11694 5331854 4971615 5002890 5353517 4697922 5265945 5553975 5658208 5517673 5503196 5650734
11684 5650734 5855366 6712706 7096557 6838225 6819279 6982318 6896739 7128458 7053228 7474657
11674 7474657 7719494 7979809 8236916 8215870 8905365 8897669 8959662 8899762 9264085 9763186
11664 9763186 9908630 9712479 9928478 10324284 10573126 10858655 11409336 11387594 11528383 11906698
11654 11906698 12440350 12737371 12667424 12905027 13635012 13876897 14188632 14471472 14537869 14951498
11644 14951498 15275106 15546083 15645050 15902775 16236703 16632114 17118460 17213569 16568947 17348458
11634 17348458 17529697 17501280 17468160 18125250 18013215 18353363 18705153 19129564 18732272 19022313
11624 19022313 20016576 20095267 20223243 21026386 21512868 21954119 21873502 22726511 23267402 23487593
$$ packed form
11694E331854l60239L1275L50627o55595N68023K88030J04233j40535j4477J47538
11684E650734K04632Q57340L83851k58332j8946J63039q5579K31719p5230M21429
11674G474657K44837K60315K57107k1046O89495p696O1993n9900L64323M99101
11664I763186J45444j96151K15999L95806K48842K85529N50681k1742J40789L78315
11654A1906698N33652K97021o9947K37603P29985K41885L11735K82840O6397M13629
11644A4951498L23608K70977R8967K57725L33928L95411M86346R5109o44622P79511
11634A7348458J81239k8417l3120O57090j12035L40148L51790M24411l97292K90041
11624A9022313R94263P8691J27976Q03143M86482M41251q0617Q53009N40891K20191
$$ plain form
11614 23487593 24076747 24895359 25632374 26415437 26877675 27743963 28474453 29380081 30592649
11605 30592649 31278218 32346444 33275713 34156489 35271319 36139463 37411959 38990403 40356579
11596 40356579 42146359 43300120 44999103 46722436 48102173 50284721 52256271 53991885
11588 53991885 56406726 58653953 61176190 63700690 65825463 68300287 70858712 73196885
11580 73196885 75370592 77518295 79843159 81453117 83055460 84760083 86253714 86581601
11572 86581601 86512824 86169123 86144560 85330090 83612272 81418526 79430760 77300871 75037015
11563 75037015 72287470 69436026 66390993 63828388 61301739 58994169 56464996 53670495
11555 53670495 51400942 49312282 47150594 45144282 42882921 40837262 39559558 37947079
$$ packed form
11614B3487593N89154Q18612P37015P83063M62238Q66288P30490R05628J212568
11605C0592649O85569J068226R29269Q80776J114830Q68144J272496J578444J366176
11596D0356579J789780J153761J698983J723333J379737K182548J971550J735614
11588E3991885K414841K247227K522237K524500K124773K474824K558425K338173
11580G3196885K173707K147703K324864J609958J602343J704623J493631L27887
11572H6581601o8777l43701k4563q14470j717818k193746j987766k129889k263856
11563G5037015k749545k851444l045033k562605k526649k307570k529173k794501
11555E3670495k269553k088660k161688k006312k261361k045659j277704j612479
$$ plain form
11547 37947079 36035764 34859737 33620065 31797480 30566316 29555870 28379527 27412659
11539 27412659 26258887 25412450 24954532 23934519 23072814 21778684 20906914 20604976 19650673
11530 19650673 19033517 18609374 18010940 17771461 17121438 16906683 16444411 15788260 16006824
11521 16006824 15571921 14645031 14616731 14224848 13708664 13140619 12827913 12956601 12445006
11512 12445006 11814362 10943564 10778677 10643303 10349600 10110134 9909265 9595441 9545023
11503 9545023 9722536 8965119 8661872 8694179 8568609 8465886 7981320 8190197 8365874 7829296
11493 7829296 7552741 7365134 7111302 7576430 6928586 6483354 6587524 6395132 6665539
11484 6665539 6718495 6278024 6138556 6242019 6132277 6003786 5693890 6023076 5915832 5807739
$$ packed form
11547C7947079j911315j176027j239672j822585j231164j010446j176343r66868
11539B7412659j153772q46437m57918j020013q61705j294130q71770l01938r54303
11530A9650673o17156m24143n98434k39479o50023k14755m62272o56151K18564
11521A6006824m34903r26890k8300l91883n16184n68045l12706J28688n11595
11512A2445006o30644q70798j64887j35374k93703k39466k00869l13824n0418
11503I545023J77513p57417l03247L2307j25570j02723m84566K08877J75677n36578
11493G829296k76555j87607k53832M65128o47844m45232J04170j92392K70407
11484F665539N2956m40471j39468J03463j09742j28491l09896L29186j07244j08093
$$ plain form
11474 5807739 5680791 5560324 5287636 5821618 5424906 5409041 5549378 5166215 5142683 5284330
11464 5284330 4937970 4969212 5109879 4950484 4433132 4782329 5087044 4711536 4650957 4845534
11454 4845534 4362699 4291463 4636840 3998297 3929741 4452048 4788599 4672826 4147571 4087802
11444 4087802 3788624 4131613 4145671 3716338 4473396 4719677 4605561 4522825 4285738 3908490
11434 3908490 4271891 4019732 3731926 3655912 3733459 4266402 4566150 4059383 4479691 4531273
11424 4531273 3866774 3340021 3421878 3940513 3759466 3678233 4096871 3855931 4386123 4138844
11414 4138844 4489661 4521302 4081138 4409512 4539837 4223780 4103834 3858212 4002686 4032404
11404 4032404 4241628 4444968 4430289 4336401 4279535 4895356 5043643 4442126 4327644 4406014
$$ packed form
11474E807739j26948j20467k72688N33982l96712j5865J40337l83163k3532J41647
11464E284330l46360L1242J40667j59395n17352L49197L04715l75508o0579J94577
11454D845534m82835p1236L45377o38543o8556N22307L36551j15773n25255n9769
11444D087802k99178L42989J4058m29333P57058K46281j14116q2736k37087l77248
11434C908490L63401k52159k87806p6014P7547N32943K99748n06767M20308N1582
11424D531273o64499n26753Q1857N18635j81047q1233M18638k40940N30192k47279
11414D138844L50817L1641m40164L28374J30325l16057j19946k45622J44474K9718
11404D032404K09224K03340j4679r3888n6866O15821J48287o01517j14482P8370
$$ plain form
11394 4406014 3991788 4500815 4539040 4862573 4429073 4364351 4547292 4514952 4637347 4730761
11384 4730761 4409354 4720932 4978696 5098763 4990366 4828575 5345177 5487302 5366485
11375 5366485 5582589 5577864 5519936 5631023 5715596 5777920 6003544 5674950 5539982 6182740
11365 6182740 6067971 6077556 6320536 6609124 7021131 6895311 6668224 7358175 7796223 7929992
11355 7929992 7913629 8444855 8575721 8200653 8456163 8942280 9223094 9164091 9046869 9015697
11345 9015697 9401990 9878584 9908642 9960068 10200504 10234562 10111739 10745893 11516039 11374530
11335 11374530 11300064 11650909 12292985 12457308 12970458 13103510 13343171 14096803 14313359
11326 14313359 14637236 14790309 15467041 15976326 16503598 17526128 17772209 18325697 18856559
$$ packed form
11394D406014m14226N09027L8225L23533m33500o4722J82941l2340J22395R3414
11384D730761l21407L11578K57764J20067j08397j61791N16602J42125j20817
11375E366485K16104m725n7928J11087Q4573O2324K25624l28594j34968O42758
11365F182740j14769R585K42980K88588M12007j25820k27087O89951M38048J33769
11355G929992j6363N31226J30866l75068K55510M86117K80814n9003j17222l1172
11345I015697L86293M76594L0058N1426K40436L4058j22823O34154P70146j41509
11335A1374530p4466L50845O42076J64323N13150J33052K39661P53632K16556
11326A4313359L23877J53073O76732N09285N27272J022530K46081N53488N30862
$$ plain form
11317 18856559 19568120 20130465 20858460 21792959 22501551 23208421 24033175 24668890 25322616
11308 25322616 26060003 26669179 27872787 28097066 28888035 29835589 29918762 30426937 30504464
11299 30504464 30483087 30487509 30413624 30228085 29947642 30056976 29898965 28574585 27837917 27242990
11289 27242990 26680094 26192554 25187357 24333379 23394603 22686746 22465534 21581576 20340318
11280 20340318 19754968 18664926 18164014 17459844 16997758 16565271 15626544 15043451 14071959
11271 14071959 13958379 13507156 12582190 12792533 12654605 11586577 11278795 11081696 10523069
11262 10523069 10477315 9903580 9500487 9138923 8799717 8621446 8544543 8399467 7997848 7636289
11252 7636289 7756143 7285024 7208675 7051580 6868103 6402127 5834049 5726588 5246829 5400255
$$ packed form
11317A8856559P11561N62345P27995R34499P08592P06870Q24754O35715O53726
11308B5322616P37387O09176J203608K24279P90969R47554Q3173N08175P7527
11299C0504464k1377M422p3885j85539k80443J09334j58011j324380p36668n94927
11289B7242990n62896m87540j005197q53978r38776p07857k21212q83958j241258
11280B0340318n85350j090042n00912p04170m62086m32487r38727n83093r71492
11271A4071959j13580m51223r24966K10343j37928j068028l07782j97099n58627
11262A0523069m5754n73735m03093l61564l39206j78271p6903j45076m01619l61559
11252G636289J19854m71119p6349j57095j83477m65976n68078j07461m79759J53426
$$ plain form
11242 5400255 5988418 5878638 5638136 5454177 5166956 5348000 5148166 4699207 4602380 5069292
11232 5069292 4802072 4897586 4320900 4240083 4292963 4395863 4271759 3863836 3914087 4030668
11222 4030668 3514639 3651633 4053395 3438049 3837681 3492182 3644238 3246247 2929110
11213 2929110 3219374 2968251 3242034 3126784 3387351 3230300 2987247 3256444 3101888
11204 3101888 2776388 2744607 2908014 2789927 3428471 3473228 2960174 2846674 3013125 2965163
11194 2965163 2689281 2627067 2590785 2461024 2307318 2216695 2698886 2836763 2840608 2498928
11184 2498928 2378702 2301396 2272686 2418725 2512561 2336270 1958170 1953085 1851427 2251814
11174 2251814 2241784 2312762 2554995 2191483 2296190 2228272 2201925 2372416 2365912 2212556
$$ packed form
11242E400255N88163j09780k40502j83959k87221J81044j99834m48959r6827M66912
11232E069292k67220R5514n76686q0817N2880J02900j24104m07923N0251J16581
11222D030668n16029J36994M01762o15346L99632l45499J52056l97991l17137
11213B929110K90264k51123K73783j15250K60567j57051k43053K69197j54556
11204C101888l25500l1781J63407j18087O38544M4757n13054j13500J66451m7962
11194B965163k75882o2214l6282j29761j53706r0623M82191J37877L845l41680
11184B498928j20226p7306k8710J46039R3836j76291l78100n085j01658M00387
11174B251814j0030P0978K42233l63512J04707o7918k6347J70491o504j53356
$$ plain form
11164 2212556 1908127 2186721 2329246 2262132 1816199 1945933 2301608 2897420 2513285 2570969
11154 2570969 2641862 2267385 2196874 1815453 1947826 2299714 2091842 1995355 2320737 2374340
11144 2374340 2254878 1901229 2251519 2357514 1927641 2050286 1621922 1824938 1604310
11135 1604310 1464635 2153088 2503672 2722585 2314391 2154077 2057792 2219268 2332755 2648111
11125 2648111 2495316 2323556 1963273 2143689 2533914 2346028 2279338 2653581 2808721 2729720
11115 2729720 2378071 2307849 2834432 2657799 2681527 3027211 2725478 2594577 2680209 2862002
11105 2862002 2832300 2708420 2691747 2216224 2538088 2740112 2713501 2528365 2670292 3152968
11095 3152968 3300052 2819231 2729721 2904185 3355393 3245844 3165405 3023053 2954638 3165235
$$ packed form
11164B212556l04429K78594J42525o7114m45933J29734L55675N95812l84135N7684
11154B570969P0893l74477p0511l81421J32373L51888k07872r6487L25382N3603
11144B374340j19462l53649L50290J05995m29873J22645m28364K03016k20628
11135A604310j39675O88453L50584K18913m08194j60314r6285J61476J13487L15356
11125B648111j52795j71760l60283J80416L90225j87886o6690L74243J55140p9001
11115B729720l51649p0222N26583j76633K3728L45684l01733j30901Q5632J81793
11105B862002k9702j23880j6673m75523L21864K02024k6611j85136J41927M82676
11095C152968J47084m80821q9510J74464M51208j09549q0439j42352o8415K10597
$$ plain form
11085 3165235 3423521 3509923 3502535 3772514 4065451 4224045 4209024 4337413 4264799 4029643
11075 4029643 4045680 4048057 4575910 4861891 4549321 4264533 4336872 5083053 5164459 5215426
11065 5215426 5034451 5095447 5337773 5653528 5601150 6089978 6250687 6109511 6275926 5876860
11055 5876860 6255715 6618305 6552594 6275500 6450930 6684709 7166904 7791974 7628601 7531112
11045 7531112 7718133 8183870 8452843 8519054 8579942 8933047 9109666 9692677 9584482 10235433
11035 10235433 10826557 11132549 11301049 11393348 11944062 12210624 12361179 12903203 13627735
11026 13627735 13983420 14516877 14997218 15087621 15231402 15653296 16628574 17090368 17317314
11017 17317314 17898662 18313238 18170565 18156253 18218881 18399613 18937801 18872541 19038164 18896493
$$ packed form
11085C165235K58286Q6402p388K69979K92937J58594j5021J28389p2614k35156
11075D029643J6037K377N27853K85981l12570k84788P2339P46181Q1406N0967
11065E215426j80975O0996K42326L15755n2378M88828J60709j41176J66415l99066
11055E876860L78855L62590o5711k77094J75430K33779M82195O25070j63373r7489
11045G531112J87021M65737K68973O6211O0888L53105J76619N83011j08195O50951
11035A0235433N91124L05992J68500R2299N50714K66562J50555N42024P24532
11026A3627735L55685N33457M80341R0403J43781M21894R75278M61794K26946
11017A7317314N81348M14576j42673j4312O2628J80732N38188o5260J65623j41671
$$ plain form
11007 18896493 19010902 19006281 19062685 18810302 17948212 17546773 17447042 16891958 16422313 16109501
10997 16109501 15564268 15270983 14527135 14471802 13781841 13055988 12566223 12449868 12215210
10988 12215210 11407878 10962322 10746134 10034142 9839580 9825561 9247720 9146557 8664139
10979 8664139 8654883 8316890 8615426 8335826 7960459 7694216 7385274 7149715 6649714 6096310
10969 6096310 6348018 6283493 6516992 6532948 5461588 4930570 4806859 4920839 4959213 4633901
10959 4633901 4334720 4420010 4645981 4161531 4023509 4558544 4278428 4040349 4208038 4185696
10949 4185696 4059293 3428922 3127272 2919105 3106746 3287566 3584588 3472289 3090033
10940 3090033 2411898 2524225 2595093 2746031 3121827 2799756 2669244 2423350 2470118 2166584
$$ packed form
11007A8896493J14409m621N6404k52383q62090m01439r9731n55084m69645l12812
10997A6109501n45233k93285p43848n5333o89961p25853m89765j16355k34658
10988A2215210q07332m45556k16188p11992j94562j4019n77841j01163m82418
10979H664139r256l37993K98536k79600l75367k66243l08942k35559n00001n53404
10969F096310K51708o4525K33499J5956j071360n31018j23711J13980L8374l25312
10959D633901k99181Q5290K25971m84450j38022N35035k80116k38079J67689k2342
10949D185696j26403o30371l01650k08167J87641J80820K97022j12299l82256
10940C090033o78135J12327P0868J50938L75796l22071j30512k45894M6768l03534
$$ plain form
10930 2166584 2008440 1966172 2321722 2098108 2002130 2372311 1861208 1788146 1767729 2041202
10920 2041202 2085700 1619036 2080150 2032462 1792503 1699673 2299832 2054307 1933537 1229174
10910 1229174 1384251 1754543 1972342 2042346 2049317 2069126 1815015 1463455 1208050 1627143
10900 1627143 2020735 1742934 1408896 1687091 1864234 1989372 1825944 1346070 1373467 1781105
10890 1781105 1452056 1342807 1201397 1443133 1442184 1159325 1048303 1405843 1061857 1082317
10880 1082317 1158916 1081424 1518825 1044285 801840 1280203 1024379 861850 934581 1097468
10870 1097468 1208176 675113 252320 819062 1051695 1244919 1279475 1410172 1070106 881289
10860 881289 1080538 765999 775090 959071 1074740 1121804 743515 740321 665413 748546 988273
$$ packed form
10930B166584j58144m2268L55550k23614r5978L70181n11103p3062k0417K73473
10920B041202M4498m66664M61114m7688k39959r2830O00159k45525j20770p04363
10910A229174J55077L70292K17799P0004O971J9809k54111l51560k55405M19093
10900A627143L93592k77801l34038K78195J77143J25138j63428m79874K7397M07638
10890A781105l29049j09249j41410K41736r49k82859j11022L57540l43986K0460
10880A082317P6599p7492M37401m74540k42445M78363k55824j62529P2731J62887
10870A097468J10708n33063m22793N66742K32633J93224L4556J30697l40066j88817
10860H81289J99249l14539R091J83981J15669M7064l78289l194p4908Q3133K39727
$$ plain form
10849 988273 782217 842331 898291 1226616 1071058 1605328 1457118 673250 365912 716940
10839 716940 447474 680479 1003736 784698 921711 877681 801132 807635 801871 853368 540236
10828 540236 378545 431216 555858 881501 1110428 948651 1099394 1218236 783049 840845
10818 840845 741381 651539 766318 976999 1077081 801039 535745 769991 972108 544901
10808 544901 641540 560507 397688 370293 985480 1086428 533908 509539 790840 1082319
10798 1082319 370620 336589 460625 160074 749059 1181552 1178700 1333894 1031555 507701
10788 507701 622216 503910 573096 295493 140693 437697 597828 623323 671124 710979
10778 710979 1070399 959452 704127 663788 679944 650971 752333 544560 503872 644210
$$ packed form
10849I88273k06056O0114N5960L28325j55558N34270j48210p83868l07338L51028
10839G16940k69466K33005L23257k19038J37013m4030p6549O503n764N1497l13132
10828E40236j61691N2671J24642L25643K28927j61777J50743J18842m35187N7796
10818H40845r9464q9842J14779K10681J00082k76042k65294K34246K02117m27207
10808E44901R6639q1033j62819k7395O15187J00948n52520k4369K81301K91479
10798A082319p11699l4031J24036l00551N88985M32493k852J55194l02339n23854
10788E07701J14515j18306O9186k77603j54800K97004J60131K5495M7801L9855
10778G10979L59420j10947k55325m0339J6156k8973J01362k07773m0688J40338
$$ plain form
10768 644210 988204 1154416 828294 637792 1142915 961956 458875 447722 373758 521400
10758 521400 692050 1160173 888707 1048355 633063 601149 530977 729081 602219 572337
10748 572337 537763 740792 771534 229699 72814 455744 576802 738885 317935 683338
10738 683338 972314 861930 152321 142803 -77769 190745 845844 878934 868729 618593
10728 618593 535959 432480 431193 408031 349297 30003 371285 431378 476226 179579 -16455
10717 -16455 211102 517984 662771 694384 575260 615458 451607 312476 527512 432128
10707 432128 87655 207386 474972 337843 178171 -42945 379781 328407 320577 120722
10697 120722 247737 909633 901591 426439 698040 335119 253504 929005 1027958 1102966
$$ packed form
10768F44210L43994J66212l26122j90502N05123j80959n03081j1153p3964J47642
10758E21400J70650M68123k71466J59648m15292l1914p0172J98104j26862k9882
10748E72337l4574K03029L0742n41835j56885L82930J21058J62083m20950L65403
10738F83338K88976j10384p09609r518k20572K68514O55099L3090j0205k50136
10728F18593q2634j03479j287k3162n8734l19294L41282O0093M4848k96647j96034
10717a6455K27557L06882J44787L1613j19124M0198j63851j39131K15036r5384
10707D32128l44473J19731K67586j37129j59672k21116M22726n1374p830j99855
10697A20722J27015O61896q042m75152K71601l62921q1615O75501R8953P5008
$$ plain form
10687 1102966 804546 722945 959224 940530 707016 599057 742611 767243 657988 798990
10677 798990 715922 363665 137777 548326 326292 468209 158171 483301 98183 -397879
10667 -397879 238350 1130509 1081522 324096 553077 505425 419412 707877 544397 751206
10657 751206 706909 922886 734098 414268 -114778 10918 -202942 211137 358110 273826
10647 273826 233477 715372 610655 257999 236429 555280 598966 128592 359213 887875
10637 887875 362067 536850 547568 626381 606672 343681 602528 26847 72109 -86540
10627 -86540 175447 525070 1070914 878223 715980 394232 433261 333894 554488 652166
10617 652166 820525 913028 759619 750172 692293 670986 719801 939760 927807 673500 204167
$$ packed form
10687A102966k98420q1601K36279j8694k33514j07959J43554K4632j09255J41002
10677G98990q3068l52257k25888M10549k22034J41917l10038L25130l85118m96062
10667c97879O36229Q92159m8987p57426K28981m7652q6013K88465j63480K06809
10657G51206m4297K15977j88788l19830n29046J25696k13860M14079J46973q4284
10647B73826m0349M81895j04717l52656k1570L18851M3686m70374K30621N28662
10637H87875n25808J74783J0718P8813j9709k62991K58847n75681M5262j58649
10627h6540K61987L49623N45844j92691j62243l21748L9029r9367K20594R7678
10617F52166J68359R2503j53409r447n7879k1307M8815K19959j1953k54307m69333
$$ plain form
10606 204167 -57588 389407 213740 336970 593907 538342 629571 713456 457388 439742
10596 439742 224033 428442 455890 617780 336222 239108 294428 219999 399430 407345 573205
10585 573205 305964 36554 442395 564598 698777 629513 616894 924229 892226 489226
10575 489226 394196 394814 79530 339116 594294 486299 354389 518381 179597 256928
10565 256928 226691 146847 525837 527912 125971 -47814 -98250 -160450 364301 888390 669204
10554 669204 431016 463106 789671 742820 341967 -101809 -156236 275655 408346 296537
10544 296537 402889 842456 763979 815333 864708 355450 418627 260299 -82397 273165
10534 273165 842664 789138 445439 641197 478230 834372 806369 333449 591277 978277
$$ packed form
10606B04167k61755M46995j75667J23230K56937n5565R1229Q3885k56068j7646
10596D39742k15709K04409K7448J61890k81558r7114N5320p4429J79431P915J65860
10585E73205k67241k69410M05841J22203J34179o9264j2619L07335l2003m03000
10575D89226r5030O18l15284K59586K55178j07995j31910J63992l38784P7331
10565B56928l0237p9844L78990K075m01941j73785n0436o2200N24751N24089k19186
10554F69204k38188L2090L26565m6851m00853m43776n4427M31891J32691j11809
10544B96537J06352M39567p8477N1354M9375n09258O3177j58328l42696L55562
10534B73165N69499n3526l43699J95758j62967L56142k8003m72920K57828L87000
$$ plain form
10524 978277 974884 698317 516052 494818 628932 871132 1063521 705780 228203 256618
10514 256618 421407 457304 464671 498264 318998 71270 217989 415202 327302 502176
10504 502176 603853 348486 917874 483503 475058 297361 426787 1001837 1018542 631473
10494 631473 551624 420706 349688 646361 364295 372097 523339 541196 999724 892987
10484 892987 906407 976027 751656 628004 271912 602015 181603 239690 201495 513183
10474 513183 889747 841531 979755 692102 146994 422721 229201 507124 612732 352314
10464 352314 537731 932987 987364 194179 157017 481503 418513 455339 519052 711997
10454 711997 812121 722983 619481 156285 315077 168083 369095 428809 542065 746431
$$ packed form
10524I78277l393k76567j82265k1234J34114K42200J92389l57741m77577K8415
10514B56618J64789L5897P367L3593j79266k47728J46719J97213q7900J74874
10504E02176J01677k55367N69388m34371q445j77697J29426N75050J6705l87069
10494F31473p9849j30918p1018K96673k82066P802J51242J7857M58528j06737
10484H92987J3420O9620k24371j23652l56092L30103m20412N8087l8195L11688
10474E13183L76564m8216J38224k87653n45108K75727j93520K77923J05608k60418
10464C52314J85417L95256N4377p93185l7162L24486o2990L6826O3713J92945
10454G11997J00124q9138j03502m63196J58792j46994K01012N9714J13256K04366
$$ plain form
10444 746431 417186 881463 797622 542132 900635 303528 230039 417009 424719 745455
10434 745455 507800 904046 1169979 821584 837640 729671 567931 664214 897186 969848
10424 969848 598373 819559 731951 917348 862739 418458 584543 660316 444632 879343
10414 879343 750417 660672 487140 348660 740737 619104 871414 467102 567894 113788
10404 113788 499117 798122 1088149 793696 459654 517704 629019 720883 796182 639650
10394 639650 514376 508168 572170 551812 286164 399082 652401 702967 1121470 574758
10384 574758 403302 603990 606087 673435 685972 891224 1052157 696856 330261 549485
10374 549485 780388 1183320 1099938 711692 838727 823419 763898 1075799 916178 1099311
$$ packed form
10444G46431l29245M64277q3841k55490L58503n97107p3489J86970P710L20736
10434G45455k37655L96246K65933l48395J6056j07969j61740R6283K32972P2662
10424I69848l71475K21186q7608J85397n4609m44281J66085P5773k15684M34711
10414H79343j28926q9745j73532j38480L92077j21633K52310m04312J00792m54106
10404A13788L85329K99005K90027k94453l34042N8050J11315R1864P5299j56532
10394F39650j25274o208O4002k0358k65648J12918K53319N0566M18503n46712
10384E74758j71456K00688K097O7348J2537K05252J60933l55301l66595K19224
10374E49485K30903M02932q3382l88246J27035j5308n9521L11901j59621J83133
$$ plain form
10364 1099311 713056 566955 474026 878562 731243 464195 473556 622650 1254970 1353932
10354 1353932 987800 680375 383131 404032 606054 747247 1260659 1455791 1152268 1232752
10344 1232752 1341414 1271007 1095895 943281 738844 1071157 1438370 1623046 1513148 1283408
10334 1283408 1346905 1184250 1083771 1205949 1062959 1351286 1336543 1554313 1568499 1697955
10324 1697955 1728011 1384099 1347682 1585822 818479 860933 1129009 1184309 1150421 1027155
10314 1027155 1194763 1409103 1426796 1654121 1825776 1582416 1501150 1244002 1548983 1588780
10304 1588780 1075176 1237436 1494130 1616876 1666877 1763176 1670388 1567501 1864333 1763137
10294 1763137 1959422 1900889 1968067 2196257 1782569 1826758 2159607 2164934 2313689 2093472
$$ packed form
10364A099311l86255j46101r2929M04536j47319k67048R361J49094O32320R8962
10354A353932l66132l07425k97244K0901K02022J41193N13412J95132l03523Q0484
10344A232752J08662p0407j75112j52614k04437L32313L67213J84676j09898k29740
10334A283408O3497j62655j00479J22178j42990K88327j4743K17770J4186J29456
10324A697955L0056l43912l6417K38140p67343M2454K68076N5300l3888j23266
10314A027155J67608K14340J7693K27325J71655k43360q1266k57148L04981L9797
10304A588780n13604J62260K56694J22746N0001R6299r2788j02887K96832j01196
10294A763137J96285n8533O7178K28190m13688M4189L32849N327J48755k20217
$$ plain form
10284 2093472 2097728 2264040 2233815 1980099 1808785 1931369 2046867 1819658 1936103 2010851
10274 2010851 2251802 1918756 2289282 2668055 2892451 2609042 2499338 2820835 2759287 2761337
10264 2761337 2561337 2490430 2604218 2762976 2912940 2737007 2947433 2960428 3048279 3210117
10254 3210117 3278172 3662621 3603524 3763969 3733445 3868186 3786112 4222298 4492546 4365022
10244 4365022 4181819 4205386 4366037 4742952 5083287 5309054 5297851 5345501 5557230 5023235
10234 5023235 5009318 5163917 5223081 5247156 5261284 5466763 5710312 5568729 5661896 5657126 5537084
10223 5537084 5673126 5640936 5968374 5729407 5511638 6063114 6577626 6593913 6262479 6594124
10213 6594124 7055193 7345400 7579568 7561639 7490861 7951332 8305208 8674153 8661199 9213204
$$ packed form
10284B093472M256J66312l0225k53716j71314J22584J15498k27209J16445P4748
10274B010851K40951l33046L70526L78773K24396k83409j09704L21497o1548K050
10264B761337k00000p0907J13788J58758J49964j75933K10426J2995Q7851J61838
10254C210117O8055L84449n9097J60445l0524J34741q2074M36186K70248j27524
10244D365022j83203K3567J60651L76915L40335K25767j1203M7650K11729n33995
10234E023235j3917J54599N9164K4075J4128K05479K43549j41583R3167m770j20042
10223E537084J36042l2190L27438k38967k17769N51476N14512J6287l31434L31645
10213F594124M61069K90207K34168j7929p0778M60471L53876L68945j2954N52005
$$ plain form
10203 9213204 9471370 9788802 9888305 10405322 10982052 11365216 12239706 12467747 12958906 13394270
10193 13394270 13723841 14519271 15010465 15296844 15314508 16034902 16933539 16984957 16773408 16798589
10183 16798589 17101255 17139622 16509071 16007285 15091368 14703128 14624767 13967940 13202449 12197294
10173 12197294 11644676 11299801 10884240 10231114 10245855 9299687 8988032 8506941 7774011
10164 7774011 7440618 7715033 7821975 7294814 6835542 6746236 6153540 5892155 5812871 5403305
10154 5403305 5035872 5007345 5290747 5156651 4855140 5123825 4686673 4297069 4573664 3984156
10144 3984156 3804312 4112259 3925190 4026443 3955351 3758404 3709725 3532028 3619589 3788154
10134 3788154 3824905 3458243 3560966 3964125 4050029 3857344 3726266 4012896 4212608 4226291
$$ packed form
10203I213204K58166L17432R9503N17017N76730L83164Q74490K28041M91159M35364
10193A3394270L29571P95430M91194K86379J7664P20394Q98637N1418k11549K5181
10183A6798589L02666L8367o30551n01786r15917l88240p8361o56827p65491j005155
10173A2197294n52618l44875m15561o53126J4741r46168l11655m81091p32930
10164G774011l33393K74415J06942n27161m59272q9306n92696k61385p9284m09566
10154E403305l67433k8527K83402j34096l01511K68685m37152l89604K76595n89508
10144C984156j79844L07947j87069J01253p1092j96947m8679j77697Q7561J68565
10134C788154L6751l66662J02723M03159Q5904j92685j31078K86630J99712J3683
$$ plain form
10124 4226291 4240519 4764849 5259207 5258105 5306638 5454909 5281373 5118431 4969372 4865959
10114 4865959 4779490 4977189 5135738 4494574 4112423 4005226 3825474 3289986 3034637 2734075
10104 2734075 2789968 2600272 2267197 2347825 2390560 2322925 2284773 2242105 2368412 2261177
10094 2261177 2211827 2361646 2202145 1791194 1956687 2274863 2178866 1890303 1848209 1972357
10084 1972357 1955767 2112509 1915220 1823727 2137891 2291448 2210790 2027946 1783310 1502274
10074 1502274 1586482 1955874 1918857 1784541 2069195 2064571 1530295 1939205 1844063 1371973
10064 1371973 1721477 1770086 1908899 2012545 1679050 1551751 1953896 2208893 1860327 1606146
10054 1606146 1363040 1182677 1287593 1301345 1272789 1056495 894341 1005767 892417 1152796
$$ packed form
10124D226291J4228N24330M94358j102M8533J48271j73536j62942j49059j03413
10114D865959q6469J97699J58549o41164l82151j07197j79752n35488k55349l00562
10104B734075N5893j89696l33075Q0628M2735o7635l8152m2668J26307j07235
10094B261177m9350J49819j59501m10951J65493L18176r5997k88563m2094J24148
10084A972357j6590J56742j97289r1493L14164J53557q0658j82844k44636k81036
10074A502274Q4208L69392l7017j34316K84654m624n34276M08910r5142m72090
10064A371973L49504M8609J38813J03646l33495j27299M02145K54997l48566k54181
10054A606146k43106j80363J04916J3752k8556k16294j62154J11426j13350K60379
$$ plain form
10044 1152796 1487977 1798927 2105373 2073895 1667972 1636917 1626587 1540535 1917634 1685046
10034 1685046 1654634 2023397 1704623 1637472 1579404 1527208 1404899 1587914 1727103 1709299
10024 1709299 1563792 1415613 1430420 1501790 1932289 1657470 1602249 1533452 1579123 1841581
10014 1841581 1884495 2096679 1731394 1417581 1680314 2047622 1864417 1839247 2008756 1641005
10004 1641005 1157614 1612600 1709300 1872432 1957234 1795004 1619701 1334058 1718020 1713749
9994 1713749 1890101 1538833 1543511 1370459 1636191 1360924 1468141 1831906 1810793 1915421
9984 1915421 1924315 2126855 2080896 2064171 1455317 1544149 1975176 1682594 1732292 1950320 2086080
9973 2086080 1769195 1631579 2012633 2283032 2342793 1984042 1662175 1929179 2446252 2441857
$$ packed form
10044A152796L35181L10950L06446l1478m05923l1055j0330q6052L77099k32588
10034A685046l0412L68763l18774o7151n8068n2196j22309J83015J39189j7804
10024A709299j45507j48179J4807P1370M30499k74819n5221o8797M5671K62458
10014A841581M2914K12184l65285l13813K62733L67308j83205k5170J69509l67751
10004A641005m83391M54986R6700J63132Q4802j62230j75303k85643L83962m271
9994A713749J76352l51268M678j73052K65732k75267J07217L63765k1113J04628
9984A915421Q894K02540m5959j6725o08854Q8832M31027k92582M9698K18028J35760
9973B086080l16885j37616L81054K70399N9761l58751l21867K67004N17073m395
$$ plain form
9963 2441857 2649882 2646783 3002753 3215532 3104089 3026739 3170973 3349732 3467050 3440571
9953 3440571 3563852 3773694 3761404 3116409 2947031 3248158 2880756 3308260 3004226 2757807
9943 2757807 2582211 2804949 2662408 2746706 2405900 2025703 2336249 2296454 2193734 2130548
9933 2130548 2074485 2343639 1941831 1906288 2186303 2767675 2568101 2683944 2666499 2331970
9923 2331970 2311800 2171559 2278278 1954172 1860728 2059390 2521642 2852419 2885304 1985808
9913 1985808 2296642 2262164 2242992 2230774 1909285 1803993 2125238 2242757 1996786 2288403
9903 2288403 2162917 2626185 2645551 2807003 2831069 2352920 2371197 2540757 3106159 3159219
9893 3159219 2828925 2574127 2511617 2736923 3128713 3336020 3585960 3037830 2603330 2538916
$$ packed form
9963B441857K08025l099L55970K12779j11443p7350J44234J78759J17318k6479
9953C440571J23281K09842j2290o44995j69378L01127l67402M27504l04034k46419
9943B757807j75596K22738j42541Q4298l40806l80197L10546l9795j02720o3186
9933B130548n6063K69154m01808l5543K80015N81372j99574J15843j7445l34529
9923B331970k0170j40241J06719l24106r3444J98662M62252L30777L2885q99496
9913A985808L10834l4478j9172j2218l21489j05292L21245J17519k45971K91617
9903B288403j25486M63268J9366J61452K4066m78149J8277J69560N65402N3060
9893C159219l30294k54798o2510K25306L91790K07307K49940n48130m34500o4414
$$ plain form
9883 2538916 3111355 2706494 3068075 3497045 3264833 3447618 3861920 4004925 4077389 4367743
9873 4367743 4546443 4482786 5063484 5914716 6201254 6590979 7008393 7175765 7158983 7065653
9863 7065653 7048211 6279236 5648538 5114325 4584763 4333707 4867120 4349939 3990792 3352980
9853 3352980 3546851 3977933 3518695 3924431 3769575 3819163 3334183 3499668 4242895 4077789
9843 4077789 4233748 4157338 3998073 3689691 3670601 3487377 3648031 3666063 3681093 3916599
9833 3916599 3656095 3485930 3113554 3528416 3376287 3245869 3070280 3238617 3446292 3737890
9823 3737890 3631261 3141694 3055048 3413825 3303060 3203198 3015098 3097889 3939993 4244080
9813 4244080 3500545 3418021 3890384 3396741 3090640 3747962 3625990 3598602 3719667 3766031
$$ packed form
9883B538916N72439m04861L61581M28970k32212J82785M14302J43005P2464K90354
9873D367743J78700o3657N80698Q51232K86538L89725M17414J67372j6782r3330
9863G065653j7442p68975o30698n34213n29562k51056N33413n17181l59147o37812
9853C352980J93871M31082m59238M05736j54856M9588m84980J65485P43227j65106
9843D077789J55959p6410j59265l08382j9090j83224J60654J8032J5030K35506
9833C916599k60504j70165l72376M14862j52129j30418j75589J68337K07675K91598
9823C737890j06629m89567q6646L58777j10765r9862j88100Q2791Q42104L04087
9813D244080p43535q2524M72363m93643l06101O57322j21972k7388J21065M6364
$$ plain form
9803 3766031 3909109 3902628 3599491 3499469 3374476 3930099 3647037 3908128 3695375 3927592
9793 3927592 4091650 3936146 4115631 4370568 4510196 3889530 4117548 4376041 4267913 4151772
9783 4151772 4028829 4123377 4096534 4182301 4132119 4454011 4901679 4756049 4816654 4707344
9773 4707344 4923908 4841800 4852957 4601419 4878852 5058675 5000357 5645063 5758021 5856839
9763 5856839 5502056 5235810 5403560 5373424 5395283 5003657 4822712 5041070 5092897 5226408
9753 5226408 5489545 5287003 5171012 5530318 5909937 5720374 5676486 6433387 6092942 6101469
9743 6101469 6194897 5938089 6416161 6259080 6333694 6767609 6843232 6923286 6802428 6929028
9733 6929028 7325741 7429213 7813788 7993341 7678211 7612572 7869609 7882818 8177656 8285183
$$ packed form
9803C766031J43078o481l03137j00022j24993N55623k83062K61091k12753K32217
9793C927592J64058j55504J79485K54937J39628o20666K28018K58493j08128j16141
9783D151772j22943R4548k6843Q5767n0182L21892M47668j45630O0605j09310
9773D707344K16564q2108J1157k51538K77433J79823n8318O44706J12958R8818
9763E856839l54783k66246J67750l0136K1859l91626j80945K18358N1827J33511
9753E226408K63137k02542j15991L59306L79619j89563m3888P56901l40445Q527
9743F101469R3428k56808M78072j57081P4614M33915P5623Q0054j20858J26600
9733F929028L96713J03472L84575J79553l15130o5639K57037J3209K94838J07527
$$ plain form
9723 8285183 8738748 8506392 8396221 8319917 8419184 8681459 9089898 9421905 9538322 9249605
9713 9249605 9487451 9309651 9452834 9535087 9722722 10397721 10143906 10007099 10654632 10932183
9703 10932183 10705472 11092040 11323713 11488598 11525958 11572634 11875700 12615578 12819738 12747382
9693 12747382 13153340 13308151 13749005 14473673 14593267 14287353 14619400 14995060 15465406
9684 15465406 15540978 16190881 16749295 16815073 17766822 17802794 18423216 19138430 19629150 20434767
9674 20434767 20902896 21114596 21411025 22209774 22969464 23591779 24097623 24611805 25608126
9665 25608126 26195249 27175186 27957801 29077894 30115980 31264392 32538358 34025642 35543438
9656 35543438 37109496 38269853 40227818 43287040 46123011 49567915 53816651 58695693
$$ packed form
9723H285183M53565k32356j10171p6304R9267K62275M08439L32007J16417k88717
9713I249605K37846j77800J43183Q2253J87635O74999k53815j36807O47533K77551
9703A0932183k26711L86568K31673J64885L7360M6676L03066P39878K04160p2356
9693A2747382M05958J54811M40854P24668J19594l05914L32047L75660M70346
9684A5465406P5572O49903N58414O5778R51749L5972O20422P15214M90720Q05617
9674B0434767M68129K11700K96429P98749P59690O22315N05844N14182R96321
9665B5608126N87123R79937P82615J120093J038086J148412J273966J487284J517796
9656C5543438J566058J160357J957965L059222K835971L444904M248736M879042
$$ plain form
9648 58695693 64997868 71974333 78342571 84311499 87803020 88912495 89024583 87687514
9640 87687514 87231374 87885659 89274811 90683068 91493114 90501868 86866601 82249118 76541232
9631 76541232 71130249 65975515 62220426 59148478 57311568 56201583 55271236 55193127 55673443
9622 55673443 55565181 55741878 56266988 57270706 58276179 59708264 60845636 61910999 63544309
9613 63544309 64827374 66515196 68417204 70588196 72967068 75327397 78230233 81184815
9605 81184815 84267571 87967060 91412730 95432693 100095928 105842318 111841835 119536944
9597 119536944 128496351 138584911 151171307 165305828 183717521 206813202 233834662
9590 233834662 266041914 299735178 330458301 355356496 369383194 372236382 368965133
$$ packed form
9648E8695693O302175O976465O368238N968928L491521J109475J12088j337069
9640H7687514m56140O54285J389152J408257Q10046r91246l635267m617483n707886
9631G6541232n410983n154734l755089l071948j836910j109985r30347p8109M80316
9622E5673443j08262J76697N25110J003718J005473J432085J137372J065363J633310
9613F3544309J283065J687822J902008K170992K378872K360329K902836K954582
9605H1184815L082756L699489L445670M019963M663235N746390N999517P695109
9597A19536944Q959407J0088560J2586396J4134521J8411693K3095681K7021460
9590B33834662L2207252L3693264L0723123K4898195J4026698K853188l271249
$$ plain form
9583 368965133 365073233 364633862 370903135 380084665 388436834 391105521 380893941 357928061
9575 357928061 327063970 291919991 256504804 225563379 199622908 177742303 160075561
9568 160075561 145846081 132535290 121456069 112468451 104545453 98756436 93967345 90227523
9560 90227523 87284184 84805992 82361723 80448353 79174430 77824536 77183911 76314909
9552 76314909 75899752 75794406 76405539 77495417 79464573 82146560 84993432 87891731 91134870
9543 91134870 93623431 95840368 97181566 97244605 96378325 94243244 90682651 86784766 82436532
9534 82436532 77769281 72238369 67414474 63609594 61053375 59111825 57858997 57233393
9526 57233393 57912774 59303523 61160188 63356143 65659280 67759591 70098686 72105472
$$ packed form
9583C68965133l891900m39371O269273R181530Q352169K668687j0211580k2965880
9575C57928061l0864091l5143979l5415187l0941425k5940471k1880605j7666742
9568A60075561j4229480j3310791j1079221q987618p922998n789017m789091l739822
9560I0227523k943339k478192k444269j913370j273923j349894o40625q69002
9552G6314909m15157j05346O11133J089878J969156K681987K846872K898299L243139
9543I1134870K488561K216937J341198O3039q66280k135081l560593l897885m348234
9534H2436532m667251n530912m823895l804880k556219j941550j252828o25604
9526E7233393O79381J390749J856665K195955K303137K100311K339095K006786
$$ plain form
9518 72105472 74168393 75658916 76407324 75932909 74129196 72033529 68010168 63439903
9510 63439903 58797578 54256897 50566873 47571952 44394245 42227494 40663981 39738531
9502 39738531 39025793 39028775 38787673 38712845 38649734 38375011 38277078 38620586 38896535 39597923
9492 39597923 40865235 42512570 44343921 46988985 49956015 53456816 57369217 61581044
9484 61581044 65321158 69208246 72268447 73902170 74440917 75274473 75317296 75272680 75070421
9475 75070421 75178654 77232672 80487027 83573883 85317155 85433671 84244457 81529779
9467 81529779 78374974 76905980 76796390 76986724 75001920 72371795 67612107 60083224
9459 60083224 52292368 45235475 40152462 36311326 32843243 30091276 28630735 26781187
$$ packed form
9518G2105472K062921J490523P48408m74415j803713k095667m023361m570265
9510F3439903m642325m540681l690024k994921l177707k166751j563513r25450
9502C9738531p12738K982k41102p4828o3111k74723r7933L43508K75949P01388
9492C9597923J267312J647335J831351K645064K967030L500801L912401M211827
9484F1581044L740114L887088L060201J633723N38747Q33556M2823m4616k02259
9475G5070421J08233K054018L254355L086856J743272J16516j189214k714678
9467H1529779l154805j468994j09590J90334j984804k630125m759688p528883
9459F0083224p790856p056893n083013l841136l468083k751967j460541j849548
$$ plain form
9451 26781187 24874353 23567083 22745859 21803868 20906956 20007844 18916389 17922489 17559851
9442 17559851 16847527 16377723 15514423 15307074 15225721 14572344 14464520 13987458 13171806 12630151
9432 12630151 12437382 11850408 11113201 10921791 11335250 11163627 10577764 10150660 10337835
9423 10337835 10210736 10392404 10362734 10414289 9996110 10021080 9585486 9434966 9207232 8963278
9413 8963278 9239963 9790932 9282524 8678918 8810449 8461936 8467421 8261013 7588893 7456926
9403 7456926 7519414 7308583 7384540 7122935 7274578 7394828 7482553 7333222 6800719 6718907
9393 6718907 6476357 6659445 7043589 6935381 6641393 6608603 6805078 7079459 6866168 7074649
9383 7074649 7057062 7250417 7444517 7543284 7343541 7337438 6957230 6985414 7082728 7165411 7512059
$$ packed form
9451B6781187j906834j307270q21224r41991q96912q99112j091455r93900l62638
9442A7559851p12324m69804q63300k07349q1353o53377j07824m77062q15652n41655
9432A2630151j92769n86974p37207j91410M13459j71623n85863m27104J87175
9423A0337835j27099J81668k9670N1555m18179K4970m35594j50520k27734k43954
9413H963278K76685N50969n08408o03606J31531l48513N485k06408o72120j31967
9403G456926O2488k10831P5957k61605J51643J20250Q7725j49331n32503q1812
9393F718907k42550J83088L84144j08208k93988l2790J96475K74381k13291K08481
9383G074649j7587J93355J94100R8767j99743o103l80208K8184R7314Q2683L46648
$$ plain form
9372 7512059 7043730 6896136 6717481 6335991 5878488 6155427 6188301 6533043 6518326 6266843
9362 6266843 6020158 6157764 5948583 5350159 5419742 5277069 5583668 5957023 6229453 5931481
9352 5931481 6118605 5981481 5804462 5744136 5944619 6166481 5936584 5861512 5405117 6171502
9342 6171502 6217241 6082939 5796893 5409739 5613771 6234738 6302950 6364158 5798372 5556503
9332 5556503 5758161 5822391 5893274 5857479 5741155 5847819 5832379 5568288 5915183 6323145
9322 6323145 6519517 6692496 6623186 6376177 6640996 6842058 6980339 7167564 7205091 7356929
9312 7356929 7487505 7472200 7392144 7410476 7958177 8307051 8473263 7996491 7919231 7866314
9302 7866314 8047649 8680332 8882654 9112263 9966517 10812564 11205371 11813441 13013344
$$ packed form
9372G512059m68329j47594j78655l81490m57503K76939L2874L44742j4717k51483
9362F266843k46685J37606k09181n98424O9583j42673L06599L73355K72430k97972
9352E931481J87124j37124j77019o0326K00483K21862k29897p5072m56395P66385
9342F171502M5739j34302k86046l87154K04032O20967O8212O1208n65786k41869
9332E556503K01658O4230P0883l5795j16324J06664j5440k64091L46895M07962
9322F323145J96372J72979o9310k47009K64819K01062J38281J87225L7527J51838
9312G356929J30576j5305q0056J8332N47701L48874J66212m76772p7260n2917
9302G866314J81335O32683K02322K29609Q54254Q46047L92807O08070J199903
$$ plain form
9293 13013344 13183420 12940210 12294302 11836719 11051948 10767956 10524884 10317467 10914576
9284 10914576 10537256 10111550 10627541 11207267 11422277 12109997 12186044 12455941 13192846 13888707
9274 13888707 14027200 13983898 13674795 13077427 12910769 13745581 13894068 13955708 13726318 13208422
9264 13208422 12691413 12131388 12262067 12439699 12551890 13168196 13617826 13177417 13362827
9255 13362827 13940829 14157189 14475305 14166982 14060759 14488554 15479739 15659010 15466487
9246 15466487 16163716 17166627 17632386 18067007 19250215 20220788 20779047 21300147 22431845
9237 22431845 23792930 25321090 26721922 28323338 30325376 32955879 35438395 39046204
9229 39046204 43508405 49575831 57478023 66677913 73822330 73252601 67951055 62566633
$$ packed form
9293A3013344J70076k43210o45908m57583p84771k83992k43072k07417N97109
9284A0914576l77320m25706N15991N79726K15010O87720P6047K69897P36905O95861
9274A3888707J38493m3302l09103n97368j66658Q34812J48487O1640k29390n17896
9264A3208422n17009n60025J30679J77632J12191O16306M49630m40409J85410
9255A3362827N78002K16360L18116l08323j06223M27795R91185J79271j92523
9246A5466487O97229J002911M65759M34621J183208R70573N58259N21100J131698
9237B2431845J361085J528160J400832J601416K002038K630503K482516L607809
9229C9046204M462201O067426P902192R199890P144417n69729n301546n384422
$$ plain form
9221 62566633 60118630 61049597 64706750 69025992 69391883 62708676 53558529 45358660
9213 45358660 38622158 34071634 31246319 29192898 27495502 25820247 24720169 24041815
9205 24041815 23591992 23556533 23028775 22555149 22159839 22388459 22789560 23747074 24007826 23301742
9195 23301742 22577625 21557197 20728765 20746633 20591784 20998756 21136020 20509269 19329176
9186 19329176 17794227 16772397 15857743 15467128 15161742 15047588 14072801 13385746 13650476
9177 13650476 13768923 13491848 13269553 13528386 13099291 12592513 12771496 12927069 12328474
9168 12328474 12293184 12414879 12198575 12334160 12328166 12705771 12855998 12686290 12743155 12654721
9158 12654721 12370759 12322014 13123811 13351211 12850407 12483515 12957728 13462095 13592060 13124556
$$ packed form
9221F2566633k448003R30967L657153M319242L65891o683207r150147q199869
9213D5358660o736502m550524k825315k053421j697396j675255j100078o78354
9205B4041815m49823l5459n27758m73626l95310K28620M01101R57514K60752p06084
9195B3301742p24117j020428q28432J7868j54849M06972J37264o26751j180093
9186A9329176j534949j021830r14654l90615l05386j14154r74787o87055K64730
9177A3650476J18447k77075k22295K58833m29095n06778J78983J55573n98595
9168A2328474l5290J21695k16304J35585n994L77605J50227j69708N6865q8434
9158A2654721k83962m8745Q01797K27400n00804l66892M74213N04367J29965m67504
$$ plain form
9148 13124556 13205665 13064061 13213807 13370328 13467753 13850422 14485413 14990466 14847213 14675581
9138 14675581 14934860 15307313 15585589 15862918 15715735 15530547 15601052 15983272 16161446 16116011
9128 16116011 16294246 16735944 17535795 18122769 18299988 18678620 18575986 18625922 18348805 18818555
9118 18818555 19097200 19658839 19905426 19886349 20496143 21230173 21371661 21606202 22279490 22496177
9108 22496177 22570442 23059626 23748723 24355019 24728919 24988569 25155356 25558873 26220396 26796893
9098 26796893 27563011 28502867 28998275 29121095 29534736 30443841 31139936 32227034 32574611
9089 32574611 33439963 34243530 35499367 36675385 37402563 38487645 39276302 40220527 41326342
9080 41326342 42335698 43396861 44313868 45110321 46416846 47924511 49435001 50712908
$$ packed form
9148A3124556Q1109j41604J49746J56521R7425L82669O34991N05053j43253j71632
9138A4675581K59279L72453K78276K77329j47183j85188P0505L82220J78174m5435
9128A6116011J78235M41698P99851N86974J77219L78632j02634M9936k77117M69750
9118A8818555K78645N61639K46587j9077O09794P34030J41488K34541O73288K16687
9108B2496177P4265M89184O89097O06296L73900K59650J66787M03517O61523N76497
9098B6796893P66118R39856M95408J22820M13641R09105O96095J087098L47577
9089C2574611Q65352Q03567J255837J176018P27178J085082P88657R44225J105815
9080D1326342J009356J061163R17007P96453J306525J507665J510490J277907
$$ plain form
9072 50712908 51990869 53542836 54782880 55846417 57116407 58813695 60316028 62329967
9064 62329967 64402948 66363720 68715255 71556744 74432821 77499998 81701349 85806566
9056 85806566 91350849 97747621 105252098 114153082 125766049 139239620 156005063 175573718
9048 175573718 193141676 199914195 195289896 187275709 181620835 181142577 186296167 196062658
9040 196062658 208717207 217304854 215182659 205305314 194380121 186374038 181469932 178343065
9032 178343065 174694987 169655014 165606580 163027591 162679734 163591159 165925399 168868307
9024 168868307 169584149 167706889 165224382 163764406 164478338 166894746 170325830 175840431
9016 175840431 183717980 193724597 207102676 224157353 246107002 273769956 305877073
$$ packed form
9072E0712908J277961J551967J240044J063537J269990J697288J502333K013939
9064F2329967K072981J960772K351535K841489K876077L067177M201351M105217
9056H5806566N544283O396772P504477Q900984J1612967J3473571J6765443J9568655
9048A75573718J7567958O772519m624299q014187n654874m78258N153590R766491
9040A96062658J2654549Q587647k122195r877345j0925193q006083m904106l126867
9032A78343065l648078n039973m048434k578989l47857R11425K334240K942908
9024A68868307P15842j877260k482507j459976P13932K416408L431084N514601
9016A75840431P877549J0006617J3378079J7054677K1949649K7662954L2107117
$$ plain form
9009 305877073 335579709 348695230 343466870 331687420 324183385 326951966 341234799
9002 341234799 365383064 396938120 425882318 435358998 425356777 407489612 390811311
8995 390811311 377799368 364955765 351014131 336476294 322168158 309120279 301113662
8988 301113662 296926177 292711076 286023411 274517740 257270283 237767738 219225247
8981 219225247 204368169 191231230 178000940 166099323 155733654 147174112 141404646
8974 141404646 137588451 136108627 136524310 137594321 138501510 137505650 134771565 132126828
8966 132126828 130548082 129900964 128188557 124647299 120576354 117949298 117261847 117608385
8958 117608385 119536916 123133923 126188504 127117021 125156277 122939949 122037406 122001985 121745305
$$ packed form
9009C05877073K9702636J3115521n228360j1779450p504035K768581J4282833
9002C41234799K4148265L1555056K8944198R476680j0002221j7867165j6678301
8995C90811311j3011943j2843603j3941634j4537837j4308136j3047879q006617
8988C01113662m187485m215101o687665j1505671j7247457j9502545j8542491
8981B19225247j4857078j3136939j3230290j1901617j0365669q559542n769466
8974A41404646l816195j479824M15683J070011R07189r95860k734085k644737
8966A32126828j578746o47118j712407l541258m070945k627056o87451L46538
8958A17608385J928531L597007L054581R28517j960744k216328r02543l5421k56680
$$ plain form
8949 121745305 118448203 112581088 106464584 101830417 98893044 97015290 95806131 95238734
8941 95238734 94670919 94270244 94589296 95464802 97304275 99963471 102930647 106883488 111409084
8932 111409084 115674600 121037072 127827809 136558127 148297123 162814867 179668811 194203824
8924 194203824 194747828 183276088 168930027 158061116 153269910 151625413 151564216 153123235
8916 153123235 156192854 161463476 170344957 180270748 192324364 206829490 222629056 238702220
8908 238702220 254499321 271003307 290390230 315518247 348297047 382344487 402455487
8901 402455487 403913925 384955881 345893419 297349219 251051048 213927109 185567674
8894 185567674 164486812 148694235 136447408 126306504 119288232 114049707 109060486
$$ packed form
8949A21745305l297102n867115o116504m634167k937373j877754j209159n67397
8941I5238734n67815m00675L19052Q75506J839473K659196K967176L952841M525596
8932A11409084M265516N362472O790737Q730318J1738996J4517744J6853944J4535013
8924A94203824N44004j1471740j4346061j0868911m791206j644497o1197J559019
8916A53123235L069619N270622Q881481R925791J2053616J4505126J5799566J6073164
8908B38702220J5797101J6503986J9386923K5128017L2778800L4047440K0111000
8901D02455487J458438j8958044l9062462m8544200m6298171l7123939k8359435
8894A85567674k1080862j5792577j2246827j0140904p018272n238525m989221
$$ plain form
8887 109060486 105226113 102302963 99129225 96670134 95114880 94204561 93908161 94117547
8879 94117547 94792952 96386726 98712112 101657126 105871227 110447226 117118713 125598138
8871 125598138 134010300 142587253 151865754 161219746 171752195 186042913 205332185 225477745
8863 225477745 238176083 239730549 229482787 206581027 177572087 149636137 127202414
8856 127202414 111025997 97815813 87622181 80237108 74454422 69278628 65750910 62923147
8848 62923147 59957031 56851903 54379171 52861701 51091016 49488646 48191621 47234605
8840 47234605 46896276 45339531 43656483 42786152 42017388 41416835 40453976 39644966 39389967
8831 39389967 39378100 39216091 38932400 39033464 38751427 39204258 39719356 40184290 40932884 41995894
$$ packed form
8887A09060486l834373k923150l173738k459091j555254r10319k96400K09386
8879I4117547O75405J593774K325386K945014M214101M575999O671487Q479425
8871A25598138Q412162Q576953R278501R353992J0532449J4290718J9289272K0145560
8863B25477745J2698338J554466j0247762k2901760k9008940k7935950k2433723
8856A27202414j6176417j3210184j0193632p385073n782686n175794l527718k827763
8848F2923147k966116l105128k472732j517470j770685j602370j297025r57016
8840D7234605l38329j556745j683048q70331p68764o00553r62859q09010k54999
8831C9389967j1867j62009k83691J01064k82037M52831N15098M64934P48594J063010
$$ plain form
8821 41995894 43023057 44341738 46473392 48718498 52143598 55883110 60831438 66549920
8813 66549920 71824815 74772172 74904371 72081231 68698356 67085893 66823308 68138986
8805 68138986 70472020 72270141 72019148 68092112 62791014 57221213 52623480 49639301
8797 49639301 47631354 45898570 45085125 44938847 45232045 45433504 46660918 48634339 50706213
8788 50706213 54162983 57436456 59957500 61603958 64263313 67364709 71946229 75531579
8780 75531579 79627209 83793493 88563936 93148255 95364285 93729515 89060975 82853142
8772 82853142 77109557 73589722 72292319 71901083 69820253 64375094 57558427 51010004
8764 51010004 46069573 42464913 39139306 37232932 35768570 34828958 33570284 33363407
$$ packed form
8821D1995894J027163J318681K131654K245106L425100L739512M948328N718482
8813F6549920N274895K947357J32199k823140l382875j612463k62585J315678
8805F8138986K333034J798121k50993l927036n301098n569801m597733k984179
8797D9639301k007947j732784q13445j46278K93198K01459J227414J973421K071874
8788E0706213L456770L273473K521044J646458K659355L101396M581520L585350
8780G5531579M095630M166284M770443M584319K216030j634770m668540o207833
8772H2853142n743585l519835j297403l91236k080830n445159o816667o548423
8764E1010004m940431l604660l325607j906374j464362r39612j258674k06877
$$ plain form
8756 33363407 33512394 34021896 34751920 36427077 38242401 40529497 42027183 42874099 43511125
8747 43511125 44263391 44835513 44446573 43413163 42355896 42469929 43288037 43551027 42463078
8738 42463078 39309917 34473454 29815523 26308492 23713727 21169277 19323535 18138361
8730 18138361 16891214 16159987 15285080 14519511 13607170 13095131 12583544 12242744 11604632
8721 11604632 11126605 10871953 10513036 10375093 9796936 9744033 9361038 8785763 8767176 8720144
8711 8720144 8665923 8164982 8102372 7854968 7877661 7704207 7142752 6967799 6825151 6508772
8701 6508772 6190893 6098292 6074817 5976517 6083004 5906527 5469618 5343571 4988224 5277452
8691 5277452 4990514 4891745 4774522 4787025 4449403 4398372 4304873 4183349 4364841 4379347
$$ packed form
8756C3363407J48987N09502P30024J675157J815324K287096J497686Q46916O37026
8747D3511125P52266N72122l88940j033410j057267J14033Q18108K62990j087949
8738D2463078l153161m836463m657931l507031k594765k544450j845742j185174
8730A8138361j247147p31227q74907p65569r12341n12039n11587l40800o38112
8721A1604632m78027k54652l58917j37943n78157n2903l82995n75275j8587m7032
8711H720144n4221n00941o2610k47404K2693j73454n61455j74953j42648l16379
8701F508772l17879r2601k3475r8300J06487j76477m36909j26047l55347K89228
8691E277452k86938r8769j17223J2503l37622n1031r3499j21524J81492J4506
$$ plain form
8681 4379347 4765328 4647428 4504790 4536112 4365289 4583634 5042349 4802346 4531501 4540959
8671 4540959 4445476 4551624 4548423 4447765 4988522 4980321 4656317 4654167 4540071 4549311 4728496
8660 4728496 4581197 4600981 4554801 4373274 3628434 3972547 4117467 4343787 4098988 3560321
8650 3560321 3391088 3351286 3831142 3450127 3491854 3603690 3514611 3266946 3333416 3464364
8640 3464364 3585330 3441326 3610380 3166617 3345593 3578136 3717877 3233854 2993048 3254940
8630 3254940 3539765 3446154 2881581 2769468 3038719 3312464 3475499 3413166 3223461 3093898
8620 3093898 2816148 3053417 2755885 2819227 2959883 2600203 2852187 2624032 2380965 2534545
8610 2534545 2487135 2491248 2545256 1828239 1595584 1655157 1553288 1879550 2048087 2060922 1775089
$$ packed form
8681D379347L85981j17900j42638L1322j70823K18345M58715k40003k70845R458
8671D540959r5483J06148l201j00658N40757q201l24004k150j14096R240J79185
8660D728496j47299J9784m6180j81527p44840L44113J44920K26320k44799n38667
8650C560321j69233l9802M79856l81015M1727J11836q9079k47665O6470J30948
8640C464364J20966j44004J69054m43763J78976K32543J39741m84023k40806K61892
8630C254940K84825r3611n64573j12113K69251K73745J63035o2333j89705j29563
8620C093898k77750K37269k97532O3342J40656l59680K51984k28155k43067J53580
8610B534545m7410M113N4008p17017k32655N9573j01869L26262J68537J2835k85833
$$ plain form
8599 1775089 1734816 1954072 1511991 1334552 1141439 1221111 1351469 1413281 1878397 1882454
8589 1882454 1759918 1659742 1544432 1682828 926666 939996 1057576 1277472 1195843 1118824
8579 1118824 804597 1327905 2109029 1195639 1107500 667726 1003904 1452065 1397455 822973
8569 822973 752300 1014155 1201531 1110470 995403 1233846 1280523 947465 938502 1152829 1119554
8558 1119554 1367828 1704958 1456474 1533420 1513882 700671 858157 910684 944092 1257868
8548 1257868 1464185 1842667 2011871 1962106 1852917 2091963 1646623 1361516 1762358 1675664
8538 1675664 1456136 1926365 1502918 1733461 2050835 2017591 2425834 2171549 1572658 1451176
8528 1451176 1090792 1114015 1341725 1426641 1414825 473858 555015 887584 675475 845029
$$ packed form
8599A775089m0273K19256m42081j77439j93113P9672J30358O1812M65116M057
8589A882454j22536j00176j15310J38396p56162J3330J17580K19896q1629p7019
8579A118824l14227N23308P81124r13390q8139m39774L36178M48161n4610n74482
8569H22973p0673K61855J87376r1061j15067K38443M6677l33058q963K14327l3275
8558A119554K48274L37130k48484P6946j9538q13211J57486N2527L3408L13776
8548A257868K06317L78482J69204m9765j09189K39046m45340k85107M00842q6694
8538A675664k19528M70229m23447K30543L17374l3244M08243k54285n98891j21482
8528A451176l60384K3223K27710Q4916j1816r40967Q1157L32569k12109J69554
$$ plain form
8518 845029 833931 833377 891985 889055 543483 740510 1183902 657417 562510 1228845 1122834
8507 1122834 1331831 1336347 1253909 1304935 1064644 868781 968114 1371561 1556467 1311095
8497 1311095 1407919 1402777 1255814 1417349 1662955 1530953 1353988 1359343 1240338 1128546
8487 1128546 659994 775061 830539 934430 1024225 1137447 1146910 684051 410967 778515
8477 778515 1130080 613395 244822 766681 663081 141702 179731 379168 76302 287055
8467 287055 254787 271066 99830 437694 648415 817917 666110 341040 686785 442906
8457 442906 30152 420646 738808 826580 930973 1045437 823636 501340 844160 837736
8447 837736 753735 420866 999532 1071610 699678 387902 484417 840811 928208 441827
$$ packed form
8518H45029j1098n54N8608k930l45572J97027M43392n26485r4907O66335j06011
8507A122834K08997M516q2438N1026k40291j95863R9333M03447J84906k45372
8497A311095R6824n142j46963J61535K45606j32002j76965N355j19005j11792
8487A128546m68552J15067N5478J03891Q9795J13222R463m62859k73084L67548
8477G78515L51565n16685l68573N21859j03600n21379L8029J99437l02866K10753
8467B87055l2268J6279j71236L37864K10721J69502j51807l25070L45745k43879
8457D42906m12754L90494L18162Q7772J04393J14464k21801l22296L42820o424
8447H37736q4001l32869N78666P2078l71932l11776R6515L56394Q7397m86381
$$ plain form
8437 441827 468905 621776 165206 642012 618073 -273522 324381 484727 453349 723370
8427 723370 537064 539739 639150 884883 637632 703585 453883 332425 53098 330554
8417 330554 820879 1204592 777365 398154 417274 -27279 -19005 390507 264137 344789
8407 344789 369519 147760 370083 352381 208311 -38873 15507 342802 508556 310432
8397 310432 379879 630128 544942 564614 737769 702091 367284 -186860 -198659 123109 303283
8386 303283 198216 275043 395995 107820 499143 232497 -179729 -87265 12091 164936
8376 164936 -230692 -122271 404115 -23975 -50789 38836 10414 123007 147378 404159
8366 404159 353438 263749 -238969 -249464 62409 -294158 -233576 -274929 -322248 88826 304376
$$ packed form
8437D41827K7078J52871m56570M76806k3939q91595N97903J60346l1378K70021
8427G23370j86306K675R9411K45733k47251O5953k49702j21458k79327K77456
8417C30554M90325L83713m27227l79211J9120m44553Q274M09512j26370Q0652
8407C44789K4730k21759K22323j7702j44070k47184N4380L27295J65754j98124
8397C10432O9447K50249q5186J9672J73155l5678l34807n54144j1799L21768J80174
8386C03283j05067P6827J20952k88175L91323k66646m12226R2464R9356J52845
8376A64936l95628J08421N26386m28090k6814Q9625k8422J12593K4371K56781
8366D04159n0721q9689n02718j0495L11873l56567O0582m1353m7319M11074K15550
$$ plain form
8355 304376 330535 195583 418885 690690 311477 73743 265833 577953 485578 121448
8345 121448 -346582 -80625 6223 57108 -43227 10172 206187 -322282 -296939 -35306
8335 -35306 89932 -20395 156741 295641 386942 368359 352275 -154460 -234529 -202656 -135141
8324 -135141 -177156 -102959 -394367 -267265 -167969 -569784 114103 464151 135473 97636
8314 97636 -144592 -463054 26840 346994 288491 183858 251160 251842 35739 -207560 -369808
8303 -369808 -384336 -103980 -102887 -101478 -166421 -174834 -123912 55559 -127471 -261736 30139
8292 30139 118853 93598 -402909 -292371 -383891 -545644 -231337 -665999 -301344 -399416 -402900
8281 -402900 21831 -427626 135068 -11909 -243646 -906970 -853548 -374438 -286214 199247
$$ packed form
8355C04376K6159j34952K23302K71805l79213k37734J92090L12120r2375l64130
8345A21448m68030K65957Q6848N0885j00335N3399J96015n28469K5343K61633
8335c5306J25238j10327J77136J38900R1301j8583j6084n06735q0069L1873O7515
8324a35141m2015P4197k91408J27102R9296m01815O83887L50048l28678l7837
8314I7636k42228l18462M89894L20154n8503j04633O7302O82k16103k43299j62248
8303c69808j4528K80356J093J409o4943q413N0922J79471j83030j34265K91875
8292C0139Q8714k5255m96507J10538r1520j61753L14307m34662L64655r8072l484
8281d02900M24731m49457N62694j46977k31737o63324N3422M79110Q8224M85461
$$ plain form
8271 199247 113370 59929 545630 492581 34629 -137325 -416274 54905 343558 -132473
8261 -132473 -291082 -188858 170855 108806 124137 11429 -190414 -402408 -320467 -288415
8251 -288415 -113973 4560 -12285 207342 51027 269015 158944 305517 499004 395427
8241 395427 262777 -189519 -562321 -593633 -432315 -156908 -153402 -157369 -279289 -428572 -369089
8230 -369089 -342155 -658238 -471462 -239342 -248530 -432778 -399579 -459657 -200824 -52094 105763
8219 105763 -301652 -319764 -155843 51288 -115087 -549112 -138290 -225560 104806 -184760
8209 -184760 -296606 -405921 -653888 -643373 -280852 -421909 159318 224647 133506 216897
8199 216897 113596 408044 -131567 -47027 -347686 -713045 -2308465 -1726527 30974 106400
$$ packed form
8271A99247q5877n3441M85701n3049m57952j71954k78949M71179K88653m76031
8261a32473j58609J02224L59713o2049J5331j12708k01843k11994Q1941L2052
8251b88415J74442J18533j6845K19627j56315K17988j10071J46573J93487j03577
8241C95427j32650m52296l72802l1312J61318K75407L506l967j21920j49283N9483
8230c69089K6934l16083J86776K32120r188j84248L3199o0078K58833J48730J57857
8219A05763m07415j8112J63921K07131j66375m34025M10822q7270L30366k89566
8209a84760j11846j09315k47967J0515L62521j41057N81227O5329r1141Q3391
8199B16897j03301K94448n39611Q4540l00659l65359j595420N81938J757501P5426
$$ plain form
8189 106400 40115 -390638 3272 83710 -117290 -479570 -247212 37535 62556 -21417
8179 -21417 75474 -129077 -46113 232027 147453 -128470 -588812 -916018 -514903 -485889 -440516
8168 -440516 -237376 123168 696944 -19177 -120175 36190 -157923 -338812 -147773 -152861
8158 -152861 -339169 -284265 -3796 -160718 -62804 -547471 -709737 -483576 -407351 39683
8148 39683 -33594 -325243 -309924 -142925 98368 -118696 -161231 -46601 96438 220067
8138 220067 -377488 -86959 -385541 -146328 324860 68780 318007 -70044 -427499 -48421
8128 -48421 83785 -275566 -444891 -596645 -389054 -89378 -88577 -411484 -641165 -160865
8118 -160865 -119363 -532977 -458664 -662397 -482728 -481048 -350644 -120048 243658 37647
$$ packed form
8189A06400o6285m30753L93910Q0438k01000l62280K32358K84747K5021q3973
8179b1417R6891k04551Q2964K78140q4574k75923m60342l27206M01115K9014M5373
8168d40516K03140L60544N73776p16121j00998J56365j94113j80889J91039n088
8158a52861j86308N4904K80469j56922R7914m84667j62266K26161P6225M47034
8148C9683p3277k91649J5319J66999K41293k17064m2535J14630J43039J23629
8138B20067n97555K90529k98582K39213M71188k56080K49227l88051l57455L79078
8128d8421J32206l59351j69325j51754K07591K99676Q01l22907k29681M80300
8118a60865M1502m13614P4313k03733J79669J680J30404K30596L63706k06011
$$ plain form
8108 37647 -250660 -194960 -118531 -179778 -519434 -778489 -670456 -557325 -337994 -197463
8098 -197463 -167503 -144307 -309203 -152941 -217196 -415041 -107788 -198374 -132165 -35584 -627486
8087 -627486 -637588 -308486 -122255 -423073 -368091 -362533 -299229 -691520 -675591 -512415 -360887
8076 -360887 -390000 -250908 -76406 50057 -56053 -432087 -634216 -633678 -212127 -134929 -233794
8065 -233794 -473514 -312729 -549159 -832181 -232916 -18164 89030 52483 -53264 -420263
8055 -420263 -649514 -84940 -65563 -302659 121472 223608 -16962 -197244 -330564 73403
8045 73403 -56359 -132163 103111 -197163 -285495 -659183 -302345 41054 85978 -265492
8035 -265492 -332636 -10287 -386097 -763907 -499120 -371922 -606772 -204335 -306652 -403661
$$ packed form
8108C7647k88307N5700P6429o1247l39656k59055J08033J13131K19331J40531
8098a97463K9960K3196j64896J56262o4255j97845L07253r0586O6209R6581n91902
8087f27486j0102L29102J86231l00818N4982N558O3304l92291J5929J63176J51528
8076c60887k9113J39092J74502J26463j06110l76034k02129N38M21551P7198r8865
8065b33794k39720J60785k36430k83022N99265K14752J07194l6547j05747l66999
8055d20263k29251N64574J9377k37096M24131J02136k40570j80282j33320M03967
8045G3403j29762p5804K35274l00274q8332l73688L56838L43399M4924l51470
8035b65492o7144L22349l75810l77810K64787J27198k34850M02437j02317r7009
$$ plain form
8025 -403661 -115032 -15374 -80315 -455404 -212251 -28054 -225049 -380008 -846796 -345937
8015 -345937 -199098 -408921 -294696 -147190 -350805 1586 33528 -14824 190063 -169258
8005 -169258 -262321 -383138 -450291 -790636 -496921 253661 -14836 -49814 71269 -228469
7995 -228469 134515 -361343 -423944 -42448 -280407 -300279 132386 -530399 -585238 -855972
7985 -855972 -546041 -91935 -140497 -663413 -756825 -128699 -127221 -207983 -18669 -131665 -76060
7974 -76060 -311089 -687290 -272234 -253258 -556168 -469872 -77087 -375165 -507706 -764093
7964 -764093 -439945 -167619 -459758 -189152 -164077 77613 -77875 -426912 -116122 110613
7954 110613 57889 -466633 -155407 -68874 -468648 -577902 -336489 -723990 -130684 -294644
$$ packed form
8025d03661K88629R9658o4941l75089K43153J84197j96995j54959m66788N00859
8015c45937J46839k09823J14225J47506k03615L52391L1942m8352K04887l59321
8005a69258r3063j20817o7153l40345K93715P50582k68497l4978J21083k99738
7995b28469L62984m95858o2601L81496k37959j9872M32665o62785n4839k70734
7985h55972L09931M54106m8562n22916r3412O28126J478q0762J89314j12996N5605
7974g6060k35029l76201M15056J8976l02910Q6296L92785k98078j32541k56387
7964g64093L24148K72326k92139K70606K5075K41690j55488l49037L10790K26735
7954A10613n2724n24522L11226Q6533l99774j09254K41413l87501N93306j63960
$$ plain form
7944 -294644 -261825 -33478 56762 101541 -484954 -679243 -473446 -58245 -262364 -437838
7934 -437838 -240767 -489168 467 -387450 -518138 -7351 54639 25816 123820 49447
7924 49447 -267419 -154405 -370888 -291456 -352341 -410169 -190141 -55173 67244 109053 123521
7913 123521 187970 -103041 133282 18289 -221335 -138728 -593733 -805726 -706802 -108304
7903 -108304 -50196 -232380 -534166 -280421 7854 143163 -201938 -259867 242537 421825
7893 421825 -1108 -255718 -463051 -126505 -108520 -396026 -192058 -212052 -68760 47139
7883 47139 21355 -312935 -340755 -394874 -433847 -276465 234173 -183914 -448474 -109695 -344784
7872 -344784 -388162 -15167 -66307 -387642 -190786 -81671 -575733 -696408 -569870 -80740
$$ packed form
7944b94644L2819K28347R0240M4779n86495j94289K05797M15201k04119j75474
7934d37838J97071k48401M89635l87917j30688N10787O1990k8823R8004p4373
7924D9447l16866J13014k16483P9432o0885n7828K20028J34968J22417M1809J4468
7913A23521O4449k91011K36323j14993k39624Q2607m55005k11993R8924N98498
7903a08304N8108j82184l01786K53745K88275J35309l45101n7929N02404J79288
7893D21825m22933k54610k07333L36546J7985k87506K03968j9994J43292J15899
7883D7139k5784l34290k7820n4119l8973J57382N10638m18087k64560L38779k35089
7872c44784m3378L72995n1140l21335J96856J09115m94062j20675J26538M89130
$$ plain form
7862 -80740 575957 493671 27752 27424 -307550 -287572 -191010 -220778 -219641 27082 -275713
7851 -275713 -166142 -186232 -196134 29906 223869 201092 -12089 -232716 -105748 452006
7841 452006 294226 62248 117780 -238463 -460319 -417228 -556484 -247506 8222 166870
7831 166870 -113495 -434390 -281549 -50564 -104257 -366394 -286373 -129669 46149 -146103
7821 -146103 -206091 -80752 146348 -75985 -465313 -327728 -56381 160586 -453886 -715215
7811 -715215 -336362 35215 -7082 36043 76265 776936 -107858 -727112 -796382 -704624 -307204
7800 -307204 2212 174191 -240453 -65824 -410286 -405202 -494185 -437684 -694989 -475491
7790 -475491 -268119 -140092 -146646 131785 -454026 -574107 -77992 -398 -606884 -223289
$$ packed form
7862h0740O56697q2286m65919l28l34974J9978R6562k9768J137K46723l02795
7851b75713J09571k0090r902K26040J93963k2777k13181k20627J26968N57754
7841D52006j57780k31978N5532l56243k21856M3091j39256L08978K55728J58648
7831A66870k80365l20895J52841K30985n3693k62137Q0021J56704J75818j92252
7821a46103n9988J25339K27100k22333l89328J37585K71347K16967o14472k61329
7811g15215L78853L71577m2297M3125M0222P00671q84794o19254o9270R1758L97420
7800c07204L09416J71979m14644J74629l44462N084q8983N6501k57305K19498
7790d75491K07372J28027o554K78431n85811j20081M96115P7594o06486L83595
$$ plain form
7780 -223289 -281321 -348596 -458222 -298287 -191972 -158821 257748 348714 363105 178439 302272
7769 302272 -119132 -46695 -85440 -306902 -60465 -45162 -316897 -347535 -59095 410007
7759 410007 -14857 -117485 243221 275077 226400 13764 389832 270858 103300 -146284
7749 -146284 57712 67436 79311 137812 -26024 272859 94733 261121 50788 118275 62773
7738 62773 -30980 -68076 140127 30075 25393 -355612 -206367 -12105 113322 127765 121961
7727 121961 295444 -37080 -272802 -383226 -461343 143954 -448758 -518167 -159145 -33724
7717 -33724 -57792 -101398 -67340 47115 56805 -4133 65393 -146644 -393905 205630 -254275
7706 -254275 -505111 -315657 -422118 -192368 -237845 -317367 -470 -171019 -46114 -15806
$$ packed form
7780b23289n8032o7275j09626J59935J06315L3151M16569R0966J4391j84666J23833
7769C02272m21404P2437l8745k21462K46437J5303k71735l0638K88440M69102
7759D10007m24864j02628L60706L1856m8677k12636L76068j18974j67558k49584
7749a46284K03996R724J1875N8501j63836K98883j78126J66388k10333O7487n5502
7738F2773r3753l7096K08203j10052m682l81005J49245J94262J25427J4443n804
7727A21961J73483l32524k35722j10424p8117O05297n92712o9409L59022J25421
7717c3724k4068m3606L4058J14455R690o0938O9526k12037k47261N99535m59905
7706b54275k50836J89454j06461K29750m5477p9522L16897j70549J24905L0308
$$ plain form
7696 -15806 -129514 -260770 -499729 -309548 -259749 -223065 -415918 -752537 -92313 68988
7686 68988 -213485 -432971 -92735 121114 -385222 -274197 122538 78251 -123623 -96463
7676 -96463 37632 130634 -151 -154323 -263978 -174137 -94150 -382204 -890584 -376750
7666 -376750 -153763 -77225 99593 28383 -49166 -2240 61040 -201229 -728724 -683068 -506028
7655 -506028 -187627 -462701 -344561 -462280 -480900 -338516 73492 -177141 -273744 -227890
7645 -227890 85655 -321016 -394483 -331144 -139639 -84289 97159 -202209 -465234 154745
7635 154745 343658 229118 -6091 -317292 -449976 -385671 -458288 -562292 -631415 -477148
7625 -477148 -383889 -197111 -229332 -117752 91866 356094 -82444 -331080 -132577 -349324
$$ packed form
7696a5806j13708j31256k38959J90181M9799L6684j92853l36619O60224J61301
7686F8988k82473k19486L40236K13849n06336J11025L96735m4287k01874K7160
7676i6463J34095R3002j30785j54172j09655Q9841P9987k88054n08380N13834
7666c76750K22987P6538J76818p1210p7549M6926O3280k62269n27495M5656J77040
7655e06028L18401k75074J18140j17719j8620J42384M12008k50633r6603M5854
7645b27890L13545m06671p3467O3339J91505N5350J81448k99368k63025O19979
7635A54745J88913j14540k35209l11201j32684O4305p2617j04004o9123J54267
7625d77148R3259J86778l2221J11580K09618K64228m38538k48636J98503k16747
$$ plain form
7615 -349324 -319598 -517777 -431409 -365753 -426398 -363003 -367449 203871 222734 97581 265909
7604 265909 321179 180589 133119 -259796 -504750 -122119 -30272 -332343 15223 -108711
7594 -108711 244936 91551 78033 432357 -370681 -184922 7924 -513715 -454290 -535948
7584 -535948 -425616 -195161 -25691 -177850 -200148 -225020 -120148 213439 -138173 -88435
7574 -88435 -546466 -518514 -453973 101725 -239174 -332023 -280741 -102434 193073 -367998 -254961
7563 -254961 255890 799891 430320 466386 365607 -87229 -100651 -110194 -146674 -151905 -164791
7552 -164791 -5957 -272518 -228634 -66644 -390036 -268688 -178019 347468 239266 -143660
7542 -143660 -379801 -509910 -722303 -398404 -477332 -306869 -164865 -473896 -23934 4229
$$ packed form
7615c49324K9726j98179Q6368O5656o0645O3395m446N71320J8863j25153J68328
7604B65909N5270j40590m7470l92915k44954L82631R1847l02071L47566j23934
7594a08711L53647j53385j3518L54324q03038J85759J92846n21639N9425q1658
7584e35948J10332K30455J69470j52159k2298k4872J04872L33587l51612M9738
7574h8435m58031K7952O4541N55698l40899r2849N1282J78307K95507n61071J13037
7563b54961N10851N44001l69571L6066j00779m52836j3422r543l6480n231j2886
7552a64791J58834k66561M3884J61990l23392J21348R0669N25487j08202l82926
7542a43660k36141j30109k12393L23899p8928J70463J42004l09031M49962K8163
$$ plain form
7532 4229 -230633 -223301 -306652 131188 442641 208162 238502 265600 -72327 -40845 159213
7521 159213 -315052 -533475 -219251 -64133 -30659 -218714 -269249 -223585 -511886 -154077
7511 -154077 -419222 -56830 41319 21437 110891 149318 -40311 -115263 -234582 27483 -350893
7500 -350893 -287088 -150483 -120548 -179103 -19632 244420 142110 -199263 -182853 -389117
7490 -389117 -59986 580929 143433 51588 184600 17 29875 64199 -188475 -191239 24155
7479 24155 493327 348302 75237 -112142 -9367 7063 395665 98367 -345567 -325792
7469 -325792 -254781 431391 268654 -212572 -591082 -627033 -477804 -724794 -678500 -333914
7459 -333914 -360651 52101 -271154 -594869 -468045 -204327 242906 142908 -56945 -173101
$$ packed form
7532D229k34862P332q3351M37840L11453k34479L0340K7098l37927L1482K00058
7521A59213m74265k18423L14224J55118L3474j88055n0535M5664k88301L57809
7511a54077k65145L62392R8149j9882Q9454L8427j89629p4952j19319K62065l78376
7500c50893O3805J36605K9935n8555J59471K64052j02310l41373J6410k06264
7490c89117L29131O40915m37496r1845J33012j84583K9858L4324k52674k764K15394
7479B4155M69172j45025k73065j87379J02775J6430L88602k97298m43934J9775
7469c25792P1011O86172j62737m81226l78510l5951J49229k46990M6294L44586
7459c33914k6737M12752l23255l23715J26824K63718M47233r9998j99853j16156
$$ plain form
7449 -173101 -198116 158206 123646 81993 -164208 -192639 174866 -205727 152397 220340 -131248
7438 -131248 -328404 -168213 268714 263021 -45899 -272152 -639031 -772541 -835888 -969461
7428 -969461 -625339 -696649 -782418 -617772 -764677 -292965 -25794 -706288 -516245 -607216
7418 -607216 -878977 -149052 -165866 -489442 -668673 -404863 -259157 -395951 -244238 -202550
7408 -202550 -155537 264400 388223 64694 -255123 -34493 199518 276527 228910 198194
7398 198194 -423888 -154762 -66641 -156406 -715470 -746760 97954 239318 29884 202150
7388 202150 115189 224820 237454 366572 -62863 -64234 141224 -3009 -71669 -682921 -980385
7377 -980385 -887485 -240735 195861 144075 -64476 -61486 -90338 -274867 -135568 -143896 63790
$$ packed form
7449a73101k5015L56322l4560m1653k46201k8431L67505l80593L58124O7943l51588
7438a31248j97156J60191M36927n693l08920k26253l66879j33510o3347j33573
7428i69461L44122p1310q5769J64646j46905M71712K67171o80494J90043r0971
7418f07216k71761P29925j6814l23576j79231K63810J45706j36794J51713M1688
7408b02550M7013M19937J23823l23529l19817K20630K34011P7009m7617l0716
7398A98194o22082K69126Q8121q9765n59064l1290Q44714J41364k09434J72266
7388B02150q6961J09631J2634J29118m29435j371K05458j44233o8660o11252k97464
7377i80385R2900O46750M36596n1786k08551K990k8852j84529J39299q328K07686
$$ plain form
7366 63790 -48190 198091 174452 11202 282194 405671 722914 672703 265163 84289
7356 84289 212895 420983 360465 345558 323132 184379 81025 -289076 -344170 -294803 321137
7345 321137 420054 236873 91202 65509 -22509 277628 -281538 -807466 -927890 -376331
7335 -376331 -320039 -381658 -679277 -429968 -209029 -458747 -271486 111948 235129 91787
7325 91787 60286 11739 171636 71511 175739 37185 143299 18858 -607522 -298735
7315 -298735 -202603 -355048 -397410 -418212 -366598 -79411 -345499 -560900 10287 -11679 -146812
7304 -146812 -646294 -422288 -274781 63908 118862 94333 -109614 -243808 -140860 -169359
7294 -169359 -161911 120 436469 513679 -269551 -163456 87196 283494 366108 -158671
$$ packed form
7366F3790j11980K46281k3639j63250K70992J23477L17243n0211m07540j80874
7356H4289J28606K08088o0518j4907k2426j38753j03354l70101n5094M9367O15940
7345C21137R8917j83181j45671k5693q8018L00137n59166n25928j20424N51559
7335c76331N6292o1619k97619K49309K20939k49718J87261L83434J23181j43342
7325I1787l1501m8547J59897j00125J04228j38554J06114j24441o26380L08787
7315b98735R6132j52445m2362k0802N1614K87187k66088k15401N71187k1966j35133
7304a46812m99482K24006J47507L38689N4954k4529k03947j34194J02948k8499
7294a69359P448J62031M36349P7210p83230J06095K50652J96298Q2614n24779
$$ plain form
7284 -158671 -49376 412384 145917 514277 288051 -100210 -233027 -215526 -217353 -498658
7274 -498658 -385660 -359225 -23593 137871 229259 211344 -183536 -558020 -306590 300612
7264 300612 57819 -548017 -351075 -544971 -404987 -394343 74191 -110056 -174536 70171
7254 70171 257330 177349 193875 -119417 21733 -5665 -67074 -280188 -343518 -409011 -271900
7243 -271900 -618753 -436062 -432460 -677815 -409875 -84811 -98726 146773 225777 194355 -117184
7232 -117184 3683 223032 90948 36382 -64666 33963 47361 -135978 -202321 -254041 -203956
7221 -203956 108122 7413 30862 -32929 -82768 355298 619859 280465 215844 -94802
7211 -94802 -57933 -56331 255355 76441 -220836 -278555 -302523 -193992 -471184 -207266 134287
$$ packed form
7284a58671J09295M61760k66467L68360k26226l88261j32817J7501j827k81305
7274d98658J12998K6435L35632J61464R1388j7915l94880l74484K51430O07202
7264C00612k42793o05836J96942j93896J39984J0644M68534j84247o4480K44707
7254G0171J87159p9981J6526l13292J41150k7398o1409k13114o3330o5493J37111
7243b71900l46853J82691L602k45355K67940L25064j3915K45499P9004l1422l11539
7232a17184J20867K19349j32084n4566j01048R8629J3398j83339o6343n1720N0085
7221b03956L12078j00709K3449o3791m9839M38066K64561l39394o4621l10646
7211i4802L6869J602L11686j78914k97277n7719k3968J08531k77192K63918L41553
$$ plain form
7200 134287 -76817 -20638 -323663 -95456 -28233 -51497 -214065 -470521 -274772 -139924
7190 -139924 -210457 59282 43666 317561 -17877 -400404 -667905 -64190 236991 141524
7180 141524 479 -234800 -211917 28822 63307 -94766 -268570 -386621 -590110 -546988
7170 -546988 -107722 -75687 -176198 -491144 -648605 -484857 -45129 122471 -107386 398590
7160 398590 348965 106209 -4387 137203 257427 576797 802728 137145 -288857 -271653
7150 -271653 -371858 -613967 -517699 -566501 -464846 -482218 -668123 -185886 417432 233893
7140 233893 -372537 -527456 -449041 -499765 -575998 -359837 -62336 -515253 -267111 324242
7130 324242 422622 421476 615479 297669 -95358 -252767 -185301 455596 322099 159880
$$ packed form
7200A34287k11104N6179l03025K28207O7223k3264j62568k56456J95749J34848
7190a39924p0533K69739j5616K73895l35438l82527k67501O03715L01181r5467
7180A41524j41045k35279K2883K40739L4485j58073j73804j18051k03489M3122
7170e46988M39266L2035j00511l14946j57461J63748M39728J67600k29857N05976
7160C98590m9625k42756j10596J41590J20224L19370K25931o65583m26002J7204
7150b71653j00205k42109R6268m8802J01655j7372j85905M82237O03318j83539
7140B33893o06430j54919P8415n0724p6233K16161K97501m52917K48142N91353
7130C24242R8380j146J94003l17810l93027j57409O7466O40897j33497j62219
$$ plain form
7120 159880 -3248 44852 -39256 -40959 372870 -53657 -96301 -304075 125240 275694 -151977
7109 -151977 -24451 390321 50909 194404 230298 297058 491379 -45071 -410119 33643
7099 33643 -280516 -574655 -282709 -605186 -204279 -10540 228481 137471 28639 -308828
7089 -308828 -476040 -293108 -166269 181770 70715 -334516 -491729 132079 163978 193520
7079 193520 262871 219111 695368 276882 385432 414641 -183215 -552502 102200 423937
7069 423937 238355 -301689 -79364 -116157 -171754 -114796 -194048 79115 341853 333674 487794
7058 487794 10167 -498638 -49217 -324757 -132346 -29141 356584 289008 309079 129415
7048 129415 210592 32724 -420026 -481546 39322 -68714 -463083 -141850 323287 366139
$$ packed form
7120A59880j63128M8100q4108j703M13829m26527m2644k07774M29315J50454m27671
7109a51977J27526M14772l39412J43495L5894O6760J94321n36450l65048M43762
7099C3643l14159k94139K91946l22477M00907J93739K39021r1010j08832l37467
7089c08828j67212J82932J26839L48039j11055m05231j57213O23808L1899K9542
7079A93520O9351m3760M76257m18486J08550K9209n97856l69287O54702L21737
7069D23937j85582n40044K22325l6793n5597N6958p9252K73163K62738q179J54120
7058D87794m77627n08805M49421k75540J92411J03205L85725o7576K0071j79664
7048A29415Q1177j77868m52750o1520N20868j08036l94369L21233M65137M2852
$$ plain form
7038 366139 126080 192326 758454 674826 194557 99777 -513225 -100600 27342 38217
7028 38217 -27363 -182944 -9271 -521210 -233164 251286 657211 395837 26633 -378600
7018 -378600 31493 -3088 6191 -80607 160416 82160 289633 92232 -505772 -638880 -514881
7007 -514881 -213207 68876 441654 566290 326184 392633 -79678 -524339 -287870 -532271
6997 -532271 -391876 -50386 -24635 -18700 321417 150922 44102 -186933 -440856 -249208
6987 -249208 261287 -130386 -255604 -337654 -272641 -48647 -57897 -278419 -540255 -504039 -207015
6976 -207015 89812 144715 2516 -107252 -170352 -250036 -116578 -285067 -486208 -340938
6966 -340938 -91971 -253746 -432012 -17363 41014 -222791 -309308 -483908 -257152 -150525
$$ packed form
7038C66139k40059O6246N66128q3628m80269r4780o13002M12625J27942J0875
7028C8217o5580j55581J73673n11939K88046M84450M05925k61374l69204m05233
7018c78600M10093l4581R279q6798K41023p8256K07473j97401n98004j33108J23999
7007e14881L01674K82083L72778J24636k40106O6449m72311m44661K36469k44401
6997e32271J40395L41490K5751N935L40117j70495j06820k31035k53923J91648
6987b49208N10495l91673j25218q2050O5013K23994r250k20522k61836L6216K97024
6976b07015K96827N4903j42199j09768o3100p9684J33458j68489k01141J45270
6966c40938K48967j61775j78266M14649N8377k63805q6517j74600K26756J06627
$$ plain form
6956 -150525 -382697 -192043 68803 49271 551257 1081429 637668 444500 67759 723175
6946 723175 654488 542096 460752 661040 512463 707173 717160 1119541 475003 323725
6936 323725 591253 682781 602946 147422 306560 280819 347438 -93881 -18323 306229 320786
6925 320786 -66856 49063 66886 149121 17454 -108867 -403663 -174700 156576 -324356
6915 -324356 -98848 19762 123825 -111207 -79844 91774 19478 55826 -231660 -400422
6905 -400422 -364020 -160063 -82333 124213 245068 156242 -460298 -89012 125520 -401753
6895 -401753 -303616 -577723 -591045 -94078 61385 333872 216696 -49551 -438187 -284861
6885 -284861 -266787 132649 -16653 -125283 241556 -333457 -445977 -402301 -465746 -393021
$$ packed form
6956a50525k32172J90654K60846j9532N01986N30172m43761j93168l76741O55416
6946G23175o8687j12392q1344K00288j48577J94710R987M02381o44538j51278
6936C23725K67528R1528p9835m55524J59138k5741O6619m41319P5558L24552J4557
6925C20786l87642J15919J7823Q2235j31667j26321k94796K28963L31276m80932
6915c24356K25508J18610J04063k35032L1363J71618p2296L6348k87486j68762
6905d00422L6402K03957P7730K06546J20855q8826o16540L71286K14532n27273
6895d01753R8137k74107j3322M96967J55463K72487j17176k66247l88636J53326
6885b84861J8074L99436j49302j08630L66839n75013j12520M3676o3445P2725
$$ plain form
6875 -393021 -226954 -97262 211263 138358 -36329 74436 -170435 -211201 281295 -275301
6865 -275301 -514562 -321600 -179501 -146730 -382999 -236839 51795 71923 -1491 376562
6855 376562 -217903 -130431 151 -25154 92166 -60027 -222028 -475011 -191403 -344038
6845 -344038 -217246 -47421 -258898 -41587 -160136 -117028 -129233 82662 -138047 -63507
6835 -63507 -175843 -108878 -306965 -452415 -56944 -16292 -219459 -553580 -331006 -375560
6825 -375560 -388046 -285977 -73787 94200 -21610 -405111 -56713 -172668 -134587 -5255
6815 -5255 248192 767028 418056 253446 -144541 -282439 106227 319933 -51666 -319999
6805 -319999 -315526 216935 682874 584236 112413 316257 206255 -196572 21475 34532
$$ packed form
6875c93021J66067J29692L08525p2905j74687J10765k44871m0766M92496n56596
6865b75301k39261J92962J42099L2771k36269J46160K88634K0128p3414L78053
6855C76562n94465Q7472J30582k5305J17320j52193j62001k52983K83608j52635
6845c44038J26792J69825k11477K17311j18549M3108j2205K11895k20709P4540
6835f3507j12336O6965j98087j45450L95471M0652k03167l34121K22574m4554
6825c75560j2486J02069K12190J67987j15810l83501L48398j15955L8081J29332
6815e255K53447N18836l48972j64610l97987j37898L88666K13706l71599k68333
6805c19999M473N32461M65939r8638m71823K03844j10002m02827K18047J3057
$$ plain form
6795 34532 -245681 -165450 -72090 -351713 -730239 -1007368 -358313 29389 -481911 -288704
6785 -288704 -235979 -315747 -182215 -167903 -2355 -114724 -54530 81133 60459 6694 -384276
6774 -384276 -395319 -283849 223405 661845 514832 -76242 -321650 120358 4828 -364774
6764 -364774 -266551 45865 304880 -24731 -550604 -272736 -107227 -14469 94419 54855
6754 54855 95123 16207 -25588 -159360 111561 34910 -53090 224708 -3985 163515 224657
6743 224657 -176133 -20533 139104 -405792 -156202 318447 410279 -188206 194214 329868
6733 329868 249397 349787 -210442 -361401 -119858 -148449 -289870 -107611 -270754 -144517
6723 -144517 -3675 -185711 -292530 -306111 -261614 -178922 80426 -201654 -114817 -21256 347165
$$ packed form
6795C4532k80213Q0231R3360k79623l78526k77129O49055L87702n11300J93207
6785b88704N2725p9768J33532J4312J65548j12369O0194J35663k0674n3765l90970
6774c84276j1043J11470N07254M38440j47013n91074k45408M42008j15530l69602
6764c64774R8223L12416K59015l29611n25873K77868J65509R2758J08888l9564
6754E4855M0268p8916m1795j33772K70921p6651q8000K77798k28693J67500O1142
6743B24657m00790J55600J59637n44896K49590M74649R1832n98485L82420J35654
6733C29868q0471J00390n60229j50959K41543k8591j41421J82259j63143J26237
6723a44517J40842j82036j06819j3581M4497Q2692K59348k82080Q6837R3561L68421
$$ plain form
6712 347165 148674 -94316 -478703 -247208 105830 370891 525948 153025 -95568 -251003
6702 -251003 -330313 88795 -190984 -178082 95957 489659 608550 115403 49399 -123382
6692 -123382 -260434 -236056 -114313 -105945 -16878 -167501 -306568 -297105 111943 222203 -19206
6681 -19206 197351 377164 278562 35102 -641921 -183885 330231 310352 332517 271939 -104624
6670 -104624 -195025 -426134 -336564 -183897 410682 461693 268766 -102224 -176617 65276
6660 65276 -253807 -513680 193961 433428 158897 19736 -344338 -551259 -646103 -197502
6650 -197502 -602721 -378307 -246810 -242708 -133734 -349412 -505046 -194334 -426562 -720561
6640 -720561 -459629 -208823 -246888 -346812 -696028 -305974 -338032 -403123 -6792 177729
$$ packed form
6712C47165j98491k42990l84387K31495L53038K65061J55057l72923k48593j55435
6702b51003p9310M19108k79779J2902K74039L93702J18891m93147o6004j72781
6692a23382j37052K4378J21743Q368Q9067j50623j39067R463M09048J10260k41409
6681a9206K16557J79813r8602k43460o77023M58036N14116j9879K2165o0578l76563
6670a04624r0401k31109Q9570J52667N94579N1011j92927l70990p4393K41893
6660F5276l19083k59873P07641K39467k74531j39161l64074k06921r4844M48601
6650a97502m05219K24414J31497M102J08974k15678j55634L10712k32228k93999
6640g20561K60932K50806l8065r9924l49216L90054l2058o5091L96331J84521
$$ plain form
6630 177729 247485 267084 281798 -296997 212620 96572 -384964 -354419 -4182 118725
6620 118725 -150536 82983 -191234 -151454 -265055 -306105 -278597 -45304 -50020 -244091 42711
6609 42711 -157963 -698791 -821177 -525057 -539897 -608409 -185150 -151718 -728317 -351563
6599 -351563 -389861 190316 379246 523727 -346496 -207283 79463 -113701 114874 -64966
6589 -64966 -178476 -188839 -253793 36030 509342 194415 148986 369020 336516 204062 -122540
6578 -122540 -332357 -322145 -366545 -477101 -277521 -111748 -93874 376982 427874 -144660
6568 -144660 -72559 154040 591884 335456 -73811 -301236 -425364 -430566 -113254 69104
6558 69104 131477 296596 -283223 -143150 -277927 -800591 -381814 -293085 -153573 -174026
$$ packed form
6630A77729O9756J9599J4714n78795N09617j16048m81536L0545L50237J22907
6620A18725k69261K33519k74217L9780j13601m1050K7508K33293m716j94071K86802
6609D2711k00674n40828j22386K96120j4840o8512M23259L3432n76599L76754
6599c51563l8298N80177J88930J44481q70223J39213K86746j93164K28575j79840
6589f4966j13510j0363o4954K89823M73312l14927m5429K20034l2504j32454l26602
6578a22540k09817J0212m4400j10556J99580J65773J7874M70856N0892n72534
6568a44660P2101K26599M37844k56428m09267k27425j24128n202L17312J82358
6558F9104O2373J65119n79819J40073j34777n22664M18777Q8729J39512k0453
$$ plain form
6548 -174026 27772 64999 -236458 256509 12596 -141679 -369613 -297318 -575261 -368994
6538 -368994 -590298 -402765 -369828 -446163 -78741 -137023 -22390 -5293 -25918 1893 655940
6527 655940 68501 70233 -210190 -516399 -26131 -74971 -391405 -473086 -609702 -489138
6517 -489138 83351 41170 306263 30347 5114 -505473 -521954 -393913 -154330 -150756 -27379
6506 -27379 46048 -174693 71916 -422142 -414064 107329 177504 56220 214978 97899 87800
6495 87800 -10669 6048 95886 -192230 107353 133434 248997 256512 272238 -96207 -170398
6484 -170398 49232 36602 205745 200349 -148025 -215657 -82145 166650 135932 -217378 71022
6473 71022 299945 114535 254378 707585 492972 99575 -48455 -40011 205545 273768
$$ packed form
6548a74026K01798L7227l01457M92967k43913j54275k27934P2295k77943K06267
6538c68994k21304J87533L2937p6335L67422n8282J14633J7097k0625K7811O54047
6527F55940n87439J732k80423l06209M90268m8840l16434q1681j36616J20564
6517d89138N72489m2181K65093k75916k5233n10587j6481J28041K39583L574J23377
6506b7379P3427k20741K46609m94058Q078N21393P0175j21284J58758j17079j0099
6495H7800r8469J6717Q9838k88116K99583K6081J15563P515J5726l68445p4191
6484a70398K19630j2630J69143n396l48374o7632J33512K48795l0718l53310K88400
6473G1022K28923j85410J39843M53207k14613l93397j48030Q444K45556O8223
$$ plain form
6463 273768 -113967 -406183 -423068 -331079 6239 121898 -437420 -982830 -891857 -674351
6453 -674351 -342248 -310035 -547262 -411716 87916 -281324 -84311 142942 -18551 -33358
6443 -33358 -298452 -415374 -165535 61511 297613 26326 -121915 -191643 159436 525347
6433 525347 174651 258862 48568 -44417 145163 131207 245830 -27207 -205841 -142905
6423 -142905 141833 112117 5258 485570 356103 97577 279860 238930 -54141 -410902
6413 -410902 -222107 -25374 -472755 16096 -384088 -197909 -328101 -45144 271007 -38422
6403 -38422 -469563 -199954 -292958 -294157 -112062 -668776 -439721 -117891 138796 368225
6393 368225 74855 -68948 303442 523628 156256 -269333 155581 -6142 -204345 -296746
$$ packed form
6463B73768l87735k92216j6885R1989L37318J15659n59318n45410R0973K17506
6453f74351L32103L2213k37227J35546M99632l69240J97013K27253j61493j4807
6443c3358k65094j16922K49839K27046K36102k71287j48241o9728L51079L65911
6433E25347l50696Q4211k10294r2985J89580j3956J14623k73037j78634O2936
6423a42905K84738k9716j06859M80312j29467k58526J82283m0930k93071l56761
6413d10902J88795J96733m47381M88851m00184J86179j30192K82957L16151l09429
6403c8422m31141K69609r3004j199J82095n56714K29055L21830K56687K29429
6393C68225k93370j43803L72390K20186l67372m25589M24914j61723j98203r2401
$$ plain form
6383 -296746 -243025 -99480 -313357 -389578 -567283 -1028611 -1169211 -545776 -152088 -351870
6373 -351870 -583470 -417246 -427190 -317433 -462209 -385779 -187822 -851819 -471228 -172831
6363 -172831 -172710 -273999 -134231 339485 72482 -75182 -59433 -60844 -336464 -216509 -19154
6352 -19154 -123177 -363237 -19491 -119716 -125630 -501887 -410181 -97946 -66264 59020 -342206
6341 -342206 -178253 107577 -116614 306056 438762 432944 387421 263100 29100 -9436
6331 -9436 142331 -122034 -200094 -108875 -400799 -84128 -178054 -27707 -303085 -833917 -681525
6320 -681525 -306131 -482060 -439163 -306372 -441882 -254139 -116504 185514 79769 227029
6310 227029 -415346 -406333 -135298 -101585 299003 171226 65156 101499 -576842 -113819
$$ packed form
6383b96746N3721J43545k13877p6221j77705m61328j40600O23435L93688j99782
6373c51870k31600J66224r944J09757j44776P6430J97957o63997L80591K98397
6363a72831J21j01289J39768M73716k67003j47664J5749j411k75620J19955J97355
6352a9154j04023k40060L43746j00225n914l76257R1706L12235L1682J25284m01226
6341c42206J63953K85830k24191M22670J32706n818m5523j24321k34000l8536
6331i436J51767k64365p8060R1219k91924L16671r3926J50347k75378n30832J52392
6320f81525L75394j75929M2897J32791j35510J87743J37635L02018j05745J47260
6310B27029o42375R013K71035L3713M00588j27777j06070L6343o78341M63023
$$ plain form
6300 -113819 556761 322522 -341530 -58265 -33531 -225232 -598766 -266518 -510451 -340227
6290 -340227 -326343 -312509 -36374 -24353 -169702 83354 76738 229720 509222 217448 320192
6279 320192 -175582 -197983 -129462 -359387 -241103 83080 627428 452906 273444 165458
6269 165458 191138 -81803 -135960 -662493 51310 86583 -106956 132299 -313330 -685527
6259 -685527 -737672 -488102 -34875 154486 -209642 -317659 -412987 -517758 -314634 -291285
6249 -291285 -545801 -355161 -307602 97446 182860 -223314 -505391 13231 159390 172592
6239 172592 38690 240089 -208912 -67509 -126962 309477 255735 625137 573391 237775
6229 237775 267056 -57459 78406 -24520 417146 245429 16383 381324 307026 316453
$$ packed form
6300a13819O70580k34239o64052K83265K4734j91701l73534L32248k43933J70224
6290c40227J3884J3834K76135J2021j45349K53056o616J52982K79502k91774J02744
6279C20192m95774k2401O8521k29925J18284L24183N44348j74522j79462j07986
6269A65458K5680k72941n4157n26533P13803L5273j93539K39255m45629l72197
6259f85527n2145K49570M53227J89361l64128j08017r5328j04771K03124K3349
6249b91285k54516J90640M7559M05048Q5414m06174k82077N18622J46159J3202
6239A72592j33902K01399m49001J41403n9453M36439n3742L69402n1746l35616
6229B37775K9281l24515J35865j02926M41666j71717k29046L64941p4298R427
$$ plain form
6219 316453 179869 186795 166737 96349 323810 340439 116527 -34388 -33223 131530 189175
6208 189175 84604 269157 -296409 -27735 223966 144203 239507 -162633 -75600 -181031
6198 -181031 174530 23761 -190830 -204535 78465 167136 -81243 106819 109779 -128754
6188 -128754 -50142 217479 401486 525989 184468 -107989 -277607 67416 -135734 -204949
6178 -204949 137676 37058 19678 -260986 -433702 -303545 -234888 -295907 -384154 -38280
6168 -38280 -57302 -137530 -339857 -74895 209081 -198983 -167608 -314010 -20088 204558
6158 204558 -72004 7494 383994 72724 60683 -34500 -408421 -102306 -116974 -170470 -553807
6147 -553807 -496758 -40792 27866 12058 -182085 -141458 112637 -214668 -427598 -195888
$$ packed form
6219C16453j36584O926k0058p0388K27461J6629k23912j50915J165J64753N7645
6208A89175j04571J84553n65566K68674K51701p9763R5304m02140Q7033j05431
6198a81031L55561j50769k14591j3705K83000Q8671k48379J88062K960k38533
6188a28754P8612K67621J84007J24503l41521k92457j69618L45023k03150o9215
6178b04949L42625j00618j7380k80664j72716J30157O8657o1019q8247L45874
6168c8280j9022q0228k02327K64962K83976m08064L1375j46402K93922K24646
6158B04558k76562P9498L76500l11270j2041r5183l73921L06115j4668n3496l83337
6147e53807N7049M55966O8658j5808j94143M0627K54095l27305k12930K31710
$$ plain form
6137 -195888 -217923 -351724 -229398 -166742 104270 33019 -345325 -478443 34845 -113115
6127 -113115 -248799 129208 -117414 -459713 49271 187767 -18479 98796 194590 83272
6117 83272 648 25288 -171824 -205668 -96646 -121113 -62838 9201 73579 -29860 -132968
6106 -132968 -305638 -460799 -311213 -531165 -412158 -628734 -88403 -86780 -343251 -91704
6096 -91704 -270976 197368 272176 -186435 99852 201780 -22898 -124191 351712 310211
6086 310211 267315 173267 191088 -4855 -94688 49437 -276207 -384761 114427 266461
6076 266461 222069 370449 -78475 -283639 -383330 -140257 99741 -109341 91333 -5268
6066 -5268 -99033 -287601 -204400 -26478 -30942 -63762 -4199 51996 -204866 94271 215516
$$ packed form
6137a95888k2035j33801J22326O2656K71012p1251l78344j33118N13288j47960
6127a13115j35684L78007k46622l42299N08984J38496k06246J17275R5794j11318
6117H3272q2624K4640j97112l3844J09022k4467N8275P2039O4378j03439j03108
6106a32968j72670j55161J49586k19952J19007k16576N40331J623k56471K51547
6096i1704j79272M68344P4808m58611K86287J01928k24678j01293M75903m1501
6086C10211m2896r4048J7821j95943q9833J44125l25644j08554M99188J52034
6076B66461m4392J48380m48924k05164r9691K43073K39998k09082K00674r6601
6066e268r3765j88568Q3201J77922m464l2820N9563N6195k56862K99137J21245
$$ plain form
6055 215516 334353 495201 259707 140883 68645 -71525 -224293 303487 -7837 -192168
6045 -192168 409410 122880 185858 380573 -5555 -272036 -190857 -342213 -281071 -232264
6035 -232264 116459 -360104 -382698 -333550 -249564 -86437 -214651 -406164 87577 336646
6025 336646 -43981 -77007 284320 296675 432596 -16458 -25129 45444 365140 207415 53832
6014 53832 103399 165974 218080 1157 269288 -245819 -101452 -321221 -499309 -738227
6004 -738227 -633549 -243732 29516 189981 -82189 -415765 12838 194769 -34146 -17652
5994 -17652 476658 244244 331862 723039 198161 338869 192658 23585 356065 428844
5984 428844 252685 38307 -134470 132337 4998 169481 -160292 -387804 106209 45563
$$ packed form
6055B15516J18837J60848k35494j18824p2238j40170j52768N27780l11324j84331
6045a92168O01578k86530O2978J94715l86128k66481Q1179j51356O1142M8807
6035b32264L48723m76563k2594M9148Q3986J63127j28214j91513M93741K49069
6025C36646l80627l3026L61327J2355J35921m49054q671P0573L19696j57725j53583
6014E3832M9567O2575N2106k16923K68131n15107J44367k19769j78088k38918
6004g38227J04678L89817K73248J60465k72170l33576M28603J81931k28915J6494
5994a7652M94310k32414Q7618L91177n24878J40708j46211j69073L32480P2779
5984D28844j76159k14378j72777K66807j27339J64483l29773k27512M94013o0646
$$ plain form
5974 45563 469 -87805 -91450 180606 -227899 -71149 445062 389492 138811 140208 -244316
5963 -244316 -50543 506412 180068 79184 190417 -316214 -845728 -562082 -281765 -162252
5953 -162252 -145854 12227 148852 -53787 -98520 244900 258154 12744 -128154 -295959
5943 -295959 67733 278156 47857 -34234 -215853 -354089 12689 352187 8857 167198
5933 167198 6852 -128081 -289677 -74305 383499 378295 173750 98991 73918 194581
5923 194581 -197375 -68503 223881 66035 188174 -29737 335953 249281 167712 478687
$$ packed form
5974D5563m5094q8274l645K72056m08505J56750N16211n5570k50681J397l84524
5963b44316J93773N56955l26344j00884J11233n06631n29514K83646K80317J19513
5953a62252J6398J58081J36625k02639m4733L43420J3254k45410j40898j67805
5943b95959L63692K10423k30299q2091j81619j38236L66778L39498l43330J58341
5933A67198j60346j34933j61596K15372M57804n204k04545p4759k5073J20663
5923A94581l91956J28872K92384j57846J22139k17911L65690q6672q1569L10975
$$ [...]
##END NTUPLES=NMR SPECTRUM
##END=
