##TITLE=1H_CA-9243-1
 CDCl3
 8 sc, 
 13.2.2024
##JCAMPDX= 6.0         $$ Bruker NMR JCAMP-DX V2.0
##DATA TYPE= NMR SPECTRUM
##DATA CLASS= NTUPLES
##ORIGIN= UXNMR, Bruker Analytische Messtechnik GmbH
##OWNER= root
$$ XWIN-NMR		Version 3.5
$$ Tue Feb 13 14:51:03 2024 Russian Standard Time (UT+4h)  she@DPX200
##.OBSERVE FREQUENCY= 200.1313
##.OBSERVE NUCLEUS= ^1H
##.ACQUISITION MODE= SIMULTANEOUS
##.ACQUISITION SCHEME= undefined
##.AVERAGES= 8
##.DIGITISER RES= 18
##SPECTROMETER/DATA SYSTEM= spect
##.PULSE SEQUENCE= zg30
##.SOLVENT NAME= CDCl3
##.SHIFT REFERENCE= (INTERNAL, CDCl3, 0, 15.6301)
##AUDIT TRAIL= $$ (NUMBER, WHEN, WHO, WHERE, WHAT)
$$ ##TITLE= Audit trail, XWIN-NMR		Version 3.5
$$ ##JCAMPDX= 5.01
$$ ##ORIGIN= Bruker BioSpin GmbH
$$ ##OWNER= she
$$ F:/spectra/data/she/nmr/H-F/1/pdata/1/auditp.txt
$$ ##AUDIT TRAIL=  $$ (NUMBER, WHEN, WHO, WHERE, WHAT)
(   1,<2024-02-13 14:49:36.21 +0400>,<she>,<DPX200>,
      <created by zg, POWCHK disabled, PULCHK disabled
       configuration hash MD5:
       00 E9 B6 7A A2 85 ED C7 34 08 36 98 17 FE 4E 26
       data hash MD5: 16K
       DE C1 6A 09 5B D1 9C 6F 8C 56 75 11 A5 79 2B 68>)
(   2,<2024-02-13 14:49:38.59 +0400>,<she>,<DPX200>,
      <Start of raw data processing
       efp BC_mod = 2 LB = 0.24 FT_mod = 6 PKNL = 1 PHC0 = -24944.47 PHC1 = 7.0527 SI = 16K 
       data hash MD5: 16K
       9B 8F F0 8D 50 C3 A0 95 AF CF 67 21 B3 EA 1E 7D>)
(   3,<2024-02-13 14:49:55.07 +0400>,<she>,<DPX200>,
      <pk PHC0 = -1.829172 PHC1 = 1.6 
       data hash MD5: 16K
       9E 25 A8 FF 6A 9F E8 EF 86 21 C1 55 FC 7C F9 7B>)
(   4,<2024-02-13 14:49:58.39 +0400>,<she>,<DPX200>,
      <abs ABSG = 5 
       data hash MD5: 16K
       5A 1A BD FC 54 62 CD EE C5 E2 9A EB 30 3D AF 07>)
$$ ##END=
$$ 
$$ hash MD5
$$ A5 E4 A7 4D 2B 2A 2E 3F 3D 72 C5 33 99 77 DA BD
##$RELAX= 
##$RELAX= 
##$RELAX= 
##$RELAX= 
##$RELAX= 
##$RELAX= 
$$ Bruker specific parameters
$$ --------------------------
##$DU= <F:/spectra>
##$EXPNO= 1
##$NAME= <H-F>
##$PROCNO= 1
##$TYPE= <nmr>
##$USER= <she>
##$AMP= (0..31)
100 100 100 100 100 100 100 100 100 100 100 100 100 100 100 100 100 100 
100 100 100 100 100 100 100 100 100 100 100 100 100 100 
##$AQSEQ= 0
##$AQ_mod= 1
##$AUNM= <au_zg>
##$AUTOPOS= <>
##$BF1= 200.13
##$BF2= 200.13
##$BF3= 200.13
##$BF4= 200.13
##$BF5= 200.13
##$BF6= 200.13
##$BF7= 200.13
##$BF8= 200.13
##$BYTORDA= 1
##$CFDGTYP= 0
##$CFRGTYP= 5
##$CHEMSTR= <none>
##$CNST= (0..31)
1 1 145 1 1 1 1 1 1 1 1 1 1 1 1 1 1 1 1 1 1 1 1 1 1 1 1 1 1 1 1 1 
##$CPDPRG= <>
##$CPDPRG1= <>
##$CPDPRG2= <>
##$CPDPRG3= <>
##$CPDPRG4= <mlev>
##$CPDPRG5= <mlev>
##$CPDPRG6= <mlev>
##$CPDPRG7= <mlev>
##$CPDPRG8= <mlev>
##$CPDPRGB= <>
##$CPDPRGT= <>
##$D= (0..31)
0 1.2 0 0 0 0 0 0 0 0.06 0 0.03 0 0 0 0 0.0002 0 0 0 0 0 0 0 0 0 0 0 0 
0 0 0 
##$DATE= 1707821375
##$DBL= (0..7)
120 120 120 120 120 120 120 120 
##$DBP= (0..7)
150 150 150 150 150 150 150 150 
##$DBP07= 0
##$DBPNAM0= <>
##$DBPNAM1= <>
##$DBPNAM2= <>
##$DBPNAM3= <>
##$DBPNAM4= <>
##$DBPNAM5= <>
$$ [...]
##$SUBNAM3= <"">
##$SUBNAM4= <"">
##$SUBNAM5= <"">
##$SUBNAM6= <"">
##$SUBNAM7= <"">
##$SUBNAM8= <"">
##$SUBNAM9= <"">
##$SW= 18.0517328524113
##$SWIBOX= (0..15)
0 0 2 0 0 0 0 0 0 0 0 0 0 0 0 0 
##$SW_h= 3612.71676300578
##$TD= 16384
##$TD0= 1
##$TE= 0
##$TE2= 300
##$TE3= 300
##$TEG= 300
##$TL= (0..7)
0 120 120 120 120 120 120 120 
##$TP= (0..7)
150 150 150 150 150 150 150 150 
##$TP07= 0
##$TPNAME0= <>
##$TPNAME1= <>
##$TPNAME2= <>
##$TPNAME3= <>
##$TPNAME4= <>
##$TPNAME5= <>
##$TPNAME6= <>
##$TPNAME7= <>
##$TPOAL= (0..7)
0.5 0.5 0.5 0.5 0.5 0.5 0.5 0.5 
##$TPOFFS= (0..7)
0 0 0 0 0 0 0 0 
##$TUNHIN= 0
##$TUNHOUT= 0
##$TUNXOUT= 0
##$USERA1= <user>
##$USERA2= <user>
##$USERA3= <user>
##$USERA4= <user>
##$USERA5= <user>
##$V9= 5
##$VALIST= <valist>
##$VCLIST= <CCCCCCCCCCCCCCC>
##$VD= 0
##$VDLIST= <DDDDDDDDDDDDDDD>
##$VPLIST= <PPPPPPPPPPPPPPP>
##$VTLIST= <TTTTTTTTTTTTTTT>
##$WBST= 1024
##$WBSW= 4
##$XGAIN= (0..3)
0 0 0 0 
##$XL= 0
##$YL= 0
##$YMAX_a= 72138
##$YMIN_a= -95375
##$ZGOPTNS= <>
##$ZL1= 120
##$ZL2= 120
##$ZL3= 120
##$ZL4= 120
##$ABSF1= 15.4505
##$ABSF2= -2.60135
##$ABSG= 5
##$ABSL= 3
##$ALPHA= 0
##$AQORDER= 0
##$ASSFAC= 0
##$ASSFACI= 0
##$ASSFACX= 0
##$ASSWID= 0
##$AUNMP= <proc_1d>
##$AZFE= 0.1
##$AZFW= 0.1
##$BCFW= 0
##$BC_mod= 2
##$BYTORDP= 0
##$COROFFS= 0
##$CY= -3
##$DATMOD= 1
##$DC= 0
##$DFILT= <>
##$DTYPP= 0
##$F1P= 0
##$F2P= 0
##$FCOR= 1
##$FTSIZE= 16384
##$FT_mod= 6
##$GAMMA= 0
##$GB= 0
##$INTBC= 1
##$INTSCL= 3.70164e-10
##$ISEN= 128
##$LB= 0.24
##$LEV0= 0
##$LPBIN= 0
##$MAXI= 10000
##$MC2= 0
##$MEAN= 0
##$ME_mod= 0
##$MI= 1.114404
##$NCOEF= 0
##$NC_proc= -8
##$NLEV= 6
##$NOISF1= 3.799351
##$NOISF2= 2.8
##$NSP= 0
##$NTH_PI= 0
##$NZP= 0
##$OFFSET= 15.6301
##$PC= 1
##$PHC0= -24946.3
##$PHC1= 8.6527
##$PH_mod= 1
##$PKNL= yes
##$PPARMOD= 0
##$PSCAL= 0
##$PSIGN= 0
##$REVERSE= no
##$SF= 200.129978306223
##$SI= 16384
##$SIGF1= 3
##$SIGF2= 2
##$SINO= 5.538805
##$SIOLD= 16384
##$SREGLST= <1H.CDCl3>
##$SSB= 0
##$STSI= 16384
##$STSR= 0
##$SW_p= 3612.71676300578
##$SYMM= 0
##$S_DEV= 0
##$TDeff= 16384
##$TDoff= 0
##$TI= <>
##$TILT= no
##$TM1= 0
##$TM2= 0
##$TOPLEV= 0
##$USERP1= <user>
##$USERP2= <user>
##$USERP3= <user>
##$USERP4= <user>
##$USERP5= <user>
##$WDW= 1
##$XDIM= 16384
##$YMAX_p= 332248000
##$YMIN_p= -3220912
$$ End of Bruker specific parameters
$$ ---------------------------------
##NTUPLES= NMR SPECTRUM
##VAR_NAME=  FREQUENCY,     SPECTRUM/REAL,   SPECTRUM/IMAG
##SYMBOL=    X,             R,               I
##VAR_TYPE=  INDEPENDENT,   DEPENDENT,       DEPENDENT
##VAR_FORM=  AFFN,          ASDF,            ASDF
##VAR_DIM=   16384,         16384,           16384
##UNITS=     HZ,            ARBITRARY UNITS, ARBITRARY UNITS
##FACTOR=    0.220516191357247, 1,           1
##FIRST=     3128.05162400545, 0,            0
##LAST=      -484.66513900033, 0,            0
##MIN=       -484.66513900033, -3220912,     0
##MAX=       3128.05162400545, 332248000,    0
$$ Real data points
##PAGE= N=1
##DATA TABLE= (X++(R..R)), XYDATA
$$ [...]
11770D1552745J704427J801325J687827J389699J819245K128769K003339K125972
$$ 41552745 43257172 45058497 46746324 48136023 49955268 52084037 54087376 56213348
11762E6213348K073461K043415K211232J794043J730762J679140J896547J214393
$$ 56213348 58286809 60330224 62541456 64335499 66066261 67745401 69641948 70856341
11754G0856341J757748J483361O91025R34234K81189p14416k55786q14109p72246
$$ 70856341 72614089 74097450 74788475 75722709 76003898 75289482 75033696 74219587 73447341
11745G3447341j078892j541493j739223j625613j619999k835546k618849j917541
$$ 73447341 72368449 70826956 69087733 67462120 65842121 63006575 60387726 58470185
11737E8470185j909874j939916j747845j882755k145201k387151k122899k021712
$$ 58470185 56560311 54620395 52872550 50989795 48844594 46457443 44334544 42312832
11729D2312832j899056j546417j174704j358796j490544j345088j725466j274543
$$ 42312832 40413776 38867359 37692655 36333859 34843315 33498227 31772761 30498218
11721C0498218j044261j119000j572432j140258q94229n32907o64701j120261
$$ 30498218 29453957 28334957 26762525 25622267 24728038 24195131 23530430 22410169
11713B2410169n54804j367546n21226o54004o72947j003498K70415m94677n98825
$$ 22410169 21855365 20487819 19966593 19312589 18639642 17636144 17906559 17411882 16813057
11704A6813057p72521o42446o05956k16164n42904l23253l08179n49380k38372
$$ 16813057 16040536 15398090 14792134 14575970 14033066 13709813 13401634 12852254 12613882
11695A2613882j31308k79647p45861k95020k63930n51589j79533n98621n3897
$$ 12613882 12482574 12202927 11457066 11162046 10898116 10346527 10166994 9568373 9514476
11686I514476L36296j04752o47278k01469k31842k72506p23715J01090K28287
$$ 9514476 9850772 9746020 9098742 8897273 8665431 8392925 7669210 7770300 7998587
11677G998587j79292J81127q35288l33269J66992J30510l77090k45080p3350m97401
$$ 7998587 7819295 8000422 7165134 6831865 6998857 7129367 6752277 6507197 6433847 5936446
11667E936446J46488k05240J01998m61649k56899M92920L29106j14065l97713
$$ 5936446 6082934 5877694 5979692 5518043 5261144 5754064 6083170 5969105 5571392
11658E571392M6855o69577R6873m5818j19748Q8462l29086j03187l35076L60150
$$ 5571392 5618247 4948670 5045543 4999725 4879977 4968439 4639353 4536166 4201090 4561240
11648D561240J48109o66761K18084K41162l60921n19265L29948l08659l7029K90361
$$ 4561240 4709349 4042588 4260672 4501834 4140913 3621648 3951596 3642937 3605908 3896269
11638C896269k68857k79865L30745j20574l46297l24833R3670k91642r8844m89627
$$ 3896269 3627412 3347547 3678292 3557718 3211421 2886588 2980258 2688616 2589772 2100145
11628B100145J63664M83556p0410j81229m18648L76759N36322l13275P1303k15565
$$ 2100145 2263809 2747365 2676955 2495726 2077078 2453837 2990159 2676884 2748187 2532622
11618B532622k30400q7808L08375J92393Q7425l81675k30461r6092q309j31321
$$ 2532622 2302222 2214414 2522789 2715182 2802607 2420932 2190471 2094379 2086070 1954749
11608A954749N7422M32952O2045l5659l12322M3715J62894p44555J87702K53978
$$ 1954749 2012171 2445123 2507168 2471509 2159187 2202902 2365796 1621241 1808943 2062921
11598B062921J58304k46769R3474K75611j82114J56600K48464k60041k93900L2464
$$ 2062921 2221225 1974456 2067930 2343541 2161427 2318027 2566491 2306450 2012550 2045014
11588B045014j55725L85019j13004J06964M9895o49776m82842M81726L08150P5078
$$ 2045014 1889289 2274308 2161304 2268268 2318163 1668387 1185545 1667271 1975421 2050499
11578B050499P6490k80479l73082j76705N13531o0195K49726p2347J26814j51073
$$ 2050499 2126989 1846510 1473428 1296723 1810254 1750059 1999785 1927438 2054252 1903179
11568A903179q8313m414J46509P50125l48583j17938j97056m81231j50627J14493
$$ 1903179 1814866 1810452 1956961 2707086 2358503 2240565 2043509 1562278 1411651 1526144
11558A526144J29600O6133k91877J07840M61490L70178l90022j88338k35630K8986
$$ 1526144 1655744 1721877 1430000 1537840 1999330 2369508 1979486 1791148 1555518 1584504
11548A584504M8298N0366J5979k68961N63681M00205J7940j68443l36725j43831
$$ 1584504 1632802 1683168 1699147 1430186 1993867 2394072 2412012 2243569 1906844 1763013
11538A763013j7815J06110j83183O0491n2651m7051J24999m1932J76244K78402
$$ 1763013 1745198 1851308 1668125 1728616 1675965 1628914 1753913 1711981 1888225 2166627
11528B166627J07930j15956J8919q1363l60235J45830l77470j25275M52079O12720
$$ 2166627 2274557 2158601 2177520 2096157 1735922 1881752 1504282 1379007 1831086 2443806
11518B443806l26200l20176l3067N85142l78440K40938k7921J87082j30302m16088
$$ 2443806 2117606 1797430 1764363 2349505 1971065 2212003 2184082 2371164 2240862 1824774
11508A824774M96374j02093j61229L72511m56108k07602J23420O9989L13846O9975
$$ 1824774 2321148 2219055 2057826 2430337 1974229 1766627 1890047 1960036 2273882 2343857
11498B343857k60914j52909O54636P835l43475m7736j91199J7641P99510j54888
$$ 2343857 2082943 1930034 2584670 2592505 2249030 2201294 2010095 2027736 2827246 2672358
11488B672358j35763J00103K5100J15402j22260J95060l47652P7559n28693k17403
$$ 2672358 2536595 2636698 2661798 2777200 2654940 2850000 2502348 2579907 2051214 1833811
11478A833811L31916l65830p5870K96392j15785m29823J74810J94717m5593q1099
$$ 1833811 2165727 1799897 1724027 2020419 1904634 1474811 1649621 1844338 1798745 1717646
11468A717646o51865m27469L26298P1338J05670k65606N21099L72491m20059l73110
$$ 1717646 1065781 638312 964610 1035948 1141618 876012 1397111 1769602 1349543 976433
11458I76433J2063J48120o5806j48532k72403J45992K17981J68487J83658j28822
$$ 976433 988496 1136616 1070810 922278 649875 795867 1013848 1182335 1365993 1237171
11448A237171k93469n15176J49851l6504O97224q3046j21585P0796J00816n27190
$$ 1237171 943702 428526 578377 541873 1239097 1156051 1034466 1105262 1206078 678888
11438F78888l43877M5049M59874K47862n63945O708J2792k65061M72239J14706
$$ 678888 335011 380060 839934 1087796 523851 530559 543351 278290 750529 865235
11428H65235k24057k47089k65887R2522K24758l92063J78187j06494r7488N64713
$$ 865235 641178 394089 128202 220724 445482 53419 231606 125112 27624 592337
11418E92337m13776J3572L74781J78450m696J9613k09441k8933l45353M0655R4771
$$ 592337 178561 192133 566914 745364 740668 760281 550840 521907 176554 217209 311980
11407C11980L05629n04310k16281L9073j36940M33539l76691J20621j49221K88160
$$ 311980 617609 113299 -102982 -63909 -200849 232690 -144001 -23380 -172601 115559
11397A15559L13441J26636J32684j14597j29594j92372k09124M46516j54839N1217
$$ 115559 429000 555636 688320 573723 444129 251757 42633 489149 334310 385527
11387C85527j41609n9532O23952j54889j20756j46782J74459L3520n78921l6878
$$ 385527 243918 184386 808338 653449 532693 385911 560370 593890 14969 -21909
11377b1909M51748Q8687J01149l83866N6181j69993M32179j95832o18903K80372
$$ -21909 429839 518526 619675 235809 291990 121997 554176 358344 -260559 19813
11367A9813K79069j55580n748J25000l323l46824M5278L4428K37455L83309J49195
$$ 19813 298882 143302 137554 262554 259231 -87593 -42315 -7887 229568 612877 762072
11356G62072m11707J13995N13476k8582J8706l40812p76r7617l2305M55738p68175
$$ 762072 350365 464360 977836 949254 967960 627148 626372 528755 496450 952188 184013
11345A84013o5423j47058m05225M91505l15839M98210R6492l80966m85890J5441
$$ 184013 118590 -28468 -433693 57812 -258027 240183 336675 -44291 -530181 -514740
11335e14740R18048Q1171k1094k8781Q9631m4549k28794N3226P8739k47854l21409
$$ -514740 403308 484479 463385 434604 524235 479686 250892 304118 382857 135003 -186406
11324a86406J22598L96042j02369O8706L44396l08068O9176q3946j13065J07826
$$ -186406 -63808 332234 229865 298571 642967 334899 404075 320129 207064 314890
11314C14890L12947n96010K96501J01837o33922J62550L75036K6174j66419P1128
$$ 314890 627837 31827 328328 430165 -203757 -41207 333829 360003 193584 264712
11304B64712j48720l0843j6932k4050K21136l9687m09736K81291J74284m65352
$$ 264712 115992 85149 68217 44167 265303 225616 -184120 97171 271455 -193897
11294a93897K07152k04560j14543J93640r6209N13863O9186k87318J89384k58275
$$ -193897 13255 -191305 -305848 -112208 -208417 305446 374632 87314 276698 18423
11284A8423j35848J29915k8815J0012O7920L56974q1221o99068J87938J51154
$$ 18423 -117425 12490 -16325 -6313 61607 418581 337360 -361708 -173770 -22616
11274b2616K30795J44163Q0311L3836n48907k89829l00264J75903J60558n261
$$ -22616 208179 352342 432653 466489 -82418 -372247 -672511 -496608 -336050 -341311
11264c41311k64513L06163M53432L38679j02150k88609o8833J86100l20972J08597
$$ -341311 -605824 -299661 153771 492450 390300 101691 32858 218958 -102014 6583
11254F583O56369k93694O16p2385m66167J7543J03130K22820l75538N73560m55271
$$ 6583 662952 369258 369874 297489 -168678 -151135 -48005 174815 -200723 372837 -82434
11243h2434k6741L46679J33919j18562j93301l19750L79021K58126j44748K48928
$$ -82434 -109175 237504 371423 252861 59560 -260190 118831 376957 232209 481137
11233D81137k30612l10629k01651N86800P3712O1847l04892k00682r0388P11243
$$ 481137 250525 -60104 -261755 325045 398757 460604 155712 -44970 -135358 575885
11223E75885J51861k11405m44086l18009M75559L42736L45793O0351k89524m53066
$$ 575885 727746 516341 72255 -245754 229805 572541 918334 978685 689161 236095
11213B36095k46915N2875L17561K2492J3003J99960k24073k03777m25579j83025
$$ 236095 -10820 42055 359616 382108 395111 595071 370998 167221 -258358 -441383
11203d41383O74578n93833J58953M47925m38563M9377K69977M18725L59338m16382
$$ -441383 233195 -360638 -201685 246240 -192323 -142946 127031 545756 905094 488712
11193D88712n05547k39458K46576N26940n95519K98864L7245J80841n770l95706
$$ 488712 -16835 -256293 -9717 517223 -78296 220568 257813 438654 432884 37178
11183C7178l79437K67051j35808K68598L04330N6396j66561j02010J39285j72293
$$ 37178 -342259 -75208 -211016 57582 361912 418308 251747 149737 289022 116729
11173A16729j9589M40558k11243m47315m31095N58203P16869j05264m87140o43993
$$ 116729 97140 537698 326455 -120860 -551955 6248 723117 617853 130713 -513280
11163e13280L91479j44195K57118p0028J75150K51577K6327k4639J57196o21181
$$ -513280 -121801 -265996 -8878 -78906 96244 347821 374148 349509 506705 -114476
11153a14476k31512q2618l17736L62635L20703J69452K8535P9537j96283M60270
$$ -114476 -345988 -428606 -746342 -383707 -63004 106448 134983 214520 18237 478507
11143D78507N7947l7931P0426O4394m55698j7359M14289k48171j70540K5913j99686
$$ 478507 536454 498523 568949 633343 177645 160286 574575 326404 155864 181777 -17909
11132a7909m66660m8752L23709K75303N07708k94356k74682Q967n56598r1848
$$ -17909 -484569 -533321 -209612 65691 573399 279043 4361 13328 -543270 -635118
11122f35118j6862M09927J24256O2363K40096j38488j46933M20765J9395o05477
$$ -635118 -651980 -242053 -117797 -55434 184662 46174 -100759 320006 339401 -266076
11112b66076j24031M5113J04254K83273j15035J00897k8296N60447k31804J55908
$$ -266076 -390107 -344994 -240740 42533 -72502 28395 99 560546 328742 484650
11102D84650r6144m66104M0164R666k1527J2524K55979l95959K77730k14670p9828
$$ 484650 388506 -77598 -37434 -27768 -49295 -36771 219208 -176751 100979 -113691 -193519
11091a93519o64833p8472l10014M36181N78921l69513J05142N73115K33460K42042
$$ -193519 -858352 -936824 -1246838 -810657 -231736 -601249 -496107 77008 310468 552510
11081E52510j54500m80368j99916l79265R7578L19313J88046k14905M31373J63441
$$ 552510 398010 -82358 -282274 -661539 -563961 -244648 -56602 -271507 159866 323307
11071C23307K55308n54694J8507M88132n79351K67601l13735l70100L27961O50720
$$ 323307 578615 23921 42428 530560 -48791 218810 -94925 -465025 -137064 513656
11061E13656k52138r99702k5730M61649M95383j44740J08875J07959J87672k11975
$$ 513656 261518 -738184 -763914 -302265 193118 48378 157253 265212 452884 240909
11051B40909L6606k9866l18294L50868L5250l00100J97352r1750J51726J7931
$$ 240909 277515 247649 -70645 280223 315473 15373 212725 120975 272701 290632
11041B90632j8584J468l60485K7123m9081J96757O3652q5928n6306k17560J92430
$$ 290632 272048 273516 -86969 -59846 -108927 87830 151482 65554 9248 -208312 -15882
11030a5882J79838j48640j60975l76717p7885M53861j54514l96089R29377m26517
$$ -15882 163956 15316 -145659 -522376 -600261 -146400 -300914 -697003 232374 -194143
11020a94143j07037P28243j01475M502k50011j98334J39524J48168K35869j98813
$$ -194143 -301180 427063 325588 330090 80079 -118255 21269 169437 405306 206493
11010B06493m65105O4815k83111M21063J42037R3070m94873J15686P55393l44854
$$ 206493 -258612 -193797 -476908 -55845 86192 179262 -315611 -199925 555468 210614
11000B10614J70360n85840n58014P33038M17887L7635p40987j4149J32592L44891
$$ 210614 380974 -204866 -762880 -29842 388045 425680 -315307 -329456 -196864 148027
10990A48027m9079J52311n91716L9027n7054m91237J58605K87648l26879L43614
$$ 148027 98948 251259 -340457 -301430 -358484 -849721 -691116 -403468 -730347 -386733
10980c86733J15754L55202J14766J00225j2917n06357K99066L39505L93287m56919
$$ -386733 -270979 84223 198989 299214 286297 -220060 79006 418511 811798 354879
10970C54879l05807l4227k5943k11083K54667M07800l10065l00821J25005N6602
$$ 354879 49072 14845 -11098 -222181 32486 440286 130221 -170600 -45595 11007
10960A1007Q8514m64057P08761o27018j86058N04773K99594k84433O26069j8162
$$ 11007 99521 -364536 344225 -282793 -468851 35922 335516 51083 677152 658990
10950F58990j08456O9740n50841l35445n5909K6456K58972o7414j04426K43599
$$ 658990 550534 620274 69433 -266012 -321921 -295465 -36493 -103907 -208333 35266
10940C5266P09564j36455k87132j9463k72385J9490j23536N59175l85406k96937
$$ 35266 744830 608375 321243 301780 29395 48885 -74651 484524 99118 -197819
10930a97819N25611o0663l84796o94M80323k29194K36998M9645n88737j70913
$$ -197819 327792 267129 -117667 -118361 361962 132768 369766 419411 -169326 -340239
10920c40239N6542p6388l2344n0091K46313K29283n0041o8429L33599l954m23481
$$ -340239 -283697 -360085 -392429 -442520 -196207 33076 -16965 -85394 248205 244251 -179230
10909a79230K35738K29228k96834j40685Q0862K01034j48321Q171j45927K15316
$$ -179230 56508 285736 -11098 -151783 -70921 130113 -18208 -10037 -155964 59352
10899E9352K67404m63922J44493J77394k56638m27728L57116P47889o68419l82631
$$ 59352 326756 -137166 7327 184721 -71917 -499645 -142529 605360 -63059 -445690
10889d45690J81951K4225m27125O5134j75878l04311M38179N42374J22848j58946
$$ -445690 -263739 -239514 -666639 -601505 -777383 -1081694 -643515 -101141 21707 -137239
10879a37239J50922o84259K70202K69610O9656j17183k69524J36330k16532M649
$$ -137239 13683 -670576 -400374 -130764 -61108 -178291 -447815 -311485 -528017 -523368
10869e23368j34404M85797L83081m39766K6805j13117K91589k66376L33528P7173
$$ -523368 -657772 -171975 211106 -228660 -201855 -314972 -23383 -289759 43769 120942
10859A20942J77752p669K74440o04649m18477j85629j80163J30898m7968M28077
$$ 120942 298694 291025 565465 -39184 -457661 -643290 -823453 -692555 -740523 -312446
10849c12446K0412K63796M50662l45599j51621k88813J35700j87849J88273J72205
$$ -312446 -292034 -28238 422424 76825 -74796 -363609 -227909 -415758 -227485 -55280
10839e5280J50455J33208m18648m66228J91493L91572l05750Q8983K58940k40014
$$ -55280 95175 228383 -190265 -656493 -465000 -73428 -379178 -290195 -31255 -271269
10829b71269J83834M8672J27774N9421o64083N94456l74320k09316M4891K02014
$$ -271269 -87435 -38763 89011 148432 -515651 78805 -295515 -504831 -459940 -257926
10819b57926K15495j29066M6919M6990J23225o6791Q5134j16757K6038n4586K74037
$$ -257926 -42431 -171497 -124578 -77588 45637 -21154 63980 -52777 -26739 -81325 192712
10808A92712o35774j84059K93547p6075k75538M07931N13743n8176j58438j08458
$$ 192712 -443062 -627121 -333574 -409649 -685187 -277256 236487 178311 19873 -88585
10798h8585k7753m823L33059l61061k47178N44107j07480m26580K0981L40015
$$ -88585 -116338 -121161 211898 -149163 -396341 147766 40286 -386294 -365313 -25298
10788b5298m71356l62678P46822J10728l06807k31532J16629M83241N03318O4299
$$ -25298 -496654 -859332 -112510 -1782 -308589 -540121 -423492 59749 563067 627366
10778F27366o07919j16701k5342p84907K32563N22150K86555q0727q1174J1731
$$ 627366 19447 -97254 -122596 -907503 -674940 -152790 133765 53038 -28136 -16405
10768a6405J65408l19673J04384K49144n9751K60663r0365L319K08541o25192
$$ -16405 149003 -170670 -66286 182858 123107 383770 293405 296724 505265 -119927
10758a19927k08593p2139R5199l99461O4719J64096N09857M0189J74562j40039
$$ -119927 -328520 -400659 -305460 -704921 -640202 -476106 33751 73940 248502 108463
10748A08463l31287P9987j04573J95342J98418J79823k67821J38017l4359J89571
$$ 108463 -222824 -142837 -247410 -52068 146350 326173 58352 196369 162010 351581
10738C51581j76858n11352j13207N2691K46538L21522j69306k59240J27438m0632
$$ 351581 174723 -336629 -449836 -397145 -150607 170915 1609 -257631 -130193 -170825
10728a70825P56877m79576p6139K54683P7685L26076k1549j19154p14708L4155
$$ -170825 586052 106476 30337 285020 362705 688781 667232 548078 -166630 -132475
10718a32475m8223j76333j79440L41469j01251o43704O89874L03702J14972J94766
$$ -132475 -180698 -357031 -536471 -195002 -296253 -939957 -250083 53619 168591 363357
10708C63357n33560Q6643M36930m17081l38752N2467R0308j9416J49700R3505
$$ 363357 -170203 -83560 353370 -63711 -402463 -349996 -259688 -279104 -129404 -35899
10698c5899j34994m20559N39932K05911l26017k68870l39217K40621K41755K50038
$$ -35899 -170893 -591452 -51520 154391 -171626 -440496 -779713 -539092 -297337 -47299
10688d7299l81070r088q7770L56925K96889j60636q6524L4824j23517L30640l03585
$$ -47299 -428369 -437457 -525227 -168302 128587 -32049 -118573 -83749 -207266 123374 -180211
10677a80211O8323K18608R6107n2719q1343J3530m2255j51946n99694N46259N25360
$$ -180211 -111888 106720 202827 150108 68765 82295 40040 -111906 -711600 -165341 360019
10666C60019p9190l30199q06294O40846j68125L64724N64760L9206k55713n82595
$$ 360019 280829 -49370 -855664 -214818 -382943 -18219 546541 585747 330034 -252561
10656b52561k37390L17621k0027Q4427Q09126j07875o33421l58074M55262L41072
$$ -252561 -489951 -172330 -192357 -107930 701196 593321 -40100 -398174 57088 398160
10646C98160M1630l69407M0074j25272M74914l00540J89528j38431n03383O5337
$$ 398160 439790 70383 110457 -14815 460099 159559 349087 210656 -292727 -227390
10636b27390n5448j16965J1944L9923J25046K62667K18885J10081o53482N0674
$$ -227390 -282838 -399803 -387859 -347936 -222890 39777 258662 368743 -284739 -234065
10626b34065J88202J10667M86499k76167J38764p8027n96279J75710K23376k01913
$$ -234065 -45863 64804 551303 275136 413900 335873 -260406 -84696 138680 -63233
10616f3233k04273K68359j05766L14188M51656o18920l62343K67383Q583l20922
$$ -63233 -267506 853 -104913 209275 660931 42011 -320332 -52949 -44366 -365288
10606c65288j56545M32867J03833L11239J63166n87861J33692N13654k36577J61215
$$ -365288 -521833 -88966 14867 326106 489272 -98589 35103 548757 312180 473395
10596D73395n83579K95897q1608k31008L43304J12035J52297L37046M8578n63466
$$ 473395 -110184 185713 104105 -126903 216401 328436 480733 817779 866357 302891
10586C02891l5580N5115N479n81095K8458R77146Q9008l50088M5880l78665k97610
$$ 302891 267311 322426 327905 -253190 -224732 752414 841422 491334 537214 158549 -139061
10575a39061m5026P04133k27261l15723J91435K67844p8348J88489J24735q03922
$$ -139061 -184087 520046 292785 -22938 168497 436341 357993 546482 671217 -132705
10565a32705r813K16747K12322j28475J43151k0661K18030j78792O5817j19317
$$ -132705 -142518 74229 286551 158076 301227 280566 498596 319804 385621 266304
10555B66304J10553M01888p56601j86736J79317K15483K7412n3963J50760J63483
$$ 266304 376857 778745 22144 -164592 14725 230208 257620 203657 354417 517900
10545E17900o7653m20133l15607j31902M19251k44419j4705j80739M14549N27406
$$ 517900 450247 30114 -285493 -417395 1856 -242563 -257268 -438007 -23458 503948
10535E03948M7310Q4205K07099l1142o8583O3004m80192n32471K17973L63781
$$ 503948 551258 635463 842562 811420 742837 805841 325649 -206822 11151 374932
10525C74932l18250K35142l1891k10215J7130L55067j18100l246K05605J45101
$$ 374932 56682 291824 259933 49718 66848 421915 303815 300569 506174 651275
10515F51275l0787M80915j57259p2125n86413k19681K29082r3059M1089N08784
$$ 651275 620488 1101403 944144 872019 285606 65925 295007 201948 243037 751821
10505G51821m56275o4104J87773j20606J55780L33961p4802j35312o843k9750
$$ 751821 295546 231442 419215 298609 454389 788350 713548 578236 571393 541643
10495E41643j03186l88374N97143M20323k15726J15415n2314m86300K24228K23010
$$ 541643 438457 50083 647226 1067549 851823 967238 914924 428624 652852 875862
10485H75862m18790J81318q9068L02363j73069M39621K3128j88922l33409K76770
$$ 875862 457072 638390 549322 851685 678616 1118237 1141365 952443 619034 895804
10475H95804R346K51534M69107n25231p6226J6974L35964l77748K21803j41787
$$ 895804 905150 1156684 1625791 1100560 1024334 1041308 1377272 999524 1221327 1079540
10465A079540L84641J44482j1117L33065m15266L83436r2725K44521n6764P9191
$$ 1079540 1464181 1608663 1597546 1930611 1515345 1898781 1806056 2050577 1993813 2073004
10455B073004O6710J01719J9000L2946k00740n108j9952j68605K09332l60135
$$ 2073004 2139714 2241433 2260433 2293379 2092639 2087531 2067579 1898974 2108306 1748171
10445A748171N8394R7354N52128l49316l21580m12594K92226L37711M04206l82805
$$ 1748171 1806565 1903919 2456047 2106731 1785151 1372557 1664783 2002494 2406700 2023895
10435B023895L32895m08423l40692J81162M43000K03452k46765o6838J71064N36668
$$ 2023895 2356790 1948367 1607675 1788837 2231837 2435289 2188524 2121686 2292750 2829418
10425B829418j84703q09048J2939k09053P88284k74834k95086J69892m1361J26984
$$ 2829418 2644715 1835667 1848606 1639553 2427837 2153003 1857917 2027809 1986448 2113432
10415B113432N30733k17058l93384M20499q1062j54722N56143p4299O5516L83996
$$ 2113432 2644165 2427107 2033723 2454222 2373160 2218438 2774581 2700282 2765798 3149794
10405C149794l14407L0666O8911L76999N32402J20735M46391J30611k27032P55701
$$ 3149794 2835387 2866053 2934964 3311963 3844365 3965100 4411491 4542102 4315070 5070771
10395E070771m66619j31560L91668N3413m42172N21281N46385K34770K68178j75986
$$ 5070771 4604152 4472592 4864260 4917673 4475501 4996782 5543167 5777937 6046115 5870129
10385E870129M17933M58706N80482R5115K29643M75483j14590j35094O15871N95178
$$ 5870129 6288062 6746768 7327250 7422365 7652008 8127491 8012901 7877807 8493678 9088856
10375I088856P68327M40866J87272N43867l44647O071q7914l01770k86197J03081
$$ 9088856 9857183 10298049 10485321 11029188 10684541 10690612 10602698 10300928 10014731 10117812
10365A0117812K8885k74065j60669l7521m80388j55829p08431p69163r29109k38977
$$ 10117812 10146697 9872632 9711963 9674442 9194054 9038225 8329794 7560631 6631522 6392545
10355F392545L19506l26188l29129j934o06377l49235l23982q4405m14505j39576
$$ 6392545 6712051 6385863 6056734 6054800 5448423 5099188 4775206 4690801 4276296 4136720
10345D136720J61487o10192r2201l01993M5918O10507k66459r04328n14774J30739
$$ 4136720 4298207 3688015 3595814 3293821 3339739 3950246 3683787 2779459 2264685 2395424
10335B395424l32350N9114K96913n2164L75868l49913l21784n6737l0388k55643
$$ 2395424 2063074 2122188 2419101 2366937 2742805 2392892 2071108 2014371 1983983 1728340
10325A728340q2526J21622l94082K03991K11797k65136j18451q0480p5927j65716
$$ 1728340 1645814 1767436 1373354 1577345 1789142 1524006 1405555 1325075 1249148 1083432
10315A083432Q59982M74701j372879n92814L60096L46014l82806k34941j61741
$$ 1083432 1943414 2418115 1045236 452422 812518 1158532 775726 540785 379044
10306C79044N81171j884K4475K32128l7577j4134k84759k53242L7160K03647m42193
$$ 379044 960215 958331 982806 1214934 1177357 1163223 878464 625222 662382 866029 423836
10295D23836J18878K06340M4615n70502P5052M09058P4610j52667J99865J34495
$$ 423836 542714 749054 793669 223167 298219 707277 781887 629220 829085 963580
10285I63580m17969K16904j8861J5117L34235j60479o45287m8586P2209m4378
$$ 963580 545611 762515 743654 758771 1093006 932527 287240 238654 310863 266485
10275B66485p7513k91356M81669l62268O48206M63112l42243p79255R4108O26550
$$ 266485 188972 -102384 379285 17017 665223 1128335 786092 6837 100945 727495
10265G27495l71158q04K37944M5003K91908q2582l51341O00238R7308l38026J05504
$$ 727495 356337 355533 593477 638480 930388 847806 496465 1096703 1194011 855985 961489
10254I61489J3580l32361o4347M7770k56508N4929j10822M59973m9348k71284
$$ 961489 975069 642708 578361 626131 369623 424552 313730 773703 724355 453071
10244D53071m45712K78303P51986o44732j67883k30709m5433K99438J37039J66967
$$ 453071 7359 285662 1037648 392916 225033 -5676 -51109 248329 385368 552335
10234E52335N4893n31791m15023K46030O07186K13596j60206j64993n7914j8807
$$ 552335 607228 75437 -339586 -93556 513630 727226 567020 402027 344113 325306
10224C25306J44709k26358n11867M18314N59801l53090J06850l23630Q8416K18080
$$ 325306 470015 243657 -268210 150104 709905 356815 463665 140035 228451 446531
10214D46531J02427j21497k53550j65522J27421K79976r9021K7827O5194N55740
$$ 446531 548958 427461 173911 8389 135810 415786 316765 344592 409786 965526
10204I65526k67000m28478k68352k4217k32411N1311N45935O9801M9255J01471
$$ 965526 698526 270048 1696 -22521 -254932 -203621 342314 412115 461370 562841
10194E62841l33107l33198m9979l72952K46997K15488j84058O94083L66921P1610
$$ 562841 229734 -103464 -153443 -526395 -279398 -63910 -247968 446115 813036 884646
10184H84646k32994l22358j20082K85019q4719k73960j75296r6507k92301k5665
$$ 884646 651652 329294 209212 494231 409512 135552 -39744 -136251 -428552 -454217
10174d54217N81860J09018Q6606j32793L97372q4346k88041L45247J29261K9591
$$ -454217 127643 236661 323267 190474 587846 503500 215459 560706 689967 719558
10164G19558k57134K06289K15084l8730l38586l72696P9326L67648o30155J06301
$$ 719558 462424 668713 883797 845067 506481 133785 213111 580759 -49396 56905
10154E6905Q5708K09644k39216J52450J45588l13475L29776J52176k09082m10738
$$ 56905 142613 352257 113041 265491 411079 97604 427380 579556 370474 -40264
10144d0264L6969L26832K62833J54530J57347P9925J38508p9105j05864l88623
$$ -40264 -3295 323537 586370 740900 898247 978172 1116680 1037575 931711 543088
10134E43088L49529J24442Q4125j46446j57348N44Q98170N74591J25969K79692
$$ 543088 892617 1017059 1101184 954738 797390 797934 1696104 2270695 2396664 2676356
10124B676356P5927K9846o7623p8582M3285l20055Q5782K07457J72567l97029
$$ 2676356 2752283 2782129 2714506 2635924 2679209 2359154 2444936 2652393 2824960 2427931
10114B427931l13594o92793m83197l35717k28788J60733o1403j67328q6826J75978
$$ 2427931 2114337 1421544 938347 602630 373842 534575 473172 305844 219018 394996
10104C94996P336O88712k09987L050o00217J01887L98261j29481j13329N0532
$$ 394996 402332 1091044 881057 884107 283890 385777 784038 654557 541228 591760
10094E91760J64135l41171K37567k25835L54068M65249l03796o49887O5300j48639
$$ 591760 755895 414724 652291 426456 780524 1245773 941977 292090 357390 208751
10084B08751M59735J13737n09273j31665K04349k78172J06654L97967m50362k70243
$$ 208751 668486 782223 272950 141285 345634 67462 174116 572083 121721 -148522
10074a48522J65868M0245N1799j42512q2264J71956R5805L16514M3140K70447
$$ -148522 17346 57591 109390 -33122 -115386 56570 152375 468889 512029 782476
10064G82476J03931k52141L1851k23524k18247R6285l15271J85047j99784q5403
$$ 782476 886407 634266 666117 442593 224346 320631 5360 190407 -9377 -94780
10054i4780L89900J84761L29031K27327k98656j81242m92984m25715L99873p2825
$$ -94780 295120 479881 808912 1036239 737583 556341 63357 -362358 37515 -35310
10044c5310p5000P8413K51760j3402j83911O26060q6397m06883J04798Q1764j78613
$$ -35310 -110310 -31897 219863 206461 22550 648610 562213 155330 260128 341892 163279
10033A63279j51862n6449J91582P0080N2723p2063J83263n9577J42761j28359
$$ 163279 11417 -45032 146550 216630 269353 197290 380553 320976 463737 335378
10023C35378O3996k02025K04441N7812k38418K01437K3955R0230k81467k85267
$$ 335378 399374 197349 401790 459602 221184 422621 446576 536806 255339 -29928
10013b9928j24864r0732j68889L21401N33135l04295j27517K33345l31695M5296
$$ -29928 -154792 -245524 -414413 -93012 440123 135828 8311 241656 -90039 -44743
10003d4743K70259j06518p7012K17332J23802J40501K1784m53766l58049l6611
$$ -44743 225516 118998 41986 259318 383120 523621 545405 91639 -266410 -303021
9993c03021K95827j60158M32583K83705q3518n99067r6034J93913l91983R2223
$$ -303021 -7194 -167352 265231 548936 465418 -133649 -229683 -35770 -427753 -335530
9983c35530N55108l1612k16803O4017j99829M96827J18222q1862j42402r490j73724
$$ -335530 219578 187966 -28837 35180 -164649 332178 450400 368538 226136 216646 42922
9972D2922k6356L26675R1570l8415J54925K31142k21891m0441J16419l26243L5944
$$ 42922 16566 343241 434811 396396 551321 782463 560572 520131 636550 310307 346251
9961C46251K8795j19293k522L35131o4883j28868J8619l15766J08016l8926m48991
$$ 346251 375046 255753 253231 588362 523479 394611 413230 97464 205480 166554 -282437
9950b82437N80118K9591J77364M70677j93993m08031K97726l70584K42755M50532
$$ -282437 297681 327272 504636 975313 781320 373289 671015 300431 543186 993718
9940I93718O0870m91488M39908L68330k99116Q5231J73764k13985k82231l78761
$$ 993718 1054588 563100 1003008 1371338 1072222 1157453 1331217 1117232 835001 456240
9930D56240J39395Q28716q0259J16373J23768k53002R4920K4210J41152K10981
$$ 456240 595635 1424351 1344092 1460465 1584233 1331231 1426151 1450361 1591513 1802494
9920A802494j63845N40731J41790j56468n39880j5651J17715j15399J79888m30085
$$ 1802494 1638649 2179380 2321170 2164702 1624822 1609171 1726886 1611487 1791375 1361290
9910A361290o78668j27047J84243L21807r7735M27416k03248o57908k37562L05798
$$ 1361290 682622 555575 739818 1061625 963890 1391306 1188058 530150 292588 598386
9900E98386N30257K39289q75691o0961M57642p7354n20555L63627k91920R0479
$$ 598386 1128643 1367932 492241 431280 888922 811568 291013 654640 362720 453199
9890D53199K06320J09691n88531K59607R644q0538Q2854m3573K64388k60945J6503
$$ 453199 659519 769210 180679 440286 449930 369392 452246 408673 673061 412116 428619
9879D28619n7861N49602n47586n2724P6838j1351j77811L60049m9892l32558j96275
$$ 428619 370758 920360 372774 320050 396888 385537 207726 567775 517883 185325 -10950
9868a0950K40907Q776K49904N784K39610k06879o35401k38039O4173P61288K89679
$$ -10950 229957 238733 488637 494421 734031 527152 -108249 -346288 -282115 479173 768852
9857G68852k8997J92923o98890j38050L02056K83639M6966N60829k49100M267
$$ 768852 739855 932778 233888 95838 397894 681533 728499 1289328 1040228 1044495
9847A044495n58283l04937N64052n17459n2858J99733Q31k60109M79994K02429
$$ 1044495 486212 181275 745327 227868 175010 374743 375574 115465 595459 797888
9837G97888j25509l97964R5613P1450P6505J06581J93017m17771j00771J15524
$$ 797888 672379 274415 370028 441478 517983 624564 817581 399810 299039 414563
9827D14563K29875J81060J31235j26179j55024K73236K27045l10305j90456L74291
$$ 414563 644438 825498 956733 830554 675530 948766 1175811 865506 675050 1049341
9817A049341J248n43184K83993M40448n78919j4336n9261k13367K91512l11358
$$ 1049341 1050589 507405 791398 1231846 652927 638591 579330 365963 657475 346117
9807C46117k34883L75840l42328K37721O32899K16565o83124o0535N25472K67989
$$ 346117 111234 487074 144746 382467 1015366 1231931 548807 488272 1013744 1281733
9797A281733j48754k45036J25554m1077J71727q5858k5275m99370q1216J98490
$$ 1281733 1132979 887943 1013497 972420 1144147 1058289 1033014 533644 452428 650918
9787F50918M20647k45398j76303J00557m13187R55144J74766m74098k50117j90385
$$ 650918 1071565 826167 649864 750421 337234 1292378 1467144 993046 742929 552544
9777E52544N21491j90950k09732K05287o3606J38922J49312K25594L65251l56845
$$ 552544 1074035 883085 673353 878640 815034 953956 1103268 1328862 1694113 1337268
9767A337268J24764L4148M69616J24519j39890k71386j76701l72934J88463L1373
$$ 1337268 1462032 1496180 1965796 2090315 1950425 1679039 1502338 1129404 1317867 1349240
9757A349240K5356L62947n8382J44303n49835j8382K78419m6815l48698J04819
$$ 1349240 1374596 1737543 1679161 1823464 1273629 1255247 1533666 1486851 1138153 1242972
9747A242972l44035L49830P02144L11876l28690k45322j72598K92453O15764O5825
$$ 1242972 898937 1248767 1950911 2262787 1934097 1688775 1516177 1808630 2424394 2490219
9737B490219l88037j30662k52266M14014L90202j3320n14976k36420K687L75913
$$ 2490219 2102182 1971520 1719254 2133268 2523470 2510150 1995174 1758754 1761441 2137354
9727B137354M31331n72645r5262N10070r317m82576o6080M13580K25195q3086
$$ 2137354 2568685 1996040 1900778 2410848 2401531 1918955 1852875 2266455 2491650 2408564
9717B408564r9960n3787K00249N67940j43165o08223L51594K72861J63576n43987
$$ 2408564 2308604 2254817 2455066 3023006 2879841 2271618 2623212 2896073 3059649 2515662
9707B515662k27706k03596L56273K11616R3833R3051k57579L45535j05448M06155
$$ 2515662 2287956 2084360 2440633 2652249 2746082 2839133 2581554 2927089 2821641 3227796
9697C227796n11933k30879P25949N22430j25346m27707P8077J96986J46334k67837
$$ 3227796 2715863 2484984 3210933 3733363 3608017 3180310 3258387 3455373 3601707 3333870
9687C333870J63495J32873R9894j974J47711j84913j76047L40458M05481K80903
$$ 3333870 3497365 3630238 3730132 3728158 3875869 3690956 3514909 3855367 4260848 4541751
9677D541751p0120m46264J28048J4702J42452K07633n0834p5376j58634O89379
$$ 4541751 4471631 4025367 4153415 4168117 4310569 4518202 4467368 4391992 4233358 4922737
9667D922737O45161j68905p3707j80560K47978M26270m11893P36782K40338l07613
$$ 4922737 5567898 5398993 5325286 5144726 5392704 5818974 5407081 6143863 6384201 6076588
9657F076588O35507p7520j66297l48242j04380j88528N02467N85943k6266L35053
$$ 6076588 6712095 6634575 6468278 6120036 6015656 5827128 6329595 6915538 6889272 7224325
9647G224325k57848L51429N24585K43024M00645K64775j3841m5561l6080K49583
$$ 7224325 6966477 7317906 7842491 8085515 8486160 8750935 8737094 8691533 8655453 8905036
9637H905036L94940K45748K58589L98134m17612M8293P02079P51275M19035J33073
$$ 8905036 9299976 9545724 9804313 10202447 9784835 9833128 10535207 11286482 11705517 11838590
9627A1838590K15927k64081M2351M51971K07905R09375M71625n7581O93773m7224
$$ 11838590 12054517 11790436 11832787 12284758 12492663 13402038 13873663 13816082 14509855 14462631
9617A4462631N92991P15725l78849N04210L10858M77504K78956N2150N7561R09818
$$ 14462631 15055622 15771347 15392498 15896708 16207566 16685070 16964026 17016176 17073737 17983555
9607A7983555P29391O3604J316647R35914P39670O97082J052960J199909O51344
$$ 17983555 18712946 18776550 20093197 21029111 21768781 22465863 23518823 24718732 25370076
9598B5370076J191784J259786O55258J023739Q83266J340184P62449N78807J517944
$$ 25370076 26561860 27821646 28476904 29500643 30383909 31724093 32486542 33065349 34583293
9589C4583293R52455J65857J071042n8910Q82683J581852R91504Q35818M40504
$$ 34583293 35535748 35701605 36772647 36713737 37596420 39178272 40169776 41005594 41446098
9580D1446098J397117J327968P85803J162978J849386J311067J402950J762557
$$ 41446098 42843215 44171183 44956986 46119964 47969350 49280417 50683367 52445924
9572E2445924J638000K042484K419911K556123K662516K817346L398073L575286
$$ 52445924 54083924 56126408 58546319 61102442 63764958 66582304 69980377 73555663
9564G3555663L643821N098642N341595O583017P107335Q904542J1275635J3504576
$$ 73555663 77199484 82298126 87639721 94222738 101330073 110234615 121510250 135014826
9556A35014826J6369565J9203549K3527904K8368903K9820923K8210374K2528575
$$ 135014826 151384391 170587940 194115844 222484747 252305670 280516044 303044619
9549C03044619J3409499M114600l155801m292621k431053J769075M357079L900680
$$ 303044619 316454118 320568718 317412917 313120296 310689243 312458318 316815397 320716077
9541C20716077k067736j2376568k2191875k8358970l1252863k9951306k5980550
$$ 320716077 318648341 306271773 284079898 255720928 224468065 194516759 168536209
9534A68536209k0835379j6943358j3194505j0627970q265298p033167n907095
$$ 168536209 147700830 130757472 117562967 106934997 98669699 91636532 85729437
9527H5729437m951546m960258m066407l879438l367930l004080k853863l136939
$$ 85729437 80777891 75817633 71751226 67871788 64503858 61499778 58645915 55508976
9519E5508976k853451k102185l032052k794725k399241j315600j442462j706351
$$ 55508976 52655525 50553340 47521288 44726563 42327322 41011722 39569260 37862909
9511C7862909j219087j213881j079383p97974o22978j68535O5949k12072k57467
$$ 37862909 36643822 35429941 34350558 33552584 32929606 32761071 32827020 32614948 32357481
9502C2357481L32928L95855p26443p59405m26803j76914p79342k53343j53319
$$ 32357481 32690409 33086264 32359821 31600416 31173613 30996699 30217357 29964014 29810695
9493B9810695j57525K06085m95483o17426o25124m80038k03731j06751Q13999
$$ 29810695 29653170 29859255 29363772 28746346 28121222 27641184 27437453 27330702 28144701
9484B8144701R71172R43253J578624K005346K665143L763050M370915M245868
$$ 28144701 29115873 30059126 31637750 33643096 36308239 40071289 44442204 48688072
9476D8688072K893373J697233O26983m19589j298245n25799N54169K47604p54688
$$ 48688072 51581445 53278678 53905661 53486072 52187827 51662028 52216197 52463801 51709113
9467E1709113j579904l072171m678195n012298m858154l550535l068277k410839
$$ 51709113 50129209 47057038 42378843 37366545 32508391 28957856 25889579 23478740
9459B3478740j886041k016209p56562m55222j172157p79959j062461p72009m46585
$$ 23478740 21592699 19576490 18819928 18364706 17192549 16412590 15350129 14578120 14131535
9450A4131535q24686k79014l92847m45002p77951O3268j21541K10756n15517L1354
$$ 14131535 13306849 13027835 12634988 12189986 11412035 11475303 11353762 11564518 11049001 11080355
9440A1080355K29778n28448n05518k17096m64022j03140m28691k0326k75141p65979
$$ 11080355 11310133 10781685 10276167 10059071 9595049 9491909 9063218 9042892 8767751 8001772
9430H001772k66961o43589J37663k35739j60552j89264j88787n29635M58582j37197
$$ 8001772 7734811 7091222 7228885 6993146 6832594 6643330 6454543 5924908 6383490 6246293
9420F246293O1340r9896J1898n6919m26434q03686p16539M07582L71665j05772
$$ 6246293 6307633 6207737 6219635 6162716 5736282 4932596 4216057 4623639 4995304 4889532
9410D889532J37953j31533n76521K90922k19854j3672N74773L14504l72680k52295
$$ 4889532 5027485 4895952 4319431 4610353 4390499 4376827 4951600 5266104 4893424 4641129
9400D641129k81367l68563m0039J09127m02055k38934o2744J27530L95644Q3968
$$ 4641129 4359762 3991199 3951160 4060287 3658232 3419298 3356554 3484084 3879728 3963696
9390C963696j40317N33465m15582j62968k31959J53017N30166L07523k28428p17175
$$ 3963696 3823379 4356844 3941262 3778294 3546335 3699352 4229518 4537041 4308613 3591438
9380C591438L75424j78526J02969k67268j35624M92544J61696j41808k70941o44023
$$ 3591438 3966862 3788336 3891305 3624037 3488413 3980957 4142653 4000845 3729904 3085881
9370C085881k46011L6460K88795J49729q9863k84508L35976l68561n70485O6756
$$ 3085881 2839870 2876330 3165125 3314854 3224991 2940483 3276459 2907898 2337413 2404169
9360B404169M78043k71335j15260L54223j29635n1146l01399p7907Q5654j76948
$$ 2404169 2882212 2610877 2495617 2849840 2720205 2669059 2367660 2289753 2375407 2198459
9350B198459J54240L97740Q2844J20455m55253j81608K59185K7752l6520m2728
$$ 2198459 2352699 2750439 2833283 2953738 2498485 2316877 2576062 2603814 2567294 2524566
9340B524566M26949K95535J35381r534j09027J47639P3831k31960k59552J52177
$$ 2524566 2951515 3247050 3382431 3372897 3263870 3411509 3485340 3253380 2993828 3146005
9330C146005l35799M16403k1551k25801p3230n114J14343n8469J1923n57706M78486
$$ 3146005 2810206 3226609 3205058 2979257 2906027 2900913 3015256 2956787 2968710 2411004 2889490
9319B889490L06499o41857M493N73995m19742L68743j59306j62648n531k75098
$$ 2889490 3195989 2554132 2558625 3132620 2712878 3081621 2922315 2759667 2754136 2479038
9309B479038j7810M0510J72337L66970P96907k67440j71225k11591j8211K0815
$$ 2479038 2461228 2501738 2674075 3041045 3837952 3570512 3399287 3187696 3169485 3190300
9299C190300L79529O06861l9054j89813N20993L25894P51656O93593K44583O04019
$$ 3190300 3569829 4176690 4137636 3947823 4468816 4794710 5546366 6239959 6484542 7088561
9289G088561l672j235065p95354K88367o85029k33603L94701j55820m58440k93751
$$ 7088561 7084889 5849824 5054470 5342837 4657808 4424205 4818906 4663086 4204646 3910895
9279C910895O20753J40367n66903l74729O79201l0689M6212K92398l26247k3529
$$ 3910895 4531648 4672015 4105112 3730383 4409584 4378895 4425107 4717505 4391258 4367729
9269D367729j61502L80572M18264j6049J10344R5578M0958L8249O8955N80521
$$ 4367729 4206227 4586799 5005063 4989014 5099358 5194936 5235894 5274143 5343098 5923619
9259E923619K69202L72327J96973J69711P5452K76914J93359l07655K30324M65862
$$ 5923619 6192821 6565148 6762121 6931832 7007284 7284198 7477557 7169902 7400226 7866088
9249G866088R4765m0334k23088l50734k24523k13558j73444J49715j68114j93310
$$ 7866088 7960853 7920519 7697431 7346697 7122174 6908616 6735172 6884887 6716773 6523463
9239F523463M54271n85165k49262L87395o0813L34953J26281R69830L86872p89545
$$ 6523463 6977734 6392569 6143307 6530702 6469889 6804842 6931123 7900953 8287825 7498280
9229G498280K06723L49213J45221Q1049j42649M13190L97215R48877P81415K10314
$$ 7498280 7705003 8054216 8199437 8280486 8137837 8551027 8948242 9897119 10678534 10888848
9219A0888848j76089M81521Q66122N57028Q35106O54317O52652N92822O2261J185160
$$ 10888848 10712759 11194280 12060402 12617430 13452536 14106853 14759505 15352327 15414588 16599748
9209A6599748J820317L12758J445937K016423K755374L593105L764530N400247
$$ 16599748 18420065 18732823 20178760 22195183 24950557 28543662 32308192 37708439
9201C7708439O186154L880741l80586k904219k348862j065541N41137K065831
$$ 37708439 43894593 47775334 47394748 44490529 42141667 41076126 41617263 43683094
9193D3683094K000023n91595l774077n647251n590499m403623l405027k299900
$$ 43683094 45683117 45091522 41317445 35670194 30079695 25676072 22271045 19971145
9185A9971145j884531j601001p47381j019356o14279p31400n32793o83643k7601
$$ 19971145 18086614 16485613 15738232 14718876 14104597 13373197 12840404 12156761 12129160
9176A2129160l04157n21507k04920l82556k61393M1927l12452o61762N40945O57727
$$ 12129160 11825003 11303496 11098576 10716020 10454627 10496554 10184102 9522340 10063285 10721012
9166A0721012q5097l39479K19729M90248K60304N9685Q61230P88510R14567K55212
$$ 10721012 10635915 10296436 10516165 11006413 11266717 11326402 12187632 12976142 13890709 14145921
9156A4145921M75005p98136r63856m19303n07053O53018m9896p10337n40610j097273
$$ 14145921 14620926 13822790 12858934 12439631 11932578 12585596 12535700 11825363 11284753 10187480
9146A0187480j039942N506l47089l58928m47648j08562n90914j63245j42660m69395
$$ 10187480 9147538 9153044 8805955 8447027 7999379 7890817 7299903 7136658 6993998 6524603
9136F524603j45783q8752K04844k73101O3479j8441N1641J2178K52151L08926
$$ 6524603 6378820 6290068 6494912 6221811 6285290 6266849 6318490 6330668 6582819 6891745
9126F891745m96264o61543K95975P39545m8968J1708k14457m01155Q948J10141
$$ 6891745 6395481 5733938 6029913 6769458 6720490 6732198 6517741 6116586 6125534 6235675
9116F235675L02013k0418L3263j47409J11609j29352L43932L10454P5423k07059
$$ 6235675 6537688 6517270 6550533 6403124 6514733 6385381 6729313 7039767 7115190 6908131
9106F908131l1584M49388k33388K33939N58556J14257r9417j81445j67974N43391
$$ 6908131 6876547 7325935 7092547 7326486 7885042 7999299 7899882 7718437 7550463 8093854
9096H093854P0285k70644k7044O37869N16801J40679l47436J17105J80137m9177
$$ 8093854 8164139 7893495 7866451 8504320 9021121 9161800 8814364 8931469 9111606 9062429
9086I062429K95204K71778L02144L5355l0188L89M88347M01997L30025Q1781M43243
$$ 9062429 9357633 9629411 9931555 9966910 9936722 9937111 10425458 10827455 11157480 11239261 11682504
9075A1682504K74884m29805j32423M40641N65338L51772P6448R6429N76270L82413
$$ 11682504 11957388 11527583 11395160 11835801 12401139 12752911 12829359 12925788 13502058 13884471
9065A3884471L81186K94960j42917j9511L79586M74376K93648J00670N79624K45719
$$ 13884471 14265657 14560617 14417700 14398189 14777775 15252151 15545799 15646469 16226093 16471812
9055A6471812j6926L37951M86750Q7431Q45052R11378O09797Q86240M18082P53052
$$ 16471812 16454886 16792837 17279587 17367018 18212070 19123448 19733245 20619485 21037567 21790619
9045B1790619q6418R88799P95190L15418N19277Q64979Q47407L95952M17151J411861
$$ 21790619 21704201 22693000 23488190 23803608 24322885 25187864 26035271 26431223 26848374 28260235
9035B8260235K70780M44773Q95038R10612N41305K68136J310164P93705J267005
$$ 28260235 28531015 28975788 29870826 30781438 31322743 31590879 32901043 33694748 34961753
9026C4961753J149009J132997J536355O06094J244757J491642J425953K720592
$$ 34961753 36110762 37243759 38780114 39386208 40630965 42122607 43548560 46269152
9018D6269152K006310J972473K215286L060104M072602M336337N730852O736656
$$ 46269152 48275462 50247935 52463221 55523325 59595927 63932264 69663116 76399772
9010G6399772P703567R954715J1478319J3889691J4476404J1638230M202051k642942
$$ 76399772 84103339 94058054 105536373 119426064 133902468 145540698 149742749 147099807
9002A47099807m295463l620232p28242K476481N699982N817464J549625n910054
$$ 147099807 142804344 139184112 138455870 140932351 146632333 152449797 153999422 148089368
8994A48089368r983618j1457450j0624177q719236o834703m127276l204808j996914
$$ 148089368 138105750 126648300 116024123 107304887 100470184 96342908 93138100 91141186
8986I1141186j047969J60903M6929J046246Q63276J128374J095406J575715J681044
$$ 91141186 90093217 90254120 90301049 91347295 92210571 93338945 94434351 96010066 97691110
8977I7691110J964587L301856M920158O150973P929509J0090542J2362077J6227403
$$ 97691110 99655697 102957553 107877711 114028684 121958193 132048735 144410812 160638215
8969A60638215J9816957K3710138K4062608J8183017N229268n947127r235959
$$ 160638215 180455172 204165310 228227918 246410935 251640203 245693076 236457117
8962B36457117q045375k874369K836338Q537678R079909J012695j2911048k2030885
$$ 236457117 228411742 225537373 228373711 236911389 245991298 247003993 234092945 212062060
8954B12062060k4306647k2640487j8508741j4919272j1223826q520214p284470
$$ 212062060 187755413 165114926 146606185 131686913 120463087 111942873 104658403
8947A04658403o224018n288630m401211k837705k860075k285372j470244j495050
$$ 104658403 98434385 93145755 88744544 85906839 83046764 80761392 79291148 77796098
8939G7796098m72553j024138n65411Q68849J376136K575265L003151M284648O091518
$$ 77796098 77323545 76299407 75733996 76602845 77978981 80554246 83557397 87842045 93933563
8930I3933563Q161793J0661725J4765703J6687318R511100m648988j3756586j5972781
$$ 93933563 102095356 112757081 127522784 144210102 153721202 149072214 135315628 119342847
8922A19342847j4280411j0838218q218999o332995m824548k900877j975324k009318
$$ 119342847 105062436 94224218 86005219 79672224 74847676 71946799 69971475 67962157
8914F7962157j323945q51026r43014k81788R0877J81719j61436K02519O55767
$$ 67962157 66638212 65787186 64844172 64562384 64653261 64834980 64673544 64876063 65531830
8905F5531830Q90282N14274M29527R06693J300322J436135K238046K361047K764280
$$ 65531830 66422112 66936386 67365913 68272606 69572928 71009063 73247109 75608156 78372436
8896G8372436L976081N141150N181875N581046P358645Q785097J1103961J3626194
$$ 78372436 82348517 87489667 92671542 98252588 105611233 114396330 125500291 139126485
8888A39126485J6910990K0774716K5465466L0267813L4440697L2925392K3432238
$$ 139126485 156037475 176812191 202277657 232545470 266986167 299911559 323343797
8881C23343797Q904203p633841k3846120l4378160l6302558l2841472k7228993
$$ 323343797 332248000 324614159 300768039 266389879 230087321 197245849 170016856
8874A70016856k1009732j6452150j2539390j0457033p832076o480110n438535
$$ 170016856 149007124 132554974 120015584 109558551 101726475 95246365 89807830
8867H9807830m640722l871749l140514l000337k657341j891250r56752n09021
$$ 89807830 85167108 81295359 78154845 75154508 72497167 70605917 69649165 69140144
8859F9140144o90967q4941J96085M43397J155848J475086J838570L128931M129424
$$ 69140144 68449177 68364236 68560321 69003718 70159566 71634652 73473222 76602153 80731577
8850H0731577N595749P611325J0191244J2124568J4091149J6857735J7207332
$$ 80731577 86327326 93938651 104129895 116254463 130345612 147203347 164410679
8843A64410679J2661690M855961m771923j3174368j8731952k0079822j8015424
$$ 164410679 177072369 181928330 177156407 163982039 145250087 125170265 107154841
8836A07154841j5115969j1814032r455961p608706n720272m451247m180427l008098
$$ 107154841 92038872 80224840 70768879 63160173 57439901 52988654 48808227 45800129
8828D5800129l111677k841509k559053j560543j768903j932714j436496r28300
$$ 45800129 42688452 39846943 37287890 35727347 33958444 32025730 30589234 29660934
8820B9660934j950162j292520p24388q50857j553099p16914j241644q14548k91196
$$ 29660934 27710772 26418252 25693864 24843007 23289908 22572994 21331350 20516802 20225606
8811B0225606q58352o54322m50156n86308p80276m18384n37850q5549l37733o11397
$$ 20225606 19367254 18712932 18262776 17676468 16896192 16477808 15939958 15854409 15516676 14905279
8801A4905279q72437m35478m39045R466n17306k47430P1482l15836k55890o31862
$$ 14905279 14032842 13597364 13158319 13167785 12650479 12403049 12474531 12158695 11902805 11270943
8791A1270943n11813n25870j4372m7005o38478l00290r3851J80030l82879n29060
$$ 11270943 10759130 10233260 10218888 10171883 9533405 9233115 9139264 9319294 8936415 8407355
8781H407355m51844l86601K18727l78934J2534L87280l50901n14736r354J04083
$$ 8407355 7955511 7568910 7787637 7408703 7421237 7808517 7457616 6942880 6933526 7037609
8771G037609j25532Q5413O20379m36112k4196J92462k994o7513j40385k51639
$$ 7037609 6912077 6997490 7617869 7181757 7157561 7350023 7347029 7279516 7139131 6887492
8761F887492l27060L62145J46545L2957l93859M78137J77413k29412k08162m10357
$$ 6887492 6560432 6922577 7069122 7102079 6708220 7186357 7363770 7134358 6926196 6515839
8751F515839o46223M9185m47797L62676J49064n38837j31238K8633j23575N0537
$$ 6515839 5869616 5918801 5471004 5833680 5982744 5443907 5312669 5341302 5217727 5268264
8741E268264m89434n39159L51989M64033R2918O1356K36276l15354O86600o7860
$$ 5268264 4778830 4239671 4591660 5055693 5148611 5209967 5446243 5130889 5817489 5749629
8731E749629O43175n4265R6788j74966k76103m44325l60047P7987k61245J16008
$$ 5749629 6392804 6338539 6435327 6260361 5984258 5539933 5179886 5257873 4996628 5112636
8721E112636j04035L8488k26960k52864J1093K40705l1366n51060m04928j2890
$$ 5112636 5008601 5047089 4820129 4567265 4578358 4819063 4787697 4236637 3831709 3818819
8711C818819J40228k8153l06964k28125L1158L47954n4171M11612j92150n63677
$$ 3818819 3959047 3930894 3623930 3395805 3426963 3774917 3720746 4132358 3940208 3376531
8701C376531k0514M2606j48352M05463O4851n78856O25375J64461j15234K43743
$$ 3376531 3356017 3398623 3250271 3655734 3720585 3141729 3767104 3931565 3816331 4060074
8691D060074L38385n56478n00096K47766m87913l52204m88453j26176P86740k57204
$$ 4060074 4398459 3841981 3341885 3589651 3101738 2749534 2261081 2134905 2921645 2664441
8681B664441m63767l16006k18346L79476j51975Q7977R8880J66877R3371j78985
$$ 2664441 2200674 1884668 1666322 2045798 1893823 1981800 2080680 2247557 2340928 2161943
8671B161943L51388j50236k6259n7259o6786j14687K11147K35874n13011L234
$$ 2161943 2513331 2363095 2336836 2279577 2212791 2098104 2309251 2545125 2032114 2035348
8661B035348K6890k39269J99753L45063o30128j46064l03174j20750L15079L2441
$$ 2035348 2062238 1822969 2022722 2367785 1737657 1591593 1288419 1167669 1482748 1515189
8651A515189O3700J26805J00909J81128m42096k562r9833j72700L13993j90792
$$ 1515189 1578889 1705694 1806603 1987731 1545635 1543073 1443240 1270540 1584533 1393741
8641A393741K4315M28916K23272J50678j84383j68881L8588J10231K13667L99728
$$ 1393741 1418056 1846972 2070244 2220922 2036539 1867658 1906246 2016477 2230144 2629872
8631B629872m6885k13221J63312J30545j2077j39650M87459J71879r13154N05746
$$ 2629872 2582987 2369766 2533078 2663623 2651546 2511896 2999355 3171234 2258080 2763826
8621B763826J94658m92602K31711n15513m26898J49706R7921M36922l14283Q8486
$$ 2763826 2958484 2465882 2697593 2182080 1755182 1904888 2002809 2439731 2125448 2213934
8611B213934l3926l65828N38404N1146j06856p34545j69087j17775M89812r5197
$$ 2213934 2180008 1814180 2352584 2403730 2296874 1562329 1393242 1275467 1765279 1670082
8601A670082k2248M77905m23329K94594R9310k69677j33272p9361j74971j23005
$$ 1670082 1647834 2125739 1702410 1997004 2096314 1826637 1693365 1614004 1439033 1316028
8591A316028K05895M86147N0309j126k72159n49865J33384J86326J08149K77791
$$ 1316028 1521923 2008070 2058379 2057253 1785094 1235229 1368613 1554939 1663088 1940879
8581A940879K18371N0296R8053l61290Q2096j31068R3540L08129j19781m74553
$$ 1940879 2159250 2209546 2307599 1946309 2028405 1897337 1990877 2299006 2179225 1704672
8571A704672l76329J92568K84682P6207j35856j56967k37297j21206j89730J3331
$$ 1704672 1328343 1520911 1805593 1881800 1745944 1588977 1351680 1230474 1040744 1054075
8561A054075j76920j69538N6416M67730l29639J33423j06428l14648N66616P8166
$$ 1054075 877155 707617 764033 1231763 902124 1035547 929119 614471 1181087 1259253
8551A259253k14181q55728O90656J65575m13344l38317J78457O63885j2863N4077
$$ 1259253 1045072 189344 880000 1045575 632231 293914 472371 1136256 1123393 1177470
8541A177470l90571P8424J17594q478R9132p1642r6859l16843L00635m4831j61893
$$ 1177470 786899 865323 982917 974439 1073571 1001929 905070 588227 888862 844031 682138
8530F82138Q6131R3343R4802J07813j1715j51659l63211q2888J22443L12283o1714
$$ 682138 768269 861612 956414 1064227 1052512 900853 537642 454754 577197 889480 827766
8519H27766K49270J45715J55484L11041J34587Q4182K65228j29651j83699k84063
$$ 827766 1077036 1222751 1378235 1689276 1823863 1908045 2173273 2043622 1859923 1575860
8509A575860k20508J01920k26961q716J34038j85292k53812k86060j53677P20509
$$ 1575860 1355352 1457272 1230311 1221595 1355633 1170341 916529 630469 476792 1197301
8499A197301j93897N3369l14050o7958k48219K87885k47099J43367J06977J98089
$$ 1197301 1003404 1056773 742723 674765 426546 714431 467332 610699 717676 915765
8489I15765m24638k92621k16747n9917M19839Q6015J64702n47600L00468N27893
$$ 915765 491127 198506 -18241 -78158 341681 427696 592398 44798 345266 873159
8479H73159M65826p14440J31416O0413l6208O37056L25957J29130k40624m32618
$$ 873159 1338985 624545 755961 816374 780166 1417222 1743179 1872309 1631685 1199067
8469A199067k70192k31654J11794k23032k8477j49825K97937L61245l45644m23777
$$ 1199067 928875 697221 809015 585983 557506 407681 705618 1066863 721219 297442
8459B97442K78999L63212l79067j11528K90468k88723M26601Q1640Q1577K08539
$$ 297442 576441 939653 560586 449058 739526 450803 877404 959044 1040621 1249160
8449A249160p8077J24979j45850j5470m69780L6124L5041J33971k83460k10804
$$ 1249160 1171083 1296062 1150212 1134742 664962 701086 736127 870098 586638 375834
8439C75834k33877M68564O1703j03542m74940K28131L93479k13137J32905j37568
$$ 375834 141957 610521 672224 568682 93742 321873 715352 502215 635120 497552
8429D97552m88638k75583M57914M21979k42464K1651N13796l92306n1049o5461
$$ 497552 8914 -266669 191245 613224 370760 392411 906207 513901 462852 397391
8419C97391k1275r9794K42481K1424J2980j4909p1721J69681J20774l40311l02380
$$ 397391 376116 276322 518803 540227 553207 538298 466577 636258 757032 416721 114341
8408A14341J65312k449j94770l5340J03128j15210j81427J74373J25176K89629
$$ 114341 279653 277204 82434 47094 150222 35012 -146415 27958 153134 442763
8398D42763L29362j91545m69256N4565L23231J34450M03288k88173j45825o19249
$$ 442763 772125 580580 111324 165889 489120 623570 1026858 738685 592860 -26389
8388b6389M09048j82453k869L87894n80709K07261K78833l05227J55407O4511
$$ -26389 382659 200206 197337 585231 4522 211783 490616 185389 340796 405307
8378D05307k46282R0262O60792l27028L19555j60019p35406J62786K10062k09901
$$ 405307 159025 249287 910079 583051 902606 742587 7181 169967 380029 170128
8368A70128k46958K97185L6128j72615L58305l33189j92050j2794O6658J1903
$$ 170128 -76830 220355 256483 83868 442173 108984 -83066 -95860 -29202 -17299
8358a7299J46458k25432K4870N5465o1438M55972j87118j36642n7533O23942p76942
$$ -17299 129159 -96273 -71403 -15938 -77376 378596 191478 54836 -2697 621245 -155697
8347a55697l60961J25763N34900R0287J809N6902j68027L41390j937k52710J58116
$$ -155697 -516658 -390895 144005 234292 236101 293003 124976 466366 464429 211719 369835
8336C69835n23024J65149l19415J90444m8484q2966K99669J44223K89641j65706
$$ 369835 -153189 11960 -307455 -117011 -165495 -248461 51208 195431 485072 319366
8326C19366l79167K30450m3692k96329l1397m9647O2153j32979N05401m513m39947
$$ 319366 -59801 170649 126957 -169372 -200769 -250416 -188263 -321242 184159 179646 -260301
8315b60301P6775P69280p33873l24624O11696l2725k15981j73495o2828K30055
$$ -260301 -183526 585754 -148119 -472743 138953 106228 -109753 -283248 -346076 -116021
8305a16021K37680J38689j84320j47687n6607j35712J93349R2000j5705k71842
$$ -116021 121659 260348 76028 -71659 -128266 -263978 -70629 21371 5666 -266176
8295b66176L91919K35670J96708l67820K9982K29665j32061O10453J24262l45306
$$ -266176 125743 361413 558121 190301 220283 449948 317887 928340 1052602 707296
8285G07296m2291p92012p7136K31253O1943J99419K3946P0875q7167K0980K66865
$$ 707296 665005 -127007 -204143 27110 89053 288472 312418 383293 296126 317106 583971
8274E83971n14225k33211k45396K40350L75899m4406k99761j66944P244J54031
$$ 583971 69746 -163465 -408861 -168511 207388 162982 -136779 -303723 -296479 -142448
8264a42448L38082m0796O15975k33878k5881k4430k35032n21924M46590k81107
$$ -142448 195634 154838 770813 536935 511054 486624 251592 -270332 176258 -104849
8254a04849R6729P465M9033K19180j95770o08704J18597K15277M1412L80194j16426
$$ -104849 -8120 -655 48378 267558 71788 -536916 -418319 -203042 -161630 218564 102138
8243A02138l33580J75882J76137m6102O4192R2628J77109k44310m40367K58876
$$ 102138 -231442 -55560 120577 74475 138667 231295 408404 164094 -276273 -17397
8233a7397j73759Q7612R6864K3099J44174j05683m37961L4479L52883r8351K85227
$$ -17397 -191156 -103544 -6680 16419 160593 54910 -383051 -348572 4311 -94040 191187
8222A91187k75591K42843m71360K66086N18205J43848j80645p38947Q2109M73394
$$ 191187 -84404 158439 -312921 -46835 471370 615218 434573 -304374 -222265 251129
8212B51129l86994J04394K27803J47120l25181M29124K8341O874m06439K95224
$$ 251129 -135865 -31471 196332 343452 18271 447395 475736 482610 76171 371395
8202C71395k28253L47811r2181L23457j15136J054945j7074Q67190k73346L567741
$$ 371395 143142 490953 398772 722229 607093 1662038 1644964 2512154 2238808 5806549
8192E806549j347764p679697J517849q90018Q85394J96748N29933k18877k7110
$$ 5806549 4458785 -3220912 -1703063 -2593081 -1707687 -1510939 -981006 -1199883 -1226993
8183a226993N6775M05304j83880K79957J51077l6088M75246q28k3295K71437O7358
$$ -1226993 -1170218 -764914 -948794 -668837 -517760 -553848 -78602 -79430 -102725 168712 236070
8172B36070k67306l53279J12522L33705j60914o7063j35714n80435J51981N91250
$$ 236070 -31236 -384515 -271993 61712 -99202 -166265 -301979 -882414 -730433 -139183
8162a39183M580m03176l06079J15138L10497J92036m49711L92159l31026O28002
$$ -139183 -134603 -537779 -843858 -728720 -418223 -226187 -675898 -283739 -614765 13237
8152A3237K1748k02971m30274J35893O33784J09888l59136l53415L86606L85168
$$ 13237 34985 -167986 -598260 -462367 171417 281305 -77831 -431246 -44640 340528
8142C40528k16410k46861L3541J27245m0836k08594j55434L8813K96674j28540
$$ 340528 124118 -122743 -89202 38043 -2793 -211387 -366821 -328008 -31334 -159874
8132a59874o32685K14820O24258j56944k04471L49823K18039n30813q0233j57206
$$ -159874 -792559 -577739 46519 -110425 -314896 34927 252966 -277847 -358080 -515286
8122e15286L2415k19380L31562J12407m2328j8920N07579K2113q8340k53327n36840
$$ -515286 -482871 -702251 -370689 -258282 -300610 -319530 188049 210162 121822 -131505 -668345
8111f68345J63199L14935O56223k73434k99786J1201O8265R4478j7647q3081K81491
$$ -668345 -505146 -190211 466012 192578 -107208 -96007 -27742 66736 49089 -33992 247499
8100B47499q2767k88425n76474P4931k2273L85085J03504L70405J51117k42093
$$ 247499 164732 -123693 -700167 -625236 -647509 -262424 -158920 211485 362602 120509
8090A20509j38851l3989K55799l03899j68738M80405j35339j20445L529j69133
$$ 120509 -18342 -52331 203468 -100431 -269169 211236 75897 -44548 -41019 -210152
8080b10152P1568k3506k75939K9857J85377k08298m61369O49509N35801k25801
$$ -210152 -138584 -162090 -438029 -408172 -222795 -431093 -892462 -242953 292848 67047
8070F7047p11889J72364K54325l87120M63628J61082l26700n41143k24022L66063
$$ 67047 -644842 -472478 -218153 -605273 -141645 19437 -307263 -848406 -1072428 -706365
8060g06365M61510K14947j02459j25197R0143K09080R3779L7754J39897l50671
$$ -706365 -244855 -29908 -132367 -257564 -167421 41659 135438 173192 313089 -37582
8050c7582m07075m9172N33651J32182K5801n0041k35427P0069J09383j64525k29826
$$ -37582 -444657 -493829 39822 172004 197805 147764 -87663 -17594 91789 -72736 -302562
8039c02562j40154K34156K82717m74126O5216J07404l4452J47833n8168j44751
$$ -302562 -442716 -208560 74157 -399969 -334753 -227349 -261801 -113968 -172136 -316887
8029c16887k5860L06371j90736k29277K41539L98024k14946m69725J87919j57040
$$ -316887 -342747 -36376 -227112 -456389 -214850 183174 -31772 -501497 -313578 -470618
8019d70618l460L75301J15539k00747P7882n95877O24137l6070n52262k0747J23620
$$ -470618 -474078 -98777 16762 -183985 -106103 -701980 -77843 -113913 -666175 -686922 -563302
8008e63302l2220r8286J26522j06168L52966l92620K04118j39337L10966L13917
$$ -563302 -595522 -693808 -567286 -673454 -320488 -713108 -508990 -648327 -337361 -23444
7998b3444l68520q5038K81434M49595K48469k34322o37158N7528L17659j15663
$$ -23444 -391964 -477002 -195568 254027 502496 268174 -368984 -311456 6203 -109460
7988a09460j79541l6484K96202L01113p0835j08331M47176l8390q1787l06997
$$ -109460 -289001 -325485 -29283 271830 200995 92664 539840 501450 419663 112666
7978A12666q45000P5236M12425j71242m4582N02892K72702n91531m97112L0411
$$ 112666 -732334 -657098 -244673 -415915 -460497 42395 315097 -276434 -773546 -743135
7968g43135M69467k23156J716J65093M9073M2908r9803l8749K40232j62735J04567
$$ -743135 -273668 -496824 -495108 -330015 -280942 -238034 -337837 -376586 -136354 -299089 -194522
7957a94522J79998K44474o26187L8343J6069K14707K61691J34248J38735p54995
$$ -194522 -14524 229950 -396237 -357894 -341825 -127118 134573 268821 407556 -347439
7947c47439K69042M83027o36410j14862j46500L65771J63177o82660l38996M01734
$$ -347439 -78397 404630 -231780 -346642 -493142 -127371 35806 -646854 -985850 -584116
7937e84116K23375L99786j40495k89079k38529L22621N10013l3951j40885m42721
$$ -584116 -360741 39045 -101450 -390529 -629058 -306437 203576 169625 28740 -413981
7927d13981Q0784j99564k56720N32838L7162n94415L79571K76336Q1779L72946
$$ -413981 -333197 -532761 -789481 -256643 -219481 -813896 -434325 -157989 -76210 296736
7917B96736o670Q656j8945p2073k03705l05817N81425o9689O8263o1048l45433
$$ 296736 290066 298722 279777 207704 3999 -301818 279607 209918 278181 217133 -128300
7906a28300K32540O5717l84429n6976o0684J16438L51389k1233p94672M02553
$$ -128300 104240 169957 -214472 -271448 -332132 -215694 135695 114462 -680210 -277657
7896b77657j84010p3184r6038k83894O49503P11637k99178j70215J61844J39073
$$ -277657 -461667 -534851 -630889 -914783 -265280 446357 147179 -23036 138808 277881
7886B77881L9609K7480j10438k55339o9019M78034j63392j26338L55074m88403
$$ 277881 317490 344970 234532 -20807 -89826 388208 224816 98478 453552 -34851
7876c4851l45187j02516k46902K49715J30648k47317K14847j36767J91875K17808
$$ -34851 -380038 -482554 -729456 -479741 -349093 -596410 -381563 -518330 -326455 -108647
7866a08647j00610m9788j30341L47931k93981N46468m63930M25545M2716m57570
$$ -108647 -209257 -259045 -389386 -41455 -335436 211032 -252898 172647 215363 -242207
7856b42207l6584J20471L91451r6556n93237p3410O80891l15148k26633J04306
$$ -242207 -278791 -158320 233131 136575 -456662 -530072 150819 -164329 -390962 -286656
7846b86656k2656J00985o7159K0901J34154M46893n20683k36173k6769M9413N49668
$$ -286656 -309312 -208327 -275486 -254585 -120431 326462 -194221 -430394 -457163 -407750 141918
7835A41918m88375j14668l52463K68765K39149J16391l81452R2851K98335N05051
$$ 141918 -346457 -461125 -813588 -544823 -305674 -189283 -570735 -477884 -179549 325502
7825C25502m22100j27812M22856p3838k84251l23554L9551j42833J74609P90716
$$ 325502 -96598 -224410 198446 124608 -159643 -483197 -443646 -586479 -411870 378846
7815C78846j65726k61402J66747j72493k72729Q7054L04136j34145J88359l95768
$$ 378846 213120 -48282 118465 -54028 -326757 -239703 64433 -69712 118647 -277121
7805b77121K63797J95632m17503j53252j80528k2090Q5089K29618J68754k74717
$$ -277121 -13324 182308 -235195 -388447 -568975 -591065 -505976 -276358 -107604 -382321
7795c82321l09033K36173p6953P52262N452k69717R63K5300q1509Q1338p9373
$$ -382321 -691354 -455181 -532134 220128 225580 -44137 -43174 -17874 -99383 -18045 -97418
7784i7418m55887L19061l4063j29525K77527K39222K93226l02940n33838J76446
$$ -97418 -553305 -234244 -268307 -397832 -120305 118917 412143 109203 -424635 -248189
7774b48189k4299K4973L36062k65223k53169q026K17373o5012J34781J67471Q5535
$$ -248189 -272488 -247515 88547 -176676 -429845 -437871 -220498 -285510 -150729 16742 102277
7763A02277p34054K30471K78898m29521J58100K33308K6032J20665k4665j04602
$$ 102277 -631777 -401306 -122408 -551929 -393829 -160521 -134489 -13824 -38489 -143091
7753a43091r4752K12349J97426k91831n46159J69189K39430J75862O97425l6743
$$ -143091 -237843 -25494 171932 -119899 -666058 -496869 -257439 -81577 615848 579105
7743E79105l34506J0705l67360k01515J50823K94238K43181n75588n7383K28469
$$ 579105 244599 255304 -112056 -313571 -162748 131490 374671 -200917 -258300 -29831
7733b9831L09566k89703k67187k20029p2677K97164J30728J05533j14288q8955
$$ -29831 279735 -9968 -277155 -497184 -569861 -272697 -141969 -36436 -150724 -239679
7723b39679J22812m29081M72265J67304p0215L07491m85033n88164j96099N42527
$$ -239679 -116867 -545948 -73683 93621 23406 330897 -154136 -742300 -938399 -395872
7713c95872M03914J63018j80039J96497k22698r2325l37602J00217k6361j93888
$$ -395872 8042 171060 -8979 187518 -35180 -127505 -465107 -364890 -391251 -585139
7703e85139q9653L59907L76860J16429j84211k69143O51997o45973O6039L72969
$$ -585139 -674792 -314885 61975 178404 -5807 -274950 377047 -268926 -202887 170082
7693A70082o40737L8183p4062j00662M76968N4470J46068J50559l89370J15080
$$ 170082 -470655 -432472 -506534 -607196 -130228 -75758 70310 220869 -168501 -53421
7683e3421o7756L109J66538j71049M78753l35001R8212j65976O4438m87211o2032
$$ -53421 -121177 -118068 48470 -122579 356174 21173 119385 -46591 17847 -469364 -531396
7672e31396M65627J32812l46066l67823L61795J28129K4330L3953J19012K02783
$$ -531396 -65769 67043 -279023 -646846 -285051 -156922 -132592 -98639 20373 223156
7662B23156J92904l40762j13353N89388q1082k25389k11266q256J01292l86531
$$ 223156 416060 75298 -38055 551333 470251 244862 33596 25340 126632 -259899
7652b59899q6066J24250L0613j25625k02866N05714n1300j26761j95152K48344
$$ -259899 -345965 -221715 -191102 -316727 -519593 -13879 -65179 -191940 -387092 -138748
7642a38748N2428p9843j49872k25541J23129n62481M19833Q0286n3819j28948
$$ -138748 -86320 -166163 -316035 -541576 -418447 -980928 -561095 -480809 -534628 -663576
7632f63576M42283J57658K18137m42466j85452N73651j67165l54125J67489N00589
$$ -663576 -221293 -63635 154502 -287964 -473416 100235 -66930 -421055 -253566 247023
7622B47023k17738k45074K4230M78136l48280J44968L89703l84974m27091k83773
$$ 247023 29285 -215789 -191559 286577 -61703 83265 472968 87994 -339097 -622870
7612f22870m60164O33311O04470j52728K715K43630n76184l09585j23251K11894
$$ -622870 -1083034 -449723 154747 2019 4734 248364 -327820 -637405 -760656 -548762
7602e48762K05483m5259M57487k08933o34041P67765K65425l09610k91564j38740
$$ -548762 -343279 -388538 68949 -139984 -774025 -6260 259165 -50445 -342009 -480749
7592d80749K85354O4423L4635j950J72845o3539q6094j78830R2474l75379K65749
$$ -480749 -195395 -130972 -96337 -98287 74558 11019 -75075 -253905 -161431 -536810 -271061
7581b71061K53907J85503k61334P0744M29542m24873k7449L09972j9812j98257
$$ -271061 -17154 168349 -92985 -22241 407301 -17572 -45021 264951 245139 46882
7571D6882J40914M830k61209J78897L62296j30124l38701l07664K9120L063n3646
$$ 46882 187796 192626 -68583 110314 472610 342486 3785 -303879 -274759 -271696 -325342
7560c25342M2117m58593K59126J71059N11071k69566J21759n5530k10151L27222
$$ -325342 -283225 -741818 -482692 -311633 199438 -70128 51631 -3899 -214050 113172
7550A13172O7209p13052l53840M00905K34790N5411K13274K49317n1315l40223
$$ 113172 180381 -532671 -886511 -485606 -250816 -195405 17869 267186 215871 -124352
7540a24352J49188l39405M24867j12063m27824j16281J16877J58325j405K19310
$$ -124352 24836 -314569 110298 -1765 -429589 -545870 -428993 -270668 -272073 -52763
7530e2763K10328M50263k15452m17480j01825m2890k53173O6466K7551Q3229K75857
$$ -52763 157565 607828 392376 -25104 -126929 -169819 -422992 -356526 -328975 -245746 30111
7519C0111K8447n7228J18698l83941J59853N370M3653J02698q2960j5724J05373
$$ 30111 58558 1330 120028 -263913 -104060 -98690 -55037 47661 -35299 -51023 54350
7508E4350M24189L03975k82078r39475J80755k92194m27567L29644q5385J31411
$$ 54350 478539 782514 500436 -439039 -258284 -550478 -978045 -648401 -733786 -602375
7498f02375L80341m29821n3381P29206p8281j91204J66894j85554k56124L39483
$$ -602375 -222034 -651855 -705236 23970 -54311 -245515 -78621 -264175 -520299 -180816
7488a80816M09922r7565p1052L43639j48338L8224m74948Q9768q3526l18049J22643
$$ -180816 229106 131541 60489 404128 255790 294014 -180934 -91166 -174692 -492741 -370098
7477c70098L13898o5897N49643n63935p00261j43426L14676K16095q5221J47886
$$ -370098 -56200 -122097 427546 -136389 -836650 -980076 -665400 -449305 -534526 -386640
7467c86640M88903K48856k94901j70818j54837j35347o4060o5364M07653J46723
$$ -386640 102263 351119 56218 -114600 -269437 -404784 -468844 -534208 -126555 20168
7457B0168j23944n65954J62838K53864p4592K53848r4448m5867k43343M81840
$$ 20168 -103776 -669730 -506892 -253028 -327620 -73772 -168220 -214087 -457430 24410
7447B4410K93640l55926M7297N815k20103k23706Q5349L71798l86507P8386Q4336
$$ 24410 318050 -37876 9421 15236 -204867 -428573 -343224 28574 -357933 -279547 -195211
7436a95211J32120j04416l02276P3958k03796K59375L5457k14747Q4632J51966
$$ -195211 -63091 -167507 -469783 -395825 -599621 -340246 -304789 -519536 -434904 -282938
7426b82938n9443l09975K82992j07715J87659q8588J85826R3465o7474P1699m96479
$$ -282938 -342381 -652356 -369364 -477079 -289420 -378008 -192182 -98717 -166191 -94492 -590971
7415e90971l21414M16332J5670M09727K57510K44552j72262j25817k78843o04618
$$ -590971 -912385 -496053 -480383 -70656 186854 431406 259144 133327 -145516 -750134
7405g50134L71387L51212l21073k57841J55938p3222K9294K99932R7643K67188
$$ -750134 -378747 -27535 -348608 -606449 -450511 -523733 -494439 -194507 -96864 170324
7395A70324j72536n85784j92450r5180M07291J34797m3843l7130k25318K04820
$$ 170324 -2212 -587996 -780446 -875626 -468335 -333538 -377381 -414511 -639829 -435009
7385d35009M65469K17345k31199l05630P5797q2661j70778L16447m0096M63803
$$ -435009 30460 247805 16606 -289024 -213227 -295888 -466666 -150219 -190315 273488
7375B73488J58983k39784k0864O1984l95863k58033J64551J4774M16968j8149
$$ 273488 432471 192687 171823 233807 -162056 -420089 -255538 -240764 176204 158055
7365A58055j9498k81383J47579l16066J5848K81424K72499n87010j87668M69860
$$ 158055 138557 -142826 4753 -311313 -295465 -14041 258458 -328552 -516220 -46360
7355d6360K2107j32811j66882J50233l10177l35511O65561P120j59257o4570N59985
$$ -46360 -24253 -157064 -323946 -173713 -483890 -819401 -153840 -146720 -305977 -370547 189438
7344A89438j48095k18397j16734J33572J97068j03918K47451L9666k6332Q814
$$ 189438 41343 -177054 -293788 -160216 36852 -67066 180385 220051 193719 202533
7334B02533l50501L7405q9833P1308l0766Q6847k10591k80519M20357M08544j9416
$$ 202533 -147968 -110563 -200396 -129088 -159854 -73007 -283598 -564117 -143760 264784 245368
7323B45368O4408J18780m39375M0216J65434K0337l41362n54091j98208N75652
$$ 245368 309776 428556 -10819 29397 194831 215168 -126194 -680285 -878493 -302841
7313c02841K95598P74830l72643p9106L08816m59928l74845K89566m384K84720
$$ -302841 -7243 767587 394944 315838 624654 164726 -210119 79447 75063 359783
7303C59783n16806j37333K48369j52748k32643p885L6767l8863J90542J38578
$$ 359783 -157023 -294356 -45987 -198735 -431378 -439263 -402496 -441359 -250817 -112239
7293a12239L20947k72510m51108K71253L50955L2291j75521j98381l5910n15227
$$ -112239 208708 -63802 -514910 -243657 107298 139589 -35932 -234313 -270223 -785450
7283g85450M33387M59473J16468o2585O0157L65363l61445m09997L8732J03434
$$ -785450 -352063 107410 223878 161293 221450 586813 225368 -184629 -145897 -42463
7273d2463j82951Q9510J76206m0728k71476o38779L24308M0575j28783K26673
$$ -42463 -225414 -135904 40302 -426 -271902 -910681 -586373 -545798 -674581 -447908
7263d47908L85335P0690k43898J7445n53517N2973j11120O03623n5987o1916r3798
$$ -447908 -62573 8117 -235781 -218336 -771853 -718880 -830000 -226377 -282364 -344280 -438078
7252d38078M94697L694j86245P8632R372K34619K91521j33902J62025l4405L4900
$$ -438078 56619 60313 -125932 -47300 -37928 196691 488212 354310 516335 481930 516830
7241E16830m97371M3798J1657o4295l09868J32571k28067L9421M9257M2091L3325
$$ 516830 19459 63257 74914 10619 -299249 -166678 -394745 -355324 -306067 -263976 -230651
7230b30651o14726K76122j88690M09422K16359J78561Q0366j69606j41405K75334
$$ -230651 -845377 -569255 -757945 -348523 -132164 46397 126763 -42843 -184248 91086
7220I1086r7194m17962K16922J32073J54476j74958j25449P56433J70529m83122
$$ 91086 -6108 -424070 -207148 -75075 79401 -95557 -221006 535427 705956 222834
7210B22834m64688K8569l53087K51181J42240N03323L26096n76887k38238R6854
$$ 222834 -241854 -213285 -566372 -315191 -172951 330372 656468 79581 -158657 -61803
7200f1803l53189K78611j33064j46613J10336J84216J00200L39431o97910j54150
$$ -61803 -414992 -136381 -269445 -416058 -305722 -121506 -21306 318125 -379785 -533935
7190e33935K75941M18578n7107O7635l01699M0307J97837k98252J37945j01577
$$ -533935 -257994 160584 103477 171112 -130587 -90280 107557 -190695 -52750 -154327
7180a54327k49365K85295l2533M38171O8713m71650k30211L03867l81225j21431
$$ -154327 -403692 -118397 -150930 287241 355954 -115696 -345907 -42040 -423265 -544696
7170e44696k15273K45338k0248J67106M25199K31930l60041q2839j26508o2663
$$ -544696 -759969 -514631 -534879 -367773 57426 289356 -70685 -153524 -280032 -342695
7160c42695L40142k60582r2041R1084J89010j5142j93645M37611J55851n04662
$$ -342695 -2553 -263135 -355176 -264092 -75082 -90224 -283869 153742 309593 -195069
7150a95069q3083L18915K82411N9561k27219l5559p3118k0738L81422m41778k36647
$$ -195069 -278152 40763 323174 382735 155516 119957 46839 26101 407523 -34255 -270902
7139b70902O4955r5768m45372O83590j79735J04574j63049K27961J39705l18006
$$ -270902 -205947 -301715 -747087 -63497 -243232 -138658 -301707 -73746 65959 -252047
7129b52047K64307l3035j87267J99665n36375L39515R7161j44484M34813k62790
$$ -252047 12260 -20775 -208042 -8377 -544752 -205237 -108076 -252560 182253 -80537
7119h0537j35395Q78416k0838n35671k33616j05058L94057j08198j12061J14876
$$ -80537 -215932 662484 641646 105975 -127641 -232699 161358 53160 -58901 55975
7109E5975L75321o3051k23971n3375J6714M33406l27840k80187R0357j03740m61895
$$ 55975 431296 368245 144274 90899 107613 541019 213179 -67008 23349 -80391 -542286
7098e42286k85810M5943Q62567k83126k64243K26994K09418p55616K06699P57585
$$ -542286 -828096 -782153 80414 -202712 -466955 -239961 -30543 -786159 -579460 178125
7088A78125l32477J14592L07131k61996j57556j09091K36478j8431Q7258k34126
$$ 178125 -154352 -39760 267371 5375 -152181 -261272 -24794 -43225 44033 -190093
7078a90093K04914l1264k32880k04746J16350Q4956j69299M10554J70207j14129
$$ -190093 14821 -16443 -249323 -454069 -337719 -252763 -422062 -11508 158699 44570
7068D4570j8877n26652m11051M84580K5231J73907K60422K41543J91431K47427
$$ 44570 25693 -500959 -912010 -427430 -402199 -228292 32130 273673 465104 712531
7058G12531O6537o07823j26325j38771j17593O26646j84547j06577L92749p3550
$$ 712531 779068 171245 44920 -93851 -211444 415202 230655 124078 516827 443277
7048D43277k55387m0868K05011k99858j19478M67328O7028j61813p0175K5084
$$ 443277 187890 147022 352033 52175 -67303 400025 467053 305240 235065 260149
7038B60149k08257o5697k39003L34557K06200Q9837p23608p0362J19588K77414
$$ 260149 51892 -13805 -252808 81749 287949 377786 -345822 -416184 -296596 -19182
7028a9182J19934k89159Q0996k10025j5774k24367J32193L93475n1692k47640
$$ -19182 100752 -188407 -107411 -317436 -333210 -557577 -425384 -31909 -83601 -331241
7018c31241k51234L85057K69630J42941L1265n21322J02183L94879m08614m8592
$$ -331241 -582475 -197418 72212 215153 246418 -274904 -172721 222158 -186456 -235048
7008b35048L40425k48386j33898l16978K24968J31431M14282O3922o81272J72475
$$ -235048 105377 -143009 -276907 -593885 -368917 -237486 176796 240718 -440554 -268079
6998b68079J15692J67590l41275K83682k90043j9067K92154N0534J21365M32146
$$ -268079 -152387 15203 -326072 -42390 -332433 -351500 -59346 -8812 112553 544699
6988E44699n05919J22780j48052N6513J3319k10012q6920J6229J61684l08864
$$ 544699 38780 161560 13508 70021 83340 -126672 -213592 -197363 -35679 -344543
6978c44543J30410J37400k83025K51923k3502O0858n10931R4667L43921m7012
$$ -344543 -214133 -76733 -359758 -107835 -131337 -70479 -581410 -486743 -142822 -189834
6968a89834J68391l41800M97725l29177o18752L50975Q2894N31392m4372n2703
$$ -189834 -21443 -363243 134482 -194695 -813447 -462472 -379578 151814 107442 54739
6958E4739K60234k70330p613q2657j89712m38921K93720K93255O26469o04701
$$ 54739 314973 44643 37030 -45627 -235339 -674260 -380540 -87285 539184 -65517
6948f5517l31449L7745k14634r3615K94009R6740P4893K14901K75773l46610p45781
$$ -65517 -396966 -359221 -573855 -667470 -373461 -276721 -201828 13073 288846 -57764 -803545
6937h03545N47938j19581k03068O31996m3220l42858K48426j95619n85283M82416
$$ -803545 -255607 -375188 -578256 53740 10520 -332338 -83912 -279531 -864814 -382398
6927c82398K87656k78275N56098K59401j639J50822m16694l09350k77987K46077
$$ -382398 -94742 -373017 183081 442482 440843 591665 174971 -134379 -412366 -166289
6917a66289M60584L64373r9569K4714N50259J96307k90547o27066p0312K50144
$$ -166289 294295 658668 559099 583813 1134072 1330379 1039832 412766 342454 592598
6907E92598k12552k32156k04071L38255J52229k92699k30545k69M03940l93808
$$ 592598 380046 147890 -56181 282074 434303 141604 -88941 -89210 314730 -79078
6897g9078j41873K30103k28856m45345K53316L98126L99559k9570l74753k8096
$$ -79078 -220951 9152 -219704 -665049 -411733 -13607 385952 356382 -18371 -46467
6887d6467L74708K29232o81812K06P59455p1049J07674j95579j010067L21998
$$ -46467 328241 557473 -124339 -124133 635322 564273 671947 476368 -533699 -211701
6877b11701M13319j49431j36883K59388l99243m47487L6611n9926k22934R8283
$$ -211701 201618 52187 -84696 174692 -224551 -672038 -635427 -695353 -918287 -820004
6867h20004N35963L76078o01227J34254L02314L8671m10149K73621Q1071k95138
$$ -820004 -284041 92037 -509190 -374936 -72622 -33951 -444100 -170479 -89408 -384546
6857c84546K94477o9579l45548j7266M22315j66383j12566L80409K8870J0119
$$ -384546 -90069 -159648 -505196 -522462 -100147 -266530 -379096 1313 30183 40302
6847D0302m38437L30627J89970l63884N3009k96333P2560J79086J29606J38701
$$ 40302 -398135 -67508 122462 -241422 -188413 -484746 -412186 -233100 -103494 35207
6837C5207k19515N4073p9452K81398k94664k68834R2237J25535J48564K33060
$$ 35207 -184308 -130235 -209687 71711 -222953 -491787 -399550 -274015 -125451 107609
6827A07609k63973j55261l40799Q3791K01772L03649J01282l97663K49327L6209
$$ 107609 -156364 -311625 -652424 -568633 -366861 -63212 38070 -359593 -110266 -74057
6817g4057O2075J18342J45663J95673o5670o02054n53466L40446q1716J76925
$$ -74057 -11982 106360 252023 447696 382026 -220028 -773494 -433048 -514764 -337839
6807c37839M32117j22529L9175j31097O33305j17747l21987m86309L52917L00361
$$ -337839 94278 -28251 10924 -120173 513132 395385 73398 -412911 -59994 240367
6797B40367k233k26089J77981j31384j88844n47109k9508L38558J26639M90995
$$ 240367 238134 12045 190026 58642 -130202 -677311 -706819 -368261 -241622 249373
6787B49373m4393l15614J79014j31970l31030P2183p1054j06640J95902j38566
$$ 249373 204980 -110634 68380 -63590 -394620 -322437 -393491 -500131 -304229 -442795
6777d42795O865N38599L87560m45699L36469J021o40197j28431L32761j12175
$$ -442795 -435930 102669 490229 44530 380999 382020 -258177 -386608 -53847 -166022
6767a66022k70486p7055K65850J14037N7480o4194l59103j3255J06567K5781r9051
$$ -166022 -436508 -513563 -247713 -133676 -76196 -140390 -499493 -512748 -406181 -380400 -479451
6756d79451K7306J5300k17125M32765j03824J02544J41678K5862m24970M01692
$$ -479451 -452145 -436845 -653970 -221205 -325029 -222485 -80807 -54945 -479915 -78223
6746g8223M3772R1409r6087k76760k955M43931K29313k23096n74617l92879L34063
$$ -78223 -34451 56958 -39129 -315889 -318844 125087 354400 131304 -443313 -836192 -502129
6735e02129N84394J86011j78925l15570J94244N08058l53282l26001L59071K07938
$$ -502129 82265 268276 89351 -226219 -31975 476083 122801 -203200 155871 363809
6725C63809j05103l49688n02218J66388K11495N64024m48900K27767j68170O0440
$$ 363809 258706 -90982 -593200 -426812 -215317 348707 -100193 127574 -40596 19844
6715A9844o8781o5349k18272J66534O10523l21853o86607J57315L80177K00564
$$ 19844 -48937 -114286 -332558 -166024 444499 122646 -563961 -406646 -26469 174095
6705A74095r8599J38838n6753M6504l64171J39940k10167j61497o33640J56395
$$ 174095 75496 214334 157581 204085 -160086 -20146 -230313 -391810 -1025450 -869055
6695h69055M00712L6700J16948j04384k56156N9059K31923l2304P1765r7482K31518
$$ -869055 -468343 -431643 -314695 -419079 -675235 -616176 -384253 -416557 -344792 -442274 -210756
6684b10756K13715N913j82529j51075n5363K03588k28244n39569N32155j45271
$$ -210756 2959 8872 -173657 -324732 -380095 -176507 -404751 -944320 -412165 -557436
6674e57436n6208p4115K8737K26097Q6778o8420l4958k74966J70385N33964l48021
$$ -557436 -613644 -687759 -659022 -432925 -346147 -414567 -449525 -724491 -554106 -20142 -368163
6663c68163r1761k67534J39457L29663K60677m27530l94004j25713K2357L69763
$$ -368163 -459924 -727458 -588001 -258338 2339 -425191 -819195 -944908 -922551 -552788
6653e52788P6585j56880J24232K41601K79670l42323J52639p4276m31849L18979
$$ -552788 -476203 -633083 -508851 -267250 12420 -329903 -177264 -251540 -683389 -364410
6643c64410P2010k57906m2357J52024J38251L32890J27345m42199K35051N79553
$$ -364410 -292400 -550306 -592663 -440639 -302388 30502 157847 -284352 -49301 530252
6633E30252o43661q1485N0198k13250J44771l03028M33770J05647n44442j1409
$$ 530252 -113409 -194894 -144696 -357946 -213175 -516203 -82433 23214 -521228 -532637
6623e32637L35130P32271k37827l61767r9078P1732l32762j00928J28577K85466
$$ -532637 -197507 534764 296937 -64830 -163908 -92176 -424938 -525866 -397289 -111823
6613a11823J01122L74345k93916l58703o8153l2800l0368j5028O30733n57362
$$ -111823 -10701 363644 69728 -288975 -357128 -389928 -420296 -435324 195409 -361953
6603c61953K39656N0805M4740l35660m37815k47005Q04773m6787J29419L47853
$$ -361953 -122297 -71492 -26752 -362412 -800227 -1047232 -242459 -289246 -159827 188026
6593A88026n43855J02732k24100P1214k62888Q4522M62244l14837L30235N47445
$$ 188026 -355829 -253097 -477197 -405983 -668871 -584349 -122105 -436942 -106707 440738
6583D40738j52972n9775l97049p6324M71158j02911l90517L27856k87984J20863
$$ 440738 287766 227991 -169058 -245382 225776 122865 -267652 60204 -227780 -106917
6573a06917l2476K31374J07666O236J11831k47626K12714m22883J9914M5709K7491
$$ -106917 -139393 91981 199647 205883 317714 70088 282802 -140081 -120167 -74458 -46967
6562d6967k00464O6517j48681k2367p3788J16336P0116K66453m2214O9354K14055
$$ -46967 -247431 -180914 -329595 -351962 -425750 -309414 -239298 27155 -15059 54295 268350
6551B68350N29215l58686n81502N6447l78040L30999L64411J46851R9644r48705
$$ 268350 797565 438879 -142623 -86176 -464216 -133217 231194 378045 477689 -471016
6541d71016J04283L06176K5569p5751L38190k95500M36349j70371m78725j30783
$$ -471016 -366733 -60557 -34988 -110739 227451 -68049 368300 197929 -280796 -411579
6531d11579j55269N32842R1016j93640L07791p50006n0511J25563p0119J63504
$$ -411579 -566848 -34006 57010 -136630 171161 -578845 -629356 -503793 -573912 -410408
6521d10408P0749K76021l10729O11773n10812p2949K07737J75602l05114K11782
$$ -410408 -339659 -63638 -374367 237406 -273406 -346355 -138618 36984 -268130 -56348
6511e6348k26124P6181N58416j7065m07560j43393m29911q303j22571J5774L45834
$$ -56348 -282472 -206291 352125 335060 -72500 -215893 -645804 -654107 -776678 -760904 -415070
6500d15070K73812K50394J11342o0326j1929N460o47367Q4048J24587K78394l15499
$$ -415070 -141258 109136 220478 160152 148223 153683 -493684 -409636 -285049 -6655 -322154
6489c22154m08710K00012q3967L98198r8659J85124j57391l94103m1935K54355
$$ -322154 -730864 -530852 -614819 -216621 -315280 -130156 -287547 -681650 -723585 -469230
6479d69230j73486K83983j74001K60350R4828l28527K02355L44590j63151l9633
$$ -469230 -642716 -358733 -532734 -272384 -177556 -506083 -303728 40862 -122289 -161922
6469a61922j4590m05770L78205o5185K09967j8179R7330j53079n81333R30486
$$ -161922 -176512 -582282 -204077 -269262 -59295 -77474 19856 -133223 -714556 215930
6459B15930N8750j07938m98007M01385L74157l95856k68740j31502j81420q4560
$$ 215930 274680 166742 -331265 70120 444277 48421 -220319 -351821 -533241 -617801
6449f17801M24939J97943K89780j75736k61964P4248M8518M6166j30936q3909
$$ -617801 -192862 5081 294861 119125 -142839 -68591 -20073 26093 -104843 -188752
6439a88752P393k47339l87560k31065M05888j17435K81041J42875P87114J88489
$$ -188752 -181359 -428698 -816258 -1047323 -641435 -758870 -477829 -334954 452160 640649
6429F40649m02424m05519J39706O599l81636K24513L25833r9773p8519j87913
$$ 640649 238225 -167294 -27588 -20989 -402625 -178112 147721 47948 -30571 -218484
6419b18484j71238P3713m40744M07041L19212m4436o33962J53743k44777l18520
$$ -218484 -389722 -316009 -756753 -349712 -30500 -74936 -708898 -555155 -799932 -1118452
6409a118452K81250N01424J54768j51457O65716p46398L6413L92659l57807j67394
$$ -1118452 -837202 -335778 -181010 -332467 333249 -413149 -376736 15923 -341884 -509278
6399e09278p4076J95467K79356M6283J6983k66131K85889k13540j82654K07848
$$ -509278 -583354 -387887 -108531 -62248 -45265 -311396 -25507 -239047 -421701 -213853
6389b13853J77964l30839R4170j04764J1805K54570Q1218L20902k27575J104m16044
$$ -213853 -35889 -366728 -272558 -377322 -365517 -110947 -29729 291173 63598 64702 -351342
6378c51342j09043O6666q937J78944p484l894l61859k8995K37347M19701Q2934
$$ -351342 -460385 -393719 -402656 -223712 -231196 -235090 -596949 -625944 -388597 31104 114038
6367A14038m16030J71375l10894j96689L25678p374L72855J45156l25159j20260
$$ 114038 -301992 -130617 -441511 -638200 -312522 -319896 52959 198115 -127044 -247304
6357b47304m78822k4900K00647M93954n25932j40678N04277r4839M19275o09347
$$ -247304 -726126 -751026 -550379 -56425 -582357 -723035 -218758 -313597 105678 -503669
6347e03669l0759P79762M50874k59208l63604j77824N16485k3200J46580k91449
$$ -503669 -534428 245334 696208 437000 73396 -104428 412057 388857 535437 243988
6337B43988l49569L93432L09970m59095m38045K68436j7128o2416m49886j11096
$$ 243988 -105581 287851 597821 138726 -299319 -30883 -48011 -110427 -560313 -671409
6327f71409N35140J01142M64610J34867L3j34343j075234K58503J09933Q9261
$$ -671409 -136269 -35127 429483 564350 564383 430040 -645194 -386691 -276758 -187497
6317a87497j21692j76329j96175n3034N33146l17116o5447L17482k56717j66116
$$ -187497 -309189 -485518 -681693 -734727 -201581 -518697 -584144 -266662 -523379 -689495
6307f89495M39755j58759n5099J75367j9213l67721L40229J2459J52529J83418
$$ -689495 -249740 -408499 -463598 -288231 -307444 -675165 -334936 -322477 -169948 13470
6297A3470j46908M02844l37077l40236L69427M93639p24864o3334J55326J50385
$$ 13470 -133438 269406 -67671 -407907 -38480 455159 -269705 -333039 -177713 -27328
6287b7328l99156j3902K93450j51612K46115P8821l61447q3793K06825N40796
$$ -27328 -426484 -440386 -146936 -298548 -52433 26388 -335059 -418852 -212027 328769
6277C28769o50612l72300k96005K89780J18010L15294J3673j86792K17989R7981
$$ 328769 -321843 -694143 -990148 -700368 -582358 -267064 -253391 -440183 -222194 -124213
6267a24213J38201L39253n57006r283L41226l88512L50538R566l87813O8519K58261
$$ -124213 13988 353241 -203765 -213048 128178 -260334 90204 99770 -288043 -219524 38737
6256C8737k44491K88809k82370k01015N4264r1680Q4699j23620P873N11646n19316
$$ 38737 -205754 83055 -199315 -400330 -346066 -437746 -353047 -476667 -468794 42852 -476464
6245d76464J03764M38489j68311M92400J40194l81150n57267j44465N20344k68657
$$ -476464 -372700 65789 -102522 389878 530072 148922 -408345 -552810 -32466 -301123
6235c01123Q8959k11152k76426J29028K59998L56811J61252m16200M9535J69050
$$ -301123 -212164 -423316 -699742 -570714 -310716 46095 207347 -208853 -159318 9732
6225I732k88682k10666L8437K43393L85513K62790l22914l24239K3457q9617N6015
$$ 9732 -278950 -489616 -451179 -207786 177727 440517 117603 -206636 -183179 -272796 -216781
6214b16781j79173l90637K76115J87197L91332j67092K06281K8110n30222l37830
$$ -216781 -395954 -786591 -510476 -323279 68053 -99039 107242 135352 -394870 -732700
6204g32700L76546M27885L76k40458M58133Q8877k54594L81155m33394l14094
$$ -732700 -356154 71731 72107 -168351 289782 378659 124065 505220 71826 -242268
6194b42268j24033K10197k5305l9806p2213k12694O4994K15409m5217N2754n2084
$$ -242268 -366301 -156104 -181409 -221215 -293428 -506122 -441128 -225719 -270936 -218182 -270266
6183b70266K11663j08799j18553l66146J99540L50009o0612M60582L3433p3184
$$ -270266 -58603 -167402 -285955 -652101 -452561 -102552 -163164 297418 330851 257667
6173B57667k11802p50104q1750J26576J04773Q5329M88231j44014L05226j65493
$$ 257667 45865 -704239 -785989 -659413 -554640 -469311 18920 -125094 180132 14639
6163A4639k01870K32451l2110O5660m1544o1598k693Q3032J50214K81752m35352
$$ 14639 -187231 45220 13110 78770 37226 -24372 -27065 55967 206181 487933 52581
6152E2581O5238n71003J23516l8552k07127n4963L75090L0625K26315J25017j16290
$$ 52581 117819 -453184 -329668 -368220 -575347 -630310 -255220 -224595 1720 126737 10447
6141A0447l15996J41588j2951K12635j23550j46519j82175K10282K58999J06987
$$ 10447 -305549 -163961 -176912 35723 -87827 -234346 -416521 -206239 52760 159747
6131A59747j86173k68280L09679K7815m52910oM00126M8522J53368J03672k79981
$$ 159747 -26426 -294706 14973 42788 -410122 -410128 -10002 38520 191888 295560 15579
6120A5579k78815J67713L35501j85751j31794J76272p7899L32973l47197k16334
$$ 15579 -263236 -95523 239978 54227 -77567 98705 20806 353779 6582 -209752
6110b09752l57512P02676l02031J8203k62256L31238j4520j49888m47200r4422
$$ -209752 -567264 135412 -166619 -148416 -410672 -79434 -93954 -243842 -691042 -785464
6100g85464L47563J61299K99602k74292J47061l0344k93843j00812O3769M33966
$$ -785464 -437901 -276602 23000 -251292 -104231 -134575 -428418 -529230 -465461 -31495
6090c1495N41780p5810n44213N5865n01115o5887M30674m23648k27820J63394
$$ -31495 510285 434475 -109738 -53873 -554988 -620875 -190201 -613849 -841669 -678275
6080f78275N90041l37707N91131J38596q239k88494m41286J31045j241J83919
$$ -678275 -88234 -425941 165190 303786 295547 7053 -434233 -303188 -304429 -120510
6070a20510J02663K787j10039Q6106j21987J63822o9025k94146L52191J0566J46258
$$ -120510 -17847 -15060 -125099 -38993 -160980 2842 -66183 -360329 -8138 2428 148686
6059A48686n00282N27417K96341j35278o46147M49120J82106n63755J4647j02498
$$ 148686 -351596 175821 472162 336884 -309263 139857 321963 -241792 -227145 -329643
6049c29643J56352O26949j11332l23339K80057o7195K36452q02589n24616N69691
$$ -329643 -173291 453658 342326 18987 299044 231849 468301 -334288 -858904 -289213
6039b89213j67422k48221L0710O08523K38975j67698L14744j02344N3582n7767
$$ -289213 -456635 -704856 -674146 -65623 173352 5654 320398 218054 271636 213869
6029B13869l15028m28085L36128K99916m74154J63910L24711k13967M7996l50128
$$ 213869 -101159 -529244 -193116 106800 -367354 -203444 121267 -92700 -44704 -394832
6019c94832l49933O04478O06731p6831k85742m337K32866m838r663k10450J20898
$$ -394832 -744765 -140287 466444 389613 103871 99534 332400 327562 317899 107449 228347
6008B28347o74310K55194K30176k12163K65699j60926L8147m04497L21008J05055
$$ 228347 -445963 -190769 39407 -172756 92943 -67983 -29836 -434333 -113325 -8270
5998h270L11104J67265n67578L32366j88962j23402J77098k58579o63874K85468
$$ -8270 302834 470099 -97479 234887 45925 -77477 99621 -158958 -822832 -537364
5988e37364N11214K4940k48058o789K19654K77342N9215k15167m4475k62628J21145
$$ -537364 -26150 -1210 -249268 -256057 -36403 240939 300154 84987 40512 -222116 -100971
5977a00971j97044K01891J12427J70543M01332k88684q081j00586k80347m49304
$$ -100971 -298015 -96124 16303 186846 588178 299494 291413 190827 -89520 -538824
5967e38824M55286M79244o5752L63509j11414m88029J01708j14111n67816N16312
$$ -538824 -83538 395706 329954 693463 582049 94020 195728 81617 -486199 30113
5957C0113k6061k37971M28490l55356l29333K55608J01539L28269j18390k98776
$$ 30113 4052 -233919 194571 -160785 -490118 -234510 -132971 195298 76908 -221868
5947b21868R1816j63053L64491L2871L41195l29491k13246j04767r1648k42959
$$ -221868 -130052 -293105 71386 104257 445452 115961 -97285 -202052 -293700 -536659
5937e36659J93293N46441J15819K6010K09896k46122j74690L15071j11393Q9407
$$ -536659 -343366 203075 318894 344904 554800 308678 133988 449059 337666 427073
5927D27073l09974L85051l98342J60472l7608j49187L01767K05518n9451o91567
$$ 427073 117099 502150 103808 264280 226672 77485 379252 584770 525319 -166248
5917a66248J47975J60198k49277j498J68376N5793r8386J1864L44968k9121q8759
$$ -166248 -18273 141925 -107352 -108850 59526 115319 16933 28797 373765 344644 255885
5906B55885l87094J12131L31347l35582L39504l00268L45544O2250l05404j82800
$$ 255885 -131209 -19078 312269 -23313 316191 15923 361467 423717 118313 -64487
5896f4487N1906l2861L993J05012M94889m37139O982K29010n9732L17365o3279
$$ -64487 -12581 -45442 -41449 63563 558452 121313 128295 357305 297573 614938 551659
5885E51659P3755p2409M6234l10049l16048K07133J73502o3788l08153K70903
$$ 551659 625414 553005 599239 289190 -26858 180275 353777 289989 -18164 252739
$$ [...]
##END NTUPLES=NMR SPECTRUM
##END=
