##TITLE=1H_CA-9242-1
 CDCl3
 8 sc, 
 12.2.2024
##JCAMPDX= 6.0         $$ Bruker NMR JCAMP-DX V2.0
##DATA TYPE= NMR SPECTRUM
##DATA CLASS= NTUPLES
##ORIGIN= UXNMR, Bruker Analytische Messtechnik GmbH
##OWNER= root
$$ XWIN-NMR		Version 3.5
$$ Mon Feb 12 14:46:38 2024 Russian Standard Time (UT+4h)  she@DPX200
##.OBSERVE FREQUENCY= 200.1313
##.OBSERVE NUCLEUS= ^1H
##.ACQUISITION MODE= SIMULTANEOUS
##.ACQUISITION SCHEME= undefined
##.AVERAGES= 8
##.DIGITISER RES= 18
##SPECTROMETER/DATA SYSTEM= spect
##.PULSE SEQUENCE= zg30
##.SOLVENT NAME= CDCl3
##.SHIFT REFERENCE= (INTERNAL, CDCl3, 0, 15.5607)
##AUDIT TRAIL= $$ (NUMBER, WHEN, WHO, WHERE, WHAT)
$$ ##TITLE= Audit trail, XWIN-NMR		Version 3.5
$$ ##JCAMPDX= 5.01
$$ ##ORIGIN= Bruker BioSpin GmbH
$$ ##OWNER= she
$$ F:/spectra/data/she/nmr/H-F/1/pdata/1/auditp.txt
$$ ##AUDIT TRAIL=  $$ (NUMBER, WHEN, WHO, WHERE, WHAT)
(   1,<2024-02-12 14:45:27.21 +0400>,<she>,<DPX200>,
      <created by zg, POWCHK disabled, PULCHK disabled
       configuration hash MD5:
       00 E9 B6 7A A2 85 ED C7 34 08 36 98 17 FE 4E 26
       data hash MD5: 16K
       EF 1D B1 8F 30 3F BE D7 74 6D A3 E1 8A 75 01 8C>)
(   2,<2024-02-12 14:45:29.64 +0400>,<she>,<DPX200>,
      <Start of raw data processing
       efp BC_mod = 2 LB = 0.24 FT_mod = 6 PKNL = 1 PHC0 = -24941.12 PHC1 = -1.347304 SI = 16K 
       data hash MD5: 16K
       C8 12 4C 20 C6 13 29 F3 6C F4 0D 06 32 45 37 00>)
(   3,<2024-02-12 14:45:49.07 +0400>,<she>,<DPX200>,
      <pk PHC0 = -2.457323 PHC1 = 5.8 
       data hash MD5: 16K
       6D 06 67 35 82 0E 4A 90 C7 EF B4 4B 1B 0F 33 83>)
(   4,<2024-02-12 14:45:52.32 +0400>,<she>,<DPX200>,
      <abs ABSG = 5 
       data hash MD5: 16K
       FE 9A 47 DE 9E A4 02 73 8E 16 7F C7 CF 9D B6 53>)
$$ ##END=
$$ 
$$ hash MD5
$$ 98 91 DA CF 25 26 0B 83 A6 D8 B9 23 0A F2 47 3D
##$RELAX= 
##$RELAX= 
##$RELAX= 
##$RELAX= 
##$RELAX= 
##$RELAX= 
$$ Bruker specific parameters
$$ --------------------------
##$DU= <F:/spectra>
##$EXPNO= 1
##$NAME= <H-F>
##$PROCNO= 1
##$TYPE= <nmr>
##$USER= <she>
##$AMP= (0..31)
100 100 100 100 100 100 100 100 100 100 100 100 100 100 100 100 100 100 
100 100 100 100 100 100 100 100 100 100 100 100 100 100 
##$AQSEQ= 0
##$AQ_mod= 1
##$AUNM= <au_zg>
##$AUTOPOS= <>
##$BF1= 200.13
##$BF2= 200.13
##$BF3= 200.13
##$BF4= 200.13
##$BF5= 200.13
##$BF6= 200.13
##$BF7= 200.13
##$BF8= 200.13
##$BYTORDA= 1
##$CFDGTYP= 0
##$CFRGTYP= 5
##$CHEMSTR= <none>
##$CNST= (0..31)
1 1 145 1 1 1 1 1 1 1 1 1 1 1 1 1 1 1 1 1 1 1 1 1 1 1 1 1 1 1 1 1 
##$CPDPRG= <>
##$CPDPRG1= <>
##$CPDPRG2= <>
##$CPDPRG3= <>
##$CPDPRG4= <mlev>
##$CPDPRG5= <mlev>
##$CPDPRG6= <mlev>
##$CPDPRG7= <mlev>
##$CPDPRG8= <mlev>
##$CPDPRGB= <>
##$CPDPRGT= <>
##$D= (0..31)
0 1.2 0 0 0 0 0 0 0 0.06 0 0.03 0 0 0 0 0.0002 0 0 0 0 0 0 0 0 0 0 0 0 
0 0 0 
##$DATE= 1707734726
##$DBL= (0..7)
120 120 120 120 120 120 120 120 
##$DBP= (0..7)
150 150 150 150 150 150 150 150 
##$DBP07= 0
##$DBPNAM0= <>
##$DBPNAM1= <>
##$DBPNAM2= <>
##$DBPNAM3= <>
##$DBPNAM4= <>
$$ [...]
##$SUBNAM3= <"">
##$SUBNAM4= <"">
##$SUBNAM5= <"">
##$SUBNAM6= <"">
##$SUBNAM7= <"">
##$SUBNAM8= <"">
##$SUBNAM9= <"">
##$SW= 18.0517328524113
##$SWIBOX= (0..15)
0 0 2 0 0 0 0 0 0 0 0 0 0 0 0 0 
##$SW_h= 3612.71676300578
##$TD= 16384
##$TD0= 1
##$TE= 0
##$TE2= 300
##$TE3= 300
##$TEG= 300
##$TL= (0..7)
0 120 120 120 120 120 120 120 
##$TP= (0..7)
150 150 150 150 150 150 150 150 
##$TP07= 0
##$TPNAME0= <>
##$TPNAME1= <>
##$TPNAME2= <>
##$TPNAME3= <>
##$TPNAME4= <>
##$TPNAME5= <>
##$TPNAME6= <>
##$TPNAME7= <>
##$TPOAL= (0..7)
0.5 0.5 0.5 0.5 0.5 0.5 0.5 0.5 
##$TPOFFS= (0..7)
0 0 0 0 0 0 0 0 
##$TUNHIN= 0
##$TUNHOUT= 0
##$TUNXOUT= 0
##$USERA1= <user>
##$USERA2= <user>
##$USERA3= <user>
##$USERA4= <user>
##$USERA5= <user>
##$V9= 5
##$VALIST= <valist>
##$VCLIST= <CCCCCCCCCCCCCCC>
##$VD= 0
##$VDLIST= <DDDDDDDDDDDDDDD>
##$VPLIST= <PPPPPPPPPPPPPPP>
##$VTLIST= <TTTTTTTTTTTTTTT>
##$WBST= 1024
##$WBSW= 4
##$XGAIN= (0..3)
0 0 0 0 
##$XL= 0
##$YL= 0
##$YMAX_a= 94965
##$YMIN_a= -133146
##$ZGOPTNS= <>
##$ZL1= 120
##$ZL2= 120
##$ZL3= 120
##$ZL4= 120
##$ABSF1= 15.59043
##$ABSF2= -2.461421
##$ABSG= 5
##$ABSL= 3
##$ALPHA= 0
##$AQORDER= 0
##$ASSFAC= 0
##$ASSFACI= 0
##$ASSFACX= 0
##$ASSWID= 0
##$AUNMP= <proc_1d>
##$AZFE= 0.1
##$AZFW= 0.1
##$BCFW= 0
##$BC_mod= 2
##$BYTORDP= 0
##$COROFFS= 0
##$CY= -3
##$DATMOD= 1
##$DC= 0
##$DFILT= <>
##$DTYPP= 0
##$F1P= 0
##$F2P= 0
##$FCOR= 1
##$FTSIZE= 16384
##$FT_mod= 6
##$GAMMA= 0
##$GB= 0
##$INTBC= 1
##$INTSCL= 3.70164e-10
##$ISEN= 128
##$LB= 0.24
##$LEV0= 0
##$LPBIN= 0
##$MAXI= 10000
##$MC2= 0
##$MEAN= 0
##$ME_mod= 0
##$MI= 1.114404
##$NCOEF= 0
##$NC_proc= -7
##$NLEV= 6
##$NOISF1= 3.799351
##$NOISF2= 2.8
##$NSP= 0
##$NTH_PI= 0
##$NZP= 0
##$OFFSET= 15.56069
##$PC= 1
##$PHC0= -24943.58
##$PHC1= 4.452696
##$PH_mod= 1
##$PKNL= yes
##$PPARMOD= 0
##$PSCAL= 0
##$PSIGN= 0
##$REVERSE= no
##$SF= 200.129992197974
##$SI= 16384
##$SIGF1= 3
##$SIGF2= 2
##$SINO= 5.538805
##$SIOLD= 16384
##$SREGLST= <1H.CDCl3>
##$SSB= 0
##$STSI= 16384
##$STSR= 0
##$SW_p= 3612.71676300578
##$SYMM= 0
##$S_DEV= 0
##$TDeff= 16384
##$TDoff= 0
##$TI= <>
##$TILT= no
##$TM1= 0
##$TM2= 0
##$TOPLEV= 0
##$USERP1= <user>
##$USERP2= <user>
##$USERP3= <user>
##$USERP4= <user>
##$USERP5= <user>
##$WDW= 1
##$XDIM= 16384
##$YMAX_p= 282539668
##$YMIN_p= -1532057
$$ End of Bruker specific parameters
$$ ---------------------------------
##NTUPLES= NMR SPECTRUM
##VAR_NAME=  FREQUENCY,     SPECTRUM/REAL,   SPECTRUM/IMAG
##SYMBOL=    X,             R,               I
##VAR_TYPE=  INDEPENDENT,   DEPENDENT,       DEPENDENT
##VAR_FORM=  AFFN,          ASDF,            ASDF
##VAR_DIM=   16384,         16384,           16384
##UNITS=     HZ,            ARBITRARY UNITS, ARBITRARY UNITS
##FACTOR=    0.220516191357247, 1,           1
##FIRST=     3114.16075351498, 0,            0
##LAST=      -498.556009490796, 0,           0
##MIN=       -498.556009490796, -1532057,    0
##MAX=       3114.16075351498, 282539668,    0
$$ Real data points
##PAGE= N=1
##DATA TABLE= (X++(R..R)), XYDATA
$$ [...]
11871C58036J06764m5006k00861j38634Q2096J7444l0219J43549k7883j20076
11861A45210j2706o6722J00486Q1686n0569K02505J71321j3401k84778N5302k69099
11850E9235K78430L06439k54750j85200R9488Q3573n4038n266j6539q3114m2846
11839A85412J06650k6835J16769Q0111j5519J04762k94380M5727O2220j99112
11829A65805j73488J60093k9851j17173J41402M7444K29937k05924M3964J39036
11819D01245K4822J10486k57506j23590j10449q440K11362R901q625L6400j72535
11808A13071j71639K58700M1939l5118K05517O0382K86159j42487m2995j48229
11798D25300m3341j37067J88859K06113j72726K52251L5010k18878n2349M0077
$$ plain form
11871 358036 464800 419794 218933 80299 162395 179839 149620 293169 265286 145210
11861 145210 132504 65782 166268 247954 197385 399890 571211 557810 273032 328334 59235
11850 59235 337665 644104 389354 204154 303642 387215 333177 327911 311372 228258 185412
11839 185412 292062 265227 381996 462107 446588 551350 256970 302697 364917 165805
11829 165805 -7683 152410 122559 5386 146788 194232 424169 218245 262209 401245
11819 401245 426067 536553 279047 155457 45008 36568 247930 257831 249206 285606 113071
11808 113071 -58568 200132 242071 206953 412470 472852 759011 616524 573529 425300
11798 425300 381959 244892 433751 639864 467138 719389 754399 535521 483172 523249
11788E23249o5099n2593K3503K76193K66245k03774l66323j23282J37129L6018
11778D51266K7556M7828r5436k20711K16222j07286K73969J03045l12369j39281
11768B44803K89131J55496j38874p8220k33704J08329J75175l3011L7378j27310
11758C99193N96J18315j3474j86112q0056J80963J57964m7538Q4978J68748K10227
11747I93804j32191k02854j14492J36438o2833J41657J02643j46483L7898m2586
11737G11001j84230k12683K46493J53611r046j51420L57691K0158l11626j57818
11727D62131J12267J79960J01673N1461P4134J3438n8671j46715N2319Q6064L44614
11716A272675n6215k5099n8896n0640K0970J3596k05346k34K71193k3183M1304
$$ plain form
11788 523249 458150 405557 429060 705253 971498 767724 401401 278119 415248 451266
11778 451266 478822 526650 431214 210503 426725 319439 593408 696453 384084 244803
11768 244803 533934 689430 550556 472336 238632 346961 522136 489125 526503 399193
11758 399193 399789 518104 504630 318518 238462 419425 577389 529851 614829 783577 993804
11747 993804 861613 658759 544267 680705 617872 759529 862172 715689 753587 711001
11737 711001 526771 314088 560581 714192 705146 553726 911417 931575 619949 462131
11727 462131 574398 754358 856031 907492 981626 995064 936393 789678 841997 928061 1272675
11716 1272675 1216460 1191361 1132465 1081825 1102795 1116391 911045 910811 1182004 1158821 1200125
11705A200125j29028N719p0183O7397q0752L628J66833j40605j078k9716M9979
11694A042319j54017K0284m0601j31513O6824m2245M145J39778k3191J2371P5464
11683I69618J08476j84237j65690q7192K54980K88456j54284j3564K75284J2920
11673A304767R7466k25470K58555k00834K5207K13656p385P2668J38680J35673
11663A812983K36111l84267o88766k1502M0880L53042p3665M1897M60275O19k73522
11652A504085j6149n8777J9742J70009q6652K09008N6346k71314Q4499k811L50222
11641A958208l21174j29788K14109k42322M28978L26202j6914J39263k17988q4971
11631B053603K06747N8566O5489J75937j32720L4258P7338K01431o9410k11414
$$ plain form
11705 1200125 1071097 1076816 1006633 1074030 993278 996906 1163739 1023134 1022056 992340 1042319
11694 1042319 888302 908586 867985 736472 803296 761051 765196 904974 881783 894154 969618
11683 969618 1078094 893857 728167 640975 895955 1184411 1030127 1016563 1291847 1304767
11673 1304767 1402233 1176763 1435318 1234484 1259691 1473347 1465962 1538630 1677310 1812983
11663 1812983 2049094 1664827 976061 954559 995439 1348481 1274816 1316713 1776988 1777607 1504085
11652 1504085 1487936 1429159 1448901 1618910 1532258 1741266 1797612 1526298 1610797 1607986 1958208
11641 1958208 1637034 1507246 1721355 1479033 1908011 2234213 2217299 2356562 2138574 2053603
11631 2053603 2260350 2318916 2384405 2560342 2427622 2461880 2539218 2740649 2671239 2459825
11621B459825L1429R4302o6030o2645p8943K13917L87387N3629j41898k6256J92234
11610C056951J22164n39K70108k55549j17648J91604J00240J66612k7590k9980
11600C476373l4149K352K56349R5349K43841r4621L175j75298q7435L54145J6954
11589D057035R2732K03024L7535K66970K18996L2978O8180K25041J20571M7806
11579E370868J2000K86080J203r2962J99770L93244o1194J14201M5905M55893
11569F725008M6275j31285K35248J68927K40456K39862o1411Q8311J43742K49488
11559G944621M97673L33327N6046N7996M64401J34544K56419M872K62672J35907
11549A0148478r491K88229N64924N65552M23516J99140L34264J1710N68977K19169
$$ plain form
11621 2459825 2491254 2585556 2519526 2456881 2377938 2591855 2979242 3032871 2890973 2864717 3056951
11610 3056951 3179115 3178576 3448684 3193135 3075487 3267091 3367331 3533943 3506353 3476373
11600 3476373 3442224 3444576 3700925 3796274 4040115 3945494 3948669 3773371 3685936 4040081 4057035
11589 4057035 4149767 4352791 4390326 4657296 4876292 4909270 4977450 5202491 5323062 5370868
11579 5370868 5382868 5668948 5670151 5577189 5776959 6170203 6109009 6223210 6269115 6725008
11569 6725008 6771283 6639998 6875246 7044173 7284629 7524491 7463080 7551391 7695133 7944621
11559 7944621 8442294 8775621 8831667 8889663 9354064 9488608 9745027 9749899 10012571 10148478
11549 10148478 10138987 10427216 10992140 11557692 11981208 12180348 12514612 12526322 13095299 13314468
11539A3314468L30352N82182L43286O04584O77609J44987L59898O19855N24829
11530A7502050N81889P72151N74599M45254O28644P12923O37484M57958N72254
11521B2885206P35341N29035Q13390R33086Q69389Q98738R63401P96184Q67421
11512C0291191R90419J186343Q46868J212048J292486J264457J310944J442301
11504C9837057J208702J356429J690636J459029J091266J336011J406964J629506
11496E1015600J217555R62438J581607M58548J8605M11399Q6623j50577j89279
11487E5412519o81405o65510q08716j254799j319043j457092j459453j537625
11479D6228876j690055j898317j381379j701687j612973j160997j577280j115813
$$ plain form
11539 13314468 13644820 14227002 14570288 15174872 15852481 15997468 16357366 16977221 17502050
11530 17502050 18083939 18856090 19430689 19875943 20504587 21217510 21854994 22312952 22885206
11521 22885206 23620547 24149582 24962972 25896058 26765447 27664185 28627586 29423770 30291191
11512 30291191 31281610 32467953 33314821 34526869 35819355 37083812 38394756 39837057
11504 39837057 41045759 42402188 44092824 45551853 46643119 47979130 49386094 51015600
11496 51015600 52233155 53195593 54777200 55235748 55254353 55665752 55752375 55601798 55412519
11487 55412519 54731114 54065604 53256888 52002089 50683046 49225954 47766501 46228876
11479 46228876 44538821 42640504 41259125 39557438 37944465 36783468 35206188 34090375
11471C4090375j491305j213384j614999j454097j301231r32333n26894r50302
11463B4605830j208292q67260r44101q78090o98264o51985p32536n52396p75312
11454A7297594p99599o52859o32737j74607l49142o84212n74915o21945l67866
11445A2439712k58597k71811k69976l91693k31538n18797l49190j91312o6708
11436I890090k31247m18626k07055m12047k43845k9029p9772j22203j71617l74811
11426G599838n27252r7413P5525l21387j20821k15403j68330O8120j70542j82712
11416E939623k27214l44791J46954l28536Q640r732j83427R1166J34362l67662
11406D859383l69100j83000J18198M7587k21423J75888P8510k73482j66651j76493
$$ plain form
11471 34090375 32599070 31385686 29770687 28316590 27015359 26083026 25556132 24605830
11463 24605830 23397538 22530278 21586177 20708087 20009823 19357838 18625302 18072906 17297594
11454 17297594 16497995 15845136 15212399 15037792 14688650 14004438 13429523 12807578 12439712
11445 12439712 12181115 11909304 11639328 11247635 11016097 10497300 10148110 9956798 9890090
11436 9890090 9658843 9240217 9033162 8621115 8377270 8348241 8268469 8146266 7974649 7599838
11426 7599838 7072586 6975173 7050698 6729311 6608490 6393087 6224757 6292877 6122335 5939623
11416 5939623 5712409 5367618 5514572 5186036 5194676 5184944 5001517 5092683 5227045 4859383
11406 4859383 4490283 4307283 4425481 4473068 4251645 4427533 4506043 4232561 4065910 3889417
11396C889417q0337j17432j23449J31094j87810m34843R4613K48202O6306j0026
11386C475735l49904j38024J0360R8431k2592j64262j60941J75559L6724l1213
11376B929873k35493k8277r0516k29443l2709M8668o0709J34724m2253J16354
11366B510219r813k87642R3247J82169l19557K9153q991K67706k25910k1353K6688
11355B235916J5358j29482j22580O828j44064r2451J12123J66570j56669j30189
11345A761360J26731M0473p403L9979j87836j24871k4281J98078K37063k59515
11335A799778r0897j94491j40644K37499K9099k83720r0540L28996N5707k94250
11325A356537R5276K4902l73523m2664J02559J68656R2844N8145k76408j11806
$$ plain form
11396 3889417 3809080 3691648 3568199 3699293 3511483 3076640 3171253 3419455 3485761 3475735
11386 3475735 3125831 2987807 2998167 3096598 3074006 2909744 2748803 2924362 2961086 2929873
11376 2929873 2694380 2666103 2575587 2346144 2313435 2362103 2301394 2436118 2393865 2510219
11366 2510219 2500406 2212764 2306011 2488180 2168623 2197776 2188785 2456491 2230581 2209228 2235916
11355 2235916 2251274 2121792 1999212 2006040 1861976 1769525 1881648 2048218 1891549 1761360
11345 1761360 1888091 1928564 1921161 1961140 1773304 1648433 1624152 1822230 2059293 1799778
11335 1799778 1708881 1514390 1373746 1611245 1640344 1356624 1266084 1595080 1650787 1356537
11325 1356537 1451813 1476715 1103192 1060528 1163087 1331743 1424587 1482732 1206324 1094518
11315A094518M8510K97259k71022j19857J99524O5808j08277l4518J28517J14564
11305A415026l7554j76245j19941l0464J19713L0148k41933J6300J46937N8486
11295A180473j07416o3819M1236Q8589M4681j11509j38837K60381J25620j19028
11285A200371l1643k77645L599r4653P1854O0305k7791J22043L3376J59526p7618
11274A141724O7556j44579N9740j97358J8146K55167n9038k8697k21156J55861
11264A047366J69373l08351L3560L8520J2360o7800L01751P6637n8531K1081l51255
11253I14711j32176n5322r4310L6441J08440J87836k72810k66309J28617J27927
11243F83045j01310j06027q342M62483P791k00735P1827n0131J14618j68076k06706
$$ plain form
11315 1094518 1143028 1440287 1169265 1049408 1248932 1314740 1206463 1171945 1300462 1415026
11305 1415026 1377472 1201227 1081286 1050822 1170535 1200683 958750 975050 1121987 1180473
11295 1180473 1073057 1009238 1050474 1139063 1183744 1072235 933398 1193779 1319399 1200371
11285 1200371 1168728 891083 894682 800029 871883 932188 904397 1026440 1059816 1219342 1141724
11274 1141724 1209280 1064701 1124441 927083 945229 1200396 1141358 1112661 891505 1047366
11264 1047366 1216739 908388 941948 980468 992828 925028 1226779 1303416 1244885 1265966 914711
11253 914711 782535 727213 632903 669344 777784 965620 692810 426501 555118 683045
11243 683045 581735 475708 467366 929849 937640 736905 808732 758601 873219 705143 498437
11232D98437J02026R6555J6683K47386p2186J2092q5868j49297K15326l9112j12773
11221G29269j95736j29519M52269j33831o1662K27281O1494q1959L15063j21089
11211A061580j41854J85225j84346L1264j27476j78998K31584l1338j34915m499
11201G06227O9619K54089J15784m5252j33001r7092J5307j64584J33324o9081
11191G85340M7740r4432j05487j66850J70291J54719o9553K01179p3967l54220
11181D94760L41155J13221k10980m1759n3715L5233k6466r5832j1305M4814j09723
11170D79403M70746l08085j2706J88566k41014Q4342j85583J67034m728k91563
11160C46412m7000J24219q1899J01438N8213P4856J17904j49424j73221L9420
$$ plain form
11232 498437 600463 697018 713701 961087 888901 900993 815125 665828 881154 842042 729269
11221 729269 533533 404014 856283 722452 660790 888071 949565 867606 1182669 1061580
11211 1061580 919726 1104951 920605 951869 824393 645395 876979 845641 710726 706227
11201 706227 775846 1029935 1145719 1100467 967466 870374 885681 721097 854421 785340
11191 785340 833080 738648 633161 466311 636602 791321 721768 922947 848980 494760
11181 494760 835915 949136 738156 696397 642682 677915 651449 555617 544312 589126 479403
11170 479403 950149 642064 629358 817924 576910 661252 475669 642703 637975 346412
11160 346412 299412 423631 341732 443170 501383 576239 694143 544719 371498 410918
11150D10918p8689j30513K98631R1769J8766J04479k31991L1507k4448K5605K15136
11139G31170k33284r6727j01034k4591P318J4412L6603O8355n1569k043k0993
11128C27617q2380M7941M20194j77663k47575k10326p7872K24465Q6749q7405
11118B23745p0999J90528J33454L3810n7213k74302j69923Q552j1774K11442j8210
11107A99110K95789K6717k35497J06735R4006P1387L0096J62721o5648j72904
11097E12512L02J6415l47968j2828J68761J29823K49979L545k12820m2872l23475
11086A41374r8892M36000m2712j04361p6116J0954k00461Q8492L03831k95270
11076A62839k24250J42152N8781p4452O5998M792o0622N0952N3109k46585n149
$$ plain form
11150 410918 332229 201716 500347 592116 610882 715361 483370 514877 490429 516034 731170
11139 731170 497886 401159 300125 275534 282852 297264 333867 402222 350653 348610 327617
11128 327617 245237 293178 713372 535709 288134 77808 -64 224401 311150 223745
11118 223745 152746 343274 476728 510538 453325 179023 9100 17652 5878 217320 199110
11107 199110 494899 521616 286119 392854 486860 558247 588343 751064 685416 512512
11097 512512 512814 529229 181261 168433 337194 467017 716996 720541 507721 464849 141374
11086 141374 42482 478482 435770 331409 255293 266247 65786 154278 458109 162839
11076 162839 -61411 80741 139522 65070 131068 135860 75238 126190 179299 -67286 -72435
11065g2435K09062N8424k45467m9685N3879L00363K806j91312N8278N6568K48814
11054D29295J44258n8303l4255k83108j17903L6672O9618k25118j55900K42143
11044D7399m6125J00934J27826o7204K06667o6189p996J3746L1939J71801k53635
11033B59163j48221o1008j05827P0398K22490J0277n32536n1350K57570K16012
11023A36968j08534q13L19724k67476J15426O4116l4140k6659j20846k08301J96572
11012F6037J15428M1809P0907j05548K03651r2700j59496K46143l33606r9493
11002d6868m7885l7447M6537J14286J97028O6518j5058O8722j1022j49883L1437
10991B16365P3371J33613p9460j78767j82960R3688K89967j08117j18814j8259
$$ plain form
11065 -72435 136627 195051 -50416 -100101 -46222 254141 256947 65635 123913 180481 429295
11054 429295 573553 515250 480995 197887 79984 116656 186274 -38844 -194744 47399
11044 47399 1274 102208 230034 162830 369497 303308 295312 309058 340997 512798 259163
11033 259163 110942 49934 -55893 14505 236995 247272 -285264 -336614 -79044 136968
11023 136968 28434 27621 347345 79869 195295 259411 225271 198612 77766 -130535 66037
11012 66037 181465 223274 294181 188633 392284 299584 140088 386231 52625 -46868
11002 -46868 -94753 -132200 -85663 28623 225651 292169 277111 345833 334811 184928 216365
10991 216365 289736 423349 343889 165122 -17838 75850 365817 257700 138886 120627
10981A20627j50032j477L05050J44289O969r1884o1173k9592N8220P7476J37782
10970E16255k24794k32017j1142Q8822J41743j12721j14617o4606J30109j58136
10960d1104L08659j5618K17645K4641k66834j71571j6943J26611J21760p9738
10950B07508k30970q2551n1650L4508K17112q2113J42292L48557j84941q0070
10940B37682k83823j00233l3539M16461j93387j23582j03400K02848R9030J35248
10930B53305k57408j25094M82535j26064n0144r4414R7568L6680N1206k44999
10920B3171n8843M15976k8836l66047m0560J39456J27897j15018k51423M20142
10910B65915L4851J22212k74101j18860J41690J03948j22217Q3509l03039j10024
$$ plain form
10981 120627 -29405 -30882 274168 418457 425426 333542 272369 242777 300997 378473 516255
10970 516255 291461 59444 48302 137124 278867 166146 51529 -13077 117032 -41104
10960 -41104 267555 251937 469582 494223 227389 55818 38875 165486 287246 207508
10950 207508 -23462 -106013 -157663 -123155 93957 11844 154136 502693 317752 237682
10940 237682 -46141 -146374 -179913 236548 43161 -80421 -183821 19027 118057 253305
10930 253305 -4103 -129197 353338 227274 177130 82716 180284 216964 268170 23171
10920 23171 -35672 380304 351468 -14579 -55139 84317 212214 97196 -154227 265915
10910 265915 300766 422978 148877 30017 171707 275655 153438 236947 -66092 -176116
10900a76116L53793J34322k46386p7586J60050j3641J67733k79931k727K3937
10890D3448R9237M9429M06558l03394l03279L41499n9166q5206J53999j39969
10880B03156K04871j9337j39579K5759M5283k27559Q4011j73013L9518J59432
10870B02542K9306j43000K10431k68486O3666k08679Q047K69374L7184k0593N8239
10859B38031L7308k29980j61594K31416R1834j85013j73798j4120J18475K39938
10849A92497P3101k81374M31124l37825j69040J12540J08599k78006Q0742K85386
10839B17744q3690J6319M6318n909K7991M3305K2370J74484q419l28623k43071
10828a21181J19509l4797k9771R1221j06096j0673o9557K29359o2006J49869J24934
$$ plain form
10900 -176116 177677 311999 65613 -11973 148077 134436 302169 22238 19511 43448
10890 43448 142685 192114 598672 295278 -8001 333498 274332 189126 343125 203156
10880 203156 408027 388690 249111 274870 320153 92594 176605 3592 43110 202542
10870 202542 231848 88848 299279 30793 94459 -114220 -106173 163201 200385 179792 238031
10859 238031 275339 45359 -116235 115181 207015 22002 -151796 -165916 -47441 192497
10849 192497 265598 -15776 415348 77523 -91517 21023 129622 -148384 -67642 217744
10839 217744 134054 150373 196691 190782 218773 262078 284448 458932 450513 121890 -121181
10828 -121181 -1672 -36469 -66240 24981 -81115 -91788 -161345 68014 6008 155877 280811
10817B80811r4910j56899j72408K97900K17066m9300P722p5633K60313P0306r6987
10806D87981k5859p9853k70825k20706M0010k6836r6840L3545J33534j08485O2355
10795g1979K61878l33798k76042L72794k6562j45155J68032k37592m1187K5111
10785c04500K17781P9165Q3401J66860n0416j51201j20881J32095J32610J05482
10775B90396j29292L3890K41983k34522l86426L00443r6870J25440j4169q5807
10765D5066J82385j30881k29295J19350j36792K35158K10210l2545k4424j75537
10755F2695j374n076k02237p3553L61073L3733j29011L9265P0039Q6146k56422
10744a4722j37931J40205n9359n7200L1565j89800K07116J70617k36532j58339
$$ plain form
10817 280811 185901 29002 -143406 154494 371560 322260 329982 254349 514662 584968 487981
10806 487981 462122 382269 111444 -109262 -69252 -96088 -192928 -159383 -25849 -134334 -71979
10795 -71979 189899 -143899 -419941 -47147 -73709 -218864 -50832 -288424 -329611 -304500
10785 -304500 -86719 -7554 75847 242707 192291 41090 -79791 52304 184914 290396
10775 290396 161104 194994 436977 202455 -183971 116472 19602 145042 130873 45066
10765 45066 227451 96570 -132725 -13375 -150167 84991 295201 262656 238232 62695
10755 62695 61321 56245 -145992 -219545 141528 175261 46250 85515 155554 241700 -14722
10744 -14722 -152653 -12448 -71807 -129007 -97442 -287242 -80126 90491 -146041 -304380
10734c04380j04812N7285J93020Q4388m5318J02550J03682J70653J9991j759k95139
10723a9839j26281R4342K00354p9397K60288j09933o5526k57831K54556N8294
10713B09027p1206J52797k20077J46835N2090j62278j89102j57400J56817K43747
10703A61250j35336j0825P646q2437L6498j78086K85845j04805K61797P8123j75652
10692A44018j12383k24100K76585J0003p8485Q5339K77042j64795l9872K22467
10682C95819q6597j6244j44916l0053R0801p2888K3829q4374q4576M8331N785
10671D4917L4392K02544j68140r1348j34574L64864j11861l1129j56750N0496
10661C411k03206r9178L05424J75073P1641K43296m24597k25332J41406j5503
$$ plain form
10734 -304380 -409192 -351907 -158887 -74499 -119817 -17267 86415 257068 277059 275300 -19839
10723 -19839 -146120 -51778 148576 69179 329467 219534 154008 -103823 150733 209027
10713 209027 137821 290618 70541 217376 269466 107188 -81914 -239314 -82497 161250
10703 161250 25914 15089 22735 -59702 -23204 -201290 84555 -20250 241547 319670 144018
10692 144018 31635 -192465 84120 94123 15638 100977 378019 213224 173352 395819
10682 395819 309222 292978 148062 118009 208810 135922 159751 75377 -9199 39132 44917
10671 44917 79309 281853 113713 22365 -112209 252655 140794 109665 -47085 3411
10661 3411 -199795 -298973 6451 181524 253165 496461 71864 -153468 -12062 -27565
10651b7565j30924J97781J97725j1756K40357k51160q695n296j05935J13553J74354
10640C82439q2900o9078j23908J40853o0418l26992J64151N0227j40490M2247
10630b3869J42330P694j7181J08621J26514l15524k7171k5780L7226l0661J51905
10619A34104K56377q3376m0699k07059j55593M8569J58996k60013Q1201J26801
10609E9308M5366L395r5878k23447L29476j14622J62195L96703k98739n6939k29086
10598b2268L75026m9784k68207j13097j8488K5573J53229K10501Q7117l94044
10588a4442o4782L03156J52991j49057j43499r395N48356j15606n61068K87627
10578B34281q514m3033k91229K3926k4762k191J4497l5860J82514R022p7598P5433
$$ plain form
10651 -27565 -158489 39292 237017 225261 465618 214458 205763 200467 94532 208085 382439
10640 382439 299539 230461 106553 247406 186988 -140004 24147 74374 -66116 -23869
10630 -23869 118461 126155 108974 217595 344109 28585 1414 -24366 12860 -17801 134104
10619 134104 390481 307105 266406 59347 -96246 -47677 111319 -148694 -67493 59308
10609 59308 104674 108069 12191 -211256 118220 3598 165793 562496 263757 206818 -22268
10598 -22268 352758 302974 34767 -78330 -96818 -71245 81984 292485 379602 -14442
10588 -14442 -79224 223932 376923 227866 84367 74972 623328 507722 -53346 234281
10578 234281 225767 182734 -108495 -84569 -109331 -111522 -97025 -132885 49629 58651 -18947 56486
10566E6486j06010J05512K2369p3923p9577o3649r2064M8497k1690R0964J10335
10555b750K19254j37856j7886J84726J07907p8316k58916r3021O8827M6118Q8162
10544A26249l73483J12039M44677o9419j68525l09543P6179K44006K04732l39457
10534e2545n8646K58500k56487K15251J6323k26707j3095J07380P8964j14465
10524d5527r7621J31277j4498J34289j0098J10301n9672M4229N6094k35543k68271
10513b55040O6632L23962K01845j94736j03310M2140J53922l23709K9041K24080
10503A64827J35351o9895j37332L49874l93058J01378m2590o3192Q6536j28074
10493C825l32963L09756P418k82537P1003K07277k9000j16246J06931J06963J95476
$$ plain form
10566 56486 -49524 55988 78357 4434 -75143 -138792 -230856 -182359 -204049 -113085 -2750
10555 -2750 216504 78648 60762 245488 353395 275079 16163 -76858 -8031 38087 126249
10544 126249 -247234 -135195 309482 240063 71538 -238005 -161826 82180 286912 -52545
10534 -52545 -111191 147309 -109178 106073 122396 -104311 -117406 -10026 68938 -45527
10524 -45527 -143148 -11871 -26369 107920 97822 208123 148451 192680 248774 13231 -255040
10513 -255040 -188408 135554 337399 142663 39353 81493 235415 -88294 -59253 164827
10503 164827 300178 230283 92951 442825 49767 151145 108555 45363 131899 3825
10493 3825 -329138 -19382 -11964 -294501 -223498 -16221 -45221 -161467 -54536 52427 247903
10482B47903J21727O1380M1067L9890l37980k8641K36115k24348j94087J28237
10472I1263J13585K3390K62257m27647j00076m2431J05303J85586p1266k70660
10462a30696Q2117K1525K69050j91502o0109J28891J45584k00298j32397k8962
10452i6797P8220J6820L2267J37722m6091J18470P8796Q2517k87822j06402p1683
10441f3983L38843K76348j75344j4621j46589J03786J56069p4746l64352k24369
10431a88958M73362o8368j3823j72908P9703J9740M07373k95815P708J94650j53644
10420B89020K01647j07700l3033q212M3940k009l72658q9919M00116K9278l8644
10409C11826J36861k49866j24137P9633J00602j32018K14846R6081J20980j70146
$$ plain form
10482 247903 369630 431010 472077 511967 173987 145346 381461 157113 -36974 91263
10472 91263 204848 228238 490495 62848 -37228 -79659 25644 211230 139964 -130696
10462 -130696 -48579 -27054 241996 50494 -9615 119276 264860 64562 -67835 -96797
10452 -96797 -18577 -1757 30510 168232 122141 240611 319407 401924 114102 7700 -63983
10441 -63983 274860 551208 375864 361243 214654 318440 474509 399763 35411 -188958
10431 -188958 284404 216036 202213 29305 109008 128748 536121 240306 248014 442664 289020
10420 289020 490667 382967 349934 341722 385662 383653 10995 -78924 321192 350470 311826
10409 311826 448687 198821 74684 154317 254919 122901 337747 433828 554808 384662
10399C84662l15359O5429j56560k04981P827M84074J9698j41303N079P0307k355
10388B16518J23774J23459l25212j01078M03724J0288k40270k37579J50541p3516
10378E0649J88K91434j1158j5846j08152j5722k16607k12812K50103K00570l4436
10367A78211J9428r4466j59448J0446m4488N16628J50591k16108p2325N0344Q4031
10356D22844J96339l68759j18791O5951k68928O3923R7724R2679p6408q6885K10033
10345B29722L35805k04481j75035R8223p322N4055J68227q9935J519j3343l44978
10334E2457o1309M4501K51663m9299j47519L2877J01916k39824o1692J39262J03381
10323A66414J2316j91600K9688J69196P8874j32930J01537J29294J58690l6995
$$ plain form
10399 384662 69303 134732 -21828 -226809 -218982 265092 284790 143487 148566 218873 216518
10388 216518 340292 463751 138539 37461 441185 451473 211203 -26376 124165 50649
10378 50649 50837 342271 331113 315267 207115 191393 -25214 -238026 12077 212647 178211
10367 178211 197639 103173 -56275 -45829 -90317 426311 576902 360794 288469 338813 422844
10356 422844 619183 250424 131633 197584 -71344 -7421 90303 182982 106574 19689 229722
10345 229722 565527 361046 186011 284234 276912 330967 499194 409259 410778 397435 52457
10334 52457 -8852 35649 287312 238013 90494 123371 225287 -14537 -76229 63033 166414
10323 166414 178730 -12870 16818 186014 264888 131958 233495 362789 521479 484484
10313D84484L3139L2832J28021r2309k50837j67596K21780j51555n4817l9953
10303A43189n8167J16084K35098j97901p4430l5144k8064K22932K28174j74880
10293C76891j51765Q108j7521p6402K71675q2840J76517j11886K58404J16339
10283G67520m88479L57407m4901j49434O5637o0946Q1160J11305j54451l4114
10273D50704O4104J72078j7000l8473Q2755j89041m2026J32327j32732J10484
10263E93180M65819M277j99630r7165j50427J16689k22209K37076J17402j24965
10253G40047l08880m0746J87599r8040p9172L94209L34820J04906r5836l34113
10243H04794j72744j6130L40767Q6101l04057N17150j46603j74461q3190P9164
$$ plain form
10313 484484 517623 550455 678476 586167 335330 167734 389514 237959 183142 143189
10303 143189 85022 201106 436204 238303 163873 128729 100665 323597 551771 376891
10293 376891 225126 233234 215713 139311 410986 328146 504663 392777 651181 767520
10283 767520 279041 636448 591547 442113 507750 446804 527964 639269 484818 450704
10273 450704 514808 686886 669886 631413 714168 525127 483101 615428 482696 593180
10263 593180 1058999 1063276 863646 766481 616054 732743 510534 747610 865012 740047
10253 740047 431167 390421 578020 479980 400808 795017 1129837 1234743 1138907 804794
10243 804794 632050 615920 956687 1042788 738731 1255881 1109278 934817 851627 930791
10233I30791N242L08914n1189j45954J14226j29013M8279L5869J11571p3503J32483
10222A287716M02545j68401j90171j57400j04880P6460p5684J17200p9021K95827
10212A404191K3728j29997R0994J51499J32892P8391l9035N6757j13099J9451
10202A675772K31448K56627J91680K1083M3770j67999o4000J03125L7029j32693
10192B195842K59424k47924m7759j29805O6255K94598j31367L6036J3784R2318
10182B401402k14612n4422r570J63024J14969J84697r9866k08210L54137L67289
10172B998838j9222l2821k05953k7029K48637N82605N1640p7736L53363j24809
10162C747513M35033M31033L5270L45667m7993K25110j29015r47L40235o0355
$$ plain form
10233 930791 936033 1244947 1193758 1047804 1162030 1033017 1081296 1117165 1228736 1155233 1287716
10222 1287716 1690261 1521860 1331689 1174289 1069409 1145869 1070185 1187385 1108364 1404191
10212 1404191 1427919 1297922 1388916 1540415 1673307 1751698 1712663 1769420 1656321 1675772
10202 1675772 1907220 2163847 2355527 2376610 2420380 2252381 2188381 2291506 2328535 2195842
10192 2195842 2455266 2207342 2159583 2029778 2096033 2390631 2259264 2295300 2309084 2401402
10182 2401402 2186790 2132368 2122798 2285822 2400791 2585488 2485622 2277412 2631549 2998838
10172 2998838 2979616 2946795 2740842 2713813 2962450 3545055 3596695 3518959 3872322 3747513
10162 3747513 4182546 4613579 4648849 4994516 4946523 5171633 5042618 5041671 5381906 5321551
10152E321551K69683L61462M0410Q1441J30120Q9713k50317P5451K67215R2666
10142F479395k74378J62844M70489o8686J63241k2854M6864K09621L73502L44212
10132G884250K04070r5277J35377L3530l13103k49546n2558k51343j90381J5776
10122G120795M8417k1106k97529l83260m88373q4174l6540k91756n10183o66009
10112D390282j66926q8227M7718o7741j62914j12884Q4172j22103o96279n6473
10102C048625k04590L34266r1555k03753l79690M8059j64705k15619R9455l81607
10092A888886j80067J03791n5251r276q411j0219j5715j15056K37581J41693R0310
10081B068266l43512k6086k86701O3311k06800p8884L23418K698j69110q1672
$$ plain form
10152 5321551 5591234 5952696 5993106 6074547 6204667 6294380 6044063 6119514 6386729 6479395
10142 6479395 6205017 6367861 6838350 6769664 6932905 6910051 6956915 7166536 7540038 7884250
10132 7884250 8088320 7993043 8128420 8161950 7848847 7599301 7546743 7295400 7105019 7120795
10122 7120795 7169212 7148106 6850577 6467317 5978944 5894770 5858230 5566474 5056291 4390282
10112 4390282 4223356 4135129 4182847 4115106 3952192 3839308 3923480 3801377 3105098 3048625
10102 3048625 2844035 3178301 3086746 2882993 2503303 2551362 2386657 2171038 2270493 1888886
10092 1888886 1708819 1812610 1757359 1748083 1739672 1729453 1713738 1598682 1836263 1977956 2068266
10081 2068266 1724754 1698668 1411967 1475278 1268478 1189594 1513012 1515710 1346600 1264928
10071A264928k5546J11498K12624k28852r3700J84912J40182k5105m65003J55411
10061A231349o9329J40464R2552j11349O1681k83588P8732l28582j77899K31124
10051H65155K94213O0959r8598j36049k9844J55265n9092l2111O1008j07236j8667
10040I55003L89277N4989q9378k99878O1158p0675j00201n422J94317N2488j15087
10029A026591k0538r2944Q1397j62715J12144p1673J57508l14146l01457l6507
10019C77660M682L7290J40562R1075J13065o1366r5620K00098j5493j02659q3088
10008F06206J9207j70524q591N9132J7405j8159J76139O09571J11210k51871k40384
9997I09341r21p1364M1955j86579J04691K23750J74709J11317j78483k13601L25
$$ plain form
10071 1264928 1239382 1350880 1563504 1334652 1240952 1425864 1566046 1540941 1075938 1231349
10061 1231349 1162020 1302484 1395036 1283687 1345368 1061780 1140512 811930 634031 865155
10051 865155 1159368 1220327 1121729 985680 955836 1111101 1052009 1019898 1080906 973670 955003
10040 955003 1344280 1399269 1309891 1010013 1071171 1000496 900295 894873 1089190 1141678 1026591
10029 1026591 1006053 913109 994506 831791 943935 872262 1029770 715624 414167 377660
10019 377660 382342 419632 560194 651269 764334 702968 607348 807446 791953 689294 606206
10008 606206 625413 454889 446298 505430 522835 504676 680815 1290386 1401596 1149725 909341
9997 909341 908420 837056 879011 692432 797123 1020873 1195582 1306899 1128416 914815 915140
9986I15140K73971r8678L77140R105j65661l879Q0654K51789J96835r7132k5152
9975A714132K829j26015M1362j62406J70968r6494k1134R8540j40515n4254P2124
9964A499137q6290j49304O8746m13306J27601K29301m002j48380l9804r2810j91758
9953G99131j23635k87888o677L71941j9008k14261O0529K5925J45533N082k15513
9942E41159k2890J6180j83226j21718L49276L1567p4204O0496R5797Q180n5785
9931F44832K00452O4356K6757l35430k09384K52901K10849q7981l39570J82272
9921F10054J27611m7144K99677j6926K4066j44134l29735K08272J21735q001P8525
9910I24000k11205K77821j14253m123j55378j68538J45812J80416J54890m17816
$$ plain form
9986 915140 1189111 1090433 1467573 1476678 1311017 1307138 1387792 1639581 1836416 1739284 1714132
9975 1714132 1716961 1590946 1632308 1469902 1640870 1544376 1523242 1621782 1481267 1427013 1499137
9964 1499137 1412847 1263543 1332289 918983 1046584 1275885 1271883 1123503 1083699 990889 799131
9953 799131 675496 387608 380931 752872 733864 519603 580132 606057 751590 756672 541159
9942 541159 518269 534449 351223 229505 578781 610348 536144 596640 692437 700617 644832
9931 644832 845284 909640 936397 600967 391583 644484 855333 767352 427782 610054
9921 610054 737665 690521 990198 973272 997338 853204 523469 731741 853476 845475 924000
9910 924000 712795 990616 876363 872240 716862 548324 694136 874552 1029442 611626
9900F11626O5345J10099r4031N3842J87629J90893m8048n574o4225o5689j35091
9889H06776J50665J78657j25093J0584l081j53755j3297j05451q9126M3556Q0650
9878G81085N5008j36563J1824j8085Q3920K6033n0818P9865L5739l9070j17030
9867G11908K34269q1614k11314J0811K27816K11180j42048p3258Q922j21948m6204
9856G28520M8922K8232K30769O9353l18197K72726J85860j35500J00157k99096
9846I11746j39676K43791K31834m2843k84377j56708L9470K36608J63929m65798
9836G37976K05026K0796j6123K10049k5374r4785j30135J05537J08173N13269
9826A634409p3204l45944k95622j58355M06171M7750j41690M3579R8285J11936
$$ plain form
9900 611626 676971 787070 693039 746881 934510 1125403 1077355 1071781 1007556 941867 806776
9889 806776 957441 1136098 1011005 1021589 1018508 864753 851456 746005 656879 700435 781085
9878 781085 836093 699530 711354 693269 777189 803222 752404 832269 868008 828938 711908
9867 711908 946177 864563 653249 664060 891876 1103056 961008 887750 896672 774724 728520
9856 728520 777442 805674 1036443 1105796 787599 1060325 1246185 1110685 1210842 911746
9846 911746 772070 1015861 1247695 1204852 920475 763767 803237 1039845 1203774 737976
9836 737976 943002 963798 947675 1157724 1132350 1037565 907430 1012967 1121140 1634409
9826 1634409 1561205 1215261 919639 761284 1167455 1215205 1073515 1117094 1215379 1327315
9816A327315p6177k35644K6899P112J52992p8264k37766J42643l189P4371J30040
9805A230332K62912j23116l48753m5146M00975L6290o4606K7463j34660K97281
9795A538972N7819j49635j12951j37582L08212l5148l4196L29691L9164n0443
9785A753903n31L72936o43527j16412J92426j23992J28122M45322q9738K59351
9775B177860j57066j14779J2902q7238K4261k4359k3936j44877J07865J22620
9765A893253R6618q2366k17234k66078L42694J73984R1149j61983r1772J46452
9755A924717L35739r7953J95650K1540K06643k52240k00135O2682K03710N8392
9745B458745k77035K59250J23184j4971J09947J03174q7291k302J23851K9569
$$ plain form
9816 1327315 1251138 1015494 1042393 1049505 1202497 1124233 886467 1029110 1025921 1100292 1230332
9805 1230332 1493244 1370128 1021375 976229 1377204 1413494 1348888 1376351 1241691 1538972
9795 1538972 1596791 1447156 1334205 1196623 1504835 1469687 1435491 1765182 1804346 1753903
9785 1753903 1753372 2126308 1482781 1366369 1558795 1434803 1562925 2008247 1918509 2177860
9775 2177860 2020794 1906015 1918917 1831679 1855940 1831581 1807645 1662768 1770633 1893253
9765 1893253 1989871 1907505 1690271 1424193 1766887 1940871 2032020 1870037 1778265 1924717
9755 1924717 2260456 2162503 2358153 2379693 2586336 2334096 2133961 2196643 2400353 2458745
9745 2458745 2181710 2440960 2564144 2549173 2659120 2762294 2675003 2672701 2796552 2826121
9735B826121J21749K7786R021J29758J07818j65827j28606L27932J46676k18198
9725C184230l4708J2674J13196J06876Q7662J99187J13054K26M90509j03977J38210
9714D307139n1751O626K63959k13293j8197N5345M52955j31023O1105K31312L90205
9703E354382J38967j71284J13095L91193j08196M8243J15180k07860K02234L75604
9693F251558J87356R1280m6333L88652M56774M508k40710L11099N89945K74383
9683H268512o2465j14585M73614K56091o3300J82260J13861L33891M99834K42791
9673A0130504K5535J89386N21723M29871L68602N4923K83240J32762J13107K11340
9663A2460993M96447M05446R3343L29288N56564L22716K76590M33740O11740L87924
$$ plain form
9735 2826121 2947870 2975656 2984677 3114435 3222253 3056426 2927820 3255752 3402428 3184230
9725 3184230 3149522 3162196 3275392 3382268 3469930 3669117 3782171 3782397 4272906 4168929 4307139
9714 4307139 4255388 4262014 4525973 4312680 4294483 4349828 4802783 4671760 4732865 4964177 5354382
9703 5354382 5493349 5322065 5435160 5826353 5718157 5766400 5881580 5673720 5875954 6251558
9693 6251558 6438914 6530194 6483861 6872513 7329287 7333795 7093085 7404184 7994129 8268512
9683 8268512 8206047 8091462 8565076 8821167 8757867 8940127 9053988 9387879 9887713 10130504
9673 10130504 10156039 10345425 10867148 11297019 11665621 11720544 12003784 12136546 12249653 12460993
9663 12460993 12957440 13362886 13456229 13785517 14342081 14664797 14941387 15375127 15986867 16374791
9653A6374791L32459N99796M25303Q02437L86285O53274N71042N07518Q99162
9644B1552067R14964O11133O03972N74169J020201R35630O77401R62116J098233
9635B8949886J176348O96914J004166J145058J132270R78874R83989J316625J356598
9626C8740728J600637J710264J796097J881649K026181K543048K899603L170577
9618E6368784L159519L908834M765110N645731O769894Q231815J0600693J2780556
9610A12230936J5794456J8590134K0351401J9850868J7887098J2458597N989696
9603B23153186J176685j745223j677770L50019K854668L001879Q87372m556535
9595B23444281j0968462j6413362k0289624k1516820k0372043j7242457j3957606
$$ plain form
9653 16374791 16707250 17307046 17732349 18534786 18921071 19574345 20145387 20652905 21552067
9644 21552067 22467031 23078164 23682136 24256305 25276506 26212136 26889537 27851653 28949886
9635 28949886 30126234 30823148 31827314 32972372 34104642 35083516 36067505 37384130 38740728
9626 38740728 40341365 42051629 43847726 45729375 47755556 50298604 53198207 56368784
9618 56368784 59528303 63437137 68202247 73847978 80617872 88849687 99450380 112230936
9610 112230936 128025392 146615526 166966927 186817795 204704893 217163490 223153186
9603 223153186 224329871 222584648 220906878 221256897 224111565 227113444 228000816 223444281
9595 223444281 212475819 196062457 175772833 154256013 133883970 116641513 102683907
9588A02683907j1427097r551686p703332o435661n557796m429701m355712l299491
9580D9923431k440259k494876k328768j936282j845543j726849j579052j500066
9572C4071736j790113j450501j124537r82578r29412j108508j354678j147206
9564B4184203j150735j021768q44823p78027p76736o91461o94474o99513k42133
9555A7284533m38917k52471k98985m63854K4528k509L5277j69033k6415Q0240
9545A5772394K43672K64805l4212l4743j95390m10595j74372r9825j30515j9059
9535A5182160R8017k13429o50134n32376l91983r7107l94567r8415m16954k55602
9525A2229610L7161J83258l18707N7354L44816K81803J41742K26070L55012Q71464
$$ plain form
9588 102683907 91256810 81705124 74001792 67566131 62008335 57578634 53222922 49923431
9580 49923431 47483172 44988296 42659528 40723246 38877703 37150854 35571802 34071736
9572 34071736 32281623 30831122 29706585 28724007 27794595 26686087 25331409 24184203
9564 24184203 23033468 22011700 21166877 20388850 19612114 18920653 18226179 17526666 17284533
9555 17284533 16845616 16593145 16294160 15830306 15854834 15852325 15887602 15718569 15692154 15772394
9545 15772394 16016066 16280871 16246659 16211916 16016526 15605931 15431559 15331734 15201219 15182160
9535 15182160 15280177 15066748 14416614 13884238 13492255 13395148 13000581 12902166 12485212 12229610
9525 12229610 12266771 12450029 12131322 12188676 12533492 12815295 12957037 13183107 13538119 14409583
9515A4409583N69047L10102J030069J166283J585956K104763K545077K896986
9507B6617866K857333J966766J068280N40135O720l56546j8301Q78538M09709
9498C3970500k63494j176620k291329k895742l038969l032153k369114k062501
9490A6840578j855796j310620q75024o15532q63126n79937p05652p58875m32447
9481H843569k84796n62884l83302l75743l49837q5946M21397n03203l26744j3857
9471F378654k67162m10625k3404l04041J4425j84358l9995k39449l33907P5540
9461D665678j93222j13786O7754j09019Q3659Q6413j36515j49267j21215j04490
9451C975990k0946J28045l29255k33251Q8094P4173r5644K11301j04714J4747
$$ plain form
9515 14409583 14978630 15288732 16318801 17485084 19071040 21175803 23720880 26617866
9507 26617866 29475199 31441965 32510245 33050380 33057100 32700554 32682253 33560791 33970500
9498 33970500 33707006 32530386 30239057 27343315 24304346 21272193 18903079 16840578
9490 16840578 14984782 13674162 12799138 12183606 11320480 10740543 10034891 9276016 8843569
9481 8843569 8558773 7995889 7612587 7236844 6887007 6801061 7222458 6719255 6392511 6378654
9471 6378654 6111492 5700867 5677463 5373422 5387847 5203489 5163494 4924045 4590138 4665678
9461 4665678 4472456 4358670 4426424 4317405 4401064 4487477 4350962 4201695 4080480 3975990
9451 3975990 3955044 4083089 3753834 3520583 3608677 3682850 3587206 3798507 3693793 3708540
9441C708540J02850N5346r7631j93659J18602R0256k13391j6605j08230o2927
9431C383151J47499J46837q9239l21866l55855P4183o1074N4963J43723q9565
9421C032757j7942k6317k28717k8773k09779O1715J21235k05557j5171K38285
9411B721736N208m9709Q3044j69266M7774N1118m034L75520q2979K13445Q932
9400C200789N0318l5164k95936M6864j23990J05973N4982j77514m3454l7030J45920
9389B891758k97536k15315k8888P9349J16166P9381j12101k04733o7717l47377
9379A892987K2076K75433K78989j23235J76682k7936j50289k49140J30654M5765
9369B271986Q557J71106K88947j0650k65692j83996K45557J50649k21261P2428
$$ plain form
9441 3708540 3811390 3866736 3769105 3575446 3694048 3784304 3570913 3554308 3446078 3383151
9431 3383151 3530650 3677487 3588248 3266382 2910527 2984710 2923636 2978599 3122322 3032757
9421 3032757 3014815 2988498 2759781 2731008 2521229 2582944 2704179 2498622 2483451 2721736
9411 2721736 2726944 2677235 2760279 2591013 2638787 2689905 2685871 3061391 2978412 3191857 3200789
9400 3200789 3251107 3215943 2920007 2966871 2842881 2948854 3003836 2826322 2782868 2745838 2891758
9389 2891758 2594222 2378907 2350019 2429368 2545534 2624915 2512814 2308081 2240364 1892987
9379 1892987 1915063 2190496 2469485 2346250 2522932 2494996 2344707 2095567 2226221 2271986
9369 2271986 2280543 2451649 2740596 2729946 2464254 2280258 2525815 2676464 2455203 2527631
9359B527631J04209k95286j11133O4654R4213J86143K33172m4207j18485K32250
9349B873161j45758k1045K94904J49274k99090k3486L9193l8276K48794M5478
9339C123149J99699K17908K12251P4057Q8178M35835O21200L03710M17031P8240
9329E771258m74287l86342l62047l33712m9562n7373k12304n4525l98556o6318
9319C376232L70773N8078K25806r7241j35739K5705K40622K56755L55477K11540
9309D888008K34930K16180M2441J99377K01831K32560M0011k50375q9602M37422
9299F152783J01130o8615J63136k44473j29380K38936k36716l01829n4536o3084
9289E557352k64711J28031j94759l5472J81663L23700J79217L53627r9926J55317
$$ plain form
9359 2527631 2631840 2336554 2225421 2290075 2384288 2570431 2803603 2759396 2640911 2873161
9349 2873161 2727403 2706358 3001262 3150536 2851446 2827960 2867153 2828877 3077671 3123149
9339 3123149 3322848 3540756 3753007 3827064 3915242 4351077 4972277 5275987 5693018 5771258
9329 5771258 5296971 4910629 4548582 4214870 4165308 4107935 3895631 3841106 3442550 3376232
9319 3376232 3747005 3805083 4030889 3933648 3797909 3823614 4064236 4320991 4676468 4888008
9309 4888008 5122938 5339118 5381559 5580936 5782767 6015327 6055338 5804963 5715361 6152783
9299 6152783 6253913 6185298 6348434 6103961 5974581 6213517 5976801 5674972 5620436 5557352
9289 5557352 5292641 5420672 5225913 5190441 5372104 5695804 5875021 6228648 6128722 6284039
9279F284039J36325K50434K97099J79551J44094J90034N00261L69714O4506K5648
9269H441705K78219K04383K83702O01076O11814L96261P68244P51292P28798J123464
9259A4188958J362922J762423K362748K471123L430031L852757L246336R17845
9251C3595143j046118j700285j580476K3391J136483J517717L60610j878239l049846
9242B7378380l633544l052720k541113k243176j462836j194875j025988o25632
9234A1598496q51716l50571l9781n08326m94016l89886j26312q4721j2478j45806
9224H594883m40130j13833J94771L17542J63446J53059J00391K61496L84269M7061
9214I662955m50104o92637r5024P8101J3438L15489m28624m84633l66557n07174
$$ plain form
9279 6284039 6420364 6670798 6967897 7147448 7291542 7481576 7981837 8351551 8416057 8441705
9269 8441705 8719924 8924307 9208009 9809085 10420899 10817160 11585404 12336696 13065494 14188958
9259 14188958 15551880 17314303 19677051 22148174 25578205 29430962 32677298 33595143
9251 33595143 32549025 30848740 29268264 29291655 30428138 31945855 32306465 30428226 27378380
9242 27378380 23744836 20692116 18151003 15907827 14444991 13250116 12224128 11598496
9234 11598496 10746780 10396209 10356428 9848102 9354086 8964200 8837888 8753167 8740689 8594883
9224 8594883 8154753 8040920 8235691 8553233 8716679 8869738 8970129 9231625 9615894 9662955
9214 9662955 9212851 8520214 8425190 8503291 8516729 8832218 8403594 7918961 7552404 7045230
9204G045230k79079m98939p93366j87223K0939J9476k71233j93563j26412J72944
9194D908774j68794j40209l5638n7563L98078j4677r0648L335L8084k92652J18971
9183D667061K7701r417k82793K61311J60620k7159n5078K95053J3343n9727R6300
9172E087215k0112M2152l05451q2740K39715j01084K53968J64392J32201J44048
9162E554304k10968R0221J14352j69767J87414K32376l7881K48911J81999J13821
9152F304782J35418m07830R1719K22491J11785Q1776J9835J95253L25563J44518
9142G225310o0975n152N23155K33223j02764O3804M9896M32815K55807L10971
9132H926090o0424j01171P454K20783K60822O3289L80740L83024K57999K99810
$$ plain form
9204 7045230 6766151 6267212 5473846 5286623 5307562 5327038 5055805 4862242 4735830 4908774
9194 4908774 4739980 4599771 4564133 4506570 4904648 4889971 4799323 4802658 4840742 4548090 4667061
9183 4667061 4694762 4685345 4402552 4663863 4824483 4797324 4742246 5037299 5050642 4990915 5087215
9172 5087215 5067103 5109255 4803804 4721064 4960779 4859695 5113663 5278055 5410256 5554304
9162 5554304 5343336 5433557 5547909 5378142 5565556 5797932 5760051 6008962 6190961 6304782
9152 6304782 6440200 6032370 6124089 6346580 6458365 6540141 6559976 6755229 7080792 7225310
9142 7225310 7164335 7159183 7682338 7915561 7812797 7876601 7926497 8359312 8615119 8926090
9132 8926090 8865666 8764495 8771949 8992732 9253554 9316843 9697583 10080607 10338606 10638416
9122A0638416k32896k19638M18369M23106M44479K84479L49063L20401J97248
9113A2623027L22651J84083L47969J91741N73630M16486M45552N04548P38684
9104A6348371M99380O00341M75648K08159L55650N18746N7734O85040O71017N87168
9094B1007254N72032P01526O57835N41269N58080O74477P65768M95884N82880
9085B6557005O28535Q39967J210716J023594R64806J328470J519240J498696K256792
9076C7827821K594026K894407L349937L935773N462831O890776Q526253R857585
9068H1339409J0834819R792683M384567r06513l211305l102526j288657J143510
9060I8985987M035760M983159K703170k365614o714098q859125q352885p325286
$$ plain form
9122 10638416 10405520 10185882 10604251 11027357 11471836 11756315 12105378 12425779 12623027
9113 12623027 12945678 13129761 13477730 13669471 14243101 14659587 15105139 15609687 16348371
9104 16348371 16847751 17448092 17923740 18131899 18487549 19006295 19064029 19749069 20420086 21007254
9094 21007254 21579286 22280812 22938647 23479916 24037996 24712473 25478241 25974125 26557005
9085 26557005 27185540 28025507 29236223 30259817 31224623 32553093 34072333 35571029 37827821
9076 37827821 40421847 43316254 46666191 50601964 56064795 62955571 71481824 81339409
9068 81339409 92174228 101966911 106351478 105444965 102233660 99131134 97842477 98985987
9060 98985987 103021747 108004906 110708076 108342462 101628364 92769239 84416354 77091068
9052G7091068n632657m799841l768925k509756k006034j334475o14639n59350
9044E5865391j03673K66388L24443J024286J485393J349241K197043L225319L882924
9035F9516755M839234O510687Q326499J0072002J2860899J5727285J7370584J5270810
9027A60494755P040479k181309o499752o505145k962726J402814N704243Q086402
9019A64579761M709901m699494j3400692j7178486j7618758j5015374j2549509
9012H8827349r630759p435732o200592n232316m425274l484294l175181k865104
9004D6378097k596280k308977k054521j245377j282342j315252j366021j244487
8996C2964840o31917q53557o98120p74189r55962l55422l72941m58368n61484
$$ plain form
9052 77091068 71458411 66658570 62889645 60379889 58373855 57039380 56424741 55865391
9044 55865391 55761718 56028106 56352549 57376835 58862228 60211469 62408512 65633831 69516755
9035 69516755 74355989 80866676 89193175 99265177 112126076 127853361 145223945 160494755
9027 160494755 167535234 165353925 158854173 152349028 149386302 150789116 156493359 164579761
9019 164579761 169289662 164590168 151189476 134010990 116392232 101376858 88827349
9012 88827349 79196590 71760858 65560266 60327950 55902676 52418382 49243201 46378097
9004 46378097 43781817 41472840 39418319 38172942 36890600 35575348 34209327 32964840
8996 32964840 32332923 31479366 30781246 30007057 29051095 28695673 28322732 27864364 27302880
8987B7302880k48220o942l82233k10737j67553j34594J80866n3938j90959R9105
8977B6187675O4006J59071l9790m538R4682J01630L46600M06412L08503K10891
8967B7835142K96239P48645L93818N97582P07773Q24616K68289P20153N43919
8958C2936176N67049N54043O90227O55387R31693Q67903J061470J342319J060288
8949D0666555J051032J246079J259792R24943J560270J480506K069362K341756
8941E2600295K480371K419633L506716L734589M016382N003953O010637P050267
8933H6822843R078078J1852143J5202723J9589865K5101793K9915839L4166993
8926B31730277L0681194J7392439K735758j0123612k2060097k9093594k9929600
$$ plain form
8987 27302880 27054660 27047718 26665485 26454748 26287195 26152601 26333467 26279529 26088570 26187675
8977 26187675 26251681 26410752 26370962 26366424 26461106 26562736 26909336 27315748 27624251 27835142
8967 27835142 28131381 28880026 29273844 29871426 30579199 31403815 31672104 32392257 32936176
8958 32936176 33503225 34057268 34747495 35402882 36334575 37202478 38263948 39606267 40666555
8949 40666555 41717587 42963666 44223458 45148401 46708671 48189177 50258539 52600295
8941 52600295 55080666 57500299 61007015 64741604 68757986 73761939 79772576 86822843
8933 86822843 95900921 107753064 122955787 142545652 167647445 197563284 231730277
8926 231730277 262411471 279803910 282539668 272416056 250355959 221262365 191332765
8919A91332765k6660067k2496075j7899590j4184122j1074075q834885p444160
8912H2739791o004091n081647m325401l501257l105325k245947j753379j660394
8904E5062350j176252j069771m77223k16189K3423J65736L18777N58070J441835
8895E4630756J611126K603907L939634N062601O655852R120209J1506079J3779271
8887A08909435J4287768J1475640N456408j297168q738875j4025962j5064815
8880A01002431j4276042j2196669r571401p400211n901590m890022m323903l265891
8872C9176702k972302k635253k382226j754694j377326j807778j585181r71742
8864B3690200j374000q31879p25337p93848r98141m81907q27790p98985q06245
$$ plain form
8919 191332765 164672698 142176623 124277033 110092911 99018836 90183951 82739791
8912 82739791 76735700 71654053 67328652 63827395 60722070 58476123 56722744 55062350
8904 55062350 53886098 52816327 52339104 52122915 52146338 52312074 52630851 53188921 54630756
8895 54630756 56241882 58845789 62785423 67848024 74503876 83624085 95130164 108909435
8887 108909435 123197203 134672843 140129251 138832083 130093208 116067246 101002431
8880 101002431 86726389 74529720 64958319 57558108 51656518 46766496 42442593 39176702
8872 39176702 36204400 33569147 31186921 29432227 28054901 26247123 24661942 23690200
8864 23690200 22316200 21484321 20758984 19965136 18966995 18485088 17657298 16858313 16052068
8855A6052068p58801o72537q15224j82335o08772l20926m67603m39960n07292
8846A1278618k14161l37935l90163k25057o7144j74410k97545l78151k64320k90470
8836H639262j13780K17766k29041m11417N4991j95816k92678n8068n83114k99221
8826F728884j43680k44787R031k01264J19559j49665l23635k62271l46569N9818
8816E245421n4966k83929j39547K07385j21813k77023K0508N9709r3946k19181
8806D342618k1510j12565j68508J52403k39633j79911K03220k2135Q5911J8852
8796D058742k58304l86179K57854K54390J78036l57116k77298k7365J31964J29480
8786C704204k19594l13693p124R6787k27546j47030J15605p2571P385l64357J21329
$$ plain form
8855 16052068 15293267 14620730 13805506 13623171 13014399 12693473 12225870 11785910 11278618
8846 11278618 11064457 10726522 10336359 10111302 10044158 9869748 9572203 9194052 8929732 8639262
8836 8639262 8525482 8743248 8514207 8102790 8157781 7961965 7669287 7611219 7028105 6728884
8826 6728884 6585204 6340417 6349448 6148184 6267743 6118078 5794443 5532172 5185603 5245421
8816 5245421 5190455 4906526 4766979 4974364 4852551 4575528 4596036 4655745 4561799 4342618
8806 4342618 4321108 4208543 4040035 4192438 3952805 3772894 3976114 3953979 4039890 4058742
8796 4058742 3800438 3414259 3672113 3926503 4104539 3747423 3470125 3442760 3574724 3704204
8786 3704204 3484610 3170917 3163793 3260580 3033034 2886004 3001609 2929038 2936423 2572066 2693395
8775B693395M6143k68175K3993J66400k19232L1844o0729j54478L6627J04099
8765B399887p4004j78169J1999K20959N2459k27432R828J23047j63425j51080
8755B024069M8984j03744J70312R2008k29832K1213l3550m84040R7263J95733
8745A798416J39569o4284O6285l7949n4917j971j78242j06162K24151k00126J28089
8734A712859l7985R8864M8101J7970k5714n417j35984k42658J0823L46989j29441
8723A658407q0801P5100k05185J42592l4533j37750k10677J43720Q7621l02588
8713A135906p9772o5939p7930K84922j71697J59628L22220j52170J21298j70523
8703A305943l3428N5055K29188k57824K08514r1115o8165J71264j02560p8817
$$ plain form
8775 2693395 2739538 2471363 2495356 2661756 2442524 2474368 2413639 2259161 2295788 2399887
8765 2399887 2325883 2147714 2159713 2380672 2433131 2205699 2215527 2338574 2175149 2024069
8755 2024069 2073053 1969309 2139621 2231629 2001797 2023010 1989460 1505420 1602683 1798416
8745 1798416 1937985 1873701 1939986 1902037 1847120 1845149 1666907 1560745 1784896 1584770 1712859
8734 1712859 1674874 1773738 1821839 1839809 1814095 1808678 1672694 1430036 1440859 1787848 1658407
8723 1658407 1577606 1652706 1447521 1590113 1555580 1417830 1207153 1350873 1438494 1135906
8713 1135906 1056134 990195 912265 1197187 1025490 1185118 1507338 1355168 1476466 1305943
8703 1305943 1272515 1327570 1556758 1298934 1507448 1416333 1348168 1519432 1416872 1338055
8693A338055j3171L2972p049J31263j4080p1971M502L50673j01938o518J37893
8682A780631l71489p4165j66896L46805o0630k80618j4240N3624K6947o9491J74499
8671A344977k8427j3714k13387K29765R7385l03243K31330p821j56116J78726
8661A359475l16306m664k21923K06432M20784k56680j41036O8170p1139J08499
8651A151612j8603J02785J56671J710J58734o1235j31442j00213N1351J1460M3342
8640A366172m5888j85375P1069p2619q1181q4666L5235o1800j25075k11330N8124
8629F62666k11875O7507J36670k1413j7917P0874J8289J25505r0664l41756O3134
8618D61020L1306j96319J54492R6962p0368K5618L05975j48621O5591k46274J4946
$$ plain form
8693 1338055 1324884 1357856 1350807 1482070 1467990 1396019 1400521 1751194 1649256 1642738 1780631
8682 1780631 1409142 1334977 1168081 1514886 1454256 1173638 1159398 1213022 1239969 1170478 1344977
8671 1344977 1316550 1302836 1089449 1319214 1416599 1113356 1344686 1336865 1180749 1359475
8661 1359475 1043169 1038505 816582 1023014 1443798 1187118 1046082 1114252 1043113 1151612
8651 1151612 1133009 1235794 1392465 1394175 1552909 1491674 1360232 1260019 1311370 1322830 1366172
8640 1366172 1320284 1134909 1205978 1133359 1052178 967512 1002747 940947 815872 604542 662666
8629 662666 450791 518298 654968 633555 615638 686512 704801 830306 739642 397886 461020
8618 461020 492326 296007 450499 547461 477093 502711 808686 660065 725656 479382 494328
8607D94328J90075N4143J89661j50722k46605j42800J10407j17766J18627R5458
8597E94806l24992k085K86202j17805j5839k5168L1502k41171R4540l54917J52974
8586G8047J20538L25951P5692k52830l3951j21853M69513M02219j80934l16210
8576E66182j10349j21079J20503K38841p6709o1644j08722n3064N8632J95056
8566F47647j9560n3270P6164O2622p4813J09322K71291j24694J12553j89002L0196
8555H48456K55897j9199N091M5121o8421J9136k33124j7527R7244l29142l38110
8544B65422K16783J03487K5446l55842K8455N6904L79506N1639m01559M1351J07497
8533E19089J63401j78115o1739o144j14541R0681o139k08487L41637j35203P0549
$$ plain form
8607 494328 684403 738546 928207 777485 530880 388080 498487 380721 499348 594806
8597 594806 269814 267729 553931 436126 420287 395119 426621 185450 279990 -74927 78047
8586 78047 198585 524536 600228 347398 313447 191594 661107 1063326 882392 566182
8576 566182 455833 334754 455257 694098 617389 555745 447023 393959 452591 647647
8566 647647 628087 574817 650981 713603 638790 748112 1019403 894709 1007262 818260 848456
8555 848456 1104353 1085154 1090245 1135366 1066945 1086081 852957 835430 932674 603532 265422
8544 265422 482205 585692 611138 255296 283751 340655 720161 771800 370241 411592 519089
8533 519089 682490 504375 442636 436492 321951 412632 406493 198006 539643 404440 474989
8522D74989J76274L933j56567L09260N305L7251O3331m888k7748l93144J17319
8511F05315k7601J36553j1759j64281k81678j61977n1799K67763K22947j71921
8501C61562j37202j34218l6110J67644n8798R8385J63864l61306j18840j85065
8491b40084L89548N5514k84217O8145n3430R7027j79670L16136l6475j99721N5835
8480a1392k36L07600j49216J60755J79889l65257j20359J24872J7899L12173k20093
8469B36635J91959k64749k16836J93874J17543J26909J17646k6602k63661j55752
8459E6966J03006k83569R6700L07602l19833J5636J85893L03503j7393j12997
8449C35514K48877K40701l54419j38575K35666K6828p2806j6153l99649k48035
$$ plain form
8522 474989 651263 655196 498629 807889 813194 850445 913776 908888 881140 487996 605315
8511 605315 577714 714267 702508 538227 256549 94572 42773 310536 533483 361562
8501 361562 224360 90142 54032 221676 162878 261263 425127 63821 -55019 -240084
8491 -240084 149464 204978 -79239 -11094 -64524 32503 -147167 168969 132494 -67227 -11392
8480 -11392 -11628 295972 146756 307511 487400 122143 1784 126656 144555 456728 236635
8469 236635 428594 163845 -52991 140883 258426 385335 502981 476379 212718 56966
8459 56966 159972 -123597 -26897 280705 -39128 -23492 162401 465904 448511 335514
8449 335514 584391 825092 470673 332098 567764 594592 521786 505633 105984 -142051
8439a42051k05981K03676J65802J78766q4910j78720J12863k1298j60310L7003
8429i5160J64631p0953Q9478O2658J05446k14955k93119J09058j53534J96261
8419a00189K25485K5661j01569k17083K5052Q8749j55036l21463J19981L29834
8409h0578K52041j39889k8319p4963J1588K36553J08923j27381N2038K65J86940
8398C97218j63408m61278J1730K74150j51284O9369P2732J62531l4845J62070
8388C38985m0192l41203J40535j56107m732n0424m6938n0112K08634R1377N1096
8377A40919J30519K3733j56986o8468k61882K93250R1576K21371j75141j23462
8367A15429q5551j85433P2009l8647k6169k4021R4326K58520J98722k20609l15615
$$ plain form
8439 -142051 -348032 -144356 21446 200212 115302 -63418 49445 28147 -132163 -95160
8429 -95160 69471 -1482 87996 150654 256100 41145 -251974 -142916 -296450 -100189
8419 -100189 125296 150957 49388 -167695 -142643 -53894 -208930 -530393 -410412 -80578
8409 -80578 171463 31574 3255 -71708 -60120 176433 285356 157975 210013 210278 397218
8398 397218 233810 -227468 -215738 58412 -92872 -23503 49229 211760 176915 338985
8388 338985 298793 -42410 98125 -57982 -62714 -113138 -160076 -210188 -1554 89823 140919
8377 140919 271438 295171 138185 69717 -192165 101085 192661 414032 238891 115429
8367 115429 29878 -155555 -83546 -122193 -148362 -172383 -78057 180463 379185 158576 -157039
8356a57039m5667L745K60806n0643r6960Q7793J01366J464j69744o540K27528
8345A56109r1785K2559r6753J87921j17530l4572j75870o1469N17667j76774k26049
8334i6546q3213n9458J05113r4678P4548M752O2105K64733j1030P0343k05270
8323C1399J10063J24947o20277j54263O5132J14025M71685p9094k06921j54239
8313b97543N4578N1000M09119j00198j00895K0440p4164l38261J34407K8296M9194
8302a64027K72648L1171j08533k16192l07132Q7823L02044K03208J59913n9900
8292B01023k29391j84230J74483O055j83588Q4909J77107K08681l39036j0169
8282i4156J074K49047K7215o7073k58520R4716K50524n3726j52725J01476p0546
$$ plain form
8356 -157039 -202706 -198961 61845 11202 -85758 2035 103401 104865 -64879 -71419 156109
8345 156109 64324 86883 -9870 178051 60521 25949 -149921 -211390 306277 129503 -96546
8334 -96546 -179759 -239217 -134104 -228782 -154234 -149482 -87377 177356 166326 236669 31399
8323 31399 141462 266409 -353868 -508131 -442999 -328974 142711 63617 -143304 -297543
8313 -297543 -242965 -191965 217154 116956 16061 36501 -37663 -375924 -241517 -213221 -164027
8302 -164027 108621 139792 31259 -184933 -492065 -404242 -102198 101010 260923 201023
8292 201023 -28368 -212598 -38115 -32060 -215648 -130739 46368 255049 -83987 -94156
8282 -94156 -93082 155965 183180 116107 -142413 -47697 202827 149101 -3624 97852 27306
8271B7306r2204m845l8489L710J50786j3402J72942J41290j84828l42418M8186
8260a31966L03155p5693K40999L2369j78432M6365l0906j746k5244l77715k9697
8249b28511L3403L94796j6184p787l58122J38533k21063r5798M41625J07779m6256
8238A42415j05476O6463N3445o7745k47947j3263K09756K83605K8348m80001j10964
8227b41364J40385M9686l79902q7841J11831L47995K75216j35295j47241j49679
8217b16209M6835J92477j69587J47253N6759P6821j58364q2665J75203j1757N2722
8206A09488k20396J08563J03458k69137J76856J11426R2957p5160r9149R6436
8196A35342r5702L0477M6523M8435j697132R0226P61438L90395O601m0158J85672
$$ plain form
8271 27306 -64898 -69743 -108232 -104522 46264 32862 205804 347094 162266 -180152 -131966
8260 -131966 171189 95496 336495 368864 190432 236797 205891 204145 178901 -198814 -228511
8249 -228511 -195108 199688 183504 175717 -182405 -43872 -264935 -360733 80892 188671 142415
8238 142415 36939 103402 156847 89102 -158845 -172108 37648 321253 349601 -130400 -241364
8227 -241364 -100979 -51293 -431195 -519036 -407205 -59210 216006 80711 -66530 -216209
8217 -216209 -169374 23103 -146484 769 57528 134349 -24015 -106680 68523 56766 109488
8206 109488 -110908 -2345 101113 -168024 8832 120258 213215 138055 38906 135342
8196 135342 39640 70117 116640 165075 -1532057 -1441831 -680393 -289998 -283397 -323555 -137883
8185a37883q9436P6458j72517L05142m3459l11786K9865Q2970l4511n9751o5661
8174d20569M16030p9933K09782P101k09329M2451j05673n7535J41244J19926m2523
8163B0972j3366K7946k56998j7689l4822O5501J59607k64487L59622j16614j15756
8152a86084L96260j62451j6395j58893n4750k7777J91813J54957j7423J25755
8142B45012J06067k53349k92572J0735l2540p5926n331o6756N8744K36676q291
8131g7531O523k40433K93111j37412N6381m3762M0460J13933j42315J28912L9457
8120C7324p0162j68305M11903k34299J18804p6465J47502p7495j80760K4329J52464
8109H4840l72690K17230K18302l42473m6628R5553J05257J63134J5071j57597
$$ plain form
8185 -137883 -227319 -150861 -323378 -18236 -61695 -373481 -343616 -260646 -295157 -354908 -420569
8174 -420569 -4539 -84472 125310 132411 -76918 -34467 -140140 -197675 -56431 63495 20972
8163 20972 7606 35552 -221446 -239135 -273957 -208456 -48849 -313336 46286 -70328 -186084
8152 -186084 210176 47725 31330 -127563 -182313 -210090 -18277 136680 119257 245012
8142 245012 351079 97730 -194842 -184107 -216647 -292573 -297904 -364660 -305916 -69240 -77531
8131 -77531 -71008 -311441 -18330 -155742 -99361 -143123 -102663 11270 -131045 -2133 37324
8120 37324 -32838 -201143 210760 -23539 95265 18800 166302 88807 -91953 -67624 84840
8109 84840 -287850 -70620 147682 -194791 -241419 -145866 -40609 122525 137596 -20001
8099b0001M1642j2306j62612j97670J41209M5192J49753l04962J97694r6042J84346
8088c3757L02708j42683Q394J26843l63713k79330J10861o6953J38783j49012
8078c47859K04525j34884j6514M38657j40966j68757p2237J76659k37670p8915
8068c77961n4408K91965P5903n8547j607K69155j59683k1627N3543k25701k60
8057b09228N9310j86024P6169P3268J69911J6026r0089k54110L98399J18342N4263
8046B26237O0112n0940j84080l60952J41232K5336J10944O0177k05723l0213K85847
8035G7977k55832m8668P1249R2950k6917J97347j29115k74194l6652N573J14323
8024b11959j08293J71987J56395j27150j11669L14550j43272k81965j59236J09730
$$ plain form
8099 -20001 21641 9335 -153277 -350947 -209738 -164546 -14793 -319755 -122061 -218103 -33757
8088 -33757 268951 126268 134662 261505 -102208 -381538 -270677 -337630 -198847 -347859
8078 -347859 -143334 -278218 -294732 143925 2959 -165798 -238035 -61376 -299046 -377961
8068 -377961 -432369 -140404 -64501 -123048 -124655 144500 -15183 -36810 16733 -208968 -209228
8057 -209228 -149918 -335942 -259773 -186505 -16594 -568 -90657 -344767 53632 171974 226237
8046 226237 286349 235409 51329 -309623 -168391 -143055 -32111 28066 -177657 -207870 77977
8035 77977 -177855 -226523 -155274 -62324 -89241 108106 -21009 -295203 -331855 -326282 -211959
8024 -211959 -320252 -148265 8130 -119020 -230689 83861 -59411 -341376 -500612 -390882
8014c90882K77442j40157k0786K07705o218j09271J15453P9557j2409j16290R1396
8003b4460j14713j1759K8300K02307p6823j26770J59201J58552k30259p2988m101
7992a13513J66030j83614k49935m220J88574P2259K77005k8234k50410K8694K43408
7981A46044j81535p9061K43290k68156q8810J41660L0542K22133J08248N438o5196
7970B14597l44539j80959J42948j70051o3472L5745L54798p5687L23026k27992
7960H414k55916K02120R1213K26616k10905l82557L7321L15808l66979J19034
7950b15831J13288j75466j6228J67058J3326k4591K27969J21037k69402j54284
7940b13124K70440J02268j8383l08796j65762M9567j64300L34483J0557j64752
$$ plain form
8014 -390882 -113440 -253597 -274383 -66678 -72896 -182167 -66714 12843 434 -115856 -24460
8003 -24460 -139173 -150932 -122632 79675 2852 -123918 35283 193835 -36424 -109412 -113513
7992 -113513 52517 -131097 -381032 -385252 -196678 -124419 152586 124352 -126058 -97364 146044
7981 146044 -35491 -114552 128738 -139418 -228228 -86568 -56026 166107 274355 279793 214597
7970 214597 -129942 -310901 -167953 -338004 -401476 -365731 -10933 -86620 236406 8414
7960 8414 -247502 -45382 45831 272447 61542 -321015 -283694 32114 -334865 -215831
7950 -215831 -102543 -278009 -294237 -127179 -113853 -138444 89525 210562 -58840 -213124
7940 -213124 57316 159584 141201 -167595 -333357 -283790 -448090 -113607 -103050 -267802
7930b67802J46834K0663o0777k2205k27266k4195K39952N4800J22139n0201R5885
7919B7827q0549R2436M1077k00444l29643q6431L30807j19767J1630N00439k42225
7908e4843k63394Q6125K26292M2492j82050M6272j9895N7204k6251K54595k02804
7897c6257K0120J6164l9749j71220L3197J87876j20655k74302m2910n645M28957
7886d424M4098K7973p0990p1091o6440k43092J7504J15409J17771p816k04035
7875c45133Q4308K10671M6254l27095l6180Q9957O3988L07840j15026m02868J07903
7864c15381J20474k8671O8702O3324j75782O0989J891m0408N8433J00518J62423
7853G6512J60517k89250o5820J81883j55473k87011M43826J19607j41931j32222
$$ plain form
7930 -267802 -120968 -100305 -161082 -183287 -410553 -434748 -194796 -139996 -17857 -68058 27827
7919 27827 -52722 39714 80791 -119653 -449296 -535727 -204920 -324687 -313057 187382 -54843
7908 -54843 -318237 -232112 -5820 36672 -145378 -99106 -119001 -61797 -88048 166547 -36257
7897 -36257 -16137 27 -39722 -210942 -177745 10131 -110524 -384826 -427736 -433381 -4424
7886 -4424 39674 67647 -3343 -74434 -140874 -383966 -366462 -251053 -133282 -141098 -345133
7875 -345133 -260825 -50154 -3900 -330995 -367175 -277218 -213230 94610 -20416 -423284 -315381
7864 -315381 -194907 -223578 -154876 -91552 -267334 -206345 -204454 -244862 -186429 -85911 76512
7853 76512 237029 -52221 -118041 63842 -91631 -378642 65184 184791 42860 -89362
7843h9362j85313J5453j16280k3326K57907o5619j85964K22910J1332L28450r4266
7832G5922q3466K7481J13866O6850j21410l21002k9797O7407M8864j69696J06743
7821b18238j38091K25093J19169j25736K07241r0387j40188n9258l1668J45763
7811a06300K8220j85595k6178o4264J5688l8699K79626K74313l96170M8373L4405
7800a36581k09339j9306M6571K10673K52751n4296j0776J39381l3987l45109k0393
7789a80411R2844q7685J51945j36620k13709J66877K07277J44662j68518J40699
7779A17361k01256r5970j03256l8938q5108L44220j98869r1385L26143M6021K37272
7768B56235k6773n3511l33060O3634L56548k21445q2685n8985K54737k16949j14332
$$ plain form
7843 -89362 -274675 -259222 -375502 -398828 -140921 -206540 -392504 -169594 -158262 170188 75922
7832 75922 -7544 19937 133803 200653 79243 -241759 -271556 -204149 -155285 -324981 -218238
7821 -218238 -356329 -131236 -12067 -137803 69438 -20949 -161137 -220395 -252063 -106300
7811 -106300 -78080 -263675 -289853 -354117 -338429 -377128 -97502 176811 -219359 -170986 -136581
7800 -136581 -345920 -365226 -318655 -107982 144769 90473 79697 219078 185091 -160018 -180411
7789 -180411 -87567 -175252 -23307 -159927 -373636 -206759 518 145180 -23338 117361
7779 117361 -83895 -179865 -283121 -322059 -407167 -62947 -261816 -353201 -27058 18963 256235
7768 256235 229462 175951 -157109 -93475 263073 41628 -41057 -100042 154695 -62254 -176586
7757a76586L1124k66472j44933J20145L06552O0877P6525n6023l0597J1948k10567
7746b78007p302K92602K24448l7475j64043r5615j00936P4795O0133K67086j2176
7735B23510P3626j20297k8426j18634M0340R871m9362J45763J970j48936J46032
7724A75457J58153j87632J07166k32176k58730q7204K49243m2908j51553L25090
7714E4906j9490n3488j55392N3872j44498M690K75096K63092J7887k34485j92576
7703a30386J31403J73824m3610k52554j10003J72617J70831j47930J22509m82768
7693c96067K75867J37743k82137j59620L49591J81734k49523k9371l9544o9427
7683b80754J70918j9298J11008J0706J01125j26443j65252o7691r771J69967o1782
$$ plain form
7757 -176586 -145462 -411934 -556867 -436722 -130170 -69293 7232 -48791 -79388 -67440 -278007
7746 -278007 -285309 7293 231741 194266 30223 -65392 -166328 -91533 -31400 235686 223510
7735 223510 297136 176839 148413 29779 70119 79990 30628 176391 178361 29425 175457
7724 175457 333610 145978 253144 20968 -237762 -324966 -75723 -118631 -270184 54906
7714 54906 35416 -18072 -173464 -119592 -264090 -259400 15696 278788 296675 62190 -130386
7703 -130386 1017 174841 131231 -121323 -231326 -58709 112122 -35808 86701 -396067
7693 -396067 -120200 17543 -264594 -424214 -74623 107111 -142412 -171783 -211327 -280754
7683 -280754 -109836 -129134 -18126 -7420 93705 -32738 -197990 -265681 -275452 -105485 -167267
7672a67267r6569J34025L76382k23459j47883K48245J80588k35322j4186P9764
7662A34318j55372o16768J81945J56740P069K14888K62045j74197k2338j48279
7652a59949q9278O0538j13247Q9851K92508J40754j99633k81803J8156k11946
7642d54049K38827J12333o4258L45414k64277p2197J32005j67971J04897L84580
7632B95304m8874j50231l1431m5328R0793n8251Q4541L07948j72000l35649K22983
7621A59805O2839k90828K76005k76393j06785K72567Q744j29674J78084p5330
7611G9034l65569K36676J56041j54092j68892J79386K5302J03077K34014j45408
7601A79569j79806j09953q7287J81098R8921j47K3752J620k9117k30683j06447
$$ plain form
7672 -167267 -263836 -129811 246571 23112 -124771 123474 304062 68740 54554 134318
7662 134318 -21054 -637822 -455877 -299137 -292068 -77180 184865 10668 -11670 -159949
7652 -159949 -249227 -188689 -301936 -212085 80423 221177 21544 -260259 -242103 -454049
7642 -454049 -215222 -102889 -167147 178267 -86010 -158207 -26202 -194173 -89276 295304
7632 295304 246430 96199 64768 19440 110233 51982 136523 444471 272471 -63178 159805
7621 159805 222644 -68184 207821 -68572 -175357 97210 105954 -23720 154364 79034
7611 79034 -286535 -49859 106182 -47910 -216802 -37416 -12114 90963 324977 179569
7601 179569 -237 -110190 -197477 -16379 82542 82395 106147 107767 78650 -152033 -258480
7590b58480K96712j780M4343q9139m3962M0313N4347M9270M8782j27180j78673
7579a65447n8504r3816K11296J17243j58222m0783J26873L32647l10607J73131
7569A33811R4375k15435j4148k30412p9519J20068K34064j07526k12435K21784
7559e5373n9933k2132J51303r4708J78553j33384m04006n4636K49041K5205K3593
7548a96477j3286K64864K4817k46925q0024K57795j01680p6892K30370R3854j04527
7537E1889k19517j64029J43067R8870J62675o17j33124J17966J60610n7084k46016
7526h5310j2963Q7830O4413P8517K17797q2022k37591p7676M2963J98566j83923
7515A0601l02761M0624l06142J12128J23829P0573K57476R3943j87589k23373
$$ plain form
7590 -258480 38232 36452 80795 -8344 -52306 -11993 42354 91624 140406 13226 -165447
7579 -165447 -223951 -317767 -106471 10772 -147450 -188233 -61360 271287 -39320 133811
7569 133811 228186 12751 -1397 -231809 -311328 -191260 42804 -64722 -277157 -55373
7559 -55373 -115306 -137438 13865 -80843 97710 -35674 -439680 -494316 -245275 -220070 -196477
7548 -196477 -209763 55101 79918 -167007 -247031 10764 -90916 -167808 62562 156416 51889
7537 51889 -167628 -331657 -188590 -89720 72955 72338 -60786 57180 217790 160706 -85310
7526 -85310 -98273 -10443 53970 132487 350284 268262 30671 -47005 -4042 194524 10601
7515 10601 -292160 -251536 -557678 -445550 -321721 -251148 6328 100271 -87318 -310691
7505c10691N11347R498k70175l99709N12079L3594j77271O2443k1567q034k66357
7494c24843K82834j63275k32078L11673L60086m92352q7515R5157P0549l0782
7484b10546J32050K32663j78991K01095J0972j06788J86764k27252r7044j33414
7474a90491Q0252J2473J49837j33796N2574k7050l83669n384P2868M8535j31722
7463d55573K67456J49344J782m2246M5262j70963M5027K14208o414j42442n2380
7452a46939o1092P4512J66110P1004J68700P5808n2441Q8961l43139k01215j10869
7441b70600N487R5492K59409j2552J44027j54782q6387o9368j72137J22437J68943
7430B9969L4095q4016J15036J31895O5329l06705J8793l8256Q7708K0126j93598
$$ plain form
7505 -310691 200656 210154 -60021 -459730 52349 85943 -91328 -28885 -50452 -58486 -324843
7494 -324843 -42009 -205284 -437362 -125689 234397 -257955 -345470 -250313 -179764 -210546
7484 -210546 -78496 154167 -24824 176271 187243 80455 267219 39967 -57077 -190491
7474 -190491 -110239 -97766 52071 -81725 -29151 -56201 -439870 -445254 -372386 -323851 -455573
7463 -455573 -188117 -38773 -36991 -79237 -33975 -204938 -159911 54297 47883 -94559 -146939
7452 -146939 -208031 -133519 32591 103595 272295 348103 295662 384623 41484 -159731 -270600
7441 -270600 -265113 -169621 89788 77236 221263 66481 -19906 -89274 -261411 -138974 29969
7430 29969 64064 -19952 95084 226979 292308 -14397 4396 -33860 53848 73974 -119624
7419a19624K18856M4281j87342k98576r9623J17692J55326J26485J80176L4776
7409A72427n537o4343k23779n280j18588J14197J45881k45806k15239K43534P8057
7398a24476l20636N48592P3428k41551M4431j60579J71357M075n4154l9695q7075
7387a86283K49580L6816l12919J24414J94358K30557j90330l4197j03576J12328
7377A20748n1609J14987j82981o324m5959k60681l9494L27578j12050j63893J90226
7366a09452j65558L1758r6508M9372Q2371N2027R4649N7986O975p284o8122k85149
7354c56935K75370K7326j3944L8720O1254J49397j29849K6440j90354J14317j15450
7343a13708l6568J74948R4862J15126j93783K26052J9003j38840k46229l83492
$$ plain form
7419 -119624 99232 143513 -43829 -342405 -442028 -324336 -169010 -42525 137651 172427
7409 172427 166890 102547 -121232 -126512 -245100 -130903 14978 -230828 -446067 -202533 -124476
7398 -124476 -445112 103480 176908 -64643 -20212 -180791 -9434 -5359 -59513 -99208 -186283
7387 -186283 63297 100113 -212806 -88392 105966 336523 146193 111996 8420 120748
7377 120748 69139 184126 1145 -5179 -51138 -311819 -351313 -23735 -135785 -299678 -109452
7366 -109452 -275010 -243252 -339760 -290388 -208017 -155990 -61341 -3355 3620 -3664 -71786 -356935
7354 -356935 -81565 -54239 -68183 -29463 31791 181188 51339 77779 -112575 1742 -113708
7343 -113708 -150276 24672 119534 234660 40877 266929 285932 147092 -99137 -482629
7333d82629j14857K89999J92764k17027j29024K32406K99577j38587l6280q6023
7323a89681L13726r5044j74963J32272L0650j53731j81278M9697p4595j34860
7313d77807J23351o3768K66057J90690k06265Q5447N6886M9317M5540j71901j73807
7302b76260J06602J03194k20493J40529K16120k01165k0153K34725j31591j33556
7292a82048J53496J99980l9660j7784j99821r6745L156j196n5931M9646J73887
7281a3020O777j71268j52037Q3899J83538l3792j37302K39664M3579o6029m7773
7270f3764O5181k9875J9464J4836M4406j41624o6629j42217j55719J07458j2929
7259c61412J99543M24080o7392k17458K48000l5844k06669P1848o9878L8126L00122
$$ plain form
7333 -482629 -597486 -307487 -114723 -331750 -460774 -228368 71209 -67378 -103658 -189681
7323 -189681 124045 29001 -145962 -13690 16960 -136771 -318049 -268352 -342947 -477807
7313 -477807 -354456 -418224 -152167 38523 -167742 -82295 -25409 23908 69448 -102453 -276260
7302 -276260 -169658 -66464 -286957 -146428 69692 -131473 -151626 83099 -48492 -182048
7292 -182048 -28552 171428 131768 113984 -85837 -182582 -179426 -180622 -236553 -186907 -13020
7281 -13020 -6243 -177511 -329548 -245649 -62111 -95903 -233205 6459 50038 -15991 -63764
7270 -63764 1417 -28458 -8994 5842 50248 -91376 -158005 -300222 -455941 -348483 -361412
7259 -361412 -161869 262211 194819 -22639 225361 189517 -17152 54696 -15182 22944 323066
7248C23066k75847q206O9253K91886j26581m36333r6083q3481j02076L93720J54635
7237A03953L3931j77447j9540k26631L8523K21818q9817J28578j13813K71858
7227A71413r1437j88273K9446J20636j09739J78884j51756J63739J76763j97358
7217A02318p5423k27929O4977J90481m1669r7896j40922Q0720Q0295J82383j01483
7206A5852J24069k18757r2386O2788L18782j09783l49493J51851K45138n5107
7196I2954j67665N2820M3978m0403j19413L41980j66715l38077J74034J045l6856
7185a62318o4090R7368j7522K23203j8387j11465M06782j49800m1044N6035j0985
7174B07777k22246r7373J46560o0521j87044J34330l5376K60564r7272j03870
$$ plain form
7248 323066 47219 39013 108266 400152 273571 -162762 -258845 -342326 -444402 -50682 103953
7237 103953 137884 -39563 -59103 -285734 -247211 -25393 -115210 13368 -100445 171413
7227 171413 79976 -108297 -78851 41785 -67954 110930 -40826 122913 299676 102318
7217 102318 26895 -201034 -136057 54424 12755 -85141 -226063 -145343 -65048 117335 15852
7206 15852 139921 -78836 -171222 -108434 210348 100565 -248928 -97077 148061 92954
7196 92954 -74711 -21891 22087 -18316 -137729 204251 37536 -300541 -126507 -125462 -162318
7185 -162318 -226408 -129040 -146562 76641 58254 -53211 353571 203771 162727 218762 207777
7174 207777 -14469 -111842 34718 -25803 -212847 -78517 -113893 146671 49399 -54471
7164e4471j57955p0022J5013N05095J49171k05642j40485l1408L809M2234n2607
7153B732q6868j28931K4834L3951o8317M6223M2439Q9061q6245k10745J70781
7142a71085J73283k36900M6834k16533n909R3083K34459K841k27723o3162J30642
7131b40170J20126J00651j08952M3912J79530j17322J28515m8058j91369M253
7121a28884O2575l491k9658P9502j64819O4001j19077l2469L7005q9861O3272
7110b61904K73660k16128n4007J12389P7301J97439j03888j49696j21456k28554
7100d74844k0610J0962K53904Q0296L44175K9334j09010P8359k8497o1388R9627
7089B02308m2435J82971j22721k43715P3591n0799j51724K13783p7625j46348
$$ plain form
7164 -54471 -212426 -282448 -267435 237660 386831 181189 40704 9296 13105 55339 2732
7153 2732 -84136 -213067 -188233 -154282 -222599 -176376 -133937 -44876 -131121 -341866 -171085
7142 -171085 2198 -234702 -187868 -404401 -410310 -317227 -82768 -79927 -307650 -370812 -240170
7131 -240170 -120044 -19393 -128345 -84433 95097 -22225 106290 58232 -133137 -128884
7121 -128884 -66309 -69800 -99458 -19956 -184775 -120774 -239851 -272320 -235315 -325176 -261904
7110 -261904 11756 -204372 -258379 -145990 -68689 128750 24862 -124834 -246290 -474844
7100 -474844 -495454 -484492 -230588 -150292 193883 223217 114207 192566 164069 102681 202308
7089 202308 159873 342844 220123 -23592 49999 -800 -152524 61259 -16366 -162714
7079a62714J94245o4505J35406J95339l64454j5985J09640k76177l6829j65781
7069d51815J51084k96528O0130K32823Q183k8495K12731j8164L6311q1058m4016
7058b18814j45020L97904k87119n7383J48734R1268M8608l8379j46197O9605J03852
7047c2941j86865K5126K77119j97627L4778J21335j45813m3107K83386j6601j94756
7036g5966o826J77977j1011r1690j40732j44695J16128L6734R0223l00162o1684
7025d11704K43702L58825j8098J34014p2135l30449N4282p027k48875K19863J19178
7014D1576J55515P471j76357l0051j79590N6522L62793j73651j3916o2905j26206
7003a38799k96342K35811L15933Q8329l80449N6174K9947l38896M24051J65342
$$ plain form
7079 -162714 31531 -32974 102432 297771 -66683 -82668 26972 -249205 -286034 -451815
7069 -451815 -300731 -597259 -537129 -304306 -296123 -324618 -111887 -130051 -93740 -174798 -218814
7058 -218814 -363834 34070 -253049 -310432 -161698 -70430 -21822 -60201 -206398 -136793 -32941
7047 -32941 -219806 -194680 82439 -115188 -80410 40925 -104888 -147995 135391 118790 -75966
7036 -75966 -82792 95185 84174 -7516 -148248 -292943 -176815 -140081 -49858 -350020 -411704
7025 -411704 -168002 190823 172725 306739 234604 -95845 -41563 -48590 -297465 -77602 41576
7014 41576 197091 204562 28205 -1846 -181436 -124914 237879 64228 50312 -12593 -138799
7003 -138799 -435141 -199330 116603 204932 -175517 -119343 -89396 -428292 -4241 161101
6993A61101r5369Q0091k01952J06898Q8584J0691m1981j21011O2356J61374P35
6982B11517j70821k26198L875M06568K27563k43920j30100P9529L27206j42070
6972C43149j51811K58656n7960j63136n8871n2911K8941L7902m3788J6081L16521
6961D72773j62927o3283J76332K39052K37992m84816j09865P7783j05323k34994
6951D2724J20686N4627j18557k20546K04498q2956p0513J76645Q8615M7848Q9311
6940C32382j50758j85707q3589K03147R1594J08535k07913l9408M0837J10654
6930B19774J17766k56450k90313R2570M7932j69619k4484K31106L6340J23245
6920A27867J7867J61259J20917j25144l4408r8012Q9629L0427l25631l53372K16946
$$ plain form
6993 161101 65732 145823 -56129 50769 139353 150044 108063 -12948 49408 210782 211517
6982 211517 40696 -185502 -181627 224941 452504 208584 78484 158013 485219 343149
6972 343149 191338 449994 392034 228898 170027 117116 146057 183959 140171 156252 472773
6961 472773 309846 246563 422895 661947 899939 415123 305258 383041 277718 42724
6951 42724 163410 218037 99480 -121066 83432 476 -70037 106608 195223 243071 332382
6940 332382 181624 -4083 -87672 115475 207069 315604 107691 68283 109120 219774
6930 219774 337540 81090 -209223 -116653 -68721 -238340 -262824 -31718 4622 127867
6920 127867 145734 306993 427910 302766 268358 170346 259975 290402 -35229 -388601 -171655
6909a71655J72090P3584Q4247l5191j14908q7511N4623K18793j0301j86198j35151
6898a37578r7393P6119M68425J63115j96543q5751l26254K3958K60169m21088
6888b72821m7557K500K1515r8541R6362R6657K19061K2957k14953R2214J01279
6877A8673j81957K41574J44864j17171j0739J70532l32160j42760K23741l3582
6867a8985j51973J00999J08936k00152j55175N7960N8670Q1176N8896Q4937L4571
6856E9860j59545N7925j89326j80791l2541L79764M65804k71232j43664J3245
6846e01J24690j14373j74148J95834J86896j60205n2302J75032k49353m87334
6836e55764j38454L27218R8600K16721j39632j5415K00986J86349j64120j00515
$$ plain form
6909 -171655 435 74019 158266 123075 8167 -79344 -24721 194072 183771 -2427 -137578
6898 -137578 -234971 -158852 309573 472688 276145 190394 -135860 -111902 148267 -272821
6888 -272821 -320378 -317878 -296363 -394904 -298542 -201885 17176 40133 -174820 -82606 18673
6877 18673 -163284 78290 223154 105983 95244 265776 -66384 -209144 14597 -18985
6867 -18985 -170958 -69959 38977 -161175 -316350 -258390 -199720 -118544 -59648 25289 59860
6856 59860 -99685 -41760 -231086 -411877 -444418 -64654 401150 129918 -13746 -501
6846 -501 124189 9816 -164332 31502 218398 58193 5891 180923 -68430 -555764
6836 -555764 -694218 -367000 -268400 -51679 -191311 -206726 -5740 180609 16489 -84026
6826h4026j83495O0087j9186N90220k82996Q9685P6493j22403j49546L05547L0463
6815C10843l20885J6075l86880m8708J16235K49697K6169r4428j29606q1364K06792
6804a36060n3438L9417J41326j36917l5623m7931n6982j89490L74558k3670j71911
6793b96721J41402L33612k59305j02894k83144M33388j6151j27077M01208J45867
6783C70185m44275k34842L54107j70507l04400K48449p8115J60400n826N7027
6773d7797R5172q1426J01854K74987q4875K8242J892l67372j03089P8258J15594
6762A1440Q522j30642l40451K07488O3981P3404Q1837J17344m3656l03348J38397
6751a15684Q5876j21803J59227r3927n6530M372j58112O9574L56546j60188k69154
$$ plain form
6826 -84026 -267521 -207434 -226620 363600 80604 170289 246782 124379 -25167 280380 310843
6815 310843 -10042 6033 -380847 -429555 -313320 -63623 -37454 -131882 -261488 -342852 -136060
6804 -136060 -189498 -150081 -8755 -145672 -181295 -229226 -286208 -475698 -101140 -124810 -296721
6793 -296721 -155319 178293 -81012 -183906 -467050 -33662 -49813 -176890 224318 370185
6783 370185 -74090 -308932 45175 -125332 -429732 -181283 -259398 -98998 -104824 -47797
6773 -47797 47375 -34051 67803 342790 257915 286157 288049 -79323 -182412 -104154 11440
6762 11440 19962 -110680 -451131 -243643 -179662 -106258 -24421 92923 49267 -254081 -115684
6751 -115684 -29808 -151611 7616 -86311 -142841 -138469 -296581 -227007 129539 -30649 -299803
6740b99803R8159K40856k38849J01965K60824j76200o1037J03277k09569K47736
6730F7359j2638n9686j283l93607K84778L08909m21597k2377q8930L20097J72416
6719A53441N9587L7101l68971L5885j22933k03950L65168j6322k26276J70093
6709a17177J0109R6149K2616j24102j53420N6703j39025R298r0105J30457m4816
6698c43313l2570n2708J32589Q448N3901J67713q2060M4835k18968K61374j1438
6687g2197k10042J89792j46262J2308r8745j77824L44186J3443o1462j68054J50207
6676b24650L51021P9206q9648j87871j66735R993J69878j6541J28339l7238n2656
6665c6902j99597m1336O0673q9332J63515L94392k36788j02822J56648l7502k62977
$$ plain form
6740 -299803 -201644 39212 -199637 -97672 163152 -13048 -74085 29192 -180377 67359
6730 67359 54721 -4965 -6248 -399855 -115077 193832 -227765 -250142 -339072 -18975 153441
6719 153441 213028 250129 -118842 -82957 -205890 -409840 -44672 -60994 -287270 -117177
6709 -117177 -107068 -10919 11697 -112405 -265825 -209122 -348147 -338849 -428954 -298497 -343313
6698 -343313 -375883 -428591 -296002 -287554 -233653 -65940 -148000 -103165 -322133 -60759 -72197
6687 -72197 -282239 -92447 -238709 -226401 -325146 -502970 -158784 -145341 -206803 -374857 -224650
6676 -224650 126371 205577 115929 -71942 -238677 -228684 -58806 -75347 52992 15754 -36902
6665 -36902 -236499 -277835 -217162 -306494 -142979 251413 14625 -88197 68451 30949 -232028
6654b32028J10618J37374O0876M8999k83566k9199j11068J37192q312j97370O1266
6643c05218k50886J0438M20051J49946p4742L037k66357Q9470L16782k42786n0332
6632b00597J18640O9701q2275J21077J91138L58511j42342l10868k41669j00103
6622b18787M799j00646O9635M0691P750J73897J67517j45305R0670K00785j95611
6611I5395O1339J28365J53620k57180r8612K5755k16518M8417M0754R2706M8733
6600A22774J29159k24687j73211J02582M6070j48896L32265Q4526m70942q9479
6590b89839K44214N0742j9889r8898o7373M8344j60764J77510J59437o2595Q8941
6579F9830j28686j45388K3324K26988R9213k22390n3968J31247l907l20097N9495
$$ plain form
6654 -232028 -121410 15964 76840 125839 -157727 -186926 -297994 -160802 -169114 -366484 -305218
6643 -305218 -556104 -545666 -125615 24331 -50411 -47374 -313731 -224261 92521 -150265 -200597
6632 -200597 -81957 -12256 -94531 26546 217684 576195 433853 122985 -118684 -218787
6622 -218787 -213988 -314634 -244999 -204308 -196558 -22661 144856 -449 90221 291006 95395
6611 95395 156734 285099 438719 181539 82927 108682 -107836 -59419 -18665 74041 122774
6600 122774 251933 27246 -145965 -43383 2687 -146209 186056 270582 -200360 -289839
6590 -289839 -45625 5117 -14772 -113670 -181043 -132699 -293463 -115953 43484 -19111 69830
6579 69830 -58856 -204244 -180920 46068 145281 -77109 -131077 170 -3737 -323834 -264339
6568b64339J23096K70217k01168q8645K69117q5043m2779J08165J47840l99431
6558a62970K5927L2252J345j71398J37703O6833K65406j925Q3790L9561k93013
6547B3511r2795M2350K67491r157p0918J93537q2166m98163K14469j10890n0784
6536a73515J01417p1454K17934j1331J63207M3231j34918J4707j46895O1685q1581
6525a7513j83218q1258M9883J31850J5407m5851m6099k9180J70604K737J80471
6514A47833l62682j02741K64622p1004J9875j97347M4439k9474n7160L55361J51883
6503A63605j77292n2723j74816N9671l2380m7688J25466q0979K94568L4627J4903
6492A26962l29758J55829L25604k69969K7453P2490J747L4586J45291M2049j78505
$$ plain form
6568 -264339 -141243 128974 -72194 -160839 108278 23235 -19544 88621 236461 -162970
6558 -162970 -137043 -104791 -103446 -274844 -137141 -70308 195098 193173 276963 316524 23511
6547 23511 -69284 -26934 240557 231400 160482 354019 271853 -226310 -11841 -122731 -173515
6536 -173515 -72098 -143552 74382 63051 226258 269489 134571 149278 2383 64068 -17513
6525 -17513 -200731 -281989 -232106 -100256 -84849 -130700 -176799 -205979 -35375 -32638 147833
6514 147833 -214849 -317590 -52968 -123972 -104097 -301444 -257005 -286479 -343639 11722 163605
6503 163605 -13687 -66410 -241226 -181555 -213935 -261623 -136157 -217136 77432 112059 126962
6492 126962 -202796 -46967 278637 8668 36121 108611 110358 144944 290235 332284 153779
6481A53779k95319j08200O8766L20127j66151j85762K26236k5418R6835m5975
6471C8918O5983k44904r3367p8373K05058j09462M3528J82298J42058O2103q2951
6460A30889J43080j56391j05710j56716K65603Q8603k78125M0153J8151l0398
6450d0861Q8237L2479o4574j75950M8010p2673K89293J12397K47486k05173l14895
6439e6224J82424R4816L5167j47698K28q3882j85593J26746J62815j1965j75986
6428e9152j65084k7748J35717J5976J69552m2071k04003J8009Q1294K57723n1202
6417A29011p5393l9579k88999P6894J69765l9879J24968q1829j66697J35734R6292
6406D0288P7456k30626J82342j91474j92324J40913K19369n2306k9897j42112
$$ plain form
6481 153779 -141540 -249740 -180974 139153 -26998 -212760 13476 -11942 84893 38918
6471 38918 104901 -140003 -233370 -311743 -106685 -216147 -172619 9679 151737 213840 130889
6460 130889 273969 117578 11868 -144848 120755 209358 -68767 -28614 -10463 -40861
6450 -40861 47376 79855 15281 -160669 -112659 -185332 103961 216358 463844 258671 -56224
6439 -56224 126200 221016 256183 108485 108713 24831 -160762 -34016 128799 116834 -59152
6428 -59152 -224236 -251984 -116267 -100291 69261 27190 -176813 -158804 -77510 180213 129011
6417 129011 53618 14039 -274960 -198066 -28301 -68180 56788 -25041 -191738 -56004 40288
6406 40288 117744 -112882 69460 -122014 -314338 -173425 45944 -6362 -36259 -178371
6396a78371K73811o1476o5487Q4409j40574Q0793j17205J58673L1142q5066r7185
6385a16536j0148k62162N2539J28941K07100k98715K3146L11566o4281m4812O6469
6374f893K35299j84391k9497R579j61290J19389K09521k47337L439M085J22420
6363G4324O4405j98756M3406q5734Q937J01135O4000j55923K28710Q4122j04842
6352A23784l91745m1944J73013J27631k17930J84859o3871L8445J48407j84842
6342a04193J45969N9220j75272O2411k5908n2870K2563O7714k36226J09768m2633
6331a69457k27027L19630J64019k6134j00807O6248o3477P5862K2775j31587k63949
6320c33904J17685p0854j09785M26218K78057j6233k71614J40051p198j10333
$$ plain form
6396 -178371 95440 33964 -31523 52886 -87688 -6895 -124100 34573 65715 -19351 -116536
6385 -116536 -126684 -388846 -336307 -207366 -266 -298981 -275835 35731 -28550 -73362 -6893
6374 -6893 228406 44015 14518 24097 -137193 -17804 191717 -55620 -52181 -48096 74324
6363 74324 138729 -60027 -16621 -102355 -93418 7717 71717 -84206 144504 228626 123784
6352 123784 -267961 -309905 -136892 -9261 -227191 -42332 -106203 -67758 80649 -104193
6342 -104193 41776 100996 -74276 -11865 -37773 -90643 -68080 -366 -236592 -126824 -169457
6331 -169457 -396484 -76854 87165 61031 -39776 26472 -37005 38857 61632 -69955 -333904
6320 -333904 -216219 -287073 -396858 29360 307417 291184 19570 159621 152423 42090
6310D2090j94406M114K9778R7420p5504Q2951Q5659l37435K97262J85402J45334
6299C62665k07327k48706J37407r7454q9099J70456j4011j82238r950J09004R4391
6288B5138P2350p5667L2920j96459J32042L96949m2937k28115J13328j32546J60158
6277B57161j07642N9083k53920j21231J63705K88469k22601j68319J05464R745
6267I914K76150k92363j54629K40428j03429K66144j90131j38608J78798n2012
6257D0262l45261j85550J92420k17606k4463N01606L11424l2366q8802p7038l4564
6246D0062L34016l03620O731j62464k00279k45064l18517L99694K3375K17631
6236b08435J10583M1628k19710J68668p5711K9482q0488K32275K13679n679l26663
$$ plain form
6310 42090 -152316 -148202 -118424 -21004 -96508 -13557 72102 -265333 31929 217331 362665
6299 362665 155338 -93368 44039 -53415 -142514 27942 13931 -168307 -178257 -69253 25138
6288 25138 97488 21821 54741 -141718 -9676 387273 344336 116221 229549 97003 257161
6277 257161 149519 208602 -45318 -166549 -2844 285625 63024 -105295 169 9914
6267 9914 286064 -6299 -160928 79500 -23929 242215 52084 -86524 92274 40262
6257 40262 -304999 -490549 -298129 -515735 -540198 -38592 272832 240466 151664 74626 40062
6246 40062 374078 70458 77189 -85275 -285554 -530618 -849135 -449441 -426066 -208435
6236 -208435 -97852 -56224 -275934 -107266 -182977 -153495 -233983 -1708 211971 206292 -120371
6225a20371J97423K0862j2643p3117Q5660j17542P6707j33035o6406k18585L0307
6214c30740N8726o747P3104j23578J41892J39754j80126K42288J50703j79813
6204a4537K42084m42445K07954J11680k84982J29206J33631k8707k80061k23091
6194d49268Q3151J75506j58011j74216M40190k1071P9129L5942l15584L76805
6184G2573j78513R3493J75029K0357k05214j08839N8039M2596O4501K1174m1836
6173A3360J45417p6780L7721M8963k06279k9566L7050K0004J0093J53229j3216
6162A39996n5855J93976K2560m51931R1151j80842j86519n8677L75605k02273
6152c12809N8379J05237J01397l968M1392j02366l161P6232n1291K07204l08997
$$ plain form
6225 -120371 77052 97914 85271 12154 97814 -19728 56979 -76056 -142462 -361047 -330740
6214 -330740 -272014 -278761 -205657 -329235 -187343 -47589 -227715 14573 165276 -14537
6204 -14537 227547 -214898 -6944 104736 -180246 -51040 82591 53884 -226177 -449268
6194 -449268 -366117 -190611 -348622 -522838 -82648 -103719 -24590 11352 -304232 72573
6184 72573 -105940 -12447 162582 182939 -22275 -131114 -73075 -30479 34022 55196 13360
6173 13360 158777 81997 119718 168681 -37598 -67164 -30114 -10110 -17 153212 139996
6162 139996 84141 278117 300677 -151254 -60103 -240945 -427464 -486141 -110536 -312809
6152 -312809 -254430 -149193 -47796 -51764 -10372 -112738 -115899 -39667 -90958 116246 -192751
6141a92751j98898K68967j69681K26496j10797j15171j24484K03243K84444r5467
6131b4099j5686j8190k89721r3669K9167R3856L05780p3104o0601K37722j75676
6120h4221Q7406j6893L18011M8041n8408j53389k20772p6420l6493N5328K0297
6109a17513J35460O2501M3728j05784L0910N2055R2785R5832p3839n14094n9483
6098c57442N6109J10528J97431O9983j90836O0998k3343J51496J0104r3478k4212
6087c2662j10131k0019J65792M474q7800o5433o0457j32624n185K17051k18728
6076c45722p3906N32374k99474j49991K35625m5986Q5310J72927j25179j55814
6066a69836J28534J11401j80805J20300j98922j67579k46650L65655J25485n8351
$$ plain form
6141 -192751 -391649 -122682 -292363 -65867 -176664 -291835 -416319 -213076 71368 -24099
6131 -24099 -39785 -57975 -347696 -441365 -412198 -318342 -12562 -85666 -146267 91455 -84221
6120 -84221 3185 -13708 304303 352344 293936 140547 -80225 -156645 -193138 -137810 -117513
6109 -117513 17947 80448 124176 18392 49302 101357 194142 289974 216135 -297959 -357442
6098 -357442 -301333 -190805 6626 76609 -114227 -53229 -76572 74924 85028 -8450 -32662
6087 -32662 -142793 -162812 2980 7454 -80346 -145779 -206236 -338860 -344045 -126994 -345722
6076 -345722 -419628 112746 -186728 -336719 -101094 -147080 -61770 111157 -14022 -169836
6066 -169836 -41302 70099 -110706 9594 -189328 -356907 -603557 -237902 -112417 -170768
6056a70768K52594j5090k31331R640L15827k9182n9220O0845K2390n824r5465
6045E4416k44394j94628N3182N8633K37796p3225q8180N4628J8638K81124J79760
6034C37750j75048k24255O4348j78321k26801P1989R2516P6732j2209K18957L9478
6023H5136j3692r172l3473m2306J96899j11695j2161j04415J26422J97428k03952
6012G5019m5978J09183J44751j76899l51168J48368K84955k29697J02575J06819
6002A67928k84044j5605Q795J60581N2934j91648k7060R6971K51120j44310j17691
5991d2029l21250K08475l0392j54445L22164K42879m6057J79708k00522O7647
5981B26178M0523j13144k5001m5958j75400R7376K07787j35179L48290m088l98553
$$ plain form
6056 -170768 81826 66736 -164595 -154955 160872 131690 72470 133315 155705 149881 54416
6045 54416 -189978 -384606 -331424 -272791 -34995 -108220 -196400 -141772 -123134 157990 337750
6034 337750 162702 -61553 2795 -175526 -402327 -330338 -237822 -161090 -173299 45658 85136
6023 85136 71444 62272 28799 -13507 183392 71697 59536 -44879 81543 278971 75019
6012 75019 29041 138224 282975 106076 -245092 -96724 188231 -41466 61109 167928
6002 167928 -116116 -131721 -122926 37655 90589 -101059 -128119 -31148 219972 75662 -42029
5991 -42029 -363279 -154804 -185196 -339641 -17477 225402 179345 359053 158531 226178
5981 226178 266701 153557 128556 82598 -92802 4574 212361 77182 425472 421384 22831
5970B2831K42475j02461N9516p2161m394j35839J72662j25075k7529R9438j58358
5959b8895J3437m166P3994L80815J0953k18641q721M8541k9329k69107K8784K19444
5947B17109J53432l28624k35928L9218r809k25850N0573k4911K97815K00076j90619
5936e7518R252l34092K67034p9323J21269M01728o1347j17283R2710J08235k348
5925C48317k96366O0398J36571j81715j01045k90082j6266J37867J39393J67023
5915A04095J09593M452j01647m7721J58597o7810L4033q9003j59062k2075o9578
5904a46126l15318J9147K05017J06518L42838k21980J1755q3386p6776L00174
5894A41863k69761K36517j30253J69492l7714l3766L6653k41219l83J69963m1079
$$ plain form
5970 22831 265306 162845 222361 150200 145806 9967 182629 57554 30025 129463 -28895
5959 -28895 -15458 -19624 54370 435185 446138 227497 218776 267317 237988 -31119 -2335 217109
5947 217109 370541 41917 -194011 -154793 -164602 -390452 -339879 -364790 -66975 133101 -57518
5936 -57518 -48266 -382358 -115324 -194647 -73378 328350 267003 149720 242430 350665 348317
5925 348317 51951 112349 248920 67205 -33840 -323922 -340188 -202321 -62928 104095
5915 104095 213688 218140 116493 68772 227369 159559 193592 104589 -54473 -76548 -146126
5904 -146126 -461444 -442297 -237280 -130762 212076 -9904 1851 -81535 -158311 141863
5894 141863 -127898 108619 -21634 147858 110144 76378 113031 -128188 -128571 41392 313
5883C13j8933j08255j30069J2703m9688J43403O7610p2821K73238j16054j70013
5872a68566L4016j34543p8686J93845J9890j70306P3039J69247k3073R9590o3237
5861d8784J50953p7384O071n8332q4352K19396L026o6235R9283l4654n8527l146
5849D7315L0832l99615m4973L69732L39254r8087J2242r9151j28604R187r8871
5838f0739J31710j04217O0800j61515M7375N1948R2269j38589q3292j19609K45469
5827c8390j91589O2727L21208J7940j01078K19934k46228k34005l476J91319J36574
5816A34936J5573K17129l50790P2280P0620L2455j97561J7227M9382M4165l3704
5805G1712K1249O1787J19351J45391j53760L0990k47666k7697j22191K53139J94210
$$ plain form
5883 313 -18620 -126875 -256944 -244241 -293929 -150526 -82916 -155737 117501 1447 -168566
5872 -168566 -134550 -269093 -347779 -153934 -134044 -304350 -231311 -62064 -85137 14453 -48784
5861 -48784 102169 24785 30856 -27476 -111828 107568 110594 44359 143642 108988 50461 47315
5849 47315 78147 -321468 -366441 3291 342545 244458 256700 157549 28945 38132 -60739
5838 -60739 70971 -33246 27554 -133961 -86586 -34638 57631 -80958 -164250 -283859 -38390
5827 -38390 -229979 -167252 153956 171896 70818 290752 44524 -189481 -192957 -1638 134936
5816 134936 150509 367638 16848 89128 159748 192203 -5358 11869 61251 105416 71712
5805 71712 92961 154748 274099 419490 265730 296720 49054 21357 -100834 152305 346515
$$ [...]
##END NTUPLES=NMR SPECTRUM
##END=
