##TITLE=1H_CA-9240-2
 CDCl3
 8 sc, 
 9.2.2024
##JCAMPDX= 6.0         $$ Bruker NMR JCAMP-DX V2.0
##DATA TYPE= NMR SPECTRUM
##DATA CLASS= NTUPLES
##ORIGIN= UXNMR, Bruker Analytische Messtechnik GmbH
##OWNER= root
$$ XWIN-NMR		Version 3.5
$$ Fri Feb  9 16:31:25 2024 Russian Standard Time (UT+4h)  she@DPX200
##.OBSERVE FREQUENCY= 200.1313
##.OBSERVE NUCLEUS= ^1H
##.ACQUISITION MODE= SIMULTANEOUS
##.ACQUISITION SCHEME= undefined
##.AVERAGES= 8
##.DIGITISER RES= 18
##SPECTROMETER/DATA SYSTEM= spect
##.PULSE SEQUENCE= zg30
##.SOLVENT NAME= CDCl3
##.SHIFT REFERENCE= (INTERNAL, CDCl3, 0, 15.6378)
##AUDIT TRAIL= $$ (NUMBER, WHEN, WHO, WHERE, WHAT)
$$ ##TITLE= Audit trail, XWIN-NMR		Version 3.5
$$ ##JCAMPDX= 5.01
$$ ##ORIGIN= Bruker BioSpin GmbH
$$ ##OWNER= she
$$ F:/spectra/data/she/nmr/H-F/1/pdata/1/auditp.txt
$$ ##AUDIT TRAIL=  $$ (NUMBER, WHEN, WHO, WHERE, WHAT)
(   1,<2024-02-09 16:30:06.25 +0400>,<she>,<DPX200>,
      <created by zg, POWCHK disabled, PULCHK disabled
       configuration hash MD5:
       00 E9 B6 7A A2 85 ED C7 34 08 36 98 17 FE 4E 26
       data hash MD5: 16K
       D4 96 BD 83 5F 9B 71 90 22 89 46 46 B2 BF 4F C2>)
(   2,<2024-02-09 16:30:10.54 +0400>,<she>,<DPX200>,
      <Start of raw data processing
       efp BC_mod = 2 LB = 0.24 FT_mod = 6 PKNL = 1 PHC0 = -24857.51 PHC1 = 12.65268 SI = 16K 
       data hash MD5: 16K
       DF 08 16 88 82 56 59 A3 9D D2 F5 CE A8 D5 AC 32>)
(   3,<2024-02-09 16:30:32.28 +0400>,<she>,<DPX200>,
      <pk PHC0 = -90.0466 PHC1 = -2.6 
       data hash MD5: 16K
       5B 12 0C 78 01 B0 12 A5 16 7B B8 20 5E 77 31 34>)
(   4,<2024-02-09 16:30:35.90 +0400>,<she>,<DPX200>,
      <abs ABSG = 5 
       data hash MD5: 16K
       B9 4C 4C 7B EC B2 FE 67 D8 A3 28 30 17 1E EE 27>)
$$ ##END=
$$ 
$$ hash MD5
$$ 2C 32 F8 F7 D0 D0 D3 43 AA F3 75 BC 15 89 02 EC
##$RELAX= 
##$RELAX= 
##$RELAX= 
##$RELAX= 
##$RELAX= 
##$RELAX= 
$$ Bruker specific parameters
$$ --------------------------
##$DU= <F:/spectra>
##$EXPNO= 1
##$NAME= <H-F>
##$PROCNO= 1
##$TYPE= <nmr>
##$USER= <she>
##$AMP= (0..31)
100 100 100 100 100 100 100 100 100 100 100 100 100 100 100 100 100 100 
100 100 100 100 100 100 100 100 100 100 100 100 100 100 
##$AQSEQ= 0
##$AQ_mod= 1
##$AUNM= <au_zg>
##$AUTOPOS= <>
##$BF1= 200.13
##$BF2= 200.13
##$BF3= 200.13
##$BF4= 200.13
##$BF5= 200.13
##$BF6= 200.13
##$BF7= 200.13
##$BF8= 200.13
##$BYTORDA= 1
##$CFDGTYP= 0
##$CFRGTYP= 5
##$CHEMSTR= <none>
##$CNST= (0..31)
1 1 145 1 1 1 1 1 1 1 1 1 1 1 1 1 1 1 1 1 1 1 1 1 1 1 1 1 1 1 1 1 
##$CPDPRG= <>
##$CPDPRG1= <>
##$CPDPRG2= <>
##$CPDPRG3= <>
##$CPDPRG4= <mlev>
##$CPDPRG5= <mlev>
##$CPDPRG6= <mlev>
##$CPDPRG7= <mlev>
##$CPDPRG8= <mlev>
##$CPDPRGB= <>
##$CPDPRGT= <>
##$D= (0..31)
0 1.2 0 0 0 0 0 0 0 0.06 0 0.03 0 0 0 0 0.0002 0 0 0 0 0 0 0 0 0 0 0 0 
0 0 0 
##$DATE= 1707481805
##$DBL= (0..7)
120 120 120 120 120 120 120 120 
##$DBP= (0..7)
150 150 150 150 150 150 150 150 
##$DBP07= 0
##$DBPNAM0= <>
##$DBPNAM1= <>
##$DBPNAM2= <>
##$DBPNAM3= <>
##$DBPNAM4= <>
$$ [...]
##$SUBNAM3= <"">
##$SUBNAM4= <"">
##$SUBNAM5= <"">
##$SUBNAM6= <"">
##$SUBNAM7= <"">
##$SUBNAM8= <"">
##$SUBNAM9= <"">
##$SW= 18.0517328524113
##$SWIBOX= (0..15)
0 0 2 0 0 0 0 0 0 0 0 0 0 0 0 0 
##$SW_h= 3612.71676300578
##$TD= 16384
##$TD0= 1
##$TE= 0
##$TE2= 300
##$TE3= 300
##$TEG= 300
##$TL= (0..7)
0 120 120 120 120 120 120 120 
##$TP= (0..7)
150 150 150 150 150 150 150 150 
##$TP07= 0
##$TPNAME0= <>
##$TPNAME1= <>
##$TPNAME2= <>
##$TPNAME3= <>
##$TPNAME4= <>
##$TPNAME5= <>
##$TPNAME6= <>
##$TPNAME7= <>
##$TPOAL= (0..7)
0.5 0.5 0.5 0.5 0.5 0.5 0.5 0.5 
##$TPOFFS= (0..7)
0 0 0 0 0 0 0 0 
##$TUNHIN= 0
##$TUNHOUT= 0
##$TUNXOUT= 0
##$USERA1= <user>
##$USERA2= <user>
##$USERA3= <user>
##$USERA4= <user>
##$USERA5= <user>
##$V9= 5
##$VALIST= <valist>
##$VCLIST= <CCCCCCCCCCCCCCC>
##$VD= 0
##$VDLIST= <DDDDDDDDDDDDDDD>
##$VPLIST= <PPPPPPPPPPPPPPP>
##$VTLIST= <TTTTTTTTTTTTTTT>
##$WBST= 1024
##$WBSW= 4
##$XGAIN= (0..3)
0 0 0 0 
##$XL= 0
##$YL= 0
##$YMAX_a= 75718
##$YMIN_a= -94441
##$ZGOPTNS= <>
##$ZL1= 120
##$ZL2= 120
##$ZL3= 120
##$ZL4= 120
##$ABSF1= 15.64552
##$ABSF2= -2.406333
##$ABSG= 5
##$ABSL= 3
##$ALPHA= 0
##$AQORDER= 0
##$ASSFAC= 0
##$ASSFACI= 0
##$ASSFACX= 0
##$ASSWID= 0
##$AUNMP= <proc_1d>
##$AZFE= 0.1
##$AZFW= 0.1
##$BCFW= 0
##$BC_mod= 2
##$BYTORDP= 0
##$COROFFS= 0
##$CY= -3
##$DATMOD= 1
##$DC= 0
##$DFILT= <>
##$DTYPP= 0
##$F1P= 0
##$F2P= 0
##$FCOR= 1
##$FTSIZE= 16384
##$FT_mod= 6
##$GAMMA= 0
##$GB= 0
##$INTBC= 1
##$INTSCL= 3.70164e-10
##$ISEN= 128
##$LB= 0.24
##$LEV0= 0
##$LPBIN= 0
##$MAXI= 10000
##$MC2= 0
##$MEAN= 0
##$ME_mod= 0
##$MI= 1.114404
##$NCOEF= 0
##$NC_proc= -9
##$NLEV= 6
##$NOISF1= 3.799351
##$NOISF2= 2.8
##$NSP= 0
##$NTH_PI= 0
##$NZP= 0
##$OFFSET= 15.63781
##$PC= 1
##$PHC0= -24947.56
##$PHC1= 10.05268
##$PH_mod= 1
##$PKNL= yes
##$PPARMOD= 0
##$PSCAL= 0
##$PSIGN= 0
##$REVERSE= no
##$SF= 200.129976762595
##$SI= 16384
##$SIGF1= 3
##$SIGF2= 2
##$SINO= 5.538805
##$SIOLD= 16384
##$SREGLST= <1H.CDCl3>
##$SSB= 0
##$STSI= 16384
##$STSR= 0
##$SW_p= 3612.71676300578
##$SYMM= 0
##$S_DEV= 0
##$TDeff= 16384
##$TDoff= 0
##$TI= <>
##$TILT= no
##$TM1= 0
##$TM2= 0
##$TOPLEV= 0
##$USERP1= <user>
##$USERP2= <user>
##$USERP3= <user>
##$USERP4= <user>
##$USERP5= <user>
##$WDW= 1
##$XDIM= 16384
##$YMAX_p= 482922374
##$YMIN_p= -2538971
$$ End of Bruker specific parameters
$$ ---------------------------------
##NTUPLES= NMR SPECTRUM
##VAR_NAME=  FREQUENCY,     SPECTRUM/REAL,   SPECTRUM/IMAG
##SYMBOL=    X,             R,               I
##VAR_TYPE=  INDEPENDENT,   DEPENDENT,       DEPENDENT
##VAR_FORM=  AFFN,          ASDF,            ASDF
##VAR_DIM=   16384,         16384,           16384
##UNITS=     HZ,            ARBITRARY UNITS, ARBITRARY UNITS
##FACTOR=    0.220516191357247, 1,           1
##FIRST=     3129.59450256942, 0,            0
##LAST=      -483.122260436361, 0,           0
##MIN=       -483.122260436361, -2538971,    0
##MAX=       3129.59450256942, 482922374,    0
$$ Real data points
##PAGE= N=1
##DATA TABLE= (X++(R..R)), XYDATA
$$ [...]
$$ plain form
11750 43053071 41957254 40129268 38968942 38016915 36977769 34660477 33298275 33687248
11742 33687248 31628549 30970545 29278940 28904212 28443571 27068201 25723390 25909627 24616162
11733 24616162 23601398 23914017 22623856 22087018 20407105 19056620 19112053 19508433 19056329
11724 19056329 18010137 16863102 16798285 17584710 16862571 16405105 14630319 14436452 13933234
11715 13933234 12716950 11735335 11498989 12747054 12835911 12743787 13010820 12531728 11438932
11706 11438932 10591447 10541201 10691097 11095821 10852164 10448172 9485385 9201205 9538076
11697 9538076 9804544 9960767 10170499 10189246 9298748 8403196 8821803 8489435 8229755 8007413
11687 8007413 7932224 7711054 7579202 7586418 7923224 6515303 6445401 5752828 6028794 6387987
$$ packed form
11750D3053071j095817j827986j160326r52027j039146k317292j362202L88973
11742C3687248k058699o58004j691605l74728m60641j375370j344811J86237j293465
11733B4616162j014764L12619j290161n36838j679913j350485N5433L96380m52104
11724A9056329j046192j147035o4817P86425p22139m57466j774786j93867n03218
11715A3933234j216284r81615k36346J248065Q8857r2124K67033m79092j092796
11706A1438932q47485n0246J49896M04724k43657m03992r62787k84180L36871
11697I538076K66468J56223K09732J8747q90498q95552M18607l32368k59680k22342
11687H007413p5189k21170j31852P216L36806j407921o9902o92573K75966L59193
$$ plain form
11677 6387987 6673666 6217100 5361371 5855768 6397049 6159812 5802652 6245844 6115809
11668 6115809 6213683 5268862 5131273 5008264 4547114 4762624 5080899 4896852 4964962 5238568
11658 5238568 4936407 4643552 5611906 5528437 4713523 5254221 5054180 4837772 4736640 3821979
11648 3821979 3538679 3914158 4394728 4262870 3523554 3246220 3636517 4254598 4280391 3860882
11638 3860882 3487565 2680226 2976068 3706732 3740119 2955801 3602128 2897164 3739173 3215672
11628 3215672 3545933 3417459 3094975 2996740 3160337 3324827 2076971 1788742 2008047
11619 2008047 1766324 2864112 3700208 4025671 3325706 3472996 2383920 2033782 2072995
11610 2072995 3117143 4347673 4347196 3456556 3231463 3213791 3192994 3326310 2200831 1821603
$$ packed form
11677F387987K85679m56566q55729M94397N41281k37237l57160M43192j30035
11668F115809R7874r44821j37589j23009m61150K15510L18275j84047O8110K73606
11658E238568l02161k92855R68354q3469q14914N40698k00041k16408j01132r14661
11648C821979k83300L75479M80570j31858p39316k77334L90297O18081K5793m19509
11638C860882l73317q07339K95842P30664L3387p84318O46327p04964Q42009n23501
11628C215672L30261j28474l22484r8235J63597J64490j247856k88229K19305
11619B008047k41723J097788Q36096L25463o99965J47290j089076l50138L9213
11610B072995J044148J230530m77q90640k25093j7672k0797J33316j125479l79228
$$ plain form
11600 1821603 2223471 3126936 2586419 2584586 2739763 3454789 2798950 1849913 1753896 3282065
11590 3282065 2842687 2206073 1910884 1420081 1395185 1327530 1407379 1392491 1888779 2231225
11580 2231225 2087894 2349004 2218701 2055709 1824760 1658169 989049 492343 1594490
11571 1594490 2500144 2217440 1371264 1454322 1424327 1385824 1649907 2350180 2409298 2211338
11561 2211338 2791178 2360578 2278642 1234451 1116108 974624 1134034 1362662 942479
11552 942479 138453 281501 1320822 2119438 2300041 2210567 2073977 1719828 2653366 2004895
11542 2004895 1870288 952329 859624 1377636 1299052 1867993 2080242 1910427 1093969 893118
11532 893118 1447627 966420 1009777 569529 774682 1737158 739722 76981 965809 1478157
$$ packed form
11600A821603M01868R03465n40517j833J55177P15026o55839r49037r6017J528169
11590C282065m39378o36614k95189m90803k4896o7655P9849j4888M96288L42446
11580B231225j43331K61110j30303j62992k30949j66591o69120m96706J102147
11571A594490R05654k82704q46176Q3058k9995l8503K64083P00273N9118j97960
11561B211338N79840m30600q1936j044191j18343j41484J59410K28628m20183
11552I42479q04026J43048J039321P98616J80603q9474j36590l54149R33538o48471
11542B004895j34607r17959r2705N18012p8584N68941K12249j69815q16458k00851
11532H93118N54509m81207M3357m40248K05153R62476r97436o62741Q88828N12348
$$ plain form
11522 1478157 1753736 1550447 834852 836121 1380142 1606807 1405507 2298801 2052631 1302163
11512 1302163 1735043 2744027 2421501 1024597 -719803 -82706 688002 609355 1657189
11503 1657189 1577907 387969 551345 344944 940378 648967 994029 1152322 489914
11494 489914 -145507 -44654 934257 709631 224918 511830 2068885 1259531 696834
11485 696834 1037875 1584605 1992279 2034331 1434666 475942 520454 681510 599050 1509741
11475 1509741 1824978 2063236 1610544 588569 301325 909366 1540857 1098849 861561
11466 861561 549706 1104576 586841 -143884 214672 487923 575736 137241 974717 1012477
11456 1012477 -553825 -370699 -469723 -825998 -176695 -592947 196089 115613 -605458 1585685
$$ packed form
11522A478157K75579k03289p15595J269N44021K26665k01300Q93294k46170p50468
11512A302163M32880J008984l22526j396904j744400O37097P70708p8647J047834
11503A657189p9282j189938J63376k06401N95434k91411L45062J58293o62408
11494D89914o35421J00853R78911k24626m84713K86912J557055q09354n62697
11485F96834L41041N46730M07674M2052n99665r58724M4512J61056q2460R10691
11475A509741L15237K38258m52692j021975k87244O08041O31491m42008k37288
11466H61561l11855N54870n17735p30725L58556K73251Q7813m38495Q37476L7760
11456A012477j566302J83126r9024l56275O49303m16252P89036q0476p21071K191143
$$ plain form
11446 1585685 2399470 1232753 667604 -565347 -867195 209435 110463 447966 613617
11437 613617 421627 312045 -55527 -47650 514088 88842 -220760 -284124 302021 -591504
11427 -591504 -847680 -437503 57542 117304 -688493 -289443 117628 -620332 -669835 168614
11417 168614 -55972 -530517 -503138 -628541 -622139 -636036 -516130 -228767 -204302 -302161 227435
11406 227435 669597 19855 483954 1207776 955885 158289 -671113 161581 -145175 -213270
11396 -213270 737009 1480318 2381095 1188771 1218640 221953 495527 1044158 1760478 1335357
11386 1335357 351827 -201692 -31279 2988 -942843 -850197 -116201 -546022 -914588 -275224
11376 -275224 235627 -298161 313605 762957 764436 544759 602392 -324032 -496247 -1037749
$$ packed form
11446A585685Q13785j166717n65149j232951l01848J076630r8972L37503J65651
11437F13617j91990j09582l67572P877N61738m25246l09602o3364N86145q93525
11427e91504k56176M10177M95045N9762q05797L99050M07071p37960m9503Q38449
11417A68614k24586m74545K7379j25403O402j3897J19906K87363K4465r7859N29596
11406B27435M42162o49742M64099P23822k51891p97596q29402Q32694l06756o8095
11396b13270R50279P43309R00777j192324K9869r96687K73574N48631P16320m25121
11386A335357r83530n53519J70413L4267r45831R2646P33996m29821l68566O39364
11376b75224N10851n33788O11766M49352J479k19677N7633r26424j72215n41502
$$ plain form
11366 -1037749 -887586 -304503 1309784 1297012 234787 -539523 -752819 1246720 -197280
11357 -197280 -290301 888924 36225 -322204 -257001 135314 990856 1005756 1916790 1858156
11347 1858156 1229386 675455 1784439 1802801 308331 -70077 895182 1534461 1581775
11338 1581775 1096169 1066582 927769 1119662 -282488 -968439 -99909 -621490 47297
11329 47297 541445 605844 -585636 -358456 488911 17561 244786 -442761 -1560339 -1189811
11319 -1189811 -187440 46008 -266597 -30119 -278847 -13064 -116844 -704213 84394
11310 84394 -264392 -487114 -1059024 177802 870182 622923 266133 277045 555834 927117
11300 927117 653492 -337021 55412 26846 491998 1114351 882268 320553 -83499 -63385
$$ packed form
11366a037749J50163N83083J614287j2772j062225p74310k13296J999539j444000
11357a97280r3021J179225q52699l58429O5203L92315Q55542J4900R11034n8634
11347A858156o28770n53931J108984J8362j494470l78408R65259O39279M7314
11338A581775m85606k9587j38813J91893j402150o85951Q68530n21581O68787
11329D7297M94148O4399j191480K27180Q47367m71350K27225o87547j117578L70528
11319a189811J002371K33448l12605K36478k48728K65783j03780n87369P88607
11310H4394l48786k22722n71910J236826O92380k47259l56790J0912K78789L71283
11300I27117k73625r90513L92433k8566M65152O22353k32083n61715m04052K0114
$$ plain form
11290 -63385 2866 -372386 -613448 -530912 -481236 -523207 222744 -680144 -1039270 -589261
11280 -589261 -354824 314576 -309758 -490220 -901873 -6698 920071 577422 292825 1052456
11270 1052456 1041245 833088 847528 1477477 145878 -851029 -512428 182991 215183 695375
11260 695375 934184 -26886 92548 141171 286113 -199440 -64864 631344 578617 441724
11250 441724 966117 136941 574839 501964 -32396 496471 526766 540275 425645 664064
11240 664064 473635 -88337 -591201 -311213 -216503 -1038470 -398269 1110785 789349 -848828
11230 -848828 -1045383 -184337 852371 496215 -539933 -287255 806823 1271134 743273
11221 743273 416962 1298069 884836 977947 1321070 -166846 -207662 209246 -649738 -100645
$$ packed form
11290f3385O6251l75252k41062Q2536M9676m1971P45951r02888l59126M50009
11280e89261K34437O69400o24334j80462m11653Q95175R26769l42649k84597P59631
11270A052456j1211k08157J4440O29949j331599r96907L38601O95419L2192M80192
11260F95375K38809r61070J19434M8623J44942m85553J34576O96208n2727j36893
11250D41724N24393q29176M37898p2875n34360N28867L0295J3509j14630K38419
11240F64064j90429n61972n02864K79988R4710q21967O40201J509054l21436j638177
11230h48828j96555Q61046J036708l56156j036148K52678J094078M64311n27861
11221G43273l26311Q81107m13233R3111L43123j487916m0816M16908q58984N49093
$$ plain form
11211 -100645 -346959 -704651 -779241 -470050 -538383 81668 1332107 1092644 1085635 335893
11201 335893 467954 502428 1073389 827118 261238 -427466 -454643 -104427 41258 399700
11191 399700 550889 817024 -161472 179452 -466800 -1013480 1063871 195411 363622
11182 363622 1220641 -20438 -74832 277167 -110785 -620198 284609 977730 963376 334278
11172 334278 270998 -115361 -301775 -1284924 -1102759 -744723 497364 1316721 470905 -220265
11162 -220265 -117761 -69228 -594664 -300730 -624613 -377247 151867 -182069 -110644 19444
11152 19444 165140 1015948 44336 375568 -362389 -499014 295276 -262541 600553 659244
11142 659244 203603 -422637 -64493 461105 284381 -487197 -565029 71613 863212 35272
$$ packed form
11211a00645k46314l57692p4590L09191o8333O20051J250439k39463p009p49742
11201C35893J32061L4474N70961k46271n65880o88704k7177L50216J45685L58442
11191C99700J51189K66135r78496L40924o46252n46680K077351q68460J68211
11182C63622Q57019j241079n4394L51999l87952n09413R04807O93121j4354o29098
11172C34278o3280l86359j86414r83149J82165L58036J242087Q19357q45816o91170
11162b20265J02504M8533n25436K93934l23883K47366N29114l33936P1425J30088
11152A9444J45696Q50808r71612L31232p37957j36625P94290n57817Q63094N8691
11142F59244m55641o26240L58144N25598j76724p71578p7832O36642P91599q27940
$$ plain form
11132 35272 -59663 -238581 252444 76347 -44383 579987 -22746 -747770 112226 340832
11122 340832 146562 148695 -137977 -129389 -432974 868748 289365 21806 673743 -389673
11112 -389673 -1176613 -353752 -599605 -868122 798295 725690 1120382 1195445 -872338 -1219517
11102 -1219517 -942652 -1005356 -972316 -793408 -1063271 -991724 -1072489 -1343454 -719163 557833
11092 557833 -44598 -541793 -1171610 -978094 -765283 -431542 -311589 -55086 28006 270144
11082 270144 543476 177293 219672 564459 753161 354178 436076 -398551 -209220 361248
11072 361248 91226 295073 -159914 35271 -379600 -425231 96729 184779 -11191 78648
11062 78648 -495510 185065 237109 880255 117029 -472613 109577 562496 337579 -27026
$$ packed form
11132C5272r4935j78918M91025j76097j20730O24370o02733p25024Q59996K28606
11122C40832j94270K133k86672Q588l03585J301722n79383k67559O51937j063416
11112c89673p86940Q22861k45853k68517J666417p2605L94692P5063k067783l47179
11102a219517K76865o2704L3040J78908k69863P1547q0765k70965O24291J276996
11092E57833o02431m97195o29817J93516K12811L33741J19953K56503Q3092K42138
11082B70144K73332l66183M2379L44787J88702l98983Q1898q34627J89331N70468
11072C61248k70022K03847m54987J95185m14871m5631N21960Q8050j95970Q9839
11062G8648n74158O80575N2044O43146p63226n89642N82190M52919k24917l64605
$$ plain form
11052 -27026 -386590 -894326 -469148 -547448 -381400 1042093 348872 479216 296719 -319911
11042 -319911 -354404 -735059 563417 270216 317881 769281 1076054 -781347 -874118 418008
11032 418008 1087585 971099 298964 45399 -761992 544392 -154372 -579152 -309194
11023 -309194 -670034 -855425 -790380 559849 89283 212796 -741459 -1042983 -656930 244201
11013 244201 105644 203885 -253875 -174443 -68363 -204434 -19696 791976 538609 -819127
11003 -819127 -1037727 -287275 -252500 469832 701193 622651 -602776 -391688 -39982 183651
10993 183651 394825 -33886 598159 817044 -72239 -515330 -71933 440030 80457 93761
10983 93761 252407 -358844 -631529 -21882 1099855 961241 618761 -187448 -306368 51906
$$ packed form
11052b7026l59564n07736M25178p8300J66048J423493o93221J30344j82497o16630
11042c19911l4493l80655J298476k93201M7665M51400L06773j857401r2771J292126
11032D18008O69577j16486o72135k53565q07391J306384o98764m24780K69958
11023c09194l60840j85391O5045J350229m70566J23513r54255l01524L86053R01131
11013B44201j38557R8241m57760P9432J06080j36071J84738Q11672k53367j357736
11003h19127k18600P50452L4775P22332K31361p8542j225427K11088L51706K23633
10993A83651K11174m28711O32045K18885q89283m43091M43397N11963l59573J3304
10983I3761J58646o11251k72685O09647J121737j38614l42480q06209j18920L58274
$$ plain form
10973 51906 -159719 -45782 35109 -743794 -1153742 -1221364 -363771 -284600 -324640 -207906
10963 -207906 -154234 855057 326861 327565 -567669 -628355 -1049348 -839342 -1017198 -1161385
10953 -1161385 -222119 -5219 -194492 -1132351 -247636 370412 386231 -48341 -439662 -347394
10943 -347394 322699 -852318 77181 916500 1118300 99912 143180 221630 233310 6835
10933 6835 -430943 -310970 151424 236192 -229483 -684431 -1100179 -339272 480443 -248298
10923 -248298 -789332 -440243 -767015 -651477 -364712 -344096 -470467 174276 265176 820032
10913 820032 400017 -801093 -1439660 -1990878 -1170852 -354015 196538 412718 81173
10904 81173 -61659 550824 784755 -3227 399560 -186019 -550535 -681364 -107293 -214173
$$ packed form
10973E1906k11625J13937Q0891p78903m09948o7622Q57593P9171m0040J16734
10963b07906N3672J009291n28196P04q95234o0686m20993K10006j77856j44187
10953a161385R39266K16900j89273r37859Q84715O18048J5819m34572l91321R2268
10943c47394O70093j175017R29499Q39319K01800j018388M3268P8450J1680k26475
10933F835m37778J19973M62394Q4768m65675m54948m15748P60907Q19715p28741
10923b48298n41034L49089l26772J15538K86765K0616j26371O44743R0900N54856
10913H20032m20015j201110o38567n51218Q20026Q16837N50553K16180l31545
10904H1173j42832O12483K33931p87982M02787n85579l64516j30829N74071j06880
$$ plain form
10894 -214173 -1238622 -243641 114504 1136967 259458 235132 200067 -373640 -75648 893060
10884 893060 15432 -441746 290261 918619 643650 -363709 61466 -130974 71537
10875 71537 1460225 2005151 801951 -463819 98996 -8563 -250769 -50985 -359463
10866 -359463 -154779 -663835 -269498 -686474 -107727 530547 582410 -70999 420267 118057
10856 118057 -1068611 -730727 -994898 -403435 -263219 -889914 -697647 -1111349 -1208665 210261
10846 210261 -107629 -293356 -56671 131984 253370 313384 182444 -646115 -523534 -452515
10836 -452515 460012 1200565 708270 -81079 -404912 -305676 81266 297251 436097 603557
10826 603557 -171730 -172444 -17762 225890 416975 581509 582835 -282397 -971830 -713203
$$ packed form
10894b14173j024449R94981L58145J022463q77509k4326l5065n73707K97992R68708
10884H93060q77628m57178P32007O28358k74969j007359M25175j92440K02511
10875G1537J388688N44926j203200j265770N62815j07559k42206J99784l08478
10866c59463K04684n09056L94337m16976N78747O38274N1863o53409M91266l02210
10856A18057j186668L37884k64171N91463J40216o26695J92267m13702r7316J418926
10846B10261l17890j85727K36685J88655J21386O0014j30940q28559J22581P1019
10836d52515R12527P40553m92295p89349l23833R9236L86942K15985J38846J67460
10826F03557p75287p14J54682K43652J91085J64534J326q65232o89433K58627
$$ plain form
10816 -713203 202876 -64300 -286623 766561 82185 398143 1397665 527183 94786
10807 94786 235310 325806 357065 -100519 408139 1410385 1136692 1315268 640356 4856
10797 4856 -127805 269528 96468 -370264 268252 817252 585877 1174499 937802 1112223
10787 1112223 551760 496749 108010 -192405 238945 199125 -1872624 -1371174 -738565 -1528430
10777 -1528430 -1561628 -73678 237107 611277 824986 527597 469687 -296635 -865825 -952312
10767 -952312 699816 314733 -547345 -475305 506507 1022079 808719 568618 -101303 -377744
10757 -377744 249253 93466 141031 -248742 279875 336285 1057546 1492993 180347 56039
10747 56039 748862 745921 668609 -146770 -641395 -1099282 -1575988 -260399 -151350 -109270
$$ packed form
10816g13203R16079k67176k22323J053184o84376L15958R99522q70482m32397
10807I4786J40524R0496L1259m57584N08658J002246k73693J78576o74912o35500
10797D856j32661L97333j73060m66732O38516N49000k31375N88622k36697J74421
10787A112223n60463n5011l88739l00415M31350l9820k071749N01450O32609p89865
10777a528430l3198J487950L10785L74170K13709k97389n7910p66322n69190q6487
10767i52312J652128l85083q62078P2040R81812N15572k13360k40101o69921k76441
10757c77744O26997j55787M7565l89773N28617N6410P21261M35447j312646j24308
10747E6039O92823k941p7312q15379m94625m57887m76706J315589J09049M2080
$$ plain form
10737 -109270 -838772 -900854 570119 751606 120894 -866048 -529870 -621628 420024 -440762
10727 -440762 -396728 -2189 -422388 734880 682874 841769 490233 -1065926 -1435122 -500976
10717 -500976 428101 705390 -482836 -581225 277957 1126907 492676 -376765 -444589 -599030
10707 -599030 960056 398447 445527 385624 -267658 4097 61069 74579 -184563 -1025735
10697 -1025735 -504040 401966 -725565 -522511 -180838 -1153981 -466488 819662 -374321
10688 -374321 -445289 -281481 -1273338 -760268 450294 236033 -166087 165299 -330253 86447
10678 86447 177091 350357 -983769 -1073573 -698877 -351699 -987792 120348 293774 -712026
10668 -712026 -747195 -794493 -28295 430582 778367 159253 348811 125458 -136972 -680530
$$ packed form
10737a09270p29502o2082J470973J81487o30712r86942L36178r1758J041652q60786
10727d40762M4034L94539m20199J157268n2006J58895l51536j556159l69196R34146
10717e00976R29077K77289j188226r8389Q59182Q48950o34231q69441o7824j54441
10707e99030J559086n61609M7080n9903o53282K71755N6972J3510k59142q41172
10697a025735N21695R06006j127531K03054L41673r73143O87493J286150j193983
10688c74321p0968J63808r91857N13070J210562k14261m02120L31386m95552M16700
10678H6447R0644J73266j334126q9804L74696L47178o36093J108140J73426j005800
10668g12026l5169m7298P66198M58877L47785o19114J89558k23353k62430n43558
$$ plain form
10658 -680530 -857779 -933945 219243 -44869 -232476 108870 -343588 -661883 -456234 125693
10648 125693 -172856 92800 296925 746065 1306632 301974 -1104095 -1017209 518489
10639 518489 1511026 997700 -371790 -1156695 -845669 -679528 104762 788430 -24573
10630 -24573 935899 1286736 1193484 196664 675950 471013 238831 19109 -90215 157697
10620 157697 -569546 -662253 -554856 47002 10167 -721798 -1235985 -1368231 -159438 454415
10610 454415 782944 323156 400925 223060 -162663 441082 -170950 194270 138777 111875
10600 111875 106314 560214 -80233 -982605 -193009 -539312 -984729 -88275 91199 -560677
10590 -560677 -335944 -45470 443005 -494609 -1185231 250625 552290 911886 274708
$$ packed form
10658f80530j77249p6166J153188k64112j87607L41346m52458l18295K05649N81927
10648A25693k98549K65656K04125M49140N60567j004658j406069Q6886J535698
10639E18489R92537n13326j369490p84905L11026J66141P84290O83668q13003
10630b4573R60472L50837r3252r96820M79286k04937k32182k19722j09324K47912
10620A57697p27243r2707J07397O01858l6835p31965n14187j32246J208793O13853
10610D54415L28529m59788P7769j77865l85723O03745o12032L65220n5493k6902
10600A11875n561M53900o40447r02372P89596l46303m45417Q96454J79474o51876
10590e60677K24733K90474M88475r37614o90622J435856L01665L59596o37178
$$ plain form
10581 274708 -103885 205364 -400684 -257558 68629 615727 439134 208155 357091 -49808
10571 -49808 -433877 -1845913 -1295836 -326843 314324 1226464 588444 863894 474211 -110878
10561 -110878 559576 559638 459842 1004980 593598 776202 1493520 1238185 977321 656875
10551 656875 635244 411754 747893 744467 629470 412536 -640831 328548 1636795 1891030
10541 1891030 551160 -76656 -420625 -43358 361592 -499504 -1220272 -775610 107467
10532 107467 294637 765435 -4764 285576 449414 326118 240400 61654 284758 -227060
10522 -227060 -181197 -277379 689605 116595 -485135 653537 351767 1154702 1229662 660332
10512 660332 188613 -214848 -283706 1105467 1367209 1261959 815761 1146203 2232455
$$ packed form
10581B74708l78593L09249o06048J43126L26187N47098j76593k30979J48936m06899
10571d9808l84069j412036N50077R68993O41167R12140o38020K75450l89683n85089
10561a10878O70454O2r9796N45138m11382J82604P17318k55335k60864l20446
10551F56875k1631k23490L36139l426j14997k16934j053367R69379J308247K54235
10541A891030j339870o27816l43969L77267M04950q61096p20768M44662Q83077
10532A07467J87170M70798p70199K90340J63838j23296q5718j78746K23104n11818
10522b27060M5863r6182R66984n73010o01730J138672l01770Q02935P4960n69330
10512F60332m71719m03461o8858J389173K61742j05250m46198L30442J086252
$$ plain form
10503 2232455 1561572 1118339 126322 519719 141194 432187 41423 -356346 -853586
10494 -853586 -640562 643004 -856832 -224048 346762 165990 629550 583813 609524 216085
10484 216085 -415432 -71789 216255 875526 -16516 88611 -459676 24765 -143995 -829734
10474 -829734 437236 -359370 -298706 87150 194263 800443 -195010 116313 265615 1437915
10464 1437915 1878753 1521729 1963746 1103973 1851384 3008712 1474850 1592916 2055107
10455 2055107 2301454 1767962 1916469 2335120 1795870 2182321 1582509 1478362 996687
10446 996687 878523 1447712 1785504 1593923 1055654 1158032 1422530 1125626 1333894 150585
10436 150585 1248618 1643538 1299100 3141346 3382374 2588617 3013392 1411223 748041
$$ packed form
10503B232455o70883m43233r92017L93397l78525K90993l90764l97769m97240
10494h53586K13024J283566j499836O32784N70810j80772M63560m5737K5711l93439
10484B16085o31517L43643K88044O59271q92042J05127n48287M84441j68760o85739
10474h29734J266970p96606O0664L85856J07113O06180r95453L11323J49302J172300
10464A437915M40838l57024M42017q59773P47411J157328j533862J18066M62191
10455B055107K46347n33492J48507M18651n39250L86451n99812j04147m81675
10446I96687j18164N69189L37792j91581n38269J02378K64498k96904K08268j183309
10436A50585J098033L94920l44438J842246K41028p93757M24775j602169o63182
$$ plain form
10427 748041 1239471 1862918 1932200 3082292 3144346 3033909 3755506 3027348 2666454 2843277
10417 2843277 3226408 3117170 2346215 3090181 3412423 3580294 3501154 3453237 4427759 4606040
10407 4606040 4548285 4373375 4337731 5101050 4767841 4631157 4565526 4667248 3998220 5230925
10397 5230925 5177441 5032647 4642733 3459221 4520654 4863351 5619612 4062645 4026033
10388 4026033 3479319 4217869 5410016 6134733 5274810 5110838 5384452 5693877 5569426
10379 5569426 5196826 4684230 4857264 6462061 6518742 6452104 7150679 7698191 7462203 6669084
10369 6669084 6796701 7998545 8146396 8012989 7840251 7911654 8406569 8768627 9189030
10360 9189030 9597917 9729919 10773325 10787718 12221738 11724630 11896878 11578526 12446053
$$ packed form
10427G48041M91430O23447O9282J150092O2054j10437P21597p28158l60894J76823
10417B843277L83131j09238p70955P43966L22242J67871p9140m7917R74522J78281
10407D606040n7755j74910l5644P63319l33209j36684o5631J01722o69028J232705
10397E230925n3484j44794l89914j183512J061433L42697P56261j556967l6612
10388D026033n46714P38550J192147P24717q59923j63972K73614L09425j24451
10379E569426l72600n12596J73034J604797N6681o6638O98575N47512k35988p93119
10369F669084J27617J201844J47851j33407j72738P1403M94915L62058M20403
10360I189030M08887J32002J043406J4393J434020m97108J72248l18352Q67527
$$ plain form
10351 12446053 13366892 13661734 15656463 15357331 16510817 17283972 16897336 17930749 18522416
10342 18522416 19580536 20744083 21221984 20734797 20337418 20339690 20676297 21460742 20699342
10333 20699342 20508732 20132419 20154742 19901094 19592942 18485429 16495011 14847683 13895690
10324 13895690 13538065 13846484 12681920 11428607 11259046 11383638 11222380 10302496 9739790
10315 9739790 8870931 7468260 7185752 7283525 7407563 7473310 7299675 7126774 6441789 6010209
10305 6010209 6250054 5773201 4659528 4905914 5755193 4921625 5200501 4394480 4278034
10296 4278034 3240549 3280335 2540415 1998055 2886980 2776858 3684356 3670253 2989925 2985131
10286 2985131 2453418 3258202 3793550 2826134 3220696 2962585 2541785 2363707 2882753
$$ packed form
10351A2446053R20839K94842J994729k99132J153486P73155l86636J033413N91667
10342A8522416J058120J163547M77901m87187l97379K272L36607P84445p61400
10333B0699342j90610l76313K2323k53648l08152j107513j990418j647328r51993
10324A3895690l57625L08419j164564j253313j69561J24592j61258r19884n62706
10315I739790q68859j402671k82508R7773J24038O5747j73635j72901o84985m31580
10305F010209K39845m76853j113673K46386Q49279q33568K78876q06021j16446
10296D278034j037485L9786p39920n42360Q88925j10122R07498j4103o80328m794
10286B985131n31713Q04784N35348r67416L94562k58111m20800j78078N19046
$$ plain form
10277 2882753 2394076 3563308 2718998 2115494 1760383 1469504 1993513 2742749 2528335
10268 2528335 1349419 424977 1518548 2062512 1965973 2044478 2369635 2463067 2599066 2755392
10258 2755392 1510989 1425140 1720176 1816269 1322410 2228034 2064656 1544760 1118873 1938973
10248 1938973 1244735 1463571 1289746 742397 1056006 555578 1235820 538577 383317
10239 383317 1146607 1280502 608267 612015 723995 1219336 2265508 1499296 411151 1063969
10229 1063969 1250577 650710 860479 1572351 492116 271349 595929 1147842 1070096
10220 1070096 465235 694669 890834 1000684 823987 125230 467941 666908 482821
10211 482821 826349 519867 1204284 895064 2339022 3134809 2172185 2226666 2353253 1889567
$$ packed form
10277B882753m88677J169232q44310o03504l55111k90879N24009P49236k14414
10268B528335j178916r24442J093571N43964r6539P8505L25157R3432J35999J56326
10258B755392j244403q5849K95036R6093m93859R05624j63378n19896m25887Q20100
10248A938973o94238K18836j73825n47349L13609n00428O80242o97243j55260
10239C83317P63290J33895o72235L748J11980M95341J046172p66212j088145O52818
10229A063969J86608n99867K09769P11872j080235k20767L24580N51913p7746
10220A070096o04861K29434J96165J09850j76697o98757L42711J98967j84087
10211D82821L43528l06482O84417l09220J443958P95787r62624N4481J26587m63686
$$ plain form
10201 1889567 2777961 2877528 2141958 1328426 491756 1191883 850267 1841361 1737148 590911
10191 590911 1009541 922505 1074969 707243 180912 671085 434855 531887 1647399 2216494
10181 2216494 1241258 422618 218912 957054 1215357 378741 279155 619675 2081649
10172 2081649 1920876 1569130 1454359 1367918 1665979 1715793 1885661 1299893 1224652 1754942
10162 1754942 1333189 1363443 1876979 1461733 1247959 573664 94200 427771 1021738 1331369
10152 1331369 718460 1848755 1551040 884625 1385883 549290 617917 625956 135743 184524
10142 184524 730398 1233072 1932061 1580551 1581695 902624 -84196 649934 1830401 2220630
10132 2220630 2331261 1730429 2350926 2405083 2043551 1740316 657809 439315 1678144
$$ packed form
10201A889567Q88394R9567p35570q13532q36670P00127l41616R91094j04213j146237
10191E90911M18630q7036J52464l67726n26331M90173k36230R7032J115512N69095
10181B216494r75236q18640k03706P38142K58303q36616r9586L40520J461974
10172B081649j60773l51746j14771q6441K98061M9814J69868n85768p5241N30290
10162A754942m21753L0254N13536m15246k13774o74295m79464L33571N93967L09631
10152A331369o12909J130295k97715o66415N01258q36593O8627Q039m90213M8781
10142A84524N45874N02674O98989l51510J144o79071r86820P34130J180467L90229
10132B220630J10631o00832O20497N4157l61532l03235j082507k18494J238829
$$ plain form
10123 1678144 2186029 2916856 1782842 1411031 1046015 423062 999180 1114452 221110
10114 221110 -287802 55439 475899 1570151 1419754 1233020 1099130 1143357 1057991 1492992
10104 1492992 1128320 1120621 1463824 743035 559655 385158 292210 543454 303033 1105017
10094 1105017 1805113 1925666 1861042 1641892 2080809 2028106 1473628 2217605 1473258 1338640
10084 1338640 680284 822129 1580765 2838393 3705744 3493208 3513462 3178672 3675536
10075 3675536 3708106 3436975 3454570 2664619 3024530 3028416 2393650 1924359 2106484 2202591
10065 2202591 2794672 2357346 847502 339078 1262610 2246987 1965820 1572274 1342353
10056 1342353 1233049 1010221 702313 1245203 1857726 1056447 1056400 1286205 707916 493643
$$ packed form
10123A678144N07885P30827j134014l71811l65016o22953N76118J15272q93342
10114B21110n08912L43241M20460J094252j50397j86734j33890M4227q5366M35001
10104A492992l64672p699L43203p20789j83380j74497r2948K51244k40421Q01984
10094A105017P00096J20553o4624k19150M38917n2703n54478P43977p44347j34618
10084A338640o58356J41845P58636J257628Q67351k12536K0254l34790M96864
10075C675536L2570k71131J7595p89951L59911L886o34766m69291J82125R6107
10065B202591N92081m37326j509844n08424R23532R84377k81167l93546k29921
10056A342353j09304k22828l07908N42890O12523q01279m7K29805n78289k14273
$$ plain form
10046 493643 31076 -390839 428090 354305 831280 227376 631854 1540547 400372 826772
10036 826772 557719 127410 -228010 -249198 1254287 812014 240136 278621 69789 329697
10026 329697 1124041 1007810 1688716 1132660 992038 673139 -301841 -881251 -947663 362309
10016 362309 714001 409930 -272797 -332581 -261547 64014 886506 1114797 1258698 1080632
10006 1080632 742122 813892 1035947 906837 872735 435931 1024510 749212 193022 771018
9996 771018 800099 780800 820332 637466 -354530 -68198 191619 -50339 -186362 -89538
9986 -89538 236094 350428 -123581 952215 600194 -578924 -1198750 -43646 404132
9977 404132 -213264 -141370 -282512 -244364 -709062 -503319 -144826 365613 46495 -56977
$$ packed form
10046D93643m62567m21915Q18929p3785M76975o03904M04478R08693j140175M26400
10036H26772k69053m30309l55420k1188J503485m42273n71878L8485k08832K59908
10026C29697P94344j16231O80906n56056j40622l18899r74980n79410o6412J309972
10016C62309L51692l04071o82727n9784P1034L25561Q22492K28291J43901j78066
10006A080632l38510P1770K22055j29110l4102m36804N88579k75298n56190N77996
9996G71018K9081j9299L9532j82866r91996K86332K59817k41958j36023R6824
9986h9538L25632J14334m74009J075796l52021j179118o19826J155104M47778
9977D04132o17396P1894j41142L8148m64698K05743L58493N10439l19118j03472
$$ plain form
9967 -56977 187917 -197879 -360631 71365 235470 1152905 1338470 565518 863513 1088957
9957 1088957 613886 108705 -33082 800598 1854380 1257380 604114 185709 114736 331547
9947 331547 397023 656948 614121 939757 1273280 633383 832003 750806 342507 523597
9937 523597 1683880 1010199 244489 1083978 502547 347904 719796 873145 1458560 1782858
9927 1782858 2017172 1995755 1060101 1753271 1076196 1818503 1383464 680343 873478 779255
9917 779255 699491 817380 1034711 447160 1701328 1500822 1228310 1194081 1211689 1315005
9907 1315005 869060 1456774 2097581 2601717 1761810 1858853 1658448 1132665 919653 1420250
9897 1420250 2175554 2339895 2634165 2690253 2044497 2029965 3324360 2788829 1338521 1048032
$$ packed form
9967e6977K44894l85796j62752M31996J64105R17435J85565p72952K97995K25444
9957A088957m75071n05181j41787Q33680J053782n97000o53266m18405p0973K16811
9947C31547O5476K59925m2827L25636L33523o39897J98620q1197m08299J81090
9937E23597J160283o73681p65710Q39489n81431j54643L71892J53349N85415L24298
9927A782858K34314k1417r35654O93170o77075P42307m35039p03121J93135r4223
9917G79255p9764J17889K17331n87551J254168k00506k72512l4229J7608J03316
9907A315005m45945N87714O40807N04136q39907R7043k00405n25783k13012N00597
9897A420250P55304J64341K94270N6088o45756j4532J294395n35531j450308k90489
$$ plain form
9887 1048032 1326808 1853971 1765755 2327192 1975802 1398564 1553680 1886441 2029101 2216123
9877 2216123 2862666 2690637 2517135 2401633 2809674 2113025 1461223 2306150 2717570 2697488
9867 2697488 1979555 1050867 2020688 2511611 2033687 389079 443847 1998677 2333966
9858 2333966 1660735 1544147 1952729 2556113 3051161 3421648 2662207 3255961 2592672 2084283
9848 2084283 2539051 2652619 2776254 2179573 2715122 2269563 1308573 1527257 1905622 1948802
9838 1948802 1826300 1672048 1628356 2130286 1072133 1858107 921713 1087405 1994139 1118141
9828 1118141 848146 628595 615708 634761 1339956 1317819 1552910 1113134 1061414 1742189
9818 1742189 2919834 2567166 2021521 2421516 2571552 2370240 2094025 2295728 2469008
$$ packed form
9887A048032K78776N27163q8216N61437l51390n77238J55116L32761J42660J87022
9877B216123O46543j72029j73502j15502M08041o96649o51802Q44927M11420k0082
9867B697488p17933r28688R69821M90923m77924j644608N4768J554830L35289
9858B333966o73231j16588M08582O03384M95048L70487p59441N93754o63289n08389
9848B084283M54768J13568J23635n96681N35549m45559r60990K18684L78365M3180
9838A948802j22502j54252m3692N01930j058153P85974r36394J65692R06734q75998
9828A118141k69995k19551j2887J9053P05195k2137K35091m39776n1720O80775
9818A742189J177645l52668n45645L99995J50036k01312k76215K01703J73280
$$ plain form
9809 2469008 2971384 3324954 2094198 1858098 1986373 1696202 1253812 1566603 1205190
9800 1205190 1930512 1714071 1017190 1227020 879324 1453444 1860687 999637 1263489 2759649
9790 2759649 1517004 1259505 2465373 2106582 3279577 3232018 2429313 2253525 2029107
9781 2029107 1477803 2546609 3137485 2331965 2095397 1934793 2042552 1100026 1846292
9772 1846292 1424996 1230999 2135883 2070851 2135348 2025203 1936951 2692026 3018100 3183426
9762 3183426 2952541 2281794 1756661 1831551 1506172 1382557 1634659 1425804 1094169 1869115
9752 1869115 2817067 1280751 2213784 2898354 2873491 2422502 2550177 2122509 1630607 2317399
9742 2317399 3422496 3540129 2216955 2450462 2455800 3146142 2037365 2994201 2700285
$$ packed form
9809B469008N02376L53570j230756k36100J28275k90171m42390L12791l61413
9800A205190P25322k16441o96881K09830l47696N74120M07243q61050K63852J496160
9790B759649j242645k57499J205868l58791J172995m7559q02705j75788k24418
9781B029107n51304J068806N90876q05520k36568j60604J07759r42526P46266
9772A846292m21296j93997R04884o5032O4497j10145q8252P55075L26074J65326
9762C183426k30885o70747n25133P4890l25379j23615K52102k08855l31635P74946
9752A869115R47952j536316R33033O84570k4863m50989J27675m27668m91902O86792
9742B317399J105097J17633j323174K33507N338O90342j108777R56836k93916
$$ plain form
9733 2700285 1957395 2565215 2515203 3284453 3054311 4123617 3862612 3337270 3451271 4647110
9723 4647110 4101510 3125030 3618879 4368435 3097034 2045812 3082297 3918802 2795368
9714 2795368 2300476 3182235 4286115 4315184 3797067 3973108 3700893 3440686 3852709 4308567
9704 4308567 3642760 3383925 3384497 3833746 4388646 4539977 4285342 4184733 4485291 4102623
9694 4102623 5080675 6444765 5503052 4213556 4573762 4506378 3163276 3899750 4804273
9685 4804273 4508396 4183088 5243100 4371290 5025453 4231958 4148041 4473029 4019459 4258487
9675 4258487 4842067 5206587 5035354 4110452 4820843 5352490 5401151 5621667 6578848 6099890
9665 6099890 5340706 4742311 5443149 6197327 5906550 6366937 6639227 6650513 6185221 7795053
$$ packed form
9733B700285p42890O07820n0012P69250k30142J069306k61005n25342J14001J195839
9723D647110n45600r76480M93849P49556j271401j051222J036485Q36505j123434
9714B795368m94892Q81759J103880K9069n18117J76041k72215k60207M12023M55858
9704D308567o65807k58835N72M49249N54900J51331k54635j00609L00558l82668
9694D102623R78052J364090r41713j289496L60206o7384j343102P36474R04523
9685D804273k95877l25308J060012q71810O54163p93495q3917L24988m53570K39028
9675D258487N83580L64520j71233r24902P10391N31647M8661K20516R57181m78958
9665F099890p59184n98395P00838P54178k90777M60387K72290J1286m65292J609832
$$ plain form
9655 7795053 7906746 6297763 5998970 5468336 5709370 6441358 5917620 6866748 6548261
9646 6548261 6793007 8056641 8528388 8009198 8805616 8412680 7783177 7572959 8512978
9637 8512978 9006760 8810779 8896442 9653212 10293578 9518508 8608826 8880297 10121422 10470620
9627 10470620 10702017 11396990 11791494 12755152 11971275 12396020 12900943 12406478 12884205
9618 12884205 13298113 12719845 13499167 13170243 14387834 15325148 14842703 15190439 15325002
9609 15325002 16505887 17054389 16535713 17015593 17355282 16968295 17644759 18240105 18895558
9600 18895558 19436420 19468073 20082397 20028379 20216026 20577845 20787392 21498008 21829701 22377689
9590 22377689 23888196 24213404 24504113 25081278 25168001 25502273 26219978 28498946 28499298 29116127
$$ packed form
9655G795053J11693j608983k98793n30634K41034P31988n23738R49128l18487
9646F548261K44746J263634M71747n19190P96418l92936o29503k10218R40019
9637H512978M93782j95981Q5663P56770O40366p75070r09682K71471J241125L49198
9627A0470620K31397O94973L94504R63658p83877M24745N04923m94465M77727
9618A2884205M13908n78268P79322l28924J217591R37314m82445L47736J34563
9609A5325002J180885N48502n18676M79880L39689l86987O76464N95346O55453
9600A8895558N40862L1653O14324n4018J87647L61819K09547P10616L31693N47988
9590B2377689J510507L25208K90709N77165Q6723L34272P17705K278968L52O16829
$$ plain form
9580 29116127 29267913 29673678 30987023 32053382 32759003 33712622 34726672 35968772 37494876
9571 37494876 38437519 38697482 40468848 41063094 41860276 43985497 44924196 45756567 47463345
9562 47463345 48254905 50258355 52047373 53473872 54057434 55853936 58038512 59715703
9554 59715703 60464498 62507259 64826003 66587620 69940738 73017648 76826539 79574271
9546 79574271 84728492 89350525 93631884 98866384 105259821 113554001 121612501 131666882
9538 131666882 143208191 155365544 169393186 181038227 190762797 197752344 202573272
9531 202573272 205769147 208411161 210181836 213425693 218149505 221579731 223017309 223035572
9523 223035572 220566673 215235557 210875168 207003963 204590756 204285320 207923104 214546989
$$ packed form
9580B9116127J51786M05765J313345J066359P05621R53619J014050J242100J526104
9571C7494876R42643K59963J771366N94246P97182K125221R38699Q32371J706778
9562D7463345P91560K003450J789018J426499N83562J796502K184576J677191
9554E9715703P48795K042761K318744J761617L353118L076910L808891K747732
9546G9574271N154221M622033M281359N234500O393437Q294180Q058500J0054381
9538A31666882J1541309J2157353J4027642J1645041R724570O989547M820928
9531B02573272L195875K642014J770675L243857M723812L430226J437578J8263
9523B23035572k468899n331116m360389l871205k413207l05436L637784O623885
$$ plain form
9515 214546989 224635678 237933296 256273432 276438308 298039522 320600231 340410156
9508 340410156 357385897 369969185 377651510 381146626 383465215 384960808 383992902 379627404
9500 379627404 373212629 361593779 344546324 325134633 304281277 283409616 264191394
9493 264191394 247719509 234707216 225527157 221217109 220949124 222496937 226270931 234739639
9485 234739639 247259014 264881951 286246808 308690408 333043018 353676745 366844388
9478 366844388 373273280 373100046 369981364 366870202 365211007 364406752 360755155 350350817
9470 350350817 332268489 306264675 275173801 243973535 215834522 192809446 174533824
9463 174533824 159909715 148284960 138367868 130118651 123550621 116619862 111160635 107246741
$$ packed form
9515B14546989J0088689J3297618J8340136K0164876K1601214K2560709J9809925
9508C40410156J6975741J2583288P682325L495116K318589J495593r67906m365498
9500C79627404o414775j1618850j7047455j9411691k0853356k0871661j9218222
9493B64191394j6471885j3012293r180059m310048k67985J547813L773994Q468708
9485B34739639J2519375J7622937K1364857K2443600K4352610K0633727J3167643
9478C66844388O428892j73234l118682l111162j659195q04255l651597j0404338
9470C50350817j8082328k6003814l1090874l1200266k8139013k3025076j8275622
9463A74533824j4624109j1624755r917092q249217o568030o930759n459227l913894
$$ plain form
9455 107246741 103209464 100224686 97808167 95509636 94320466 93506442 92906219 93359580
9447 93359580 93934344 95238374 98099259 102653468 107450688 111048432 114821381 115283906
9439 115283906 116009221 114926227 113267702 111316862 109471174 108772901 106910735 102506842
9431 102506842 96445955 89464898 80632687 72409960 66235828 61776668 57582920 54329942
9423 54329942 51136610 48491157 46151211 43172920 41874580 40987309 38453757 37268282
9415 37268282 36325443 35068322 33195384 32505719 31377523 29878565 29088029 28362568 26422642
9406 26422642 24345997 24593102 25012569 24228872 23077396 22258705 23162471 22320601 22222935
9397 22222935 21263276 20916935 20879019 19715692 20071447 19675242 18276322 17382215 16721291
$$ packed form
9455A07246741m037277k984778k416519k298531j189170q14024o00223M53361
9447I3359580N74764J304030K860885M554209M797220L597744L772949M62525
9439A15283906P25315j082994j658525j950840j845688o98273j862166m403893
9431A02506842o060887o981057q832211q222727o174132m459160m193748l252978
9423E4329942l193332k645453k339946k978291j298340q87271k533552j185475
9415C7268282r42839j257121j872938o89665j128196j498958p90536p25461j939926
9406B6422642k076645K47105M19467p83697j151476q18691R03766q41870r7666
9397B2222935r59659l46341l7916j163327L55755l96205j398920q94107o60924
$$ plain form
9388 16721291 17126320 17191504 15663115 15797245 16492002 16559634 15617297 15869181 15487764 15319311
9378 15319311 14890193 13852203 14098134 13015672 12672778 11985340 12055822 12522272 12250636
9369 12250636 12332742 13124836 13135648 12554801 12562957 12379341 12591611 12417619 12677766 12468821
9359 12468821 11402406 11392106 11592409 12091461 12092364 12653173 13631617 13011278 12131004 11451269
9349 11451269 12303686 12789905 11611588 10719513 11481147 12133395 11285367 10823412 10313447
9340 10313447 11190353 10747657 10942357 11024190 10177684 9554012 8919479 9167040 10090418 10887806
9330 10887806 9360550 9084722 9032165 9228329 9295361 9112959 8970390 9534086 10396901 10400380
9320 10400380 9273384 8782147 9256535 8991201 9259460 10078679 10379360 9993687 10047199
$$ packed form
9388A6721291M05029O5184j528389J34130O94757O7632r42337K51884l81417j68453
9378A5319311m29118j037990K45931j082462l42894o87438P0482M66450k71636
9369A2250636Q2106P92094J0812n80847Q156j83616K12270j73992K60147k08945
9359A2468821j066415j0300K00303M99052R03N60809R78444o20339q80274o79735
9349A1451269Q52417M86219j178317q92075P61634O52248q48028m61955n09965
9340A0313447Q76906m42696J94700Q1833q46506o23672o34533K47561R23378P97388
9330A0887806j527256k75828n2557J96164O7032j82402j42569N63696Q62815L479
9320A0400380j126996m91237M74388k65334K68259Q19219L00681l85673N3512
$$ plain form
9311 10047199 10431695 9601499 9879028 10500678 8936489 8325732 9656721 8412456 9228790
9302 9228790 9550713 9221906 8181572 8364737 8936289 7766271 7648540 7646570 7332435 8784523
9292 8784523 9156700 9267569 8569462 8268138 8067442 8369306 8954795 8310695 8453511 8868561
9282 8868561 9063015 8424896 7671159 8304296 9746491 10739520 10297401 10484304 10972559
9273 10972559 10331282 9777321 10692510 11091177 11766593 11980565 12241112 13309726 12670576
9264 12670576 12414326 13042956 14420848 14754406 15434793 16814968 17556726 16931764 16866978
9255 16866978 16503954 16905880 16534652 15198437 15029947 16302087 16443655 15880401 15251331
9246 15251331 15619825 15498743 16439999 17221248 17733866 17390244 17016577 17337525 17475271
$$ packed form
9311A0047199L84496q30196K77529O21650j564189o10757J330989j244265Q16334
9302I228790L21923l28807j040334J83165N71552j170018j17731j970l14135J452088
9292H784523L72177J10869o98107l01324k00696L01864N85489o44100J42816M15050
9282H868561J94454o38119p53737O33137J442195R93029m42119J86903M88255
9273A0972559o41277n53961R15189L98667O75416K13972K60547J068614o39150
9264A2670576k56250O28630J377892L33558O80387J380175P41758o24962o4786
9255A6866978l63024M01926l71228j336215j68490J272140J41568n63254o29070
9246A5251331L68494j21082R41256P81249N12618l43622l73667L20948J37746
$$ plain form
9237 17475271 17304900 18451872 19100428 19123803 18951924 19074646 20061866 20948928 21713506
9228 21713506 21928264 21173097 21874055 22730871 22049109 22256267 22987792 23697740 23371265
9219 23371265 23229742 23344438 22837888 23581113 23920234 24464354 24928691 24986293 25738899 25414441
9209 25414441 26293536 27347645 28353345 29167908 28547107 29739934 30022604 31002097 31775416
9200 31775416 32837043 33695975 33605559 35364078 35837783 36791085 37292118 37753350 39168469
9191 39168469 39988869 41740846 42394083 44307896 47522055 48903895 51869030 54150115
9183 54150115 57097690 59566646 63608521 68998296 75989985 83807822 92399189 100731414
9175 100731414 108129198 115000619 116580463 115335847 114049887 115359461 116847434 118797203
$$ packed form
9237A7475271j70371J146972O48556K3375j71879J22722R87220Q87062P64578
9228B1713506K14758p55167P00958Q56816o81762K07158P31525P09948l26475
9219B3371265j41523J14696n06550P43225L39121N44120M64337N7602P52606l24458
9209B5414441Q79095J054109J005700Q14563o20801J192827K82670R79493P73319
9200C1775416J061627Q58932r0416J758519M73705R53302N01033M61232J415119
9191C9168469Q20400J751977O53237J913813L214159J381840K965135K281085
9183E4150115K947575K468956M041875N389775O991689P817837Q591367Q332225
9175A00731414P397784O871421J579844j244616j285960J309574J487973J949769
$$ plain form
9167 118797203 121292419 120998663 116833402 110258489 103985402 99075067 94631995 92114797
9159 92114797 91521929 91523591 92029200 93551891 95718440 98930404 103245317 107090139 112454530
9150 112454530 119581643 128431559 138528475 149025343 162287643 179356743 202879775
9143 202879775 231811297 262699906 293109947 320642108 337270974 337077668 326111727
9136 326111727 314808510 312488629 314550084 318678428 320934449 312500770 287927810 253320763
9128 253320763 219215953 190519168 166576054 147940716 134720221 123697453 114327103
9121 114327103 104039040 97489468 91360279 84865151 81020545 76803753 72551752 69239772
9113 69239772 66151604 64179873 61508480 59071987 57536383 54436108 52507384 50602581
$$ packed form
9167A18797203K495216k93756m165261o574913o273087m910335m443072k517198
9159I2114797n92868J662N05609J522691K166549L211964M314913L844822N364391
9150A12454530P127113Q849916J0096916J0496868J3262300J7069100K3523032
9143B02879775K8931522L0888609L0410041K7532161J6628866j93306j0965941
9136C26111727j1303217k319881K061455M128344K256021q433679k4572960l4607047
9128B53320763l4104810k8696785k3943114j8635338j3220495j1022768r370350
9121A14327103j0288063o549572o129189o495128l844606m216792m252001l311980
9113F9239772l088168j971731k671393k436493j535604l100275j928724j904803
$$ plain form
9105 50602581 49469952 48462750 46731759 45918270 46274705 44891517 42592529 42183915 41857303
9096 41857303 40688471 40368062 40216297 40230823 39453309 38998546 38640874 38110509 37603331
9087 37603331 37021127 36687306 36591378 35733369 35360898 34867540 35413424 35496506 34279938 34163281
9077 34163281 34541279 34564025 34815181 34849268 34916519 35629105 35141744 35678814 36105824 35350911
9067 35350911 36399212 35616501 35879197 37180760 37115954 37755165 39402000 40290356 40012533
9058 40012533 40698675 42170130 42170670 43121008 43711526 44279987 44936949 44468449 44123768 45747397
9048 45747397 47461864 49207804 50335722 50534033 50955367 53046184 53237893 54555870 57231746
9039 57231746 59343456 61230745 63341075 66589709 68182973 72628995 77239331 80665459
$$ packed form
9105E0602581j132629j007202j730991q13489L56435j383188k298988m08614l26612
9096D1857303j168832l20409j51765J4526p77514m54763l57672n30365n07178
9087C7603331n82204l33821r5928q58009l72471m93358N45884Q3082j216568j16657
9077C4163281L77998K2746K51156L4087O7251P12586m87361N37070M27010p54913
9067C5350911J048301p82711K62696J301563o4806O39211J646835Q88356k77823
9058D0012533O86142J471455N40R50338N90518N68461O56962m68500l44681J623629
9048D5747397J714467J745940J127918J98311M21334K090817J91709J317977K675876
9039E7231746K111710J887289K110330L248634J593264M446022M610336L426128
$$ plain form
9031 80665459 85142723 91659112 97928013 103880535 108745542 111515571 111435330 111226827 111293308
9022 111293308 112092103 112591367 115171504 116392459 116993759 115987319 113168035 110564406
9014 110564406 108642497 108218121 109427989 110081423 111356449 114204861 117056798 120394400
9006 120394400 123271061 126792658 131526133 136479215 142713767 149887795 157488333 165402976
8998 165402976 175777898 188020160 203234734 218837736 237931204 260087158 286487686
8991 286487686 312967375 338063802 363594142 385835664 401417022 407218038 405777579
8984 405777579 405312167 409658347 415799237 421407608 425306972 423134567 411263506 393142070
8976 393142070 375962325 365922939 364616210 371852455 388420038 410355583 433888581
$$ packed form
9031H0665459M477264O516389O268901N952522M865007K770029q0241k08503O6481
9022A11293308P98795M99264K580137J220955O01300j006440k819284k603629
9014A10564406j921909m24376J209868O53434J275026K848412K851937L337602
9006A20394400K876661L521597M733475M953082O234552P174028P600538P914643
8998A65402976J0374922J2242262J5214574J5603002J9093468K2155954K6400528
8991B86487686K6479689K5096427K5530340K2241522J5581358N801016j440459
8984D05777579m65412M346180O140890N608371L899364k172405j1871061j8121436
8976C93142070j7179745j0039386j306729P236245J6567583K1935545K3532998
$$ plain form
8969 433888581 459902224 478019060 482922374 474601467 455029731 426688268 391098176
8962 391098176 353021241 319886246 294976005 275514994 260809274 253180424 248245128
8955 248245128 246197457 244421372 241136083 235684356 227072779 219375768 213322379 210306452
8947 210306452 209896981 209833339 208602051 205929480 200303139 191753978 182760911 175069958
8939 175069958 170661822 168846061 168308578 170177159 174470193 181305373 191833192 206528097
8931 206528097 225894992 248815601 270291798 287115883 296912263 294013460 273750366
8924 273750366 242348159 210255812 182549390 161658890 144640459 131159933 119967049
8917 119967049 111805824 104143990 98190087 92700034 87829426 84170019 80805293 77965550
$$ packed form
8969D33888581K6013643J8116836M903314q320907j9571736k8341463l5590092
8962C91098176l8076935l3134995k4910241j9461011j4705720p628850m935296
8955B48245128k047671j776085l285289n451727q611577p697011o053389l015927
8947B10306452m09471o3642j231288k672571n626341q549161q993067p690953
8939A75069958m408136j815761n37483J868581M293034O835180J0527819J4694905
8931B06528097J9366895K2920609K1476197J6824085R796380k898803k0263094
8924B73750366l1402207l2092347k7706422k0890500j7018431j3480526j1192884
8917A19967049q161225p661834n953903n490053m870608l659407l364726k839743
$$ plain form
8909 77965550 74832644 72523180 70741212 68193416 65761141 64140187 63253383 61589345
8901 61589345 60240971 59966184 59117087 57909809 56568135 55619843 55422808 55617971 54828100
8892 54828100 52892776 52792805 53282119 53575024 54097509 54993528 56407599 58251458 59564298
8883 59564298 61207994 63055926 66017559 70106222 73844118 78820939 84732923 92896359
8875 92896359 103205051 115289976 127738677 139146525 147965387 151590171 149798076 142527148
8867 142527148 131303689 118118071 104926649 91930982 82171940 74394600 68895247
8860 68895247 63653870 60188757 56441131 53244092 51435050 49265599 47853417 45992277
8852 45992277 44584631 43718818 42900328 42653684 42332584 41588200 41021015 41223886 42692097
$$ packed form
8909G7965550l132906k309464j781968k547796k432275j620954q86804j664038
8901F1589345j348374k74787q49097j207278j341674r48292j97035J95163p89871
8892E4828100j935324r9971M89314K92905N22485Q96019J414071J843859J312840
8883E9564298J643696J847932K961633M088663L737896M976821N911984Q163436
8875I2896359J0308692J2084925J2448701J1407848Q818862L624784j792095p270928
8867A42527148j1223459j3185618j3191422j2995667r759042p777340n499353
8860F8895247n241377l465113l747626l197039j809042k169451j412182j861140
8852D5992277j407646q65813q18490k46644l21100p44384n67185K02871J468211
$$ plain form
8843 42692097 42858360 44019474 45188898 46631115 49474850 51767957 55424245 59565856
8835 59565856 65099100 71059852 76479828 82571147 83351679 82260356 79014474 73660969
8827 73660969 65796423 56865398 50767266 46155648 41388289 38057743 34684197 32104237
8819 32104237 30235598 28676137 27891232 26900860 25505132 23266348 21705830 21007916 19970820
8810 19970820 19848763 20356893 19720182 18382357 17395641 16393299 15812881 15242910 15115596
8801 15115596 14507790 14429647 14155923 13937783 13247966 12720189 13199090 13716842 11694899
8792 11694899 11509911 11382480 10964830 10874018 10380604 11066606 11446625 11218779 11248191 10204952
8782 10204952 10040302 11059906 10570188 10384545 9765597 10421236 10150012 9594647 9691797
$$ packed form
8843D2692097J66263J161114J169424J442217K843735K293107L656288M141611
8835E9565856N533244N960752N419976O091319P80532j091323l245882n353505
8827G3660969p864546q931025o098132m611618m767359l330546l373546k579960
8819C2104237j868639j559461p84905r90372j395728k238784j560518o97914j037096
8810A9970820j22057N08130o36711j337825r86716j002342n80418n69971j27314
8801A5115596o07806p8143k73724k18140o89817n27777M78901N17752k021943
8792A1694899j84988j27431m17650r0812m93414O86002L80019k27846K9412j043239
8782A0204952j64650J019604m89718j85643o18948O55639k71224n55365R7150
$$ plain form
8773 9691797 9024187 8711606 7351869 7431320 7905614 7517066 6668638 7601465 7807758 7684928
8763 7684928 7619487 7595372 7753892 7443807 7189387 5933261 6304267 6745864 6570738 7206442
8753 7206442 8210225 7592382 6878111 6985514 7708633 6784877 7029976 7614344 7697064 7571725
8743 7571725 7158496 6476792 6494592 5751360 5385288 4900628 4693530 5421365 5391500 4731342
8733 4731342 4357347 4746205 4924737 3968157 3479658 3910069 4379723 4585468 4267054 4371211
8723 4371211 4702223 5228825 4831155 4076904 4914814 5555450 4677041 4162046 4138802 3721993
8713 3721993 2845111 3139406 3895256 3619805 3557888 3696818 3465252 3922096 3893380 3854985
8703 3854985 4916330 3636369 3355102 4423243 4279703 3084892 3763322 3485597 3440746
$$ packed form
8773I691797o67610l12581j359737P9451M74294l88548q48428R32827K06293j22830
8763G684928o5441k4115J58520l10085k54420j256126L71006M41597j75126O35704
8753G206442J003783o17843p14271J07403P23119r23756K45099N84368Q2720j25339
8743G571725m13229o81704J7800p43232l66072m84660k07098P27835k9865o60158
8733D731342l73995L88858J78532r56580m88499M30411M69654K05745l18414J04157
8723D371211L31012N26602l97670p54251Q37910O40636q78409n14995k3244m16809
8713C721993q76882K94295P55850k75451o1917J38930k31566M56844k8716l8395
8703C854985J061345j279961k81267J068141j43540j194811O78430k77725m4851
$$ plain form
8694 3440746 4909210 4164862 3307470 2771879 2947345 3719535 3878141 3145331 3518947
8685 3518947 3201390 2648877 3111976 2266810 2588114 2516880 2190396 2444305 2937318 3501946
8675 3501946 3273876 3403113 3165052 3078295 3424823 3387550 2098990 2026207 2370755 2317356
8665 2317356 2989194 2591201 2259674 1414097 1459222 1881662 2335940 2480260 2297775 2533622
8655 2533622 3788798 3434688 2483242 2985779 2223804 2942652 3390707 2744609 3290837
8646 3290837 3695619 4173735 4038316 3085490 2697026 2919888 3090680 2698334 3088034 3154158
8636 3154158 2050890 2560706 3788515 3177350 3462969 3257779 2187271 1717298 1830824
8627 1830824 2040434 1844831 1464519 2406954 2977910 2463292 2549615 2549173 3004270 3376269
$$ packed form
8694C440746J468464p44348q57392n35591J75466P72190J58606p32810L73616
8685C518947l17557n52513M63099q45166L21304p1234l26484K53909M93013N64628
8675C501946k28070J29237k38061q6757L46528l7273j288560p2783L44548n3399
8665B317356O71838l97993l31527q45577M5125M22440M54278J44320j82485K35847
8655B533622J255176l54110r51446N02537p61975P18848M48055o46098N46228
8646C290837M04782M78116j35419r52826l88464K22862J70792l92346L89700O6124
8636C154158j103268N09816J227809o11165K85619k05190j070508m69973J13526
8627A830824K09610j95603l80312R42435N70956n14618Q6323m42M55097L71999
$$ plain form
8617 3376269 2946402 1569779 1760687 2260095 1822002 2259706 2448031 2116490 2268067
8608 2268067 3197563 3818361 3287396 3799078 4220738 3739239 3482886 4169139 4526737 4496466
8598 4496466 4009554 4020583 3611545 3324388 3567721 2550295 2671721 2935833 2196998 1539757
8588 1539757 1323022 1836176 3314784 1198119 452044 1358187 1469032 1959109 1022579
8579 1022579 1296172 1070234 1239122 2106507 2421625 2268400 2095903 1006471 993387 1426386
8569 1426386 1145728 2376899 2003148 1551949 2777200 2761295 2482761 2251586 2578220
8560 2578220 2015751 1045398 1558541 1448357 2620809 1972042 1280896 508661 252104
8551 252104 537346 1768516 1740976 1550209 1712466 1741674 280073 179418 290919 988525
$$ packed form
8617C376269m29867j376623J90908M99408m38093M37704J88325l31541J51577
8608B268067R29496O20798n30965N11682M21660m81499k56353O86253L57598l0271
8598D496466m86912J1029m09038k87157K43333j017426J21426K64112p38835o57241
8588A539757k16735N13154J478608k116665p46075R06143J10845M90077r36530
8579A022579K73593k25938J68888Q67385L15118j53225j72497j089432j3084M32999
8569A426386k80658J231171l73751m51199J225251j5905k78534k31175L26634
8560B578220n62469r70353N13143j10184J172452o48767o91146p72235k56557
8551B52104K85242J231170k7540j90767J62257K9208j461601j00655J11501O97606
$$ plain form
8541 988525 1391857 911731 327913 734664 980096 -97439 -253107 -41708 405536 689354
8531 689354 526337 950148 1169550 973119 1555685 1153264 789051 1042211 1006112 2004670
8521 2004670 1382862 302323 2178380 2202563 1452747 963623 1097096 1446182 1173897
8512 1173897 768346 1036298 964057 1247121 1436418 1928746 984654 442336 1409547 1795130
8502 1795130 1489311 997230 1630142 2145475 2454866 2352622 1233242 636565 806475
8493 806475 805295 1696563 2157472 1950575 991967 148744 -98597 132688 1346447 527446
8483 527446 465511 1100228 1183764 135772 890811 602083 890728 1537613 1070438 1210550
8473 1210550 1261728 842664 3925 366843 1421627 828387 1353194 1431176 1501678 1508411
$$ packed form
8541I88525M03332m80126n83818M06751K45432j077535j55668K11399M47244K83818
8531F89354j63017M23811K19402j96431N82566m02421l64213K53160l6099R98558
8521B004670o21808j080539J876057K4183p49816m89124J33473L49086k72285
8512A173897m05551K67952p2241K83064J89297M92328r44092n42318R67211L85583
8502A795130l05819m92081O32912N15333L09391j02244j119380n96677J69910
8493H06475j180Q91268M60909k06897r58608q43223k47341K31285J213759q19001
8483E27446o1935O34717Q3536j047992P55039k88728K88645O46885m67175J40112
8473A210550N1178m19064q38739L62918J054784n93240N24807P7982P0502O733
$$ plain form
8463 1508411 139356 616781 1726694 1677246 1724603 2166541 2264511 1834551 994178 848686
8453 848686 1775390 1396435 581967 1061204 794653 924172 1121772 1444188 1529198 1261126
8443 1261126 1175460 1585599 830333 559705 216457 26725 738186 467418 192028 805308
8433 805308 1397368 503739 337758 1073379 1197541 1290415 1928164 1144534 415673 -184175
8423 -184175 153107 763920 1161665 562188 1140988 606143 504886 793002 1058254 1348000
8413 1348000 200380 9984 23641 -396103 408678 1104922 1388725 585617 541345 413827
8403 413827 -546994 -501450 -325064 -832153 -1244688 -481540 -594517 -282992 483745 798928
8393 798928 825587 1174434 97825 473510 -187172 -606930 -675306 423692 -163212 -931666
$$ packed form
8463A508411j369055M77425J109913m9448M7357M41938R7970m29960q40373j45492
8453H48686R26704l78955q14468M79237k66551J29519J97600L22416Q5010k68072
8443A261126q5666M10139p55266k70628l43248j89732P11461k70768k75390O13280
8433H05308N92060q93629j65981P35621J24162R2874O37749p83630p28861n99848
8423a84175L37282O10813L97745n99477N78800n34845j01257K88116K65252K89746
8413A348000j147620j90396J3657m19744Q04781O96244K83803q03108m4272j27518
8403D13827r60821M5544J76386n07089m12535P63148j12977L11525P66737L15183
8393G98928K6659L48847j076609L75685o60682m19758o8376J098998n86904p68454
$$ plain form
8383 -931666 -946404 -1512588 -1237943 158819 388557 109872 80869 45961 -362741 -246197
8373 -246197 529810 -44618 -87117 483763 674720 1125045 813315 1133453 51402 237732
8363 237732 1667 -18669 24675 293955 -188185 -1034027 -741523 -801897 -630693 -700626
8353 -700626 -665980 -180156 -127914 621653 452657 -20066 1179331 597737 929842 -868705
8343 -868705 -1075541 -846045 -310893 -403507 -191134 -491687 -858961 -473426 -779402 -502425
8333 -502425 -575006 -1657511 -710736 -125983 -422803 1099875 1157983 447926 287040 -54088
8323 -54088 -166032 257588 -377045 114313 464245 575574 -33855 -287314 -402272 -667709
8313 -667709 -1167759 -349673 274467 457344 788809 106691 -167273 111290 27136 -401725
$$ packed form
8383i31666j4738n66184K74645J396762K29738k78685k9003l4908m08702J16544
8373b46197P76007n74428m2499N70880J90957M50325l11730L20138j082051J86330
8363B37732k36065k0336M3344K69280m82140q45842K92504o0374J71204o9933
8353g00626L4646M85824N2242P49567j68996m72723J199397n81594L32105j798547
8343h68705k06836K29496N35152r2614K12373l00553l67274L85535l05976K76977
8333e02425p2581j082505R46775N84753k96820J522678N8108p10057j60886l41128
8323e4088j11944M23620o34633M91358L49932J11329o09429k53459j14958k65437
8313f67709n00050Q18086O24140J82877L31465o82118k73964K78563q4154m28861
$$ plain form
8303 -401725 -527756 -448626 526684 224533 -217599 -9909 -507566 -242207 305505 -280061
8293 -280061 -114978 -184228 -81536 686511 711144 785334 194086 -860871 -525235 744431
8283 744431 678182 287587 -214554 -273418 -720072 -740853 -651930 128339 582038 321610
8273 321610 -270054 -341620 318310 -50079 -557267 -316314 688529 995683 750315 1102529
8263 1102529 639856 148213 903011 -760245 -235176 84708 117662 -655590 -450149 -98214
8253 -98214 -895445 -1051917 -293600 -261094 -70549 -345263 -1203909 -439111 -259387 -33364
8243 -33364 709541 -30519 -328570 -330732 -190977 -395178 78492 334152 283638 13566
8233 13566 -1563366 -1739190 -1094304 278768 -493703 -320124 1052786 400776 175597
$$ packed form
8303d01725j26031P9130R75310l02151m42132K07690m97657K65359N47712n85566
8293b80061J65083o9250J02692P68047K4633P4190n91248j054957L35636J269666
8283G44431o6249l90595n02141n8864m46654k0781Q8923P80269M53699k60428
8273C21610n91664p1566O59930l68389n07188K40953J004843L07154k45368L52214
8263A102529m62673m91643P54798j663256N25069L19884L2954p73252K05441L51935
8253i8214p97231j56472P58317L2506J90545k74714q58646P64798J79724K26023
8243c3364P42905p40060k98051k162J39755k04201M73670K55660n0514k70072
8233A3566j576932j75824O44886J373072p72471J73579J372910o52010k25179
$$ plain form
8224 175597 971571 1153979 843729 885133 311206 109042 -240016 -147486 545008 1113315
8214 1113315 168360 -543113 -166301 962899 691492 805215 1519523 1314801 1921483
8205 1921483 2311498 2093097 408400 64341 -212103 -46534 617048 1018187 679115
8196 679115 132735 924608 1957296 1981919 430963 -2538971 -1186406 -1787538 -1118439
8187 -1118439 -1118707 359263 137581 -396286 62086 -80219 970198 494412 688843 443505
8177 443505 71299 -511987 -89384 63490 20435 -974748 -348703 -1431800 -1158047 -1042677
8167 -1042677 -686758 -1029721 -421843 -271652 -61302 5340 -99709 893003 457458 683484
8157 683484 -129038 -26246 487468 257704 531329 -449547 -164949 593091 385094 -31795
$$ packed form
8224A75597P95974J82408l10250M1404n73927k02164l49058R2530O92494N68307
8214A113315r44955p11473L76812J129200k71407J13723P14308k04722O06682
8205A921483L90015k18401j684697l44059k76444J65569O63582M01139l39072
8196F79115n46380P91873J032688K4623j550956k969934J352565o01132O69099
8187a118439k68J477970k21682n33867M58372j42305J050417m75786J94431k45338
8177D43505l72206n83286M22603J52874m3055r95183O26045j083097K73753J15370
8167a042677L55919l42963O07878J50191K10350O6642j05049R92712m35545K26026
8157F83484q12522J02792N13714k29764K73625r80876K84598P58040k07997m16889
$$ plain form
8147 -31795 -977840 -1236068 -492564 -1207107 -1022769 76764 -454871 -789596 -47493 601487
8137 601487 512526 771656 763923 1123374 1098886 386070 151744 -802348 197169 -517330
8127 -517330 -988019 -9606 -230481 -467079 -266955 -270906 -559302 -87827 -353768 -863734
8117 -863734 -761549 -912346 -512879 -408413 -855942 -942228 -1125459 -821662 -777114 452674
8107 452674 89516 -279156 261860 904807 -400497 -554769 -1054897 127574 -52040
8098 -52040 -951960 -16501 -261583 -966869 -756623 350926 342014 -785291 292303 268051
8088 268051 -191578 59755 -187167 785227 834355 753353 1480420 1763833 1415939 886017
8078 886017 549644 -517690 66271 79091 -142558 -345813 607029 704515 -1101112 -1063919
$$ packed form
8147c1795r46045k58228P43504p14543J84338J099533n31635l34725P42103O48980
8137F01487q8961K59130p733L59451k4488p12816k34326r54092R99517p14499
8127e17330m70689R78413k20875k36598K00124l951k88396M71475k65941n09966
8117h63734J02185j50797L99467J04466m47529q6286j83231L03797M4548J229788
8107D52674l63158l68672N41016O42947j305304j54272n00128J182471j79614
8098e2040q99920R35459k45082p05286K10246J107549q912j127305J077594k4252
8088B68051m59629K51333k46922R72394M9128q1002P27067K83413l47894n29922
8078H86017l36373j067334N83961J2820k21649k03255R52842R7486j805627L7193
$$ plain form
8068 -1063919 70491 725836 184574 -764836 -1437011 -100943 -253303 -847006 -266994
8059 -266994 192598 -465988 -1529356 -895430 603645 250145 -260038 72379 -19212 125987
8049 125987 175105 42597 1014277 475109 -383622 -617152 -1677502 -684040 -869586 -625154
8039 -625154 -617727 -876428 -858953 -615586 373149 42085 -231499 -982258 -1200697 -325484
8029 -325484 -303288 -1066919 -844145 -1080255 -791212 -907958 -367316 -306353 -396852 -355080
8019 -355080 -560946 -671976 -723779 -332100 365907 551497 -216733 -210079 -502694 -1341215
8009 -1341215 -940842 -114369 200404 197799 241052 -254670 81201 122190 30541 925131
7999 925131 675036 -53261 -162237 -115848 -416991 -4366 -835114 -945966 -581861 -462919
$$ packed form
8068a063919J134410O55345n41262r49410o72175J336068j52360n93703N80012
8059b66994M59592o58586j063368O33926J499075l53500n10183L32417r1591J45199
8049A25987M9118j32508R71680n39168q58731k33530j060350R93462j85546K44432
8039f25154P427k58701J7475K43367R88735l31064k73584p50759k18439Q75213
8029c25484K2196p63631K22774k36110K89043j16746N40642O0963r0499M1772
8019c55080k05866j11030n1803L91679O98007J85590p68230O654k92615q38521
8009a341215M00373Q26473L14773k605M3253m95722L35871M0989r1649Q94590
7999I25131k50095p28297j08976M6389l01143M12625q30748j10852L64105J18942
$$ plain form
7989 -462919 1488432 34766 63667 280693 41285 -980164 -776150 -1015387 -173192
7980 -173192 623450 580903 58626 20423 181379 897549 1409547 585874 -230243 -1392166
7970 -1392166 -622321 -158182 181172 -28772 -1572675 -1396709 -881380 850310 88579
7961 88579 -901640 -992140 -1029285 -312285 466633 702909 -325692 -915975 -597896 -730747
7951 -730747 -690592 -798185 -1891514 -887589 -294955 203386 -125767 -919090 -2038535
7942 -2038535 -2304155 -1556137 -506690 -1078613 -1593848 -1408960 -1145380 -1509283 -1608245 -560865
7932 -560865 -356323 -270845 134968 437927 48059 129070 279226 -95488 1497301 1626250
7922 1626250 232983 -561780 -380423 880330 836167 380670 -147656 -206790 -843451 -518102
$$ packed form
7989d62919J951351j453666K8901K17026k39408j021449K04014k39237Q42195
7980a73192P96642m2547n22277l8203J60956P16170N11998q23673q16117j161923
7970a392166P69845M64139L39354k09944j543903J75966N15329J731690p61731
7961H8579r90219r0500l7145P17000P78918K36276j028601n90283L18079j32851
7951g30747M0155j07593j093329J003925N92634M98341l29153p93323j119445
7942b038535k65620P48018J049447n71923n15235J84888K63580l63903r8962J047380
7932e60865K04542Q5478M05813L02959l89868Q1011J50156l74714J592789J28949
7922A626250j393267p94763J81357J260753m4163m55497n28326n9134o36661L25349
$$ plain form
7912 -518102 400030 -1304907 -991618 -1055775 350203 553271 1115850 37732 -439190
7903 -439190 -636443 -563974 -326632 -599999 -704119 -495963 -795942 -746684 -485970 -480107
7893 -480107 81983 -792993 9095 -100045 -254818 833317 320918 682058 564604 234159
7883 234159 -537382 68030 664049 956236 1581168 1547171 440920 8956 -300190 -37148
7873 -37148 -327373 -571750 -564659 -605802 -48402 -202266 -275628 -1025058 -263180 -704947 -803104
7862 -803104 31301 -119067 128378 -81354 -566394 -130495 235741 -1146495 -708899 -426669
7852 -426669 -556246 -9802 232079 591646 1073320 131305 -819333 -918712 -325975 272999
7842 272999 -64697 -624958 -560191 -219916 -842672 -1132818 -2060143 -1275826 -270081 277552
$$ packed form
7912e18102R18132j704937L13289o4157J405978K03068N62579j078118m76922
7903d39190j97253P2469K37342k73367j04120K08156k99979M9258K60714N863
7893d80107N62090q74976Q02088j09140j54773J088135n12399L61140j17454l30445
7883B34159p71541O05412N96019K92187O24932l3997j106251m31964l09146K63042
7873c7148k90225k44377P091m1143N57400j53864p3362p49430P61878m41767r8157
7862h03104Q34405j50368K47445k09732m85040M35899L66236j382236M37596K82230
7852d26669j29577N46444K41881L59567M81674r42015r50638r9379N92737N98974
7842B72999l37696n60261O4767L40275o22756k90146r27325P84317J005745N47633
$$ plain form
7832 277552 -503585 -1160379 -812727 114290 -452620 -423486 -423518 811199 741336 575640 70875
7821 70875 -368480 -836439 -688385 272508 129958 561384 888415 596927 -98027 -481079
7811 -481079 -326471 -526748 -197805 -719632 -567143 -556541 -686101 272024 498488 -319550
7801 -319550 -453489 1698111 2294338 -173739 -795453 -240058 -300010 -187745 520752 -153614
7791 -153614 416821 -182285 -78589 -503160 -1159488 -1587461 -1326117 -373001 -856639 -1176833
7781 -1176833 -843270 -517207 403860 69512 86915 -167514 -332519 -465702 -963611 -822852
7771 -822852 -784141 -551005 65352 291457 -26764 415848 -399837 465559 111571 -186575
7761 -186575 -246773 511858 511642 1274070 1288249 818062 -307870 -1497249 -1366973 -858942
$$ packed form
7832B77552p81137o56794L47652R27017n66910K9134l2J234717o9863j65696n04765
7821G0875m39355m67959J48054R60893j42550M31426L27031k91488o94954l83052
7811d81079J54608k00277L28943n21827J52489J0602j29560R58125K26464q18038
7801c19550j33939K151600N96227k468077o21714N55395n9952J12265P08497o74366
7791a53614N70435n99106J03696m24571o56328m27973K61344R53116m83638l20194
7781a176833L33563L26063R21067l34348J7403k54429j65005j33183m97909J40759
7771h22852L8711K33136O16357K26105l18221M42612q15685Q65396l53988k98146
7761a86575o0198P58631k16P62428J4179m70187j125932j189379J30276N08031
$$ plain form
7751 -858942 -220462 561935 -149184 -992417 -678188 -496610 -809289 -1281140 -428013 268764
7741 268764 473505 153705 459481 346258 -667258 -356361 248706 271958 1211610 1089790
7731 1089790 1483868 973180 -363633 -1027489 -1038418 -704383 -410566 740932 587571
7722 587571 434898 723361 837648 304497 44474 815401 946585 283107 119132 66445
7712 66445 899928 714624 968937 1097441 269361 -299632 -169633 -586906 -256032 217726
7702 217726 -580828 -372950 -700384 231148 24318 -1280032 -2435656 -2079454 232205
7693 232205 -619670 -146356 -705304 -595569 6110 162323 -421208 -1335678 -899575 25741
7683 25741 98710 -503538 -752579 -696352 -696791 -145922 -108610 -519533 -996649 -2199094 -2346203
$$ packed form
7751h58942O38480P82397p11119q43233L14229J81578l12679m71851Q53127O96777
7741B68764K04741l19800L05776j13223j013516L10897O05067K3252R39652j21820
7731A089790L94078n10688j336813o63856j0929L34035K93817J151498j53361
7722E87571j52673K88463J14287n33151k60023P70927J31184o63478j63975n2687
7712F6445Q33483j85304K54313J28504q28080n68993J29999m17273L30874M73758
7702B17726p98554K07878l27434R31532k06830j304350j155624L56202K311659
7693B32205q51875M73314n58948J09735O01679J56213n83531r14470M36103R25316
7683B5741P2969o02248k49041N6227m39N50869L7312m10923m77116j202445j47109
$$ plain form
7672 -2346203 -1536306 -1613848 -1262387 -843484 -533960 -35010 169430 -11285 -595089 -592167
7662 -592167 -731475 -811013 -397250 -785552 270407 862486 259783 -61661 1003461 808377
7652 808377 630178 359251 -150681 145316 -529372 -881015 -38970 -342534 -367497 -85474
7642 -85474 -782431 -167384 99684 -395712 -954857 -1165161 -299709 572114 -186207 15168
7632 15168 31662 183912 -27147 41282 -488137 -794008 -311823 -125474 -1197987 -585909
7622 -585909 -473326 -513141 -730179 -1189559 -776120 -402971 -1197731 -771508 -691302 -758197
7612 -758197 122121 688026 597976 125322 -233415 -224354 -283692 170340 489509 -300618
7602 -300618 -985813 -4863 -215659 -585251 -868491 -346435 -526756 -1205977 -1432955 -725886
$$ packed form
7672b346203Q09897p7542L51461M18903L09524M98950K04440j80715n83804K922
7662e92167j39308p9538M13763l88302J055959N92079o02703l21444J065122j95084
7652H08377j78199k70927n09932K95997o74688l51643Q42045l03564k4963K82023
7642h5474o96957O15047K67068m95396n59145k10304Q65452Q71823p58321K01375
7632A5168J6494J52250k11059O8429n29419l05871M82185J86349j072513O12078
7622e85909J12583l9815k17038m59380M13439L73149p94760M26223Q0206o6895
7612g58197Q80318N65905r0050m72654l58737R061n9338M54032L19169p90127
7602c00618o85195R80950k10796l69592k83240N22056j80321o79221k26978P07069
$$ plain form
7592 -725886 -20866 -207403 -140892 -235233 -279351 -1054093 69190 564954 -211754 -220229
7582 -220229 -461159 -210447 -563083 204319 269129 -10622 850055 -261562 -336052 179792
7572 179792 643719 308063 -528691 -153468 -1182671 -515285 -331318 -47755 -119835 -1077302
7562 -1077302 380054 -1053377 -735377 407544 -328178 -920236 -760026 -728280 -598123
7553 -598123 -346425 -366596 -145864 753775 871540 649916 82888 76439 -259206 -248188
7543 -248188 -614569 -1198560 -102305 -547947 -1492077 -1184201 -1022151 -802371 82200 148065
7533 148065 446152 823167 223005 445167 693151 88206 -418322 -593419 -441723 -685450
7523 -685450 -861444 -972412 -568218 -1042538 -976928 360081 1040937 -613890 -1058932 -1102512
$$ packed form
7592g25886P05020j86537O6511r4341m4118p74742J123283M95764p76708q475
7582b20229k40930K50712l52636P67402O4810k79751Q60677j111617p4490N15844
7572A79792M63927l35656q36754L75223j029203O67386J83967K83563p2080r57467
7562a077302J457356j433431L18000J142921p35722n92058J60210L1746J30157
7553e98123K51698k0171K20732Q99639J17765k21624n67028o449l35645J1018
7543b48188l66381n83991J096255m45642r44130L07876J62050K19780Q84571O5865
7533A48065K98087L77015o00162K22162K47984o04945n06528j75097J51696k43727
7523f85450j75994j10968M04194m74320O5610J337009O80856j654827m45042m3580
$$ plain form
7513 -1102512 -1842629 -1499235 -1013335 -130881 166811 -1554091 -1157655 -267414 -1125563
7504 -1125563 -121725 -456095 -355210 -293626 147293 131625 -354393 -411886 -983321 -282867
7494 -282867 -137266 -285407 -133047 -307041 -548395 -179883 375552 399868 -92875 -908558
7484 -908558 -823545 -384896 -267249 -22566 193337 -256184 781085 164759 429788 86136
7474 86136 -612458 -632454 -1250837 -1163555 -654194 -1003559 -132681 770341 318149 198576
7464 198576 -705321 -587717 -1409134 -1530822 -854887 -579548 -158964 -115132 288958 -2972
7454 -2972 252445 -865942 -838294 1043019 621701 431635 947956 453187 536037 907797
7444 907797 607493 -336350 -360973 -821454 -712602 -612853 -522872 56221 -331846 -9574
$$ packed form
7513a102512p40117L43394M85900Q82454K97692j720902L96436Q90241q58149
7504a125563J003838l34370J00885O1584M40919j5668m86018n7493n71435P00454
7494b82867J45601j48141J52360j73994k41354L68512N55435K4316m92743q15683
7484i08558Q5013M38649J17647K44683K15903m49521J037269o16326K65029l43652
7474H6136o98594j9996o18383Q7282N09361l49365Q70878R03022m52192j19573
7464A98576r03897J17604q21417j21688O75935K75339M20584M3832M04090k91930
7454b972K55417j118387K7648J881313m21318j90066N16321m94769Q2850L71760
7444I07797l00304r43843k4623m60481J08852R9749Q9981N79093l88067L22272
$$ plain form
7434 -9574 244879 -486660 -1046402 -467793 981966 789774 277140 -737955 -795910 293070
7424 293070 -672285 -153139 89943 63741 398219 780205 161438 -3896 278520 -657550
7414 -657550 -334168 39260 -61906 -294981 -21476 -232480 -246477 769329 501401 409221
7404 409221 909326 2024376 1426599 862654 1073950 -173966 -348043 -48241 -986409
7395 -986409 207661 595999 614059 461958 -128036 14602 -447182 -769311 541898 470049
7385 470049 534107 531554 106049 184964 114558 -54815 -1260673 -909959 -199698 139601
7375 139601 179202 611410 1149885 -281104 -1051974 -338874 -262507 -771223 -507753 12148
7365 12148 315908 1147111 620487 -67150 -1171206 -633966 -39055 -311837 -91531 -594877
$$ packed form
7434i574K54453p31539n59742N78609J449759j92192n12634j015095n7955J088980
7424B93070r65355N19146K43082k6202L34478L81986o18767j65334K82416r36070
7414f57550L23382L73428j01166k33075K73505k11004j3997J015806k67928r2180
7404D09221N00105J115050n97777n63945K11296j247916j74077K99802r38168
7395i86409J194070L88338J8060j52101n89994J42638m61784l22129J311209p1849
7385D70049O4058k553m25505P8915p0406j69373j205858L50714P10261L39299
7375A39601L9601M32208N38475j430989p70870P13100P6367n08716K63470N19901
7365A2148L03760Q31203n26624o87637j104056N37240N94911k72782K20306n03346
$$ plain form
7355 -594877 3211 -241653 -29153 -198126 -485691 -771275 -386873 -580227 -550849 110752
7345 110752 373943 -142253 -775813 -514532 288724 -185462 87289 9320 -376163 -615202
7335 -615202 -1071407 -988801 277088 124344 686803 907129 225694 427090 1168365 135575
7325 135575 -1375679 -25130 606712 49984 -366075 -272187 -238155 -138888 -1576542 -1079360
7315 -1079360 -81282 1024319 1063844 -588474 -711005 -8417 -172651 509170 -362920
7306 -362920 -214313 180173 -119048 -902342 -679493 -627597 -131102 -678144 -429255 44161
7296 44161 77161 690654 625686 797829 247954 341866 -266354 -1028118 -123457 311858
7286 311858 -692242 -492322 -343218 416253 61312 -202541 -686368 -456314 -14061 -695667
$$ packed form
7355e94877N98088k44864K12500j68973k87565k85584L84402j93354K9378O61601
7345A10752K63191n16196o33560K61281Q03256m74186K72751p7969l85483k39039
7335f15202m56205Q2606J265889j52744N62459K20326o81435K01396P41275j032790
7325A35575j511254J350549O31842n56728m16059R3888L4032R9267j437654M97182
7315a079360R98078J105601L9525j652318j22531P02588j64234O81821q72090
7306c62920J48607L94486k99221p83294K22849N1896M96495n47042K48889M73416
7296D4161L3000O13493o4968J72143n49875R3912o08220p61764R04661M35315
7286C11858j004100J99920J49104P59471l54941k63853m83827K30054M42253o81606
$$ plain form
7276 -695667 -24915 180544 -646672 -1165137 -1002890 -682313 -500053 -852737 -172327 -236773
7266 -236773 575138 702262 429368 -93982 694416 1139998 683600 894511 192119 -1041601
7256 -1041601 -624632 -700771 -306721 494189 -400537 444998 286129 -819611 29139 211001
7246 211001 -207207 -336728 -1302142 -582308 4727 -902146 -632349 -576372 -877708 -871731
7236 -871731 213234 2434 327698 363046 -191664 219395 -39813 -589046 -959300 -352492
7226 -352492 315615 457041 -378224 -429325 -743993 38458 -482944 -506943 -297229 -1124182
7216 -1124182 -729540 -923777 -1074406 -473305 -936213 -284624 -111775 7799 147068 52502
7206 52502 304805 822045 467699 -184596 -354739 -264507 63629 201656 -649410 -1194013
$$ packed form
7276f95667O70752K05459q27216n18465J62247L20577J82260l52684O80410o4446
7266b36773Q11911J27124k72894n23350P88398M45582m56398K10911p02392j233720
7256a041601M16969p6139L94050Q00910q94726Q45535j58869j105740Q48750J81862
7246B11001m18208j29521r65414P19834N87035r06873K69797N5977l01336N977
7236h71731J084965k10800L25264L5348n54710M11059k59208n49233l70254O06808
7226c52492O68107J41426q35265n1101l14668P82451n21402k3999K09714q26953
7216a124182L94642j94237j50629O01101m62908O51589J72849J19574J39269r4566
7206E2502K52303N17240l54346o52295j70143R0232L28136J38027q51066n44603
$$ plain form
7196 -1194013 -515866 -850449 -1477475 -437020 187660 93449 350189 469557 -350832 -264753
7186 -264753 -207605 33554 -715531 -1190363 -103641 -487633 -1131183 -414045 179558 -689567
7176 -689567 -146308 -562720 -696324 520073 1091905 555365 483578 323225 -92608 473323
7166 473323 589662 184004 -62953 -113099 -947705 -613191 24366 -662890 -608453 548836
7156 548836 427470 760514 935129 -89039 -442135 -35216 -52497 -662046 229067 -22707
7146 -22707 -587524 -1138267 -724221 -266554 125415 170171 327232 439653 166745 638291
7136 638291 -19734 -562914 -634988 -691003 -414372 -76570 -133407 -649114 -914155 -1259968
7126 -1259968 -867253 -930062 -1605260 -1634586 -1211653 -134155 -173952 -971750 -1050628 -1317175
$$ packed form
7196a194013O78147l34583o27026J040455O24680r4211K56740J19368q20389Q6079
7186b64753N7148K41159p49085m74832J086722l83992o43550P17138N93603q69125
7176f89567N43259m16412j33604J216397N71832n36540p1787j60353m15833N65931
7166D73323J16339m05658k46957n0146q34606L34514O37557o87256N4437J157289
7156E48836j21366L33044J74615j024168l53096M06919j7281o09549Q91113k51774
7146b2707n64817n50743M14046M57667L91969M4756J57061J12421k72908M71546
7136F38291o58025n43180p2074n6015K76631L37802n6837n15707k65041l45813
7126a259968L92715o2809o75198k9326M22933J077498l9797p97798p8878k66547
$$ plain form
7116 -1317175 -1191045 -678921 647668 -219833 -904827 -755197 -771156 -488369 218934 -117127
7106 -117127 -820138 -305915 -519622 -961454 -837989 -1064955 -969079 -152769 -509051 193583
7096 193583 440615 332702 256155 369740 81802 374094 149405 -182689 174669 -702168
7086 -702168 -638665 126182 -699458 -358310 -53593 -187801 -114974 -178468 -831588 366136
7076 366136 902205 331957 374510 -738117 -593596 661322 47309 -343004 820824
7067 820824 1132458 1223454 -389176 467266 1127142 152270 -870590 -561927 -1157140 -1208449
7057 -1208449 -367514 -815736 -297773 -1074553 -628620 164548 10691 -330391 140412 -358625
7047 -358625 -310590 -747305 -1350827 -486107 542394 49896 974521 496372 -78495 332086
$$ packed form
7116a317175J26130N12124J326589q67501o84994J49630j5959K82787P07303l36061
7106a17127p03011N14223k13707m41832J23465k26966R5876Q16310l56282P02634
7096A93583K47032j07913p6547J13585k87938K92292k24689l32094L57358q76837
7086g02168O3503P64847q25640L41148L04717j34208P2827o3494o53120J197724
7076C66136N36069n70248M2553j112627J44521J254918o14013l90313J163828
7067H20824L11634R0996j612630Q56442O59876r74872j022860L08663n95213n1309
7057a208449Q40935m48222N17963p76780M45933P93168j53857l41082M70803m99037
7047c58625M8035m36715o03522Q64720J028501m92498R24625m78149n74867M10581
$$ plain form
7037 332086 579750 21879 -1021266 -726261 -601521 -571222 -323076 -632954 -698021 404987
7027 404987 160396 -497614 -708333 -152234 -347128 -667439 -938565 -1180083 -635085 -313330
7017 -313330 -1414139 -1018992 -1457883 -1082764 -336320 -662863 96376 -149216 -406621 -75115
7007 -75115 -339012 151064 353422 443152 -180483 94368 -789588 126682 257348 -1113700
6997 -1113700 -1450064 -865554 -1773141 -814555 121422 -796920 -135566 65248 82317 32242
6987 32242 246775 -60312 -954655 -958324 -89019 -31289 -122380 -95368 -218704 58160 558292
6976 558292 -875145 -1100530 48017 -79002 -459937 -357850 -429578 -187500 -443137 -377440
6966 -377440 -310764 -566531 -1287137 -194325 -173507 -590131 368177 471355 -249367 -168028
$$ packed form
7037C32086K47664n57871j043145K95005J24740L0299K48146l09878o5067J103008
7027D04987k44591o58010k10719N56099j94894l20311k71126k41518N44998L21755
7017c13330j100809L95147m38891L75119P46444l26543P59239k45592k57405L31506
7007g5115k63897M90076K02358Q9730o23635K74851q83956R16270J30666j371048
6997a113700l36364N84510r07587R58586R35977r18342O61354K00814J7069n0075
6987C2242K14533l07087q94343l669Q69305N7730r1091K7012j23336K76864N00132
6976E58292j433437k25385J148547j27019l80935J02087p1728K42078k55637O5697
6966c77440O6676k55767p20606J092812K0818m16624R58308J03178p20722Q1339
$$ plain form
6956 -168028 219600 577867 335135 602825 936981 703107 -625743 -491105 -751253 524017
6946 524017 1033691 386120 171423 -217854 946292 94009 213528 359876 1045431 784134
6936 784134 239627 -72840 852205 328050 370936 764975 560326 -102439 -616983 -340355
6926 -340355 588239 1256608 -28719 274629 157010 -325139 105374 -132596 840392 153688
6916 153688 203281 1664671 812997 518415 907264 2210920 2561793 1630358 515071
6907 515071 863170 1351618 2203398 1954504 927413 1686156 2101639 625066 1000668
6898 1000668 659053 -191814 -387569 92313 -264547 739658 889362 34750 -514959
6889 -514959 -147620 -198774 108934 676895 422162 -304889 -1010083 -932044 -1163850 -279733
$$ packed form
6956a68028L87628L58267k42732K67690L34156k33874j328850J34638k60148J275270
6946E24017N09674o47571k14697l89277J164146q52283J19519J46348O85555k61297
6936G84134n44507l12467R25045n24155M2886L94039k04649o62765n14544K76628
6926c40355R28594O68369j285327L03348j17619m82149M30513k37970R72988o86704
6916A53688M9593J461390q51674k94582L88849J303656L50873r31435j115287
6907E15071L48099M88448Q51780k48894j027091P58743M15483j476573L75602
6898A000668l41615q50867j95755M79882l56860J004205J49704q54612n49709
6889e14959L67339n1154L07708N67961k54733p27051p05194P8039k31806Q84117
$$ plain form
6879 -279733 -980962 -1342358 -780307 -387051 -461083 -561371 -292866 -195966 38384 -38460
6869 -38460 275489 232091 96935 17896 -1256458 -98615 -625959 -443039 -61929 -334942
6859 -334942 -65579 499876 337685 719447 816192 -191088 -204955 -645020 -1354445 -22635
6849 -22635 582574 720121 758328 632751 467735 186004 250186 -468856 138483 290278
6839 290278 332770 370367 -204673 550744 556250 611308 450924 -260914 -230354 -344258 -425441
6828 -425441 -404665 444539 125186 -819725 -1182241 -1124286 -701158 -373174 382599 1184260
6818 1184260 129567 -1006155 -855917 -230493 -647141 -1218445 -636497 -157353 -593977
6809 -593977 -1045267 -1040357 -805890 -1340147 -634943 -1051374 -714996 -44233 -793135 -531282
$$ packed form
6879b79733p01229l61396N62051L93256p4032j00288K68505R6900K34350p6844
6869c8460L13949m3398j35156p9039j274354J157843n27344J82920L81110k73013
6859c34942K69363N65455j62191L81762R6745j007280j3867m40065p09425J331810
6849b2635O05209J37547L8207j25577j65016k81731O4182p19042O07339J51795
6839B90278M2492L7597n75040P55417N506N5058j60384p11838L0560j13904q1183
6828d25441K0776Q49204l19353r44911l62516N7955M23128L27984P55773Q01661
6818A184260j054693j135722J50238O25424m16648n71304N81948M79144m36624
6809e93977m51290M910K34467n34257P05204m16431L36378O70763p48902K61853
$$ plain form
6799 -531282 -298897 17044 452697 394376 -433403 -547303 -936344 -603645 -196177 -724405
6789 -724405 -262456 21110 -19990 691772 -226813 -366435 391235 -174875 -429895 -187083
6779 -187083 -636654 -1058828 -457444 -354129 -586550 119034 -793193 -722251 58000 -788695
6769 -788695 -499139 -274604 -615729 -1212 33869 -309026 -519028 -649620 -1284864 -615514
6759 -615514 372967 566482 -256865 -565245 -653886 -3771 1006808 1202722 608612 -350674
6749 -350674 -287787 -522107 345309 849159 -62722 -222432 -705507 -696967 -732272 -259180
6739 -259180 533696 30226 -92261 -441207 244993 110820 815574 333318 -481399 -111397
6729 -111397 947291 296176 259470 298472 483391 968607 406912 109366 582796 1173755
$$ packed form
6799e31282K32385L15941M35653n8321q27779j13900l89041L32699M07468n28228
6789g24405M61949K83566m1100P11762r18585j39622P57670n66110k55020K42812
6779a87083m49571m22174O01384J03315k32421P05584r12227P0942P80251q46695
6769g88695K89556K24535l41125O14517L5081l42895k10002j30592o35244O69350
6759f15514R88481J93515q23347l08380q8641O50115J010579J95914n94110r59286
6749c50674O2887k34320Q67416N03850r11881j59710m83075Q540l5305M73092
6739b59180P92876n03470j22487l48946O86200j34173P04754m82256q14717L70002
6729a11397J058688o51115l6706L9002J84919M85216n61695k97546M73430N90959
$$ plain form
6719 1173755 933539 1488509 -317335 -1055690 15025 177671 389222 594412 -307807
6710 -307807 -156172 -238267 -257113 299110 -334904 -193956 -256303 181941 -230879 -472849
6700 -472849 -1543923 -1354103 -825708 -87797 654559 1090428 425434 482480 599133 -20977
6690 -20977 934350 -172495 -1155657 -750461 -238252 709718 616733 370792 143745 -163831
6680 -163831 213725 -112563 78937 159715 -174114 -1232328 -124603 -247826 -744591 -203518
6670 -203518 447314 -249651 -1347893 -1551837 -1090760 -1531265 -1099797 -682071 109277 -78935
6660 -78935 -464109 -936276 -760029 -158805 -232915 -329978 -635586 104757 310332 -644764
6650 -644764 -809056 -1058440 -747054 -457416 -467763 -981938 -1550773 -930780 -392924 -28688
$$ packed form
6719A173755k40216N54970j805844p38355J070715J62646K11551K05190r02219
6710c07807J51635q2095j8846N56223o34014J40948o2347M38244m12820k41970
6700d72849j071074J89820N28395P37911P42356M35869o64994N7046J16653o20110
6690b0977R55327j106845r83162M05196N12209R47970r2985k45941k27047l07576
6680a63831L77556l26288J91500Q0778l33829j058214J107725j23223m96765N41073
6670b03518O50832o96965j098242k03944M61077m40505M31468M17726P91348j88212
6660g8935l85174m72167J76247O01224p4110r7063l05608P40343K05575r55096
6650f44764j64292k49384L11386K89638j0347n14175n68835O19993N37856L64236
$$ plain form
6640 -28688 27828 357661 153570 -228483 -343665 -463318 -879478 183743 257759 -579048
6630 -579048 -1255071 -872081 -355284 -38250 -102296 246 -465745 -278184 -441986 -381574
6620 -381574 -547729 -226318 349995 -1231748 -1347813 -467151 -1552887 -1117623 -902493
6611 -902493 -473103 -481851 -771419 -854087 -16191 -624764 -424490 2295 83100 -81799
6601 -81799 -76226 -106965 -547380 161776 953343 596187 120985 838325 649379 453276
6591 453276 182840 252524 -679637 -83675 -685913 -754488 -638991 -650666 -569066 -553566 -558366
6580 -558366 -259483 -274709 197883 -44503 -1426229 -1020691 -1162318 -588444 -92526 -464966
6570 -464966 -1094785 -160319 371252 -628934 -872899 -1678107 -1617861 -1033222 -953111 -754016
$$ packed form
6640b8688N6516L29833k04091l82053j15182j19653m16160J063221P4016q36807
6630e79048o76023L82990N16797L17034o4046J02542m65991J87561j63802O0412
6620c81574j66155L21411N76313j581743j16065Q80662j085736M35264K15130
6611i02493M29390q748k89568q2668Q37896o08573K00274M26785Q0805j64899
6601h1799N573l0739m40415P09156P91567l57156m75202P17340j88946j96103
6591D53276k70436O9684r32161N95962o02238o8575J15497j1675Q1600J5500m800
6580e58366K98883j5226M72592k42386j381726M05538j41627N73874M95918l72440
6570d64966o29819R34466N31571j000186k43965q05208O0246N84639Q0111J99095
$$ plain form
6560 -754016 -533017 231696 -304382 -554945 509475 611131 243240 -51227 194530 415177
6550 415177 1194561 498977 111362 -512930 -79448 -47388 -741431 51442 721351 -622237
6540 -622237 -858652 -638917 -900187 -578704 -513659 -209150 -676162 -550954 329845 -318597
6530 -318597 243360 106432 -189833 -719771 -68278 130569 -911506 -672847 -124565 -130276
6520 -130276 -779244 -980957 -526082 448354 325890 254528 203072 -534774 -728091 -226221
6510 -226221 -529035 -426028 -1085621 -553480 -561946 -113707 -663026 93340 -470381 -511947
6500 -511947 -543960 -718302 -396959 -774323 186523 551102 314521 -362802 -772112 -777278
6490 -777278 -493551 -200013 54189 -807285 -1489216 -1356066 -91052 254943 -717017 -321655
$$ packed form
6560g54016K20999P64713n36078k50563J064420J01656l67891k94467K45757K20647
6550D15177P79384o95584l87615o24292M33482L2060o94043P92873O69909j343588
6540f22237k36415K19735k61270L21483O5045L04509m67012J25208Q80799o48442
6530c18597N61957j36928k96265n29938O51493J98847j042075K38659N48282n711
6520a30276o48968k01713M54875R74436j22464p1362n1456p37846j93317N01870
6510b26221l02814J03007o59593N32141q466M48239n49319P56366n63721m1566
6500e11947l2013j74342L21343l77364R60846L64579k36581o77323m09310n166
6490g77278K83727K93538K54202q61474o81931J33150J265014L45995r71960L95362
$$ plain form
6480 -321655 62670 -163150 -727586 -795112 -101075 -924043 -1072739 331065 888645 59072
6470 59072 -1115230 -643261 165621 -722735 -593619 -159880 -232561 -165303 400268 -772479
6460 -772479 1714 432565 -250529 -420513 -185146 132738 -780036 -630818 -1165565 -1269722
6450 -1269722 42399 473696 -120316 492399 245182 -1092502 -738597 -478035 -1299242
6441 -1299242 -558208 -582339 356164 754625 53768 293670 145044 23688 -111155 -511127
6431 -511127 -1191299 -1067464 473443 -143596 286572 -197638 -1449893 -1005987 -189740
6422 -189740 -418363 -516247 -458633 -664511 -671345 -394103 -226948 -268177 177902 454334 -577153
6411 -577153 597505 4558 -640852 36514 -1118016 -197752 -140344 -599317 -62192 272658
$$ packed form
6480c21655L84325k25820n64436o7526O94037q22968j48696J403804N57580q29573
6470E9072j174302M71969Q08882q88356J29116M33739p2681O7258N65571j172747
6460g72479P74193M30851o83094j69984K35367L17884r12774J49218n34747j04157
6450a269722J312121M31297n94012O12715k47217j337684L53905K60562q21207
6441a299242P41034k4131R38503L98461p00857K39902j48626j21356j34843l99972
6431e11127o80172J23835J540907o17039M30168m84210j252255M43906Q16247
6422a89740k28623r7884N7614k05878o834K77242J67155m1229M46079K76432j031487
6411e77153J174658n92947o45410O77366j154530R20264N7408m58973N37125L34850
$$ plain form
6401 272658 332049 1400970 996566 405368 -176956 13133 -115432 -58572 -404482 -27236
6391 -27236 -158979 579742 159135 566968 613354 869139 -629330 -861127 -671845 -364180
6381 -364180 -223725 -701361 -490019 -705704 151712 -580677 -936882 -218758 -122442 -526211
6371 -526211 1052875 -176581 -381057 122881 53644 -962757 -509238 -190638 -1151102
6362 -1151102 -858824 -280372 -84418 -535900 -993944 -1013735 -1039513 -11285 167667 -76305
6352 -76305 -299909 -505701 -596286 -1004695 -918292 -1446820 -845499 -167638 -456036 -818216
6342 -818216 -340822 -321368 -591322 -358306 -270091 -677702 -603673 400475 -30896 -936937
6332 -936937 -798851 -768076 -167758 -597266 879903 -372852 -1502101 -498792 -564579
$$ packed form
6401B72658N9391J068921m04404n91198n82324J90089j28565N6860l45910L77246
6391b7236j31743P38721m20607M07833M6386K55785j498469k31797J89282L07665
6381c64180J40455m77636K11342k15685Q57416p32389l56205P18124R6316m03769
6371e26211J579086j229456k04476N03938o9237j016401M53519L18600r60464
6362a151102K92278N78452J95954m51482m58044j9791k5778J028228J78952k43972
6352g6305k23604k05792r0585m08409Q6403n28528O01321O77861k88398l62180
6342h18216M77394J9454k69954K33016Q8215m07611P4029J004148m31371r06041
6332i36937J38086L0775O00318m29508J477169j252755j129249J003309o5787
$$ plain form
6323 -564579 -376206 -263553 357683 -263883 -80711 393289 -204189 -429981 -975185 -494392
6313 -494392 -543975 -1096170 -1140192 -486702 225615 147384 -58738 -411346 -658666 236437
6303 236437 157513 -213758 480254 -775594 -718610 -504327 -264761 662671 1275563 992801
6293 992801 93053 579748 1100128 1057606 769310 -548916 78428 -445477 -292319 -1098418
6283 -1098418 -1135665 -775561 -425244 -355300 -314005 248332 80402 -166070 144471 -156248
6273 -156248 -256250 116704 855820 167703 -630728 -811069 -742208 -368064 -525368 -1056254
6263 -1056254 -1011558 -1278328 -1148381 -1013196 -831129 -630833 -1064147 444015 19130 101200
6253 101200 -341710 301841 184645 81643 -251948 -235689 -578070 -1731715 -649200 -48508
$$ packed form
6323e64579J88373J12653O21236o21566J83172M74000n97478k25792n45204M80793
6313d94392m9583n52195m4022O53490P12317p8231k06122l52608k47320Q95103
6303B36437p8924l71271O94012j255848N6984K14283K39566R27432O12892k82762
6293I92801q99748M86695N20380m2522k88296j318226O27344n23905J53158q06099
6283a098418l7247L60104L50317O9944M1295N62337j67930k46472L10541l00719
6273a56248j00002L72954P39116o88117p98431j80341O8861L74144j57304n30886
6263a056254M4696k66770J29947J35185J82067K00296m33314J508162m24885Q2070
6253A01200m42910O43551j17196j03002l33591J6259l42381j153645J082515O00692
$$ plain form
6243 -48508 32889 588053 436141 139240 -406182 -876363 -949400 -1147546 -900649 -207881
6233 -207881 -242995 125274 1038802 738117 244928 -23239 -42724 1037724 706667 850412
6223 850412 453562 427084 115958 -721056 -768324 -958474 -818800 -974313 -969581 -690343
6213 -690343 236284 327214 -572558 -508958 -507548 -457791 -2165 -94710 -1681511 -1395948 -50965
6202 -50965 -653184 -937817 -475459 -354529 -345866 -64820 -48567 -71853 389963 -639876
6192 -639876 -1220780 -1627664 -1357088 -1065157 -1357339 -350411 -592229 -841147 -291355 64207
6182 64207 123138 238515 -298431 -127144 -72594 165874 289008 74866 146065 7048
6172 7048 -208396 55210 -474396 -727146 -831292 -462402 -698397 -133646 -530926 -265527
$$ packed form
6243d8508Q1397N55164j51912k96901n45422m70181p3037j98146K46897O92768
6233b07881l5114L68269R13528l00685m93189k68167j9485J080448l31057J43745
6223H50412l96850k6478l11126q37014m7268j90150J39674j55513M732K79238
6213f90343R26627R0930q99772O3600J410M9757M55626r2545j586801K85563J344983
6202e0965o02219k84633M62358J20930Q663K81046J6253k3286M61816j029839
6192f39876n80904m06884K70576K91931k92182J006928k41818k48918N49792L55562
6182F4207N8931J15377n36946J71287N4550K38468J23134k14142P1199j39017
6172G048k15444K63606n29606k52750j04146L68890k35995N64751l97280K65399
$$ plain form
6162 -265527 -132330 -142880 -460720 226325 -338477 -311805 152763 -1493347 -987928 -568738
6152 -568738 -960196 -812106 571184 1030044 -49039 -1084091 -329864 -647193 -47346
6143 -47346 571193 -58655 -240755 -206974 430425 323409 439698 762994 -400943 -496088
6133 -496088 -163376 -343204 -893912 -1678238 -939871 -16391 -234256 -346091 261291 -502384
6123 -502384 -571456 424865 635839 315358 273379 294482 414279 254994 -262054 -496903
6113 -496903 -469084 96880 -574015 -454869 -1050562 -406269 293177 -56360 -214641 -178941
6103 -178941 -348822 -202468 -511869 -643796 -417073 -753979 -593113 -284155 -747233 -1189273
6093 -1189273 -852229 -308949 -761162 -193154 172738 393764 475233 677902 683622 509552
$$ packed form
6162b65527J33197j0550l17840O87045n64802K6672M64568j646110N05419M19190
6152e68738l91458J48090J383290M58860j079083j035052P54227l17329N99847
6143d7346O18539o29848j82100L3781O37399j07016J16289L23296j163937r5145
6133d96088L32712j79828n50708p84326P38367R23480k17865j11835O07382p63675
6123e02384o9072R96321K10974l20481m1979K1103J19797j59285n17048k34849
6113d96903K7819N65964o70895J19146n95693O44293O99446l49537j58281L5700
6103a78941j69881J46354l09401j31927K26723l36906J60866L08958m63078m42040
6093a189273L37044N43280m52213N68008L65892K21026Q1469K02669N720j74070
$$ plain form
6083 509552 615879 301093 769777 682517 -19052 -276524 52974 -1123397 -934171 -117887
$$ packed form
6083E09552J06327l14786M68684q7260p01569k57472L29498j176371J89226Q16284
$$ [...]
##END NTUPLES=NMR SPECTRUM
##END=
