##TITLE=1H_CA-9240-1
 CDCl3
 8 sc, 
 9.2.2024
##JCAMPDX= 6.0         $$ Bruker NMR JCAMP-DX V2.0
##DATA TYPE= NMR SPECTRUM
##DATA CLASS= NTUPLES
##ORIGIN= UXNMR, Bruker Analytische Messtechnik GmbH
##OWNER= root
$$ XWIN-NMR		Version 3.5
$$ Fri Feb  9 14:11:35 2024 Russian Standard Time (UT+4h)  she@DPX200
##.OBSERVE FREQUENCY= 200.1313
##.OBSERVE NUCLEUS= ^1H
##.ACQUISITION MODE= SIMULTANEOUS
##.ACQUISITION SCHEME= undefined
##.AVERAGES= 8
##.DIGITISER RES= 18
##SPECTROMETER/DATA SYSTEM= spect
##.PULSE SEQUENCE= zg30
##.SOLVENT NAME= DMSO
##.SHIFT REFERENCE= (INTERNAL, DMSO, 0, 15.6532)
##AUDIT TRAIL= $$ (NUMBER, WHEN, WHO, WHERE, WHAT)
$$ ##TITLE= Audit trail, XWIN-NMR		Version 3.5
$$ ##JCAMPDX= 5.01
$$ ##ORIGIN= Bruker BioSpin GmbH
$$ ##OWNER= she
$$ F:/spectra/data/she/nmr/H-F/1/pdata/1/auditp.txt
$$ ##AUDIT TRAIL=  $$ (NUMBER, WHEN, WHO, WHERE, WHAT)
(   1,<2024-02-09 14:09:56.95 +0400>,<she>,<DPX200>,
      <created by zg, POWCHK disabled, PULCHK disabled
       configuration hash MD5:
       00 E9 B6 7A A2 85 ED C7 34 08 36 98 17 FE 4E 26
       data hash MD5: 16K
       37 51 3F AD 96 C4 59 41 A3 07 52 5C 78 F8 3C A9>)
(   2,<2024-02-09 14:09:59.14 +0400>,<she>,<DPX200>,
      <Start of raw data processing
       efp BC_mod = 2 LB = 0.24 FT_mod = 6 PKNL = 1 PHC0 = -24593.11 PHC1 = 12.45267 SI = 16K 
       data hash MD5: 16K
       59 28 16 95 82 92 39 E2 26 C2 DC C4 9C B5 CB 0D>)
(   3,<2024-02-09 14:10:15.90 +0400>,<she>,<DPX200>,
      <pk PHC0 = 1.18581 PHC1 = -2.2 
       data hash MD5: 16K
       23 F1 94 29 2B FC D9 10 BE AF 50 BA 7C 64 6C C2>)
(   4,<2024-02-09 14:10:19.42 +0400>,<she>,<DPX200>,
      <abs ABSG = 5 
       data hash MD5: 16K
       AF 33 1F B2 C3 C7 9F D5 2A 4D 7E 5B F4 37 13 A0>)
$$ ##END=
$$ 
$$ hash MD5
$$ 1A 16 CD 38 3C B6 07 DD D3 5F 5B 40 FE 81 D1 53
##$RELAX= 
##$RELAX= 
##$RELAX= 
##$RELAX= 
##$RELAX= 
##$RELAX= 
$$ Bruker specific parameters
$$ --------------------------
##$DU= <F:/spectra>
##$EXPNO= 1
##$NAME= <H-F>
##$PROCNO= 1
##$TYPE= <nmr>
##$USER= <she>
##$AMP= (0..31)
100 100 100 100 100 100 100 100 100 100 100 100 100 100 100 100 100 100 
100 100 100 100 100 100 100 100 100 100 100 100 100 100 
##$AQSEQ= 0
##$AQ_mod= 1
##$AUNM= <au_zg>
##$AUTOPOS= <>
##$BF1= 200.13
##$BF2= 200.13
##$BF3= 200.13
##$BF4= 200.13
##$BF5= 200.13
##$BF6= 200.13
##$BF7= 200.13
##$BF8= 200.13
##$BYTORDA= 1
##$CFDGTYP= 0
##$CFRGTYP= 5
##$CHEMSTR= <none>
##$CNST= (0..31)
1 1 145 1 1 1 1 1 1 1 1 1 1 1 1 1 1 1 1 1 1 1 1 1 1 1 1 1 1 1 1 1 
##$CPDPRG= <>
##$CPDPRG1= <>
##$CPDPRG2= <>
##$CPDPRG3= <>
##$CPDPRG4= <mlev>
##$CPDPRG5= <mlev>
##$CPDPRG6= <mlev>
##$CPDPRG7= <mlev>
##$CPDPRG8= <mlev>
##$CPDPRGB= <>
##$CPDPRGT= <>
##$D= (0..31)
0 1.2 0 0 0 0 0 0 0 0.06 0 0.03 0 0 0 0 0.0002 0 0 0 0 0 0 0 0 0 0 0 0 
0 0 0 
##$DATE= 1707473396
##$DBL= (0..7)
120 120 120 120 120 120 120 120 
##$DBP= (0..7)
150 150 150 150 150 150 150 150 
##$DBP07= 0
##$DBPNAM0= <>
##$DBPNAM1= <>
##$DBPNAM2= <>
##$DBPNAM3= <>
##$DBPNAM4= <>
##$DBPNAM5= <>
$$ [...]
##$SUBNAM3= <"">
##$SUBNAM4= <"">
##$SUBNAM5= <"">
##$SUBNAM6= <"">
##$SUBNAM7= <"">
##$SUBNAM8= <"">
##$SUBNAM9= <"">
##$SW= 18.0517328524113
##$SWIBOX= (0..15)
0 0 2 0 0 0 0 0 0 0 0 0 0 0 0 0 
##$SW_h= 3612.71676300578
##$TD= 16384
##$TD0= 1
##$TE= 0
##$TE2= 300
##$TE3= 300
##$TEG= 300
##$TL= (0..7)
0 120 120 120 120 120 120 120 
##$TP= (0..7)
150 150 150 150 150 150 150 150 
##$TP07= 0
##$TPNAME0= <>
##$TPNAME1= <>
##$TPNAME2= <>
##$TPNAME3= <>
##$TPNAME4= <>
##$TPNAME5= <>
##$TPNAME6= <>
##$TPNAME7= <>
##$TPOAL= (0..7)
0.5 0.5 0.5 0.5 0.5 0.5 0.5 0.5 
##$TPOFFS= (0..7)
0 0 0 0 0 0 0 0 
##$TUNHIN= 0
##$TUNHOUT= 0
##$TUNXOUT= 0
##$USERA1= <user>
##$USERA2= <user>
##$USERA3= <user>
##$USERA4= <user>
##$USERA5= <user>
##$V9= 5
##$VALIST= <valist>
##$VCLIST= <CCCCCCCCCCCCCCC>
##$VD= 0
##$VDLIST= <DDDDDDDDDDDDDDD>
##$VPLIST= <PPPPPPPPPPPPPPP>
##$VTLIST= <TTTTTTTTTTTTTTT>
##$WBST= 1024
##$WBSW= 4
##$XGAIN= (0..3)
0 0 0 0 
##$XL= 0
##$YL= 0
##$YMAX_a= 65371
##$YMIN_a= -84721
##$ZGOPTNS= <>
##$ZL1= 120
##$ZL2= 120
##$ZL3= 120
##$ZL4= 120
##$ABSF1= 15.48136
##$ABSF2= -2.570489
##$ABSG= 5
##$ABSL= 3
##$ALPHA= 0
##$AQORDER= 0
##$ASSFAC= 0
##$ASSFACI= 0
##$ASSFACX= 0
##$ASSWID= 0
##$AUNMP= <proc_1d>
##$AZFE= 0.1
##$AZFW= 0.1
##$BCFW= 0
##$BC_mod= 2
##$BYTORDP= 0
##$COROFFS= 0
##$CY= -3
##$DATMOD= 1
##$DC= 0
##$DFILT= <>
##$DTYPP= 0
##$F1P= 0
##$F2P= 0
##$FCOR= 1
##$FTSIZE= 16384
##$FT_mod= 6
##$GAMMA= 0
##$GB= 0
##$INTBC= 1
##$INTSCL= 3.70164e-10
##$ISEN= 128
##$LB= 0.24
##$LEV0= 0
##$LPBIN= 0
##$MAXI= 10000
##$MC2= 0
##$MEAN= 0
##$ME_mod= 0
##$MI= 1.114404
##$NCOEF= 0
##$NC_proc= -9
##$NLEV= 6
##$NOISF1= 3.799351
##$NOISF2= 2.8
##$NSP= 0
##$NTH_PI= 0
##$NZP= 0
##$OFFSET= 15.65324
##$PC= 1
##$PHC0= -24591.92
##$PHC1= 10.25267
##$PH_mod= 1
##$PKNL= yes
##$PPARMOD= 0
##$PSCAL= 0
##$PSIGN= 0
##$REVERSE= no
##$SF= 200.129973676546
##$SI= 16384
##$SIGF1= 3
##$SIGF2= 2
##$SINO= 5.538805
##$SIOLD= 16384
##$SREGLST= <1H.CDCl3>
##$SSB= 0
##$STSI= 16384
##$STSR= 0
##$SW_p= 3612.71676300578
##$SYMM= 0
##$S_DEV= 0
##$TDeff= 16384
##$TDoff= 0
##$TI= <>
##$TILT= no
##$TM1= 0
##$TM2= 0
##$TOPLEV= 0
##$USERP1= <user>
##$USERP2= <user>
##$USERP3= <user>
##$USERP4= <user>
##$USERP5= <user>
##$WDW= 1
##$XDIM= 16384
##$YMAX_p= 435408949
##$YMIN_p= -2627189
$$ End of Bruker specific parameters
$$ ---------------------------------
##NTUPLES= NMR SPECTRUM
##VAR_NAME=  FREQUENCY,     SPECTRUM/REAL,   SPECTRUM/IMAG
##SYMBOL=    X,             R,               I
##VAR_TYPE=  INDEPENDENT,   DEPENDENT,       DEPENDENT
##VAR_FORM=  AFFN,          ASDF,            ASDF
##VAR_DIM=   16384,         16384,           16384
##UNITS=     HZ,            ARBITRARY UNITS, ARBITRARY UNITS
##FACTOR=    0.220516191357247, 1,           1
##FIRST=     3132.68254995064, 0,            0
##LAST=      -480.034213055143, 0,           0
##MIN=       -480.034213055143, -2627189,    0
##MAX=       3132.68254995064, 435408949,    0
$$ Real data points
##PAGE= N=1
##DATA TABLE= (X++(R..R)), XYDATA
$$ [...]
$$ plain form
11763 9312898 9304269 9430436 9229744 9197406 8839401 7742800 7062793 6537533 7251778 7082893
11753 7082893 6280625 7047725 7460725 6777649 6510583 6341712 5595924 6325999 5951734
11744 5951734 5483597 5036311 6141637 6063936 5505922 4786361 4400839 4401010 5184436 4905937
11734 4905937 4397962 5006943 5253985 4531895 4500366 4673615 4172119 3689852 4015974 4447761
11724 4447761 4375078 3656718 3178053 3477799 3187700 3340876 3326207 3526433 3597229 3436402
11714 3436402 3855144 3165920 3543173 3983998 4122073 4161001 3503664 2573357 2711555 3464403
11704 3464403 3332881 3937380 4327570 4301501 4502649 4372473 2762302 2666432 2939137 2629544
11694 2629544 2526266 2014181 1559268 2056234 2168791 3325197 2930558 2403306 2050186
$$ packed form
11763I312898q629J26167k00692l2338l58005j096601o80007n25260P14245j68885
11753G082893q02268P67100M13000o83076k67066j68871p45788P30075l74265
11744E951734m68137m47286J105326p7701n58014p19561l85522J71P83426k78499
11734D905937n07975O08981K47042p22090l1529J73249n01496m82267L26122M31787
11724D447761p2683p18360m78665K99746k90099J53176j4669K00226P0796j60827
11714C436402M18742o89224L77253M40825J38075L8928o57337r30307J38198P52848
11704C464403j31522O04499L90190k6069K01148j30176j610171r5870K72705l09593
11694B629544j03278n12085m54913M96966J12557J156406l94639n27252l53120
$$ plain form
11685 2050186 2346519 2073193 1890416 1925403 2635617 2753690 2680349 2253992 1383941 970681
11675 970681 1272369 1766198 2106172 1034677 1317428 1983290 1890046 1932370 2066025 1509276
11665 1509276 1352916 1262905 1343965 2648739 2352024 1332217 1108258 1692109 1157403
11656 1157403 1643821 1992552 2056453 1687422 1690081 1278458 1833962 1464196 1803954 1020766
11646 1020766 475045 818771 443984 1291843 1815075 1309838 1348908 2306613 2443015 2065148
11636 2065148 768446 -15980 834734 1936199 1691214 963442 1269033 1767378 2062823
11627 2062823 1908887 1034428 766299 193348 947581 1006415 537075 1231762 1424270 1880739
11617 1880739 1026165 100286 567572 754994 1163671 327585 95091 540188 927198
$$ packed form
11685B050186K96333k73326j82777L4987P10214J18073p3341m26357q70051m13260
11675I70681L01688M93829L39974j071495K82751O65862r3244M2324J33655n56749
11665A509276j56360r0011Q1060J304774k96715j019807k23959N83851n34706
11656A157403M86418L48731O3901l69031K659m11623N55504l69766L39758p83188
11646A020766n45721L43726l74787Q47859N23232n05237L9070R57705J36402l77867
11636B065148j296702p84426Q50714J101465k44985p27772L05591M98345K95445
11627B062823j53936q74459k68129n72951P54233N8834m69340O94687J92508M56469
11617A880739q54574r25879M67286J87422M08677q36086k32494M45097L87010
$$ plain form
11608 927198 697690 -498995 372950 623313 466274 264772 194988 440862 901945 1325959
11598 1325959 1741217 1710036 1986871 1656968 758657 614903 468412 1153106 1658691 1396298
11588 1396298 584801 602522 1487969 922749 658608 1010100 299436 898991 451395 308680
11578 308680 1025542 444075 -53312 622844 328677 39149 -23500 -345326 1129684 1227843
11568 1227843 1622490 971815 262705 618347 606993 900523 1036801 1151221 890229 1366907
11558 1366907 1278938 398080 317444 615925 741957 157488 204261 233741 50541 -634926
11548 -634926 -286255 14833 362492 -68532 -212494 -350326 -477446 -160093 -75297 -158966
11538 -158966 -114879 616701 332153 200418 -612499 -731396 -338707 670183 1173805 143428
$$ packed form
11608I27198k29508j196685Q71945K50363j57039k01502o9784K45874M61083M24014
11598A325959M15258l1181K76835l29903q98311j43754j46491O84694N05585k62393
11588A396298q11497J7721Q85447n65220k64141L51492p10664N99555m47596j42715
11578C08680P16862n81467m97387O76156k94167k89528o2649l21826J475010R8159
11568A227843L94647o50675p09110L55642j1354K93530J36278J14420k60992M76678
11558A366907q7969q80858q0636K98481J26032n84469M6773K9480j83200o85467
11548f34926L48671L01088L47659m31024j43962j37832j27120L17353Q4796q3669
11538a58966M4087P31580k84548j31735q12917j18897L92689J008890N03622j030377
$$ plain form
11528 143428 -688070 -173489 987824 1027667 630946 340398 258934 507427 497957 413267
11518 413267 909646 447909 -29981 783624 1320072 1023884 559976 1520757 1057026 442283
11508 442283 387179 333559 127913 588202 264071 1035701 1034393 96094 -503794 -422407
11498 -422407 -423237 -534426 68789 246691 166550 502848 1385437 227114 349966 652326
11488 652326 445680 397224 314137 -653018 -697490 -82623 734380 1288453 767815 154109
11478 154109 369756 670080 364642 692728 836685 817653 1820080 1242625 195033
11469 195033 97572 -438481 -183603 -461312 113290 935780 478438 -212384 427024 97672
11459 97672 458996 798323 -50193 125713 232646 248345 -118613 -65523 -120302 -129939 -144841
$$ packed form
11528A43428q31498N14581J161313L9843l96721k90548q1464K48493r470q4690
11518D13267M96379m61737m77890Q13605N36448k96188m63908R60781m63731o14743
11508D42283n5104n3620k05646M60289l24131P71630j308r38299n99888Q1387
11498d22407q30j11189O03215J77902q0141L36298Q82589j158323J22852L02360
11488F52326k06646m8456q3087r67155m4472O14867Q17003N54073n20638o13706
11478A54109K15647L00324l05438L28086J43957j9032J002427n77455j047592
11469A95033r7461n36053K54878k77709N74602Q22490m57342o90822O39408l29352
11459I7672L61324L39327q48516J75906J06933J5699l66958N3090n4779r637j4902
$$ plain form
11448 -144841 -752353 -1590731 -1357866 28173 834146 223724 206817 -352247 324533 654200
11438 654200 698938 532994 522080 -92714 84238 -36035 -768326 280366 234559 300232
11428 300232 -556414 -233540 727935 81046 -345439 -63852 880726 1084520 -112974
11419 -112974 -58578 207533 615767 368480 782480 1025069 -353812 -486384 -101650 -239988
11409 -239988 -302580 -828853 -552994 171703 -585793 -246703 243727 983276 668309 -1043196
11399 -1043196 -648878 4250 -25881 -244844 -289877 63678 -31507 -332248 -386613 -87426
11389 -87426 399613 -511780 -572602 -368549 -219229 -452302 -563957 -702739 -722151 -419605
11379 -419605 -515067 -740802 -739695 -137814 96717 -960591 -984057 -337414 -622347 -904500
$$ packed form
11448a44841o07512q38378K32865J386039Q05973o10422j6907n59064O76780L29667
11438F54200M4738j65944j0914o14794J76952j20273p32291J048692m5807O5673
11428C00232q56646L22874R61475o46889m26485K81587R44578K03794j197494
11419a12974N4396K66111M08234k47287M14000K42589j378881j32572L84734j38338
11409b39988o2592n26273K75859P24697p57496L39090M90430P39549l14967j711505
11399a043196L94318O53128l0131k18963m5033L53555r5185l00741n4365K99187
11389h7426M87039r11393o0822K04053J49320k33073j11655j38782j9412L02546
11379d19605r5462k25735J107O01881K34531j057308k3466O46643k84933k82153
$$ plain form
11369 -904500 -328131 390835 -658097 -869747 -1769705 -1782946 -710502 53292 -171118
11360 -171118 306284 738013 668663 632424 301619 722992 303663 305263 163809 111039
11350 111039 628620 535699 -108486 752129 507857 -303775 25579 18323 -575180 -1558300
11340 -1558300 -1684438 83270 -1412 -690060 -1842733 -2243108 -374520 412888 -371864
11331 -371864 -467511 588592 903495 1024306 523878 -433618 -129808 166158 720739 1365921
11321 1365921 432609 -155792 95577 383034 185070 -412831 -394839 -1127149 -1557667 -891263
11311 -891263 -282265 29378 -74256 -328865 -677519 337517 68360 -1224740 -997627
11302 -997627 -480408 -153327 -234591 -160809 -546543 -588138 285364 270293 146865 -756001
$$ packed form
11369i04500N76369P18966j048932k11650q99958j3241J072444P63794k24410
11360a71118M77402M31729o9350l6239l30805M21373m19329J600j41454n2770
11350A11039N17581r2921o44185Q60615k44272q11632L29354p256n93503r83120
11340a558300j26138J767708q4682o88648j152673m00375J868588P87408p84752
11331c71864r5647J056103L14903J20811n00428r57496L03810K95966N54581O45182
11321A365921r33312n88401K51369K87457j97964n97901J7992p32310m30518O66404
11311h91263O08998L11643j03634k54609l48654J015036k69157j293100K27113
11302i97627N17219L27081q1264P3782l85734m1595Q73502j5071j23428r02866
$$ plain form
11292 -756001 -300311 -280353 15984 311488 23667 -739137 99322 -184180 164070 172091
11282 172091 25424 -210768 -614624 -1137173 -918866 -889828 -172349 -632426 -607490 -254090
11272 -254090 -658702 -807214 -1164593 -550390 -222710 910273 539205 669170 -32684
11263 -32684 566371 665521 -715901 -604287 34470 22797 345354 404814 495992 561114
11253 561114 1075671 63163 21083 174438 -630673 -527588 -657236 -693192 -675075 -656267
11243 -656267 -1155302 -800693 -533174 -330468 -81467 -111668 352008 -470305 -828743 -461147
11233 -461147 11215 -410989 -270009 -145778 375270 912467 973124 125758 -599015 375495
11223 375495 336494 -286197 -792881 -769465 -900501 -1040884 -564464 -750041 -344195 -365328
$$ packed form
11292g56001M55690J9958K96337K95504k87821p62804Q38459k83502L48250Q021
11282A72091j46667k36192m03856n22549K18307K9038P17479m60077K4936L53400
11272b54090m04612j48512l57379O14203L27680J132983l71068J29965p01854
11263c2684N99055R9150j381422J11614O38757j1673L22557N9460R1178O5122
11253E61114N14557j012508m2080J53355q05111J03085j29648l5956J8117J8808
11243f56267m99035L54609K67519K02706K49001l0201M63676q22313l58438L67596
11233d61147M72362m22204J40980J24231N21048N37197O0657q47366p24773R74510
11223C75495l9001o22691n06684K3416j31036j40383M76420j85577M05846k1133
$$ plain form
11213 -365328 -466472 -482555 -179153 80103 -19826 7025 294832 -129186 -297601 32083
11203 32083 -186131 -120948 535548 176898 -1131324 -1192800 -374588 354902 -362442 -264190
11193 -264190 -821959 -1733398 -1669342 -1380832 -27469 -764169 -1231210 -819919 -616759 -705563
11183 -705563 -586972 77049 340426 42989 -358794 -555895 -496064 -44471 -783571 -517718
11173 -517718 -614774 -1008198 -1051186 246542 642038 -463321 -484409 61507 209269 -49921
11163 -49921 227525 260244 355501 1384103 863577 -125089 -172426 -163544 -1146981 -649591
11153 -649591 -68823 -770458 -420374 201916 448830 -122642 144787 346585 11115 923811
11143 923811 1800779 1123296 247084 -38937 48972 -313373 -620755 -974240 -473521 781832
$$ packed form
11213c65328j01144j6083L03402K59256r9929K6851K87807m24018j68415L29684
11203C2083k18214O5183O56496l58650j308222o1476Q18212P29490p17344R8252
11193b64190n57769r11439O4056K88510J353363p36700m67041M11291K03160q8804
11183g05563J18591O64021K63377k97437m01783j97101N9831M51593p39100K65853
11173e17718r7056l93424m2988J297728L95496j105359k1088N45916J47762k59190
11163d9921K77446L2719R5257J028602n20526r88666m7337Q882r83437M97390
11153f49591N80768p01635L50084O22290K46914n71472K67429K01798l35470R12696
11143I23811Q76968o77483q76212k86021Q7909l62345l07382l53485N00719J255353
$$ plain form
11133 781832 1135827 929528 984871 377502 999576 729211 -57421 259498 127217 -50428
11123 -50428 678312 224277 383665 825951 -65289 -370881 -270730 -174633 -586995 -459724
11113 -459724 -9680 -91227 -37350 399953 -552081 -40876 -310065 -796501 -1227141 -759918
11103 -759918 -71682 -230846 -323255 6021 604402 295226 712577 -49245 622095 155911
11093 155911 -761708 -1054396 -1233412 -687116 34391 108379 -125129 -373096 -441417 441229
11083 441229 282271 490937 273516 106536 -677726 -18354 218526 229236 120857 -699184
11073 -699184 -753715 -89672 -778597 -295150 -139095 -828867 -147612 46461 647128 -219109
11063 -219109 -882161 -560092 -587583 16704 -584984 -577115 -484689 -564325 -705443 83230
$$ packed form
11133G81832L53995k06299N5343o07369O22074k70365p86632L16919j32281j77645
11123e0428P28740m54035J59388M42286q91240l05592J00151R6097m12362J27271
11113d59724M50044q1547N3877M37303r52034N11205k69189m86436m30640M67223
11103g59918O88236j59164r2409L29276N98381l09176M17351p61822O71340m66184
11093A55911r17619k92688j79016N46296P21507P3988k33508k47967o8321Q82646
11083D41229j58958K08666k17421j66980p84262O59372K36880J0710j08379q20041
11073f99184n4531O64043o88925M83447J56055o89772O81255J94073O00667q66237
11063b19109o63052L22069k7491O04287o01688P869R2426p9636j41118P88673
$$ plain form
11053 83230 666287 645502 560991 585598 -38828 -121591 295632 -312472 -140013 -258941
11043 -258941 276467 173510 -398095 -919826 -642768 -868527 -1090009 -392251 613992
11034 613992 7260 -772154 445959 539819 649269 -8088 243073 232794 -775429 -802528
11024 -802528 -895145 -520405 -112945 746149 339843 -73248 461605 9521 536477 1309094
11014 1309094 814847 8033 214450 843142 433978 629295 67686 80349 -758280 -648992
11004 -648992 -937657 -535788 -389595 -185991 359180 725852 315001 -266703 -690505 -231360
10994 -231360 -175646 -755430 -152173 550803 -218806 -1221174 -1075773 -679667 -636914 -691449
10984 -691449 -5888 393874 595718 -180381 259938 -150625 -622860 -274132 -80604 -308645
$$ packed form
11053H3230N83057k0785q4511K4607o24426q2763M17223o08104J72459j18928
11043b58941N35408j02957n71605n21731K77058k25759k21482O97758J006243
11034F13992o06732p79414J218113R3860J09450o57357K51161j0279j008223k7099
11024h02528r2617L74740M07460Q59094m06306m13091N34853m52084N26956P72617
11014A309094m94247q06814K06417O28692m09164J95317n61609J2663q38629J09288
11004f48992k88665M01869J46193K03604N45171L66672m10851n81704m23802M59145
10994b31360N5714n79784O03257P02976p69609j002368J45401L96106M2753n4535
10984f91449O85561L99762K01844p76099M40319m10563m72235L48728J93528k28041
$$ plain form
10974 -308645 599988 556658 -46676 -263975 121848 -405976 -98654 -706055 -1569530 -1221605
10964 -1221605 -1204335 -1103416 -841857 -592681 -636907 234270 -195270 54667 -143881 226105
10954 226105 26667 -228905 -653066 -351923 -790430 -590360 -255837 -116293 -636339 -402216
10944 -402216 88779 242136 2735 -634800 -64820 -262059 42323 4199 59216 70220
10934 70220 551331 -577356 -695279 -714102 -652038 -1157633 -566341 362900 811930 1108720
10924 1108720 -73662 -330771 -715107 -1083542 -1039362 -1087293 -1045956 -588429 -799362 -1303656
10914 -1303656 -246432 113985 -206856 94922 209432 -783466 -1316622 63129 190532
10905 190532 760251 739721 495239 -55688 200121 947052 999319 759958 -963545 -565070
$$ packed form
10974c08645R08633m3330o03334k17299L85823n27824L07322o07401q63475L47925
10964a221605J7270J00919K61559K49176m4226Q71177m29540K49937j98548L69986
10954B26105j99438k55572m24161L01143m38507K00070L34523J39544n20046K34123
10944d02216M90995J53357k39401o37535N69980j97239L04382l8124N5017J1004
10934G0220M81111j128687j17923j8823O2064n05595N91292R29241M49030K96790
10924A108720j182382k57109l84336l68435M4180m7931M1337M57527k10933n04294
10914a303656J057224L60417l20841L01778J14510r92898n33156J379751J27403
10905A90532N69719k0530k44482n50927K55809P46931N2267k39361j723503L98475
$$ plain form
10895 -565070 87088 37272 88286 -302148 -335422 -229796 147602 -1146137 -698519 -255203
10885 -255203 -91711 458780 313339 9341 -501611 -474271 -531537 -43303 -290031 381728
10875 381728 95160 188505 567673 935438 487472 108838 295369 -666373 -493304 97202
10865 97202 -136967 343831 -260851 149366 44268 -218524 -560383 334198 902383 649311
10855 649311 99004 -431203 24532 -265443 278640 236561 325532 682112 381504 -127752
10845 -127752 165168 249424 12440 -915647 -986427 -446866 524088 35144 -519075 561205
10835 561205 237577 327940 -304724 363935 638374 -269978 18155 29721 -151927 -1138327
10825 -1138327 -305342 -118390 -696379 -341351 -236779 -283166 120992 -360660 -1308963 7680
$$ packed form
10895e65070O52158m9816N1014l90434l3274J05626L77398j293739M47618M43316
10885b55203J63492N50491j45441l03998n10952K7340n7266M88234k46728O71759
10875C81728k86568R3345L79168L67765m47966l78634J86531r61742J73069N90506
10865I7202k34169M80798o04682M10217j05098k62792l41859Q94581N68185k53072
10855F49311n50307n30207M55735k89975N44083m2079Q8971L56580l00608n09256
10845a27752K92920Q4256k36984r28087p0780N39561R70954m88944n54219J080280
10835E61205l23628R0363o32664O68659K74439r08352K88133J1566j81648r86400
10825a138327Q32985J86952n77989L55028J04572m6387M04158m81652r48303J316643
$$ plain form
10815 7680 -337828 -956909 -224503 -77783 -369259 -502766 -660028 572483 -347273 -346116
10805 -346116 165789 377675 102504 -1193877 -857850 -290901 249014 -305101 -873246
10796 -873246 -713522 -886003 -924770 -403530 299510 550982 -416520 721032 1259235 565412
10786 565412 114722 -265561 -269829 -341716 -114920 -240633 -149306 341477 -1028961 -1030039
10776 -1030039 198882 -143634 -1233792 -226457 -294242 -414760 65702 88291 -642057
10767 -642057 -856839 19579 -687747 -1034128 -294889 110510 825333 922600 1033185 192163
10757 192163 -291911 -373611 146428 -574084 -366961 326057 313568 765290 506484 -283519
10747 -283519 -640087 -1389529 -1191930 -154618 133714 -236555 -534084 62459 -289143
$$ packed form
10815G680l45508o19081P32406J46720k91476j33507j57262J232511r19756J157
10805c46116N11905K11886k75171j296381L36027N66949N39915n54115n68145
10796h73246J59724j72481l8767N21240P03040K51472r67502J137552N38203o93823
10786E65412m50690l80283m268p1887K26796j25713R1327M90783j370438j078
10776a030039J228921l42516j090158J007335o7785j20518M80462K2589p30348
10767f42057k14782Q76418p07326l46381P39239M05399P14823R7267J10585q41022
10757A92163m84074q1700N20039p20512K07123O93018j2489M51722k58806p90003
10747b83519l56568p49442J97599J037312K88332l70269k97529N96543l51602
$$ plain form
10738 -289143 -309221 102110 -434737 -291990 127893 -171360 -551578 -1060746 -182105 -463081
10728 -463081 -262195 -820280 -1327058 -553080 -418923 -346140 385876 726678 -187312 -414564
10718 -414564 -317693 -131400 112739 576174 70463 136812 -340548 -145197 166565 -420336
10708 -420336 406137 663812 479870 -462421 -476409 -19947 286863 -206449 -737468 408956
10698 408956 437544 291627 345286 890913 1255777 229288 -246236 -170088 -1042137 -1151843
10688 -1151843 -1024671 -1266059 756447 602956 564109 376588 -723330 -1188353 -803207
10679 -803207 -399110 -1246199 -452125 228555 682701 40541 -599199 -548701 -1105830 -420904
10669 -420904 73934 -19514 -521922 -89301 -462978 -1011353 -1021838 -620723 -524158 -557751
$$ packed form
10738b89143k0078M11331n36847J42747M19883k99253l80218n09168Q78641k80976
10728d63081K00886n58085n06778P73978J34157P2783P32016L40802r13990k27252
10718d14564R6871J86293K44139M63435n05711O6349m77360J95351L11762n86901
10708d20336Q26473K57675j83942r42291j3988M56462L06810m93312n31019J146424
10698D08956K8588j45917N3659N45627L64864j026489m75524P6148q72049j09706
10688a151843J27172k41388K022506j53491l8847j87521j099918m65023L85146
10679h03207M04097q47089P94074O80680M54146o42160o39740N0498n57129O84926
10669d20904M94838r3448n02408M32621l73677n48375j0485M01115R6565l3593
$$ plain form
10659 -557751 -3401 167351 -588521 353527 622497 5345 -31025 -69682 -939202 -412477
10649 -412477 -465985 -31797 193227 697642 352409 371343 825067 -219342 -259558 -15997
10639 -15997 48401 -579022 -1015663 23049 848360 535606 -705456 -360700 416729 183464
10629 183464 202488 500592 1167534 975277 1189699 176937 21001 110081 -27208 327806
10619 327806 -106606 210973 825810 406349 -211444 -449683 -699178 -554620 -158034 294334
10609 294334 833876 628668 368300 345153 498316 -98866 460981 241582 -10876 -227973
10599 -227973 342001 1220507 669410 -265562 -619851 -240881 397708 -126989 54211 319275
10589 319275 8259 510443 228516 445788 597788 471996 678987 364341 -329260 86447
$$ packed form
10659e57751N54350J70752p55872R42048K68970o17152l6370l8657q69520N26725
10649d12477n3508M34188K25024N04415l45233J8934M53724j044409m0216K43561
10639a5997O4398o27423m36641J038712Q25311l12754j241062L44756P77429k33265
10629A83464J9024K98104O66942j92257K14422j012762j55936Q9080j37289L55014
10619C27806m34412L17579O14837m19461o17793k38239k49495J44558L96586M52368
10609B94334N39542k05208k60368k3147J53163n97182N59847k19399k52458k17097
10599b27973N69974Q78506n51097r34972l54289L78970O38589n24697J81200K65064
10589C19275l11016N02184k81927K17272J52000j25792K06991l14646o93601M15707
$$ plain form
10579 86447 679988 99055 465371 134333 194680 196564 -7080 69116 711938 503081
10569 503081 400603 33339 689395 1315073 20995 304590 -629483 -468763 988081
10560 988081 621035 711618 -221339 311584 60991 292936 538327 740976 817579 1292827
10550 1292827 1154716 -296446 293134 134446 -64688 -356429 -105104 160528 751121
10541 751121 877328 895399 616070 -54701 -523044 136226 343069 240991 505591 291228
10531 291228 -149564 850181 1610824 1447933 1050812 380158 447278 732581 1260571 120016
10521 120016 562763 621935 378988 363988 815945 1298350 613096 1263577 1425092 786148
10511 786148 1140901 1535399 1891312 2497741 1387363 1110612 1233614 1496192 1068958
$$ packed form
10579H6447N93541n80933L66316l31038O0347J884k03644P6196O42822k08857
10569E03081j02478l67264O56056O25678j294078K83595r34073J60720J456844
10560I88081l67046R0583r32957N32923k50593K31945K45391K02649P6603M75248
10550A292827j38111j451162N89580j58688j99134k91741K51325K65632N90593
10541G51121J26207J8071k79329o70771m68343O59270K06843j02078K64600k14363
10531B91228m40792R99745P60643j62891l97121o70654O7120K85303N27990j140555
10521A20016M42747N9172k42947j5000M51957M82405o85254O50481J61515o38944
10511G86148L54753L94498L55913O06429j110378k76751J23002K62578m27234
$$ plain form
10502 1068958 1795335 1171721 825294 1891768 1812947 1945080 2084662 1573865 1459797
10493 1459797 1319107 1402114 2125892 2373664 2309925 1919237 2506474 2841316 1987145 1905474
10483 1905474 1507077 1760656 2590852 2229289 2040755 2999992 2359282 2728854 3043215
10474 3043215 3465626 3561799 3110997 4086841 2647013 2807419 3235059 3433755 3942022
10465 3942022 3540621 3801679 4441236 3197565 2910180 3932899 3978269 3391514 3506419
10456 3506419 3161656 3399255 4021971 3776523 4509847 4636996 4469473 4356972 3546910
10447 3546910 4066090 4724789 4593803 4865923 4621747 4431764 3872974 4221117 4224566 4099122
10437 4099122 4596449 5059153 5618917 4766074 4821160 5033791 5010876 5569248 5929368 5851839
$$ packed form
10502A068958P26377o23614l46427J066474p8821J32133J39582n10797j14068
10493A459797j40690Q3007P23778K47772o3739l90688N87237L34842q54171q1671
10483A905474l98397K53579Q30196l61563j88534R59237o40710L69572L14361
10474C043215M22411R6173m50802R75844j439828J60406M27640J98696N08267
10465C942022m01401K61058O39557j243671k87385J022719M5370n86755J14905
10456C506419l44763K37599O22716k45448P33324J27149j67523j12501q10062
10447C546910N19180O58699j30986K72120k44176j89983n58790L48143L449j25444
10437D099122M97327M62704N59764q52843N5086K12631k2915N58372L60120p7529
$$ plain form
10427 5851839 5297524 5523798 6789305 6927295 6007152 6581702 6983353 6842457 7635468
10418 7635468 7527016 7313880 8067640 8572706 8767498 8858553 9947634 9824957 10788889
10409 10788889 10913600 11604759 12382258 12147850 12511444 13972625 14989082 15180844 15592544
10400 15592544 15145096 15695877 15990629 16832228 17864155 17969411 18128359 18936133 19172075
10391 19172075 19316744 18788171 17972749 17699589 16719365 16117652 15924840 15470032 14393676
10382 14393676 13599790 12322462 12479810 11928746 11858496 10819994 10198762 9337809 9261262
10373 9261262 8756179 8359472 8935826 7758670 7135812 7104973 7005351 6403833 6418317 6617570
10363 6617570 7210556 6432780 5501972 5054114 4439574 5412268 5484151 5051798 5434369 4335091
$$ packed form
10427E851839n54315K26274J265507J37990r20143N74550M01651j40896P93011
10418G635468j08452k13136P53760N05066J94792R1055J089081j22677R63932
10409A0788889J24711O91159P77499k34408L63594J461181J016457J91762M11700
10400A5592544m47448N50781K94752Q41599J031927J05256J58948Q07774K35942
10391A9172075J44669n28573q15422k73160r80224o01713j92812m54808j076356
10382A4393676p93886j277328J57348n51064p0250j038502o21232q60953p6547
10373I261262n05083l96707N76354j177156o22858l0839r9622o01518J4484J99253
10363F617570N92986p77776r30808m47858o14540R72694P1883m32353L82571j099278
$$ plain form
10353 4335091 4034155 3957780 4021840 2927139 3472362 3297134 3247478 3421498 4069616 3431378
10343 3431378 3138863 2865520 2642356 3034895 3396193 2864964 2498938 2676776 2158537
10334 2158537 2466008 1980046 1354138 1519629 2474370 2594270 1776234 2305705 1883113
10325 1883113 1001680 1851437 2710535 2577696 2765288 3118530 2780072 1185717 1079423
10316 1079423 1468160 993671 1879310 2155576 1140935 437627 699970 1775283 2414956
10307 2414956 2318061 2074618 1020308 236398 991388 1039821 231856 -585989 394819 582116
10297 582116 377451 -267700 112326 672582 580355 803047 1555520 2444442 1180639 959927
10287 959927 1777253 1957730 1970829 1598503 1125630 891307 1549572 1538186 705909 1078573
$$ packed form
10353D335091l00936p6375O4060j094701N45223j75228m9656J74020O48118o38238
10343C431378k92515k73343k23164L92539L61298n31229l66026J77838n18239
10334B158537L07471m85962o25908J65491R54741J19900q18036N29471m22592
10325A883113q81433Q49757Q59098j32839J87592L53242l38458j594355j06294
10316A079423L88737m74489Q85639K76266j014641p03308K62343J075313O39673
10307B414956r6895k43443j054310p83910P54990M8433q07965q17845R80808J87297
10297E82116k04665o45151L80026N60256r2227K22692P52473Q88922j263803k20712
10287I59927Q17326J80477J3099l72326m72873k34323O58265j1386q32277L72664
$$ plain form
10277 1078573 142815 202416 340953 790561 1347423 1672290 1244585 1077786 1872473 1014946
10267 1014946 990803 1728167 1557255 1787034 627205 103296 1191480 1495739 1156704
10258 1156704 319528 205550 1428941 1367664 2105855 1962482 1577874 1366461 1116905
10249 1116905 508374 819794 1404360 1217732 1012057 1426056 1232479 1380197 1513358
10240 1513358 1127862 1436711 1018623 595709 698549 632459 1064900 918655 -163337
10231 -163337 469047 1541614 1053826 -152238 203277 943698 932478 943595 1040176 826813
10221 826813 1172931 1532822 940295 573973 347912 608426 1074950 872746 337854 275406
10211 275406 1303852 900621 -10953 106095 -263766 -131946 838187 1177007 -1324
$$ packed form
10277A078573r35758N9601J38537M49608N56862L24867m27705j66799P94687q57527
10267A014946k4143P37364j70912K29779j159829n23909J088184L04259l39035
10258A156704q37176j13978J223391o1277P38191j43373l84608k11413k49556
10249A116905o08531L11420N84566j86628k05675M13999j93577J47718J33161
10240A513358l85496L08849m18088m22914J02840o6090M32441j46245j081992
10231a63337O32384J072567m87788j206064L55515P40421j1220J1117R6581k13363
10221H26813L46118L59891n92527l66322k26061K60514M66524k02204n34892o2448
10211B75406J028446m03231r11574J17048l69861J31820R70133L38820j178331
$$ plain form
10202 -1324 290655 81664 184267 502691 1303212 1100665 425762 48562 -77221 -161040
10192 -161040 394112 148759 50921 611258 619924 1349043 1913645 1189160 905114 1317310
10182 1317310 731235 522463 402550 1492816 1544371 1788403 1405933 703440 1456895
10173 1456895 2156968 1698785 1456253 1522546 1166105 1108875 1338451 1616886 1038977 265192
10163 265192 153830 -455233 -457852 16066 392033 91865 498706 1418996 2012797 2187508
10153 2187508 2204095 1318610 976106 694737 638610 512998 775652 1249079 1214271 268259
10143 268259 982082 1679024 1242480 1508434 1702980 1518143 1777661 1514325 1147808 1452039
10133 1452039 1674281 1018609 1041445 1366623 1688175 1341097 934139 674657 1484933 1139099
$$ packed form
10202a324K91979k08991J02603L18424Q00521k02547o74903l77200j25783q3819
10192a61040N55152k45353r7838N60337Q666P29119N64602p24485k84046M12196
10182A317310n86075k08772j19913J090266N1555K44032l82470p02493P53455
10173A456895P00073m58183k42532O6293l56441n7230K29576K78435n77909p73785
10163B65192j11362o09063k619M73918L75967l00168M06841R20290N93801J74711
10153B187508J6587q85485l42504k81369n6127j25612K62654M73427l4808r46012
10143B68259P13823O96942m36544K65954J94546j84837K59518k63336l66517L04231
10133A452039K22242o55672K2836L25178L21552l47078m06958k59482Q10276l45834
$$ plain form
10123 1139099 510593 711528 1013102 1901440 1305403 1096143 1220626 1453418 1128679
10114 1128679 1203797 866794 851154 897267 730282 862456 588092 300547 604525 218791
10104 218791 944903 1602782 1098089 989120 839427 950745 1988657 2090203 728589
10095 728589 1357144 2362907 2108704 1922004 2016857 1148367 1389498 2019342 2244955 2206428
10085 2206428 2518705 3873941 4164205 4026167 4970417 4802276 3630726 3307533 3809243
10076 3809243 4626457 4331294 4194177 2764412 3319980 3725497 3113916 2010562 1843578
10067 1843578 1898165 1184225 1020218 1432748 1523615 1124163 946212 65610 785125 421032
10057 421032 -502949 292289 866610 892359 849822 837209 1195751 1184766 724183 119318
$$ packed form
10123A139099o28506K00935L01574Q88338n96037k09260J24483K32792l24739
10114A128679P5118l37003j5640M6113j66985J32174k74364k87545L03978l85734
10104B18791P26112O57879n04693j08969j49693J11318J037912J01546j361614
10095G28589O28555J005763k54203j86700R4853q68490K41131O29844K25613l8527
10085B206428L12277J355236K90264j38038R44250j68141j171550l23193N01710
10076C809243Q17214k95163j37117j429765N55568M05517o11581j103354j66984
10067A843578N4587p13940j64007M12530R0867l99452j77951q80602P19515l64093
10057D21032r23981P95238N74321K5749m2537j2613L58542j0985m60583o04865
$$ plain form
10047 119318 431422 379151 620053 889308 1474124 926683 917309 1308028 1284452 1722824
10037 1722824 1257901 643919 503692 216836 25948 805305 62758 -317882 42352
10028 42352 450794 350963 1035723 1088171 768908 973223 1079632 518361 549545 364222
10018 364222 1212022 1633023 706248 -609848 -363260 592779 904864 955235 1297175 1780859
10008 1780859 1483389 1027426 647411 543117 131608 -628422 -164343 1032307 584298
9999 584298 41006 326486 926556 847607 486157 298398 809734 875777 1121852 843909
9989 843909 316700 183167 308297 1075586 1416395 1464473 1160108 -343040 58683 -22995
9979 -22995 1220221 1661623 1654044 1422821 598903 1067684 836584 928749 551947 525403
$$ packed form
10047A19318L12104n2271K40902K69255N84816n47441r374L90719k3576M38372
10037A722824m64923o13982j40227k86856j90888P79357p42547l80640L60234
10028D2352M08442r9831O84760N2448l19263K04315J06409n61271L1184j85323
10018C64222Q47800M21001r26775j316096K46588R56039L12085N0371L41940M83684
10008A780859k97470m55963l80015j04294m11509p60030M64079J196650m48009
9999E84298n43292K85480O00070p8949l61450j87759N11336O6043K46075k77943
9989H43909n27209j33533J25130P67289L40809M8078l04365j503148M01723q1678
9979b2995J243216M41402p579k31223q23918M68781k31100R2165l76802k6544
$$ plain form
9969 525403 156289 781549 217553 1080811 2055168 1889352 1133418 595691 1198051 1041860
9959 1041860 703240 1061393 939383 1728801 1697344 1566053 1343304 1877132 2895395 2603833
9949 2603833 2294388 1580261 2269802 2262826 1855028 1935999 2470498 1786711 1620237 1474761
9939 1474761 1417291 1073191 986812 152218 -71771 780833 874184 1298348 1974569 2453564
9929 2453564 1766989 1587278 2081513 1722463 1401442 1993789 2530188 1760880 1836285 1695629
9919 1695629 1770551 2149580 1543233 1928419 2032194 2041373 1163735 2305460 2130824 1780306
9909 1780306 1697773 1612616 1950352 1237152 1408008 1783841 1349666 1088477 609117 663439
9899 663439 1753499 1532931 1644174 2063875 2511933 2088398 1551765 1443478 2246705 2319574
$$ packed form
9969E25403l69114O25260n63996Q63258R74357j65816p55934n37727O02360j56191
9959A041860l38620L58153j22010P89418l1457j31291k22749N33828J018263k91562
9949B603833l09445p14127O89541o976m07798Q0971N34499o83787j66474j45476
9939A474761n7470l44100q6379q34594k23989Q52604R3351M24164O76221M78995
9929B453564o86575j79711M94235l59050l21021N92347N36399p69308P5405j40656
9919A695629P4922L79029o06347L85186J03775R179q77638J141725j74636l50518
9909A780306q2533q5157L37736p13200J70856L75833m34175k61189m79360N4322
9899F63439J090060k20568J11243M19701M48058m23535n36633j08287Q03227P2869
$$ plain form
9889 2319574 2056925 2208569 3038948 2277839 2451027 2049918 2419155 2585815 2202122 2655242
9879 2655242 2461195 2554947 2577414 2481855 2926581 2455834 2791770 3286625 3333422 3122896
9869 3122896 2033919 2247690 1855297 2019663 1964650 1406268 1255782 1652566 1395368 1759406
9859 1759406 2094705 2473688 2217143 2288082 2608047 2051508 1302844 1820294 1822305 1770960
9849 1770960 2726522 2511786 1951370 1726793 2252301 2585075 1707782 1729272 2227354 2162506
9839 2162506 2941382 2866845 2301088 2474773 2373767 2351602 3094588 2208544 1485010 2036275
9829 2036275 1592706 1637677 1269038 1544908 1638125 1533043 2244220 2488919 1957454 1341434
9819 1341434 2269456 2226043 1812057 1725033 963749 2136465 3078858 2669828 1833301 1744048
$$ packed form
9889B319574k62649J51644Q30379p61109J73188m01109L69237J66660l83693M53120
9879B655242j94047R3752K2467r5559M44726m70747L35936M94855M6797k10526
9869C122896j088977K13771l92393J64366n5013n58382j50486L96784k57198L64038
9859A759406L35299L78983k56545P0939L19965n56539p48664N17450K011n1345
9849A770960R55562k14736n60416k24577N25508L32774q77293K1490M98082o4848
9839B162506P78876p4537n65757J73685j01006k2165P42986q86044p23534N51265
9829B036275m43569M4971l68639K75870R3217j05082P11177K44699n31465o16020
9819A341434R28022m3413m13986q7024p61284J172716R42393m09030q36527q9253
$$ plain form
9809 1744048 2291800 2226245 2270273 1973955 2084723 2434790 1863483 2140827 2230600 1226399
9799 1226399 1429085 1850639 1794680 1922649 2624565 3006212 3151088 2127463 1656573 1962543
9789 1962543 2573862 2297314 2112740 2070106 2686938 2644561 1728785 1474166 1032772 1805201
9779 1805201 1954695 1689414 1586535 1711395 2194694 2557199 1929574 1479231 2237256 2013198
9769 2013198 2520529 2985258 3287986 3340005 3126049 3577412 3240508 2786578 3201349 3522228
9759 3522228 3821334 3205090 2517073 3000970 3300817 3536688 3925897 2850490 2503000
9750 2503000 3262401 2334585 2864000 2812073 2763526 2196077 2950846 2737598 3118488 4036337
9740 4036337 3034773 2612061 2857173 4342238 4242870 4063817 4288728 4056434 4215255
$$ packed form
9809A744048N47752o5555M4028k96318J10768L50067n71307K77344Q9773j004201
9799A226399K02686M21554n5959J27969P01916L81647J44876j023625m70890L05970
9789A962543O11319k76548j84574m2634O16832m2377r15776k54619m41394P72429
9779A805201J49494k65281j02879J24860M83299L62505o27625m50343P58025k24058
9769B013198N07331M64729L02728N2019k13956M51363l36904m53930M14771L20879
9759C522228K99106o16244o88017M83897K99847K35871L89209j075407l47490
9750B503000P59401r27816N29415n1927m8547n67449P54769k13248L80890R17849
9740D036337j001564m22712K45112J485065r9368j79053K24911k32294J58821
$$ plain form
9731 4215255 3566053 3794472 2894515 3048382 2465971 3064805 3390252 3540661 4317604 4541383
9721 4541383 4464033 4273318 4450908 4728325 4489836 3750154 3785504 4254371 4231891 4409505
9711 4409505 4912808 4805014 5692993 5453706 5490074 5369907 5485650 5823277 4981847 4911989
9701 4911989 5843873 5184378 5344499 5388316 5952605 6145488 6366753 6276761 6129838 6404239
9691 6404239 6860663 6661148 6157942 6191015 6526780 6604198 6141386 6359602 6758090 7197004
9681 7197004 6976272 6654777 7259815 7834006 7254956 7437549 7199618 7561640 6848928 6341692
9671 6341692 6039467 6866740 7013121 7095899 7713190 7336923 7544360 7228964 7361721 7932780
9661 7932780 8093719 7231512 7365488 7452062 7955572 8520335 7570030 6839534 7881724 7723998
$$ packed form
9731D215255o49202K28419q99957J53867n82411N98834L25447J50409P76943K23779
9721D541383p7350j90715J77590K77417k38489p39682L5350M68867k2480J77614
9711D409505N03303j07794Q87979k39287L6368j20167J15743L37627q41430o9858
9701D911989R31884o59495J60121M3817N64289J92883K21265q9992j46923K74401
9691F404239M56424j99515n03206L3073L35765P7418m62812K18216L98488M38914
9681G197004k20732l21495O05038N74191n79050J82593k37931L62022p12712n07236
9671F341692l02225Q27273J46381Q2778O17291l76267K07437l15396J32757N71059
9661G932780J60939q62207J33976Q6574N03510N64763r50305p30496J042190j57726
$$ plain form
9651 7723998 7656867 7558920 8036192 7443149 7447511 8103299 8139752 8013292 8205794 8221913 8478127
9640 8478127 8476339 8804379 8973497 8589933 9186964 10194101 10038945 10173081 9805969 9554633
9630 9554633 10401921 10266905 9670970 9828902 10183822 9764436 10629685 11655897 11218699
9621 11218699 11623949 11757692 11653643 11816305 10817515 11264181 12101782 11903476 11934960 12310807
9611 12310807 12604616 13200404 13947147 13537287 14829892 14594288 14889846 14709637 14318540
9602 14318540 15145492 16535904 17561012 17584601 16905704 17424190 18697317 18013693 17628749
9593 17628749 17373022 17951062 18612515 18605145 19046648 19767975 20284085 20656168 21180815 22461592
9583 22461592 23222701 23728618 23028300 23620046 24254307 24607164 24703470 24367587 25377751
$$ packed form
9651G723998o7131r7947M77272n93043M362O55788L6453j26460J92502J6119K56214
9640H478127j788L28040J69118l83564N97031J007137j55156J34136l67112k51336
9630I554633Q47288j35016n95935J57932L54920m19386Q65249J026212m37198
9621A1218699M05250J33743j04049J62662r98790M46666Q37601j98306L1484L75847
9611A2310807K93809N95788P46743m09860J292605k35604K95558j80209l91097
9602A4318540Q26952J390412J025108K3589o78897N18486J273127o83624l84944
9593A7628749k55727N78040O61453p370M41503P21327N16110L72083N24647J280777
9583B2461592P61109N05917p00318N91746O34261L52857R6306l35883J010164
$$ plain form
9574 25377751 26364214 26933840 28327465 29683493 30392658 30478643 31070504 31259430 32534788
9565 32534788 33700154 34233578 34452171 34840397 36023577 36968782 38316735 40296215 40749235
9556 40749235 41207831 41177308 42885645 43618005 44924607 45928573 47571172 49757139 51937060
9547 51937060 52929281 54477245 55142151 56745463 59447250 61245687 63373871 64854532
9539 64854532 68117327 71242051 73737778 77078888 81534873 85407227 90398229 96052228
9531 96052228 101492051 106684107 114878192 123376929 132351622 142952979 153542482 164600619
9523 164600619 172745873 179336847 183602210 186051934 187576559 190319768 193322399 197049860
9515 197049860 200350370 201306121 200405586 197393105 194547149 192827579 191893037 194738222
$$ packed form
9574B5377751R86463N69626J393625J356028P09165Q5985N91861J88926J275358
9565C2534788J165366N33424K18593L88226J183180R45205J347953J979480M53020
9556D0749235M58596l0523J708337P32360J306602J003966J642599K185967K179921
9547E1937060R92221J547964O64906J603312K701787J798437K128184J480661
9539F4854532L262795L124724K495727L341110M455985L872354M991002N653999
9531I6052228N439823N192056Q194085Q498737Q974693J0601357J0589503J1058137
9523A64600619Q145254O590974M265363K449724J524625K743209L002631L727461
9515A97049860L300510R55751r00535l012481k845956j719570r34542K845185
$$ plain form
9507 194738222 200251752 206854497 215188952 226321613 238254260 248903770 257629025 265355830
9499 265355830 270778343 273848641 275081499 274382326 272548077 267615528 260666711 250534030
9491 250534030 239357136 226491142 213431004 201161702 191544953 183558891 177807867
9484 177807867 174726716 174799385 176298614 180039325 186414143 195016527 205757811 219027239
9476 219027239 233181620 244514537 252161161 254853586 254563603 251931260 248494475 248144661
9468 248144661 246823453 243092117 234892580 223088202 206076825 187278151 169356380
9461 169356380 153325304 139369789 128982443 121178523 113646342 108005013 103414191 99759638
9453 99759638 97633194 96912211 96742132 95926756 97470259 99893354 101983649 104537378 106779356
$$ packed form
9507A94738222N513530O602745Q334455J1132661J1932647J0649510Q725255P726805
9499B65355830N422513L070298J232858o99173j834249m932549o948817j0132681
9491B50534030j1176894j2865994j3060138j2269302r616749p986062n751024
9484A77807867l081151P2669J499229L740711O374818Q602384J0741284J3269428
9476B19027239J4154381J1332917P646624K692425k89983k632343l436785l49814
9468B48144661j321208l731336q199537j1804378j7011377j8798674j7921771
9461A69356380j6031076j3955515j0387346p803920p532181n641329m590822l654553
9453I9759638k126444p20983j70079q15376J543503K423095K090295K553729K241978
$$ plain form
9444 106779356 105990601 105117464 103336767 101577238 99956522 98874055 96643351 93174092
9436 93174092 89958796 84138037 76580155 70519280 63855208 57916888 54278114 49539341
9428 49539341 46748018 43952662 41764823 39203710 37866109 35921331 33607228 31459285
9420 31459285 30800082 29580551 28541642 27420749 26198280 25739143 24072083 22797256
9412 22797256 22602560 21793692 21120374 20573382 19949493 19332574 18685985 18333444 18430071 18777146
9402 18777146 18134390 17323590 16477120 16595524 16223792 15604846 14595445 14496012 13970654
9393 13970654 13544396 13230906 12564522 13937817 13828339 13701923 12548198 11662352 11908411
9384 11908411 11336519 11046448 11112459 11668495 11805029 11862846 12683164 11175175 10633599 9867341
$$ packed form
9444A06779356p88755q73137j780697j759529j620716j082467k230704l469259
9436I3174092l215296n820759p557882o060875o664072n938320l638774m738773
9428D9539341k791323k795356k187839k561113j337601j944778k314103k147943
9420C1459285o59203j219531j038909j120893j222469m59137j667060j274827
9412B2797256j94696q08868o73318n46992o23889o16919o46589l52541R6627L47075
9402A8777146o42756q10800q46470J18404l71732o18946j009401r9433n25358
9393A3970654m26258l13490o66384J373295j09478j26416j153725q85846K46059
9384A1908411n71892k90071O6011N56036J36534N7817Q20318j507989n41576p66258
$$ plain form
9374 9867341 9352782 10668355 10474774 9946420 10498514 10287853 10546498 10578661 10069093 9576331
9364 9576331 9402030 9803284 9863387 9913334 10236908 9592551 9577670 9046948 9172148 9379863
9354 9379863 9779610 9876569 9918793 10150702 9589296 9340255 8402599 8241609 8660710 9577224
9344 9577224 9386029 8913671 8904239 8990379 9556538 9559331 8882341 9118315 8580737 9045935
9334 9045935 9412616 8311259 8029881 8748229 8495510 8201551 8827083 8743717 8596994 8812865
9324 8812865 8557474 8352236 9664506 8851482 8485321 8480895 7888682 8609580 8877598 8367102
9314 8367102 9037931 9186116 8518826 8649085 8830585 8437691 9006427 9345362 9107676 8547799
9304 8547799 8695924 8596544 8093131 9388346 9558868 8771556 9034644 9078372 8995204 8900101
$$ packed form
9374I867341n14559J315573j93581n28354N52094k10661K58645L2163n09568m92762
9364I576331j74301M01254O0103M9947L23574o44357j4881n30722J25200K07715
9354I379863L99747R6959M2224K31909n61406k49041r37656j60990M19101R16514
9344I577224j91195m72358r432Q6140N66159K793o76990K35974n37578M65198
9334I045935L66681j101357k81378P18348k52719k93959O25532q3366j46723K15871
9324H812865k55391k05238J312270q13024l66161m426n92213P20898K68018n10496
9314H367102O70829J48185o67290J30259J81500l92894N68736L38935k37686n59877
9304H547799J48125r9380n03413J295215J70522p87312K63088M3728q3168r5103
$$ plain form
9294 8900101 8903355 9282667 9403214 8983798 8062030 8753662 9051611 9012225 8803745 9400173
9284 9400173 9725602 9998656 10195063 10111070 10929265 11192586 11109221 11286974 10909704 11103677
9274 11103677 10589029 10437558 10183800 11021979 11586457 11600079 11503768 11977449 12054482 12297617
9264 12297617 12835956 13908025 14943156 15888804 16182030 16202315 16397429 15909087 15553459
9255 15553459 15513871 15006023 14856510 15837081 14703139 15203752 14794825 14067748 13556322
9246 13556322 13776238 14083633 13586162 14524722 14950928 15324242 16255295 16235202 15849528 16678758
9236 16678758 17388299 16734639 15840580 16682150 17374229 17724905 18330400 18300901 19003743 20140829
9226 20140829 19957912 20327068 20310351 20259526 20132871 19976941 20265823 20872132 21151999 21564872
$$ packed form
9294H900101L254L79312J20547m19416r21768O91632K97949l9386k08480N96428
9284I400173L25429K73054J96407q3993Q18195K63321q3365J77753l77270J93973
9274A1103677n14648j51471k53758Q38179N64478J3622r6311M73681P7033K43135
9264A2297617N38339J072069J035131R45648K93226K0285J95114m88342l55628
9255A5553459l9588n07848j49513R80571j133942N00613m08927p27077n11426
9246A3556322K19916L07395m97471R38560M26206L73314R31053k0093l85674Q29230
9236A6678758P09541o53660q94059Q41570O92079L50676O05495k9499P02842J137086
9226B0140829j82917L69156j6717n0825j26655j55930K88882O06309K79867M12873
$$ plain form
9216 21564872 20938658 20483536 20939312 20800047 21646170 21839711 22510790 23067213 23161959 22614721
9206 22614721 22947777 23628261 24197723 24122106 24119210 24788859 25723643 27230512 27168307 26855354
9196 26855354 27561115 28709984 28598086 28896919 29663550 30707258 31727823 32473920 34516391
9187 34516391 35148689 35847678 37250108 38931836 39632110 41156111 43490161 45763941 48045051
9178 48045051 50900531 55103319 58870640 62893559 68379916 74920403 82212382 88650329
9170 88650329 93782520 96870214 95697855 93994206 94087134 94704329 96325303 97515207 96214277
9161 96214277 92668399 87852655 82427306 77239642 73491761 70560491 68778949 68260723
9153 68260723 67605039 67362784 67739390 67546535 67576051 67623936 69147833 71107474 72658802
$$ packed form
9216B1564872o26214m55122M55776j39265Q46123J93541O71079N56423R4746n47238
9206B2614721L33056O80484N69462p5617k896O69649R34784J506869o2205l12953
9196B6855354P05761J148869j11898K98833P66631J043708J020565P46097K042471
9187C4516391O32298O98989J402430J681728P00274J524001K334050K273780K281110
9178D8045051K855480M202788L767321M022919N486357O540487P291979O437947
9170H8650329N132191L087694j172359j703649R2928O17195J620974J189904j300930
9161I6214277l545878m815744n425349n187664l747881k931270j781542n18226
9153F8260723o55684k42255L76606j92855K9516M7885J523897J959641J551328
$$ plain form
9144 72658802 75558444 78584711 81907295 86216949 92355103 99046040 105887309 114662453
9136 114662453 124512258 136517904 151859202 169743961 187784501 205858521 220608620
9129 220608620 227281788 226050562 221473149 217342249 215899850 216074599 217436642 213569578
9121 213569578 201111805 183325667 162617885 143810261 126990663 113246210 102267172
9114 102267172 93359714 86181158 79888282 74161861 69307241 66113013 62226997 58642033
9106 58642033 55915150 53445637 50770683 47864282 45419622 44086858 43558991 41311865
9098 41311865 40418445 39285459 37946840 38170721 38074973 36966125 36058237 35112249 34457045
9089 34457045 34068296 32591055 32347894 31308400 30201230 29930170 29406855 29520781 29600702
$$ packed form
9144G2658802K899642L026267L322584M309654O138154O690937O841269Q775144
9136A14662453R849805J2005646J5341298J7884759J8040540J8074020J4750099
9129B20608620O673168j231226m577413m130900j442399J74749J362043l867064
9121B13569578j2457773j7786138k0707782j8807624j6819598j3744453j0979038
9114A02267172q907458p178556o292876n726421m854620l194228l886016l584964
9106E8642033k726883k469513k674954k906401k444660j332764n27867k247126
9098D1311865q93420j132986j338619K23881r5748j108848r07888r45988o55204
9089C4457045l88749j477241k43161j039494j107170k71060n23315J13926P9921
$$ plain form
9080 29600702 28981575 28430051 29207164 29036963 29501352 29801992 29379382 28976079 29025496 28609668
9070 28609668 29113603 30387462 30519103 30377482 30488554 29738057 30219012 30597100 30914522
9061 30914522 31579478 31704816 31839347 32600899 32871035 32586892 32474206 32089942 32418232
9052 32418232 33088569 34055693 34604928 34163715 35001118 35678478 35465620 35853825 36924774
9043 36924774 35996205 36626935 37187993 38328673 40058649 40934539 41277129 41968305 42700233
9034 42700233 43800250 45500286 45687105 46899489 48657512 50102845 51386231 52803871
9026 52803871 54507752 56846504 59082722 61384510 63721859 66501148 69231776 72917845
9018 72917845 75941339 78153601 77833514 79045253 80020251 81038483 82556012 84411857
$$ packed form
9080B9600702o19127n51524P77113j70201M64389L00640m22610m03303M9417m15828
9070B8609668N03935J273859J31641j41621J11072p50497M80955L78088L17422
9061C0914522O64956J25338J34531P61552K70136k84143j12686l84264L28290
9052C2418232O70337R67124N49235m41213Q37403O77360k12858L88205J070949
9043C6924774r28569O30730N61058J140680J729976Q75890L42590O91176P31928
9034D2700233J100017J700036J86819J212384J758023J445333J283386J417640
9026E2803871J703881K338752K236218K301788K337349K779289K730628L686069
9018G2917845L023494K212262l20087J211739R74998J018232J517529J855845
$$ plain form
9010 84411857 85248539 85700706 86736397 86395024 86356590 87569091 88862707 90720811 93141624
9001 93141624 95275371 97765494 100540795 103922702 107760505 111019586 115780620 119255840
8993 119255840 124913527 129911436 135282966 143391439 152871271 162947523 174633344 188619839
8985 188619839 204242591 222409250 242016029 264041420 287022641 308876345 327522786
8978 327522786 341085440 352366213 363580631 375759711 390193861 405806860 421319626
8971 421319626 432323982 435408949 430480226 419410981 401307621 378289818 353649183
8964 353649183 325836041 297891440 270627850 247011495 226108748 208600051 195516034
8957 195516034 183433024 173363990 164906962 158242591 154382607 150739278 147641228 145872568
$$ packed form
9010H4411857Q36682M52167J035691l41373l8434J212501J293616J858104K420813
9001I3141624K133747K490123K775301L381907L837803L259081M761034L475220
8993A19255840N657687M997909N371530Q108473R479832J0076252J1685821J3986495
8985A88619839J5622752J8166659J9606779K2025391K2981221K1853704J8646441
8978C27522786J3562654J1280773J1214418J2179080J4434150J5612999J5512766
8971D21319626J1004356L084967m928723j1069245j8103360k3017803k4640635
8964C53649183k7813142k7944601k7263590k3616355k0902747j7508697j3084017
8957A95516034j2083010j0069034q457028o664371l859984l643329l098050j768660
$$ plain form
8949 145872568 145069502 146117310 147997123 150873015 153958918 158209663 163248903 168210208
8941 168210208 171787533 174572414 176943301 178798946 180855720 185276933 190467697 196690630
8933 196690630 204706340 212028722 219602886 228040123 234904668 241929628 244932701 240130212
8925 240130212 224967876 203836853 182199838 162633513 145416048 131810187 120504017
8918 120504017 110726459 102577676 96601921 90870677 85488708 80867713 77779325 74258639
8910 74258639 71642596 68956506 66285948 65124034 62868002 61359072 60315235 59096654
8902 59096654 57724868 57172168 56819511 55916084 55470884 55598364 55219446 54639698 54270523
8893 54270523 55031693 55608572 56889283 58869523 59166620 59542998 61072633 64510880 68705130
$$ packed form
8949A45872568q03066J047808J879813K875892L085903M250745N039240M961305
8941A68210208L577325K784881K370887J855645K056774M421213N190764O222933
8933A96690630Q015710P322382P574164Q437237O864545P024960L003073m802489
8925B40130212j5162336k1131023k1637015j9566325j7217465j3605861j1306170
8918A20504017r777558q148783n975755n731244n381969m620995l088388l520686
8910G4258639k616043k686090k670558j161914k256032j508930j043837j218581
8902E9096654j371786n52700l52657r03427m45200J27480l78918n79748l69175
8893E4270523P61170N76879J280711J980240K97097L76378J529635L438247M194250
$$ plain form
8884 68705130 72633538 76496066 81732960 88353485 95007236 102678771 110162419 116784679
8876 116784679 121794838 123139652 119900362 113606245 105436524 96502941 88364032 81692307
8868 81692307 74601308 68278374 63355912 59142569 55635966 52220303 49419435 47113404
8860 47113404 45932337 44087602 42766710 41840541 40075740 38778063 38217774 38411226 37998931
8851 37998931 36904830 37964957 37879752 37501382 38229221 39533301 40184392 41518968 44337726
8842 44337726 46375752 48996751 52733247 56099667 58884216 61608734 61931739 61020286
8834 61020286 57481805 53438089 49199581 45021938 40718754 36881577 33753781 30603149
8826 30603149 28415757 26655219 24733205 23425525 22484393 21882159 20975950 20205654 19005069
$$ packed form
8884F8705130L928408L862528N236894O620525O653751P671535P483648O622260
8876A16784679N010159J344814l239290o294117q169721q933583q138909o671725
8868H1692307p090999o322934m922462m213343l506603l415663k800868k306031
8860D7113404j181067j844735j320892r26169j764801j297677n60289J93452m12295
8851C7998931j094101J060127q5205l78370P27839J304080O51091J334576K818758
8842D4337726K038026K620999L736496L366420K784549K724518L23005r11453
8834F1020286l538481m043716m238508m177643m303184l837177l127796l150632
8826C0603149k187392j760538j922014j307680r41132o02234r06209p70296j200585
$$ plain form
8817 19005069 18299328 17118406 15849239 15899895 15562449 14870754 14342957 13780172 13193746
8808 13193746 12739506 12569422 12106808 11643802 11905786 11658476 10603273 11194096 10707580
8799 10707580 10357636 10349109 10305504 9920716 9599279 8866917 7795616 7334452 7897505 7346636
8789 7346636 7665216 7775850 7704140 6997386 6721107 6475286 5620652 6561471 6203872 5989357
8779 5989357 6217643 5765246 5539050 5911730 5957869 6382818 6841041 6442594 5675469 5110472
8769 5110472 4583099 4462127 4638554 4699457 5287742 4465936 4028264 5122878 5182204 4769055
8759 4769055 4597293 5634410 4791608 5233108 4526488 3898331 4682148 4243393 4321192 4001806
8749 4001806 3747740 4547030 4479405 4473228 4569426 3844151 3635725 4692668 4708116 3907768
$$ packed form
8817A9005069p05741j180922j269167N0656l37446o91695n27797n62785n86426
8808A3193746m54240j70084m62614m63006K61984k47310j055203N90823m86516
8799A0707580l49944q527m3605l84788l21437p32362j071301m61164N63053n50869
8789G346636L18580J10634p1710p06754k76279k45821q54634R40819l57599k14515
8779E989357K28286m52397k26196L72680M6139M24949M58223l98447p67125n64997
8769E110472n27373j20972J76427O0903N88285q21806m37672J094614N9326m13149
8759D769055j71762J037117q42802M41500p06620o28157P83817m38755P7799l19386
8749D001806k54066P99290o7625o177R6198p25275k08426J056943J5448q00348
$$ plain form
8739 3907768 3348114 3910672 4657599 3955845 4019491 3762093 4052604 4712005 3924813 2886483
8729 2886483 3126738 3474862 3126442 3348656 2815206 2369194 2596970 2541561 2056110 2148118
8719 2148118 1851177 1687887 2290106 1135056 1182275 3028973 2471875 1447915 1292329
8710 1292329 1101195 1024644 1048098 445559 218986 402740 1629533 1889672 1652933 1226551
8700 1226551 1740544 1680180 1530680 2220286 1709865 2289790 2434554 2082250 2083057 1336607
8690 1336607 1287051 899236 635059 1083600 1000360 914557 1697057 1666678 1408190 1012721
8680 1012721 1105882 1460019 2139506 2434229 1730011 1154685 590877 922057 1351482 1284648
8670 1284648 1154005 859363 1106604 876381 722482 687871 345130 525531 746851 722251
$$ packed form
8739C907768n59654N62558P46927p01754O3646k57398K90511O59401p87192j038330
8729B886483K40255L48124l48420K22214n33450m46012K27776n5409m85451R2008
8719B148118k96941j63290O02219j155050M7219J846698n57098j023960j55586
8710A292329j91134p6551K3454o02539k26573J83754J226793K60139k36739m26382
8700A226551N13993o0364j49500O89606n10421N79925J44764l52304Q07p46450
8690A336607m9556l87815k64177M48541q3240q5803P82500l0379k58488l95469
8680A012721R3161L54137O79487K94723p04218n75326n63808L31180M29425o6834
8670A284648j30643k94642K47241k30223j53899l4611l42741J80401K21320k4600
$$ plain form
8660 722251 654643 2005984 1858485 2013848 976439 450817 1736382 1554867 1408739
8651 1408739 1389630 883779 354490 841641 1552139 1171621 762750 732168 1454698 1608296
8641 1608296 1474753 1425030 1039126 819378 919324 771102 1340222 1093735 772542 1071041
8631 1071041 502765 674135 1545027 1735259 1335052 1197324 1319754 1061602 1005226 1313323
8621 1313323 1682838 1514711 1316423 1557976 1229160 1245246 1504475 1349423 1139309 516621
8611 516621 99254 812506 1711570 2059256 2273257 2165882 2218876 808378 1100413 534034
8601 534034 129241 309130 215427 -380637 407805 1009470 1655518 1968073 1657011 2065539
8591 2065539 2000837 1798471 2188442 1866739 1905867 1358330 802542 953315 605294 338407
$$ packed form
8660G22251o7608J351341j47499J55363j037409n25622J285565j81515j46128
8651A408739j9109n05851n29289M87151P10498l80518m08871l0582P22530J53598
8641A608296j33543m9723l85904k19748R9946j48222N69120k46487l21193K98499
8631A071041n68276J71370Q70892J90232m00207j37728J22430k58152n6376L08097
8621A313323L69515j68127j98288K41553l28816J6086K59229j55052k10114o22688
8611E16621m17367P13252Q99064L47686K14001j07375N2994j410498K92035n66379
8601E34034m04793J79889r3703n96064P88442O01665O46048L12555l11062M08528
8591B065539o4702k02366L89971l21703L9128n47537n55788J50773l48021k66887
$$ plain form
8581 338407 1560540 2435753 779822 646958 -211179 1066864 2135776 1512695 732953
8572 732953 418498 1009658 1831384 1320946 407272 19628 791084 1298884 900710 810646
8562 810646 1095278 1593978 1394233 1196033 807393 -18641 374219 1192954 805662 382903
8552 382903 1241659 1061033 113372 -500383 201628 -101599 -430701 -1156182 -442370 -7217
8542 -7217 688995 437819 687063 660431 29352 192270 354865 227247 -90267 -83449 -298198
8531 -298198 -799046 30252 164215 -48842 644678 894848 830089 735847 439558 763259
8521 763259 713336 93488 -81215 -610971 -730822 -202181 -990107 -595157 279733 193434
8511 193434 -947143 -1102337 386387 -317236 -48119 142065 665588 500232 70142
$$ packed form
8581C38407J222133Q75213j655931j32864q58137J278043J068912o23081p79742
8572G32953l14455N91160Q21726n10438r13674l87644P71456N07800l98174r0064
8562H10646K84632M98700j99745j98200l88640q26034L92860Q18735l87292m22759
8552C82903Q58756j80626r47661o13755P02011l03227l29102p25481P13812M35153
8542g217O96212k51176K49244k6632o31079J62918J62595j27618l17514O818k14749
8531b98198n00848Q29298J33963k13057O93520K50170o4759r4242k96289L23701
8521G63259m9923o19848j74703n29756j19851N28641p87926L94950Q74890q6299
8511A93434j140577j55194J488724p03623K69117J90184N23523j65356m30090
$$ plain form
8502 70142 -815404 -3706 -129339 662148 745461 409524 387068 620342 -256959 -506556
8492 -506556 -228871 -542008 -318694 232831 539852 389273 -188065 682054 552002 314602
8482 314602 -93796 911496 487557 -436650 -310735 -617904 -297228 -557592 -893193 -576339
8472 -576339 -1097684 -888632 25753 -744238 -427321 -161289 -402042 -1326668 -324537 -87295
8462 -87295 -131471 -225105 -34457 563935 655289 435692 14774 -427797 132735 539105
8452 539105 372716 439260 43855 456565 496519 -684781 -762013 -283082 573341 584611
8442 584611 780224 -696710 -866759 -1078206 -582496 -71148 502338 896393 455729 -105697
8432 -105697 -738409 -1038792 -235166 -99460 -1275341 -1246076 -1019672 -781460 -1165042 -581236
$$ packed form
8502G0142q85546Q11698j25633P91487Q3313l35937k2456K33274q77301k49597
8492e06556K77685l13137K23314N51525L07021j50579n77338Q70119j30052k37400
8482C14602m08398J005292m23939r24207J25915l07169L20676k60364l35601L16854
8472e76339n21345K09052R14385p69991L16917K66032k40753r24626J002131K37242
8462h7295m4176r3634J90648N98392R1354k19597m20918m42571N60532M06370
8452E39105j66389O6544l95405M12710L9954j181300p7232M78931Q56423J1270
8442E84611J95613j476934j70049k11447M95710N11348N73486L94055m40664n61426
8432a05697o32712l00383Q03626J35706j175881K9265K26404K38212l83582N83806
$$ plain form
8422 -581236 -758091 -409130 -99230 336398 -90118 239562 -722496 -752338 769560 -242246
8412 -242246 -148169 -177127 -122470 18012 -356936 -209165 -439225 -1330641 -1334652 -556019 -469056
8401 -469056 -1172704 -896009 -27716 -609896 -747385 -1322645 -1148517 -287378 -792510 -1175681
8391 -1175681 -998822 -711834 -950886 -658364 -250964 -53619 -167960 -17996 -433905 -1036919
8381 -1036919 -915418 -87633 366259 -650658 -263352 -708706 195539 171108 -692636 -370726
8371 -370726 -489402 -200308 -705140 -740464 -734920 -409317 -137659 -592228 -1082075 -971507
8361 -971507 -684034 -934744 -1075904 -1014358 -1139691 -1450755 -1300578 -779970 -448871 -598760
8351 -598760 -472650 -67355 -731793 -358874 -87052 -463645 -854183 -717291 -188964 924414
$$ packed form
8422e81236j76855L48961L09900M35628m26516L29680r62058k9842J521898j011806
8412b42246R4077k8958N4657J40482l74948J47771k30060q91416m011P78633Q6963
8401d69056p03648K76695Q68293n82180j37489n75260J74128Q61139n05132l83171
8391a175681J76859K86988k39052K92522M07400J97345j14341J49964m15909o03014
8381a036919J21501Q27785M53892j016917L87306m45354R04245k4431q63744L21910
8371c70726j18676K89094n04832l5324N544L25603K71658m54569m89847J10568
8361i71507K87473k50710j41160O1546j25333l11064J50177N20608L31099j49889
8351e98760J26110M05295o64438L72919K71822l76593l90538J36892N28327J113378
$$ plain form
8341 924414 439996 84057 232974 -463030 -241703 51372 -272585 -330566 -516673 -172767
8331 -172767 -10837 -480757 -532341 -575866 -578499 -183619 -782126 -2157672 -2627189 -1568024
8321 -1568024 -1085748 -1241698 -1041472 -672367 -782054 -1457356 -1287244 -1041729 -1353794 -1880052
8311 -1880052 -1172449 -1552727 -1497493 -937625 -624462 -1046134 -1465372 -1468993 -569351 -252946
8301 -252946 -472735 -199633 -160292 -167403 24309 83461 -1318113 -637176 380372 225201
8291 225201 -865838 -1966490 -1470631 -1405639 -1362853 -1003455 -1444093 -1484432 -762472 -1129935
8281 -1129935 -851803 -901164 265754 16760 -142673 -1174958 -947270 174362 556444
8272 556444 1106515 898986 -269644 -938048 -1302889 -1267426 -1237563 -815489 -777985 -1313580
$$ packed form
8341I24414m84418l55939J48917o96004K21327K93075l23957n7981j86107L43906
8331a72767J61930m69920n1584m3525k633L94880n98507j375546m69517J059165
8321a568024M82276j55950K00226L69105j09687o75302J70112K45515l12065n26258
8311a880052P07603l80278N5234N59868L13163m21672m19238l621Q99642L16405
8301b52946k19789K73102L9341p111J91712N9152j401574O80937J017548j55171
8291B25201j091039j100652M95859O4992M2786L59398m40638m0339P21960l67463
8281a129935K78132m9361J166918k48994j59433j032285K27688J121632L82082
8272E56444N50071k07529j168630o68404l64841L5463K9863M22074L7504n35595
$$ plain form
8262 -1313580 -778224 -970662 -1340578 -1165713 -313293 -802604 -829099 -563906 -1182128 -1343986
8252 -1343986 157313 -793354 -797786 -852333 -595020 103664 -779737 -705362 -495281 -1448717
8242 -1448717 -1868153 -1278015 -816331 -1155381 -1269128 -514899 -112255 -261477 -564352 -424477
8232 -424477 -68829 -892147 -1272169 -1211662 -776225 -853261 -1474108 -1283453 -1099600 -1313437
8222 -1313437 -1232527 -1580608 -1277763 -1558222 -1071599 -261951 -195437 -603153 -946454 -506060
8212 -506060 85419 264242 -8446 -516578 -471084 -1478081 -1345745 -706036 -984338 -781680
8202 -781680 -1440850 -1209530 -1133401 -842668 -651007 477957 55643 -338628 -308949 -903192
8192 -903192 707741 1567837 78584 398153 54770 -314645 214680 -40621 -252108
$$ packed form
8262a313580N35356j92438l69916J74865Q52420m89311k6495K65193o18222j61858
8252a343986J501299r50667m432n4547K57313O98684q83401P4375K10081r53436
8242a448717m19436N90138M61684l39050j13747P54229M02644j49222l02875J39875
8232d24477L55648q23318l80022O0507M35437p7036o20847J90655J83853k13837
8222a313437Q0910l48081L02845k80459M86623Q09648O6514m07716l43301M40394
8212e06060N91479J78823k72688n08132M5494j006997J32336O39709k78302K02658
8202g81680o59170K31320P6129K90733J91661J128964m22314l94271K9679n94243
8192i03192J610933Q60096j489253L19569l43383l69415N29325k55301k11487
$$ plain form
8183 -252108 -429406 -721382 -724438 -809599 -904273 -321843 263451 -653976 -812682 -887953 -1251126
8172 -1251126 -1110183 -858681 -1298863 -2224270 -1491113 -1089908 -419094 416390 -262321 -1080638
8162 -1080638 -224705 -550490 -1374502 -1492373 -2040121 -1691028 -1117022 -1132137 -1134887 -603286
8152 -603286 -502197 -810292 -663077 -314985 16454 -737664 -765799 -314679 -1154114 -626977
8142 -626977 -942646 -1221920 -669541 -1069910 -1475827 -1078990 -649435 -1127794 -1941440 -2059553
8132 -2059553 -504426 265506 -29727 -341722 -159191 -774464 -883585 -972563 -1346923 -899881
8122 -899881 -1441197 -1581708 -1375050 -794566 -765967 -1421140 -481131 -1480122 -1590971 -1728590
8112 -1728590 -1559042 -926244 -744883 -274351 -1041687 -1123030 -785556 294372 -398377 -536515
$$ packed form
8183b52108j77298k91976l056q5161r4674N82430N85294r17427j58706p5271l63173
8172a251126J40943K51502m40182r25407P33157M01205O70814Q35484o78711q18317
8162a080638Q55933l25785q24012j17871n47748L49093N74006j5115k750N31601
8152f03286J01089l08095J47215L48092L31439p54118k8135M51120q39435N27137
8142f26977l15669k79274N52379m00369m05917L96837M29555m78359q13646j18113
8132b059553J555127P69932k95233l11995J82531o15273j09121q8978l74360M47042
8122h99881n41316j40511K06658N80484K8599o55173R40009r98991j10849j37619
8112a728590J69548O32798J81361M70532p67336q1343L37474J079928o92749j38138
$$ plain form
8102 -536515 -650742 -254789 -118538 -1030291 -1015704 -989489 -1668846 -2544783 -993845 -244909
8092 -244909 -85916 -164106 -648138 -418090 -538390 -162699 -359272 -963335 -735748 -499035
8082 -499035 -1493455 -1646702 -655171 -401666 -596654 -1485543 -347146 -407198 -652686 -218659
8072 -218659 -832631 -442284 -685644 -1155346 -643500 -376206 -163917 -580291 -421497 525189
8062 525189 114970 -614973 -1051694 -1714036 -1313326 -261657 -304796 -269231 -825576 -901540
8052 -901540 -1010216 -1077063 -1337636 -157262 563421 277185 -621301 -1477938 -909407 378796
8042 378796 -685437 -535839 -351184 -1001004 -1855613 -1342201 24995 -459086 -576522
8033 -576522 -993193 -618038 -1425964 -800526 -973300 -646575 93174 141812 -700346 -1310564
$$ packed form
8102e36515j14227L95953J36251r11753J4587K6215o79357q75937J550938P48936
8092b44909J58993p8190m84032K30048j20300L75691j96573o04063K27587K36713
8082d99035r94420j53247R91531K53505j94988q88889J138397o0052k45488M34027
8072b18659o13972L90347k43360m69702N11846K67294K12289m16374J58794R46686
8062E25189m10219p29943m36721o62342M00710J051669m3139L5565n56345p5964
8052i01540j08676o6847k60573J180374P20683k86236q98486q56637N68531J288203
8042C78796j064233J49598J84655o49820q54609N13412J367196m84081j17436
8033e76522m16671L75155q07926O25438j72774L26725P39749M8638q42158o10218
$$ plain form
8023 -1310564 -938775 -1121613 -677119 -848243 -1145781 -971394 -1206621 -1167944 -843621 -1958554
8013 -1958554 -1611472 -545843 -863785 -1232092 -2066299 -1530764 -861222 -877566 -1151298 -1391511
8003 -1391511 -509565 -1344616 -903024 -372328 -562259 -183465 -713042 -447904 742900
7994 742900 1054718 -77436 -121237 95412 -858620 -789121 -1547652 -2097717 -745276 -828469
7984 -828469 -666495 -915370 230583 288328 100010 -558662 -1441941 -1295983 -1056891 -1233893
7974 -1233893 -1470430 -850089 -1833665 -1980387 -762318 -682101 -739838 -392022 -258543 -182208
7964 -182208 -555857 -564767 -201868 -739840 -1190320 -682470 -1558487 -1335585 -1228345 -1516572
7954 -1516572 -1594789 -1162456 -797947 -533961 -201202 -308941 -543551 -596951 -743595 -134618
$$ packed form
8023a310564L71789j82838M44494j71124k97538J74387k35227L8677L24323j114933
8013a958554L47082J065629l17942l68307q34207N35535O69542j6344k73732k40213
8003a391511Q81946q35051M41592N30696j89931L78794n29577K65138J190804
7994G42900L11818j132154m3801K16649r54032O9499p58531n50065J352441q3193
7984h28469J61974k48875J145953N7745j88318o58672q83279J45958K39092j77002
7974a233893k36537O20341r83576j46722J218069Q0217n7737L47816J33479P6335
7964a82208l73649q910L62899n37972m50480N07850q76017K22902J07240k88227
7954a516572p8217M32333L64509K63986L32759j07739k34610n3400j46644O08977
$$ plain form
7944 -134618 -433333 336661 362888 -46083 261188 -563073 -236715 -106973 -377967 -367365
7934 -367365 -541176 -804380 -890353 -789904 -886966 -752057 -817650 -971915 -41934 -827777
7924 -827777 -1354823 -1374697 -1369639 -162251 512688 130584 -523507 -1497491 -1734399 -1913814
7914 -1913814 -1304506 -729516 -237105 -544846 -1534501 -1407332 -857991 -535053 -714201 -755601
7904 -755601 -653016 -763784 -1574337 -1566976 -894047 -1438919 -852377 -951444 -824769 -230020
7894 -230020 -1051220 -921742 -865524 -118627 76369 -109663 -307051 -1325975 -572505 -235391
7884 -235391 -600126 -361159 -648524 -1056632 -246888 -648399 -729350 -385774 -1317981 -1565176
7874 -1565176 -1488780 -1715410 -1383912 -1223579 -767377 -606510 -239699 -520372 -383147 -856005
$$ packed form
7944a34618k98715P69994K6227m08971L07271q24261L26358J29742k70994J0602
7934c67365j73811k63204q5973J00449r7062J34909o5593j54265R29981p85843
7924h27777n27046j9874N058J207388O74939l82104o54091r73984k36908j79415
7914a913814O09308N74990M92411l07741r89655J27169N49341L22938j79148m1400
7904g55601J02585j10768q10553P361O72929n44872N86542r9067J26675N94749
7894b30020q21200J29478N6218P46897J94996j86032j97388j018924P53470L37114
7884b35391l64735K38967k87365m08108Q09744m01511q0951L43576r32207k47195
7874a565176P6396k26630L31498J60333M56202J60867L66811k80673J37225m72858
$$ plain form
7864 -856005 -888981 -575466 -1803642 -2026468 -2250814 -1291532 -827932 -584625 -850466 -1143323
7854 -1143323 -531981 -845509 -761204 -410387 -275525 59342 224733 -490609 -1445270 -1633484
7844 -1633484 -1340403 -853386 -627525 -586502 -1340198 -877230 -567735 -222617 -986903 -773067
7834 -773067 -1221541 -1295003 -1577619 -2003108 -5052 -111779 -724537 -343849 -1065316 -1691555
7824 -1691555 -527909 -259903 -938091 -1634531 -1163989 -691858 -665797 -632786 -480145 -776177
7814 -776177 -662664 -646668 -909777 -488347 -178340 -4934 -1070638 -384194 -361731 408731
7804 408731 -668633 -1183437 -920694 -1043043 -1354393 -1648709 -1714685 -1765069 -1114827 -2003080
7794 -2003080 -1211741 -457504 -751438 -628421 -616568 -942789 -1175969 -1873745 -1155466 -1156895
$$ packed form
7864h56005l2976L13515j228176k22826k24346R59282M63600K43307k65841k92857
7854a143323O11342l13528Q4305L50817J34862L34867J65391p15342r54661j88214
7844a633484K93081M87017K25861M1023p53696M62968L09495L45118p64286K13836
7834g73067m48474p3462k82616m25489J998056j06727o12758L80688p21467o26239
7824a691555J163646K68006o78188o96440M70542M72131K6061L3011J52641k96032
7814g76177J13513J5996k63109M21430L10007J73406j065704O86444K2463P70462
7804D08731j077364n14804K62743j22349l11350k94316o5976n0384O50242q88253
7794b003080P91339P54237k93934J23017J1853l26221k33180o97776P18279j429
$$ plain form
7784 -1156895 -1571010 -1638214 -925807 -825359 -711937 -480919 -752555 -528732 -368060 -318164
7774 -318164 -557939 -896381 -1149473 -969266 -1054439 -706202 -607536 -1643226 -641196 -545538
7764 -545538 -1046264 -951792 -576097 -770293 -5039 118637 -785608 -1089816 -716106 -202392
7754 -202392 -361163 32671 101649 450837 205737 -368367 -945214 -742109 -957318 -1119886
7744 -1119886 -819339 -735573 -714417 -1490067 -931163 -583491 -1150199 -207123 -403189 -1174996
7734 -1174996 -1284024 -731557 -904100 -1049202 -744501 -420228 -170005 164132 456756 688489
7724 688489 -377583 -774312 -234917 -952962 -1254269 -606788 -381164 -128851 498269 407444
7714 407444 -948293 -1184399 -875645 -1150717 -260430 -435982 -854653 -839340 -796801 -1161551
$$ packed form
7784a156895m14115o7204P12407J00448J13422K31018k71636K23823J60672M9896
7774c18164k39775l38442k53092J80207q5173L48237R8666j035690J002030R5658
7764e45538n00726R4472L75695j94196P65254J23676r04245l04208L73710N13714
7754b02392j58771L93834O8978L49188k45100n74104n76847K03105k15209j62568
7744a119886L00547Q3766K1156p75650N58904L47672n66708R43076j96066p71807
7734a174996j09028N52467j72543j45102L04701L24273K50223L34137K92624K31733
7724F88489j066072l96729N39395p18045l01307O47481K25624K52313O27120r0825
7714D07444j355737k36106L08754k75072Q90287j75552m18671J5313M2539l64750
$$ plain form
7704 -1161551 -391936 -93020 -329733 63855 -324358 -1199496 -812960 -717093 -450203 -223260
7694 -223260 -194533 -185545 -573637 -1022845 -1594184 -1186199 -819108 -431393 146856 -758645
7684 -758645 -1525354 -687871 -1203704 -937526 -827221 -869240 -652652 -346098 -472045 -852128
7674 -852128 -798664 -551542 -398169 -99912 76906 -38109 -54583 202890 416990 406638
7664 406638 179504 -171348 243399 -257637 -918475 -257806 -488582 -867163 -977217 -1296843
7654 -1296843 -1584457 -1144351 159999 -271094 -40302 -626615 -635391 -1273074 -1188375 -1238247
7644 -1238247 -398441 36514 -463169 -1518001 -1337526 -836603 -1301489 -787985 -179755
7635 -179755 -609927 -904792 -538110 -565548 462931 834723 739015 -173163 -403486 119005
$$ packed form
7704a161551P69615K98916k36713L93588l88213q75138L86536R5867K66890K26943
7694b23260K8727Q988l88092m49208n71339M07985L67091L87715N78249r05501
7684g58645p66709Q37483n15833K66178J10305m2019K16588L06554j25947l80083
7674h52128N3464K47122J53373K98257J76818j15015j6474K57473K14100j0352
7664D06638k27134l50852M14747n01036o60838O60669k30776l78581j10054l19626
7654a296843k87614M40106J304350m31093K30792n86313q776o37683Q4699m9872
7644a238247Q39806M34955m99683j054832J80475N00923m64886N13504O08230
7635a79755m30172k94865L66682k7438J028479L71792r5708r12178k30323N22491
$$ plain form
7625 119005 -138371 -721785 -1643709 -631445 215598 -31437 -70153 262241 -28443 -640107
7615 -640107 -430859 -752730 -450590 88552 -336451 -39174 61401 -262966 -261084 46198
7605 46198 -454899 -310994 -753079 -1512687 -1103603 -1392265 -218336 -872884 -119138 -1186344
7595 -1186344 -893136 -771907 -1189505 -998583 -495218 -111843 666932 944146 -23519 -380299
7585 -380299 -614176 108230 1163061 893 -983194 -1235738 -1064471 -451651 -995214
7576 -995214 -969192 -25512 -90615 -665638 -427812 -86940 -345772 -1041190 -866177 -747460
7566 -747460 -407999 -846404 -1171175 -1140491 -795568 -839171 -544450 -680937 -662970 -567543
7556 -567543 15154 -136186 -648704 -356518 162941 192739 -923510 -1160696 -1400756 -622108
$$ packed form
7625A19005k57376n83414r21924J012264Q47043k47035l8716L32394k90684o11664
7615f40107K09248l21871L02140N39142m25003K97277J00575l24367J882L07282
7605D6198n01097J43905m42085p59608M09084k88662J173929o54548P53746j067206
7595a186344K93208J21229m17598J90922N03365L83375P78775K77214r67665l56780
7585c80299k33877P22406J054831j162168r84087k52544J71267O12820n43563
7576i95214K6022R43680o5103n75023K37826L40872k58832o95418J75013J18717
7566g47460L39461m38405l24771L0684L44923m3603K94721j36487J7967R5427
7556e67543N82697j51340n12518K92186N19459K9798j116249k37186k40060P78648
$$ plain form
7546 -622108 -814415 -819904 341253 490979 -669801 -969223 -1217117 -221186 357072 -94804
7536 -94804 112730 157588 -84445 -169978 -363435 -422237 176849 -505786 -1058672 -1750554
7526 -1750554 -2190520 -1606024 -1036464 -1210105 -1354999 -1004463 -590553 -539303 -1489440 -1429928
7516 -1429928 -610246 -246748 -910737 -1376829 -1026946 -1432906 -1250649 -1136752 -1173925 -779581
7506 -779581 -1014492 -1140458 -918706 -403661 512095 -244256 -393942 -601852 -946985 -638199
7496 -638199 -334977 -1040011 -1555069 -565701 296013 -353819 -1199690 -1366909 -446512 -285228
7486 -285228 -868243 -1511329 -481545 -1031175 -1537475 -546389 -1108991 -1028908 -717957 -1127160
7476 -1127160 -1531712 -1635879 -1391839 -1161914 -646009 1092993 1206051 359705 -402481
$$ packed form
7546f22108j92307n489J161157J49726j160780k99422k47894R95931N78258m51876
7536i4804K07534M4858k42033q5533j93457n8802N99086o82635n52886o91882
7526a750554m39966N84496N69560j73641j44894L50536M13910N1250r50137N9512
7516a429928Q19682L63498o63989m66092L49883m05960J82257J13897l7173L94344
7506g79581k34911j25966K21752N15045R15756p56351j49686k07910l45133L08786
7496f38199L03222p05034n15058R89368Q61714o49832q45871j67219R20397J61284
7486b85228n83015o43086J029784n49630n06300R91086n62602Q0083L10951m09203
7476a127160m04552j04167K44040K29925N15905J739002J13058q46346p62186
$$ plain form
7467 -402481 -736165 -335148 52955 555076 -363794 24250 -737745 -755848 437362 -562842
7457 -562842 -2096705 -2061244 -1300863 -1258826 -1150540 -280845 -815603 -154945 -600357 -276087
7447 -276087 -322137 -1066889 -235386 -705358 -1058054 -875359 -979568 -453722 -619077 -1042084
7437 -1042084 -518200 -974840 -575000 -840504 -1202540 -451129 -915472 -888552 -490505 -1035633
7427 -1035633 -604943 -424704 -652535 -605668 -606918 -327024 -1009319 -919704 -127630 -434000
7417 -434000 -2067 58201 504728 -388891 -997709 -710414 -28192 201363 342395 386825
7407 386825 -253927 -1259857 -581458 -1121559 -551912 -527692 -1105009 -547307 -215573 -428390
7397 -428390 -913995 -515153 460114 -91442 -398420 591905 -69671 -927378 -1355913 -901572
$$ packed form
7467d02481l33684M01017L88103N02121r18870L88044p61995j8103J193210j000204
7457e62842j533863L5461P60381M2037J08286Q69695n34758O60658m45412L24270
7447b76087m6050p44752Q31503m69972l52696J82695j04209N25846j65355m23007
7437a042084N23884m56640L99840k65504l62036P51411m64343K6920L98047n45128
7427a035633M30690J80239k27831M6867j250K79894o82295Q9615P92074l06370
7417d34000M31933O0268M46527q93619o08818K87295O82222K29555J41032M4430
7407C86825o40752j005930O78399n40101N69647K4220n77317N57702L31734k12817
7397d28390m85605L98842R75267n51556l06978R90325o61576q57707m28535M54341
$$ plain form
7387 -901572 -102598 -569266 -732295 -706255 -942075 -1396238 -1459048 -131250 322163 183122
7377 183122 -222487 -281328 523896 332676 -246674 -187639 589538 15184 -144428 -307559
7367 -307559 -410740 -921362 -1248273 -947310 -936246 -1320435 -1084456 -1009237 -181071 -672321
7357 -672321 -1086308 -671933 -918201 -920630 -493593 -506694 -1162457 -971028 -800478 -446252
7347 -446252 -471900 -65841 -180252 -279569 -561259 103869 24787 -169645 -1042172 -887481
7337 -887481 -586689 -756970 -248736 270133 -130429 -98843 432189 -397491 -706812 -646954
7327 -646954 -757050 -638914 -258024 341543 256297 -170288 -462794 524779 635207 535383
7317 535383 -529388 -1285967 -933307 -238795 140833 -436273 466525 45365 -357697 -412020
$$ packed form
7387i01572P98974m66668j63029K6040k35820m54163o2810J327798M53413j39041
7377A83122m05609n8841Q05224j91220n79350N9035P77177n74354j59612j63131
7367c07559j03181n10622l26911L00963J1064l84189K35979P5219Q28166m91250
7357f72321m13987M14375k46268k429M27037j3101o55763J91429J70550L54226
7347d46252k5648M06059j14411r9317k81690O65128p9082j94432q72527J54691
7337h87481L00792j70281N08234N18869m00562L1586N31032q29680l09321N9858
7327f46954j10096J18136L80890N99567q5246m26585k92506R87573J10428r9824
7317E35383j064771p56579L52660O94512L79628n77106R02798m21160m03062n4323
$$ plain form
7307 -412020 -139691 -1173035 -972304 -879192 -288523 -215248 -661041 -611748 21083 -63398
7297 -63398 229965 225030 53223 265022 -448759 -299007 -67034 -71699 194151 121685 -923154
7286 -923154 -570771 -266129 242093 -385949 125559 -135776 -835824 -122896 719700 -364639
7276 -364639 -742272 -952371 -1045785 -424209 538167 -127735 28043 109061 43425 -33621
7266 -33621 -630142 -321535 -617185 -513482 -475123 -730308 -549858 -617140 -390719 -54746
7256 -54746 476002 -37518 628044 -13347 290230 208089 -662535 -232148 -372706 422902
7246 422902 392951 977352 1000233 -96003 -94492 396389 -115961 -105516 -128233 47669 363186
7235 363186 -206834 -854220 11152 266318 706297 214645 -103483 709098 838996 288505
$$ packed form
7307d12020K72329j033344K00731R3112N90669P3275m45793M9293O32831q4481
7297f3398K93363m935j71807K11799p13781J49752K31973m665K65850p2466j044839
7286i23154L52383L04642N08222o28042N11508k61335p00048P12928Q42596j084339
7276c64639l77633k10099r3414O21576R62376o65902J55778Q1018o5636p7046
7266c3621n96521L08607k95650J03703L8359k55185J80450o7282K26421L35973
7256e4746N30748n13520O65562o41391L03577q2141q70624M30387j40558P95608
7246D22902k9951N84401K2881j096236J511M90881n12350J0445k2717J75902L15517
7235C63186n70020o47386Q65372K55166M39979m91652l18128Q12581J29898n50491
$$ plain form
7225 288505 -3714 -104923 -460278 -505781 -973125 -827752 -786585 -297974 -533855 599359
7215 599359 347298 -614373 -523602 81271 89882 239857 169602 321200 15301 55681 409717
7204 409717 114859 18201 -1034090 -266545 166389 55946 -133276 346353 492871 603601
7194 603601 -93417 -125849 455893 817034 413207 356712 -320579 -140729 -161142 247536
7184 247536 746057 617119 410365 786520 700897 1169946 478978 197994 187296 -154030
7174 -154030 433362 999921 309461 -357955 -534526 6836 474456 1364228 925520 363262
7164 363262 410881 57990 1007238 497352 -26344 431733 1046419 1417758 1153243 956209
7154 956209 911462 1341076 749487 910786 1686668 1516527 504852 782899 1187024 538195
$$ packed form
7225B88505k92219j01209l55355m5503m67344J45373M1167M88611k35881J133214
7215E99359k52061r61671R0771O04873Q611J49975p0255J51598l05899M0380L54036
7204D09717k94858r6658j052291P67545M32934j10443j89222M79629J46518J10730
7194F03601o97018l2432N81742L61141m03827n6495o77291J79850k0413M08678
7184B47536M98521j28938k06754L76155q5623M69049o90968k80984j0698l41326
7174a54030N87392N66559o90460o67416j76571N41362M67620Q89772m38708n62258
7164C63262M7619l52891R49248n09886n23696M58077O14686L71339k64515j97034
7154I56209m4747M29614n91589J61299P75882j70141j011675K78047M04125o48829
$$ plain form
7144 538195 290640 67281 870727 799276 730544 1693313 1091684 705915 871111 419922
7134 419922 525154 446561 962645 995895 1275694 1226392 904648 1642950 1152005 1354663
7124 1354663 1871575 1028882 1164821 896563 407760 366923 451479 595419 1253095 1232053
7114 1232053 1125735 611544 1118541 1629879 1034398 -223027 145039 1376626 1220611
7105 1220611 1402981 1829243 2173235 1784671 1814130 1911873 1349349 1920557 1594599 1248825
7095 1248825 807814 925709 1217409 1681649 2140453 2153801 1688832 1783178 1641042 1645052
7085 1645052 2250378 2761863 2520398 2905745 2938518 2403277 1946785 3086401 2671657 1274827
7075 1274827 881576 1245522 1645726 2091741 2909137 3294112 2867058 2741945 3101233 2595575
$$ packed form
7144E38195k47555k23359Q03446p1451o8732R62769o01629l85769J65196m51189
7134D19922J05232p8593N16084L3250K79799m9302l21744P38302m90945K02658
7124A354663N16912q42693J35939k68258m88803m0837Q4556J43940O57676k1042
7114A232053j06318n14191N06997N11338n95481j257425L68066J231587j56015
7105A220611J82370M26262L43992l88564K9459R7743n62524N71208l25958l45774
7095A248825m41011J17895K91700M64240M58804J3348m64969R4346j42136M010
7085A645052O05326N11485k41465L85347L2773n35241m56492J139616m14744j396830
7075A274827l93251L63946M00204M46015Q17396L84975m27054j25113L59288n05658
$$ plain form
7065 2595575 2994251 2137487 1963932 2334016 1937174 1803082 1953104 1966614 2380231 2189128
7055 2189128 1663599 2616645 3076971 2139220 1938234 1639099 2131168 2520166 2062807 2030863
7045 2030863 2419813 1899440 2794107 2831914 2260294 2654939 2283307 1653886 2044817 2562329
7035 2562329 3046076 3264784 2377222 2562867 2731021 3309492 4483869 4114170 3955837
7026 3955837 3297279 2562909 3035701 2620574 2699213 2291017 2746405 2980962 2967059 3104466
7016 3104466 3072827 3875239 4813320 4005981 3965827 3920670 3420516 4192944 4751891 4621260
7006 4621260 4410225 3825006 3613733 3312100 3072177 3141142 3551711 3237094 3911671 4325785
6996 4325785 4107214 4082424 4147605 4682154 4634996 4594185 4850906 3646964 3323738 4754068
$$ packed form
7065B595575L98676q56764j73555L70084l96842j34092J50022J3510M13617j91103
7055B189128n25529R53046M60326r37751k00986k99135M92069L88998m57359l1944
7045B030863L88950n20373Q94667L7807n71620L94645l71632o29421L90931N17512
7035B562329M83747K18708q87562J85645J68154N78471J174377l69699j58333
7026C955837o58558p34370M72792m15127P8639m08196M55388K34557j3903J37407
7016C104466l1639Q02412R38081q07339m0154m5157n00154P72428N58947j30631
7006D621260k11035n85219k11273l01633k39923O8965M10569l14617O74577M14114
6996D325785k18571k4790O5181N34549m7158m0811K56721j203942l23226J430330
$$ plain form
6986 4754068 4458650 4892755 4559197 4537436 4758967 5567325 5839822 5513040 5279156 5435167
6976 5435167 5359379 5701277 5384956 5653342 4957414 5047275 5407748 6189148 5711340 6338980
6966 6338980 6463215 6524995 6173504 5568057 6125095 6004293 5666444 5449010 5633954 5908359
6956 5908359 6381907 6396646 6807143 5433138 5500191 6301192 6723874 6469573 6557504 7084674
6946 7084674 6925185 7128149 7345514 7336164 7420452 7735391 8003839 8087762 8052254 8500553
6936 8500553 8254884 8194408 8211918 7743371 8590005 9269806 9513218 9347253 9148016 9629112
6926 9629112 10330350 9758751 9899177 9628966 9642609 9825117 9546010 10082124 10191859 11353847
6916 11353847 11464097 11055319 11499193 10532998 10727659 11134335 11175364 11698886 12977294
$$ packed form
6986D754068k95418M34105l33558k1761K21531Q08358K72497l26782k33884J56011
6976E435167p5788L41898l16321K68386o95928Q9861L60473P81400m77808O27640
6966F338980J24235O1780l51491o05447N57038j20802l37849k17434J84944K74405
6956E908359M73548J4739M10497j374005O7053Q01001M22682k54301Q7931N27170
6946G084674j59489K02964K17365r350Q4288L14939K68448Q3923l5508M48299
6936H500553k45669o0476J7510m68547Q46634O79801K43412j65965j99237M81096
6926I629112P01238n71599J40426k70211J3643J82508k79107N36114J09735J161988
6916A1353847J10250m08778M43874r66195J94661M06676M1029N23522J278408
$$ plain form
6907 12977294 12958219 13245061 13130155 13097439 14118759 14089416 14683885 15328978 15231528 15789389
6897 15789389 16197236 15576343 14874117 13819892 14741662 15063803 15082093 15111895 16069420 16719104
6887 16719104 16413208 16264785 16053561 16489367 16773146 16945877 18599934 18902164 18372341
6878 18372341 17922100 18085988 18726058 18997612 19863597 19863079 20864133 20858316 20985043 21475616
6868 21475616 22061657 22724343 23088114 22725894 23755142 24010615 23744088 24973326 25269567
6859 25269567 24517668 24864813 25814459 26405997 27004176 27596494 28848524 30145686 29969076
6850 29969076 29288210 29958028 30941991 30701460 32219871 32087184 31747888 33680126 35117578
6841 35117578 36198948 36795222 36371797 37447650 38787711 39638234 40996578 41182153 41382763
$$ packed form
6907A2977294j9075K86842j14906l2716J021320k9343N94469O45093r7450N57861
6897A5789389M07847o20893p02226j054225R21770L22141J8290K9802R57525O49684
6887A6719104l05896j48423k11224M35806K83779J72731J654057L02230n29823
6878A8372341m50241J63888O40070K71554Q65985n18J001054n817J26727M90573
6868B1475616N86041O62686L63771l62220J029248K55473k66527J229238K96241
6859B5269567p51899L47145R49646N91538N98179N92318J252030J297162j76610
6850B9969076o80866O69818R83963k40531J518411j32687l39296J932238J437452
6841C5117578J081370N96274m23425J075853J340061Q50523J358344J85575K00610
$$ plain form
6832 41382763 41895970 43221911 43750218 44121178 45655614 46129482 47026093 49303640 50063818
6823 50063818 51529558 52518040 53375368 54221195 55206743 56742051 57602504 59428640 60897188
6814 60897188 61729030 63667944 65092572 65723796 67411910 69213917 70053066 71609143 72761493
6805 72761493 74620013 76304474 78883119 80501278 82715840 83772699 85645549 88025183
6797 88025183 88966739 91396270 93373461 95441490 97322869 99840263 102506287 104029263
6789 104029263 105238247 108337436 110214596 111853601 113434300 115524841 117403219 119008611
6781 119008611 121643939 122976346 124787817 126351899 126625561 129014456 130578157 131468572
6773 131468572 132002401 132076834 132918838 132664510 131752889 132508199 131412917 131042221 131108590
$$ packed form
6832D1382763N13207J325941N28307L70960J534436M73868Q96611K277547P60178
6823E0063818J465740R88482Q57328Q45827R85548J535308Q60453J826136J468548
6814F0897188Q31842J938914J424628O31224J688114J802007Q39149J556077J152350
6805G2761493J858520J684461K578645J618159K214562J056859J872850K379634
6797H8025183R41556K429531J977191K068029J881379K517394K666024J522976
6789A04029263J208984L099189J877160J639005J580699K090541J878378J605392
6781A19008611K635328J332407J811471J564082K73662K388895J563701Q90415
6773A31468572N33829P4433Q42004k54328r11621P55310j095282l70696O6369
$$ plain form
6764 131108590 130002345 128648779 127628357 126203435 124422371 122817835 120809610 118316667
6756 118316667 115718327 113673763 111424084 109835569 108049172 104786969 101660795 99992455
6748 99992455 97417985 95651933 92854369 90715756 88021662 85863974 84138903 82078949
6740 82078949 80562144 77222732 73898267 72306308 70594527 68917067 67376110 64733565
6732 64733565 62917458 61108485 59494972 58673014 56644623 55160447 53870659 52990257
6724 52990257 51517141 50626239 49071041 47518665 46308048 44570885 43982771 43281152 41402631
6715 41402631 39396467 39206507 39157882 37910130 37093404 35866167 35050701 34730806 34021147
6706 34021147 32842002 31509478 31225440 30485046 30211038 29627922 29021569 27831681 27204936
$$ packed form
6764A31108590j106245j353566j020422j424922j781064j604536k008225k492943
6756A18316667k598340k044564k249679j588515j786397l262203l126174j668340
6748I9992455k574470j766052k797564k138613k694094k157688j725071k059954
6740H2078949j516805l339412l324465j591959j711781j677460j540957k642545
6732F4733565j816107j808973j613513q21958k028391j484176j289788q80402
6724E2990257j473116q90902j555198j552376j210617j737163n88114p01619j878521
6715D1402631k006164j89960m8625j247752q16726j227237q15466l19895p09659
6706C4021147j179145j332524k84038p40394k74008n83116o06353j189888o26745
$$ plain form
6697 27204936 26627376 26450759 26090830 25443920 24681198 23511927 22943848 22757783 21798341
6688 21798341 22280102 21754179 21390954 21729886 21444481 20124213 20094232 20294135 18889436
6679 18889436 18771159 18080014 17870479 17200332 16509862 15788214 16066054 15846378 15061006
6670 15061006 15780104 16135717 14318900 13764933 13877471 13594819 12625553 12914484 12770696
6661 12770696 12636603 13646742 13488543 13386872 13004874 12232776 12602728 12023844 11387853
6652 11387853 11231054 11258440 10963510 10515406 11081096 10447549 10960264 12089611 10518321
6643 10518321 9359076 9213178 9569829 9005274 9466443 9487355 9253288 9977040 9360338
6634 9360338 8892729 8527251 8166007 7756023 7970058 8058261 7981881 7638576 7608624 7200140
$$ packed form
6697B7204936n77560j76617l59929o46910p62722j169271n68079j86065r59442
6688B1798341M81761n25923l63225L38932k85405j320268k9981J99903j404699
6679A8889436j18277o91145k09535o70147o90470p21648K77840k19676p85372
6670A5061006P19098L55613j816817n53967J12538k82652r69266K88931j43788
6661A2770696j34093J010139j58199j01671l81998p72098L69952n78884o35991
6652A1387853j56799K7386k94930m48104N65690o33547N12715J129347j571290
6643A0518321j159245j45898L56651n64555M61169K0912k34067P23752o16702
6634I360338m67609l65478l61244m09984K14035Q8203p6380l43305k9952m08484
$$ plain form
6624 7200140 7340779 6360815 6948171 7121298 7469699 7050164 6483717 7076540 7145432 7561779
6614 7561779 6939303 6067934 6252355 5655569 5805173 5431841 4448643 5372129 5307903 5230646
6604 5230646 6043115 6849297 6607454 6577170 6865363 5905010 5288284 5574720 5686290 5959270
6594 5959270 6412377 6221036 6384536 5489727 5344393 4722960 4851994 5178582 5138043 4617340
6584 4617340 4049176 4300957 4418896 4380233 3053978 3704186 3778567 3503968 3718447 3160332
6574 3160332 2970545 2956776 2771054 3025111 3261698 3710084 4180020 4205549 3925895 2917149
6564 2917149 3007010 2727421 2906647 3521888 2739642 2227136 2575092 2625259 2943424 3704807
6554 3704807 2457557 2129828 1975091 2471261 2454374 2374349 2674917 3435503 2858903 1985608
$$ packed form
6624G200140J40639r79964N87356J73127L48401m19535n66447N92823O8892M16347
6614G561779o22476q71369J84421n96786J49604l73332r83198R23486o4226p7257
6604E230646Q12469Q06182k41843l0284K88193r60353o16726K86436J11570K72980
6594E959270M53107j91341J63500q94809j45334o21433J29034L26588m0539n20703
6584D617340n68164K51781J17939l8663j326255O50208P4381k74599K14479n58115
6574C160332j89787j3769j85722K54057K36587M48386M69936K5529k79654j008746
6564B917149Q9861k79589J79226O15241p82246n12506L47956N0167L18165P61383
6554C704807j247250l27729j54737M96170j6887q0025L00568P60586n76600q73295
$$ plain form
6544 1985608 2294146 3708479 3650322 2889631 2032945 1526059 2000820 2111545 2959337 3189423
6534 3189423 3420149 2006790 2054993 2015211 1969988 2303948 2722255 1483571 1064943 1866452
6524 1866452 1662257 1548889 2328774 2049397 1707914 1623608 518508 1151673 1893098 1481096
6514 1481096 791402 1164511 1725744 1478907 1631364 2442601 1935036 1195296 1536904 1208590
6504 1208590 1117762 1547319 1917161 1884419 1991326 1486201 1869284 2485045 2185545 2088863
6494 2088863 1774143 2050987 1886043 1083062 421998 1839149 1915739 1879542 1375790 930846
6484 930846 1119742 1774991 307501 389759 1495839 1605513 1380412 910873 1099144 1849827
6474 1849827 2234375 963644 980172 1481546 436445 703792 1447913 1175878 479201
$$ packed form
6544A985608L08538J414333n8157p60691q56686n06886M74761J10725Q47792K30086
6534C189423K30726j413359M8203l9782m5223L33960M18307j238684m18628Q01509
6524A866452k04195j13368P79885k79377l41483q4306j105100O33165P41425m12002
6514A481096o89694L73109N61233k46837J52457Q11237n07565p39740L41608l28314
6504A208590r0828M29557L69842l2742J06907n05125L83083O15761k99500r6682
6494B088863l14720K76844j64944q02981o61064J417151P6590l6197n03752m44944
6484I30846J88896O55249j467490Q2258J106080J09674k25101m69539J88271P50683
6474A849827L84548j270731J6528N01374j045101K67347P44121k72035o96677
$$ plain form
6465 479201 915119 1222339 1367958 1875395 1500352 1581007 1360021 972741 1412412 1115447
6455 1115447 822296 -190662 533110 351935 -37930 1045607 873784 1657541 1592406
6446 1592406 1290948 415593 316454 785351 1273141 1890535 1625735 1363916 1506794 1276512
6436 1276512 1421984 1514652 1080301 295569 473968 755734 924887 302026 44664 60940
6426 60940 813041 1304874 919524 13313 970193 1306651 838526 702201 -77604 491206
6416 491206 933917 972988 811851 1366171 1017035 152536 528925 494735 611428 1160624
6406 1160624 861649 941017 977713 1077406 852623 -21316 422105 484293 415850 773631
6396 773631 1124611 300004 235923 -381019 -384756 1206 841971 1459096 1099907 837497
$$ packed form
6465D79201M35918L07220J45619N07437l75043Q0655k20986l87280M39671k96965
6455A115447k93151j012958P23772j81175l89865J083537j71823P83757o5135
6446A592406l01458q75355r9139M68897M87790O17394k64800k61819J42878k30282
6436A276512J45472R2668m34351p84732J78399K81766J69153o22861k57362J6276
6426F0940P52101M91833l85350r06211R56880L36458m68125j36325p79805N68810
6416D91206M42711L9071j61137N54320l49136q64499L76389l4190J16693N49196
6406A160624k98975P9368L6696R9693k24783q73939M43421O2188o8443L57781
6396G73631L50980q24607o4081o16942l737L85962Q40765O17125l59189k62410
$$ plain form
6386 837497 466130 247461 605646 1105096 1620380 1004855 1100310 1932532 1049128 1436093
6376 1436093 993143 254038 -199043 391715 302753 -273185 1053602 522892 -243791 -186701
6366 -186701 303079 287522 435025 642744 1108705 528818 -22194 182356 328368 670599
6356 670599 1058691 715136 17024 -766911 -157728 212585 -258641 606368 -33721 130545
6346 130545 438329 114795 -667530 -254973 -47446 -32177 52528 140756 320171 1278580
6336 1278580 818264 846156 653862 66479 -151731 428291 385699 -77851 74017 654817
6326 654817 913149 166608 377321 221764 280701 218217 268194 -43801 702686 1037755
6316 1037755 936779 344598 51420 266791 -276625 -1225522 -489345 1225023 -34095
$$ packed form
6386H37497l71367k18669L58185M99450N15284o15525R5455Q32222q83404L86965
6376A436093m42950p39105m53081N90758q8962n75938J326787n30710p66683N7090
6366a86701M89780j5557J47503K07719M65961n79887n51012K04550J46012L42231
6356F70599L88092l43555o98112p83935O09183L70313m71226Q65009o40089J64266
6346A30545L07784l23534p82325M12557K07527J5269Q4705Q8228J79415R58409
6336A278580m60316K7892j92294n87383k18210N80022m2592m63550J51868N80800
6326F54817K58332p46541K10713j55557N8937o2484M9977l11995P46487L35069
6316A037755j00976n92181k93178K15371n43416r48897P36177J714368j259118
$$ plain form
6307 -34095 464100 6201 -573189 -778231 204589 -66501 123977 1595761 695254 206404
6297 206404 454435 508509 247613 719014 717075 441630 -220685 -225265 353718 1077400 776642
6286 776642 424755 153265 -529519 -817858 -102018 362240 432928 904143 373454 -117292
6276 -117292 804988 679937 -5531 272139 263409 251226 1082845 781501 248904 98970
6266 98970 536129 28367 -549302 -638382 -373595 472315 490885 241979 35147 -325840
6256 -325840 -627158 -509567 136867 448685 813949 944739 1394739 -20722 -546126 329922
6246 329922 349605 879310 515395 619565 351929 731795 832767 152510 373783 83705
6236 83705 -728475 -467426 -401955 480119 -378388 -243290 716397 -23780 780604 1361340
$$ packed form
6307c4095M98195m57899n79390k05042R82820k71090J90478J471784r00507m88850
6297B06404K48031N4074k60896M71401j939k75445o62315m580N78983P23682l00758
6286G76642l51887k71490o82784k88339P15840M64258P0688M71215n30689m90746
6276a17292R22280j25051o85468K77670q730j2183Q31619l01344n32597j49934
6266I8970M37159n07762n77669q9080K64787Q45910J8570k48906k06832l60987
6256c25840l01318J17591O46434L11818L65264J30790M50000j415461n25404Q76048
6246C29922J9683N29705l63915J04170k67636L79866J00972o80257K21273k90078
6236H3705q12180K61049O5471Q82074q58507J35098R59687p40177Q04384N80736
$$ plain form
6226 1361340 339546 994381 926750 87964 -123440 -176285 501570 1598100 1506191 311116
6216 311116 715523 464648 926519 724886 -153956 186671 363642 244817 -464329 -464867
6206 -464867 49026 613637 777895 -135779 -202309 109620 -638411 -698710 127964 201761
6196 201761 -60933 -924570 -81886 97531 -616463 -409108 -390302 -880347 -1147375 -925683
6186 -925683 -537495 -1385377 -1086026 413616 467297 18765 -379208 200714 -975587 -1076926
6176 -1076926 42538 51726 -390335 -479410 568627 658680 -415885 -1053873 -235630 137918
6166 137918 -640193 -299681 -503354 -586976 -605389 -195324 167289 561716 769129 -94577
6156 -94577 956101 1750693 646949 -29322 -985140 -104106 -72535 -352744 -28262 199905
$$ packed form
6226A361340j021794O54835o7631q38786k11404n2845O77855J096530r1909j195075
6216C11116M04407k50875M61871k01633q78842L40627J76971j18825p09146n38
6206d64867N13893N64611J64258r13674o6530L11929p48031o0299Q26674P3797
6196B01761k62694q63637Q42684J79417p13994K07355J8806m90045k67028K21692
6186i25683L88188q47882K99351J499642N3681m48532l97973N79922j176301j01339
6176a076926J119464R188m42061q9075J048037R0053j074565o37988Q18243L73548
6166A37918p78111L40512k03673q3622j8413M10065L62613L94427K07413q63706
6156i4577J050678P94592j103744o76271r55818Q81034L1571k80209L24482K28167
$$ plain form
6146 199905 475105 308517 569522 132025 -150752 830249 901675 570915 870788 582171
6136 582171 -101940 -439599 -274661 -789555 -129995 51318 533680 489899 888467 83847
6126 83847 61411 -739163 -295392 315397 487212 752969 22410 -626042 -38708 1434103
$$ packed form
6146A99905K75200j66588K61005m37497k82777R81001P1426l30760K99873k88617
6136E82171o84111l37659J64938n14894O59560J81313M82362m3781L98568q04620
6126H3847k2436q00574M43771O10789J71815K65757p30559o48452N87334J472811
$$ [...]
##END NTUPLES=NMR SPECTRUM
##END=
