##TITLE=1H_CA-9239-2
 CDCl3
 8 sc, 
 9.2.2024
##JCAMPDX= 6.0         $$ Bruker NMR JCAMP-DX V2.0
##DATA TYPE= NMR SPECTRUM
##DATA CLASS= NTUPLES
##ORIGIN= UXNMR, Bruker Analytische Messtechnik GmbH
##OWNER= root
$$ XWIN-NMR		Version 3.5
$$ Fri Feb  9 14:17:33 2024 Russian Standard Time (UT+4h)  she@DPX200
##.OBSERVE FREQUENCY= 200.1313
##.OBSERVE NUCLEUS= ^1H
##.ACQUISITION MODE= SIMULTANEOUS
##.ACQUISITION SCHEME= undefined
##.AVERAGES= 8
##.DIGITISER RES= 18
##SPECTROMETER/DATA SYSTEM= spect
##.PULSE SEQUENCE= zg30
##.SOLVENT NAME= DMSO
##.SHIFT REFERENCE= (INTERNAL, DMSO, 0, 15.6455)
##AUDIT TRAIL= $$ (NUMBER, WHEN, WHO, WHERE, WHAT)
$$ ##TITLE= Audit trail, XWIN-NMR		Version 3.5
$$ ##JCAMPDX= 5.01
$$ ##ORIGIN= Bruker BioSpin GmbH
$$ ##OWNER= she
$$ F:/spectra/data/she/nmr/H-F/1/pdata/1/auditp.txt
$$ ##AUDIT TRAIL=  $$ (NUMBER, WHEN, WHO, WHERE, WHAT)
(   1,<2024-02-09 14:15:59.89 +0400>,<she>,<DPX200>,
      <created by zg, POWCHK disabled, PULCHK disabled
       configuration hash MD5:
       00 E9 B6 7A A2 85 ED C7 34 08 36 98 17 FE 4E 26
       data hash MD5: 16K
       A2 46 D6 21 77 A6 AD 08 8B 8F 8A CD 31 B7 AB 30>)
(   2,<2024-02-09 14:16:24.70 +0400>,<she>,<DPX200>,
      <Start of raw data processing
       efp BC_mod = 2 LB = 0.24 FT_mod = 6 PKNL = 1 PHC0 = -24591.92 PHC1 = 10.25267 SI = 16K 
       data hash MD5: 16K
       2E 65 3A F5 D9 59 2B 38 94 4A F5 1D 7F F5 A9 20>)
(   3,<2024-02-09 14:16:42.56 +0400>,<she>,<DPX200>,
      <pk PHC0 = 5.698062 PHC1 = -2.4 
       data hash MD5: 16K
       59 73 8A CB 51 D6 AC 23 23 C7 09 D5 DC E4 C7 4E>)
(   4,<2024-02-09 14:16:46.06 +0400>,<she>,<DPX200>,
      <abs ABSG = 5 
       data hash MD5: 16K
       5B 30 64 A3 0B BC 15 91 7B D8 6E 39 20 E4 59 33>)
$$ ##END=
$$ 
$$ hash MD5
$$ 89 15 E5 27 75 0F 10 85 41 32 EE 4B 38 23 EE C7
##$RELAX= 
##$RELAX= 
##$RELAX= 
##$RELAX= 
##$RELAX= 
##$RELAX= 
$$ Bruker specific parameters
$$ --------------------------
##$DU= <F:/spectra>
##$EXPNO= 1
##$NAME= <H-F>
##$PROCNO= 1
##$TYPE= <nmr>
##$USER= <she>
##$AMP= (0..31)
100 100 100 100 100 100 100 100 100 100 100 100 100 100 100 100 100 100 
100 100 100 100 100 100 100 100 100 100 100 100 100 100 
##$AQSEQ= 0
##$AQ_mod= 1
##$AUNM= <au_zg>
##$AUTOPOS= <>
##$BF1= 200.13
##$BF2= 200.13
##$BF3= 200.13
##$BF4= 200.13
##$BF5= 200.13
##$BF6= 200.13
##$BF7= 200.13
##$BF8= 200.13
##$BYTORDA= 1
##$CFDGTYP= 0
##$CFRGTYP= 5
##$CHEMSTR= <none>
##$CNST= (0..31)
1 1 145 1 1 1 1 1 1 1 1 1 1 1 1 1 1 1 1 1 1 1 1 1 1 1 1 1 1 1 1 1 
##$CPDPRG= <>
##$CPDPRG1= <>
##$CPDPRG2= <>
##$CPDPRG3= <>
##$CPDPRG4= <mlev>
##$CPDPRG5= <mlev>
##$CPDPRG6= <mlev>
##$CPDPRG7= <mlev>
##$CPDPRG8= <mlev>
##$CPDPRGB= <>
##$CPDPRGT= <>
##$D= (0..31)
0 1.2 0 0 0 0 0 0 0 0.06 0 0.03 0 0 0 0 0.0002 0 0 0 0 0 0 0 0 0 0 0 0 
0 0 0 
##$DATE= 1707473759
##$DBL= (0..7)
120 120 120 120 120 120 120 120 
##$DBP= (0..7)
150 150 150 150 150 150 150 150 
##$DBP07= 0
##$DBPNAM0= <>
##$DBPNAM1= <>
##$DBPNAM2= <>
##$DBPNAM3= <>
##$DBPNAM4= <>
##$DBPNAM5= <>
$$ [...]
##$SUBNAM3= <"">
##$SUBNAM4= <"">
##$SUBNAM5= <"">
##$SUBNAM6= <"">
##$SUBNAM7= <"">
##$SUBNAM8= <"">
##$SUBNAM9= <"">
##$SW= 18.0517328524113
##$SWIBOX= (0..15)
0 0 2 0 0 0 0 0 0 0 0 0 0 0 0 0 
##$SW_h= 3612.71676300578
##$TD= 16384
##$TD0= 1
##$TE= 0
##$TE2= 300
##$TE3= 300
##$TEG= 300
##$TL= (0..7)
0 120 120 120 120 120 120 120 
##$TP= (0..7)
150 150 150 150 150 150 150 150 
##$TP07= 0
##$TPNAME0= <>
##$TPNAME1= <>
##$TPNAME2= <>
##$TPNAME3= <>
##$TPNAME4= <>
##$TPNAME5= <>
##$TPNAME6= <>
##$TPNAME7= <>
##$TPOAL= (0..7)
0.5 0.5 0.5 0.5 0.5 0.5 0.5 0.5 
##$TPOFFS= (0..7)
0 0 0 0 0 0 0 0 
##$TUNHIN= 0
##$TUNHOUT= 0
##$TUNXOUT= 0
##$USERA1= <user>
##$USERA2= <user>
##$USERA3= <user>
##$USERA4= <user>
##$USERA5= <user>
##$V9= 5
##$VALIST= <valist>
##$VCLIST= <CCCCCCCCCCCCCCC>
##$VD= 0
##$VDLIST= <DDDDDDDDDDDDDDD>
##$VPLIST= <PPPPPPPPPPPPPPP>
##$VTLIST= <TTTTTTTTTTTTTTT>
##$WBST= 1024
##$WBSW= 4
##$XGAIN= (0..3)
0 0 0 0 
##$XL= 0
##$YL= 0
##$YMAX_a= 127701
##$YMIN_a= -166095
##$ZGOPTNS= <>
##$ZL1= 120
##$ZL2= 120
##$ZL3= 120
##$ZL4= 120
##$ABSF1= 15.65324
##$ABSF2= -2.398613
##$ABSG= 5
##$ABSL= 3
##$ALPHA= 0
##$AQORDER= 0
##$ASSFAC= 0
##$ASSFACI= 0
##$ASSFACX= 0
##$ASSWID= 0
##$AUNMP= <proc_1d>
##$AZFE= 0.1
##$AZFW= 0.1
##$BCFW= 0
##$BC_mod= 2
##$BYTORDP= 0
##$COROFFS= 0
##$CY= -3
##$DATMOD= 1
##$DC= 0
##$DFILT= <>
##$DTYPP= 0
##$F1P= 0
##$F2P= 0
##$FCOR= 1
##$FTSIZE= 16384
##$FT_mod= 6
##$GAMMA= 0
##$GB= 0
##$INTBC= 1
##$INTSCL= 3.70164e-10
##$ISEN= 128
##$LB= 0.24
##$LEV0= 0
##$LPBIN= 0
##$MAXI= 10000
##$MC2= 0
##$MEAN= 0
##$ME_mod= 0
##$MI= 1.114404
##$NCOEF= 0
##$NC_proc= -7
##$NLEV= 6
##$NOISF1= 3.799351
##$NOISF2= 2.8
##$NSP= 0
##$NTH_PI= 0
##$NZP= 0
##$OFFSET= 15.64553
##$PC= 1
##$PHC0= -24586.22
##$PHC1= 7.85267
##$PH_mod= 1
##$PKNL= yes
##$PPARMOD= 0
##$PSCAL= 0
##$PSIGN= 0
##$REVERSE= no
##$SF= 200.1299752203
##$SI= 16384
##$SIGF1= 3
##$SIGF2= 2
##$SINO= 5.538805
##$SIOLD= 16384
##$SREGLST= <1H.CDCl3>
##$SSB= 0
##$STSI= 16384
##$STSR= 0
##$SW_p= 3612.71676300578
##$SYMM= 0
##$S_DEV= 0
##$TDeff= 16384
##$TDoff= 0
##$TI= <>
##$TILT= no
##$TM1= 0
##$TM2= 0
##$TOPLEV= 0
##$USERP1= <user>
##$USERP2= <user>
##$USERP3= <user>
##$USERP4= <user>
##$USERP5= <user>
##$WDW= 1
##$XDIM= 16384
##$YMAX_p= 288800093
##$YMIN_p= -559906
$$ End of Bruker specific parameters
$$ ---------------------------------
##NTUPLES= NMR SPECTRUM
##VAR_NAME=  FREQUENCY,     SPECTRUM/REAL,   SPECTRUM/IMAG
##SYMBOL=    X,             R,               I
##VAR_TYPE=  INDEPENDENT,   DEPENDENT,       DEPENDENT
##VAR_FORM=  AFFN,          ASDF,            ASDF
##VAR_DIM=   16384,         16384,           16384
##UNITS=     HZ,            ARBITRARY UNITS, ARBITRARY UNITS
##FACTOR=    0.220516191357247, 1,           1
##FIRST=     3131.13948057743, 0,            0
##LAST=      -481.577282428347, 0,           0
##MIN=       -481.577282428347, -559906,     0
##MAX=       3131.13948057743, 288800093,    0
$$ Real data points
##PAGE= N=1
##DATA TABLE= (X++(R..R)), XYDATA
$$ [...]
14288 -39810 8122 -58244 124594 238402 202877 222391 -27956 -77642 208514 126288 4565
14277 4565 136114 190842 128888 -188862 -18998 -40815 120300 60782 -57469 -132090 26894
14266 26894 -125347 -140094 -12064 16734 4050 -114211 -85798 -72218 -26700 -152528 -50083
14255 -50083 -57625 -124241 18751 -34907 -46074 -189883 -223268 -89388 24105 -194959 -381435
14244 -381435 -328501 -184836 -24141 164400 108452 275128 228230 -13536 101941 -216162
14234 -216162 -165835 -136112 -3584 55861 -116724 -164082 64357 124208 61150 251986 226117
14223 226117 -95557 3087 3583 -128161 -199276 -79090 24469 213807 -36607 -210425
14213 -210425 -36024 61086 25688 -31061 -119463 -382782 -272145 -747 49736 273201
14203 273201 254886 19568 -73128 71181 -151377 53549 71149 37863 236199 167494
14193 167494 252824 206613 98887 236536 144629 197477 172956 95156 87465 145596 303892
14182 303892 301504 70433 5391 211283 112742 85639 97213 -82915 -89607 -130620 -92290
14171 -92290 -127879 -240103 78963 -101851 -67000 33195 189526 187394 192526 341188 182054
14160 182054 -70606 -86101 33446 231518 -121576 -61347 23948 24026 126700 106751 20029
14149 20029 -216265 -14327 73394 -51108 22692 -155719 -188663 -301333 -61850 9737
14139 9737 -83920 -227199 -89245 21470 -50788 -104919 -269473 -155423 56652 59823 -122348
14128 -122348 -72144 -142637 -340305 -250012 -9079 42620 8040 -174034 -94214 -421059 -442435
14117 -442435 -272715 -55099 189326 79698 -32393 -158703 -104090 -187783 -222978 -231691
14107 -231691 -227275 146237 -32809 -124802 -57744 -85615 -269308 -272736 -20580 23439 253268
14096 253268 141828 143902 108156 -22662 39290 -170874 -207143 -99750 -114119 -152696 60250
14085 60250 52917 -4227 -82707 -111176 -138357 -138189 -127683 -205494 -4049 90216 112798 -111658
14073 -111658 82115 50335 -1100 78684 131240 -67127 -313921 -106615 -23139 -63480 -25206
14062 -25206 -209718 -226648 -85411 -159743 -274966 -206086 -132212 13030 51553 -37691 -112357
14051 -112357 -30280 -47078 -30653 98716 -61164 28449 39250 92685 115872 178947 39709
14040 39709 -83103 -28965 56673 8012 37852 -253189 -257576 -150115 -83055 12543 -37415
14029 -37415 789 -218338 -224562 -148267 -79419 -181408 63830 -77153 -142495 183883 -217116
14018 -217116 -182943 -123293 -271250 -234091 77489 101155 116143 42207 67523 -100537 -145161
14007 -145161 -211157 -179567 -43198 -301484 -236447 -86100 -131288 -264744 -182065 23152
13997 23152 -166649 -149202 59407 -23753 6069 106318 176646 194505 -114622 -89652 -36831
13986 -36831 -103586 112909 23630 -142410 -159911 -188412 -217916 -140645 -6693 -26005 -148565
13975 -148565 -137390 -126519 87576 -94384 -5978 -89795 -323343 -164781 -38919 28937
13965 28937 -211244 -751 12883 -46472 -89825 -241832 92629 94836 -107366 22347 200297
13954 200297 119389 307202 151760 94048 72721 -93454 572 119752 35103 -88896
13944 -88896 -48971 19932 -228234 -183635 -216884 -148638 -95681 13153 84634 65629 -88946
13933 -88946 -127742 -35959 77334 -20157 -104524 -90888 -173659 -53356 -49051 45881 3688
13922 3688 168269 129077 66193 192101 228785 91610 -89340 -45777 79110 158120 108823
13911 108823 -71903 -123560 -10478 107303 -43004 -69785 76387 93772 156916 -66129
13901 -66129 -96620 -106959 -309226 -149098 7617 -21096 63219 58072 -263039 -246655 -116023
13890 -116023 -15613 -176877 -168134 -143430 8912 70134 80548 -62694 -126274 -164674 -144537
13879 -144537 -39128 23692 133041 137995 98417 204671 238825 -69540 -93343 35465 1113
13868 1113 6283 33538 -199158 22322 110235 230471 69173 77844 -503 -38367 93126
13857 93126 32901 45858 -87318 -179742 -114831 -166266 -105494 176815 283977 -12369 -158991
13846 -158991 106453 192 -23560 -59276 -234462 -86920 86612 -50442 -6917 -30411
13836 -30411 175226 121921 -100730 34153 -30843 164919 65348 -11573 -53061 -36429 -3891
13825 -3891 -82557 151412 79638 79334 -198115 -219535 -185714 -265870 -155398 41873 -4089
13814 -4089 14186 -188253 -302400 -253266 -150027 -195834 -102067 -255373 -140071 -187453 -64837
13803 -64837 27839 -138302 27825 8011 -91172 -165158 -36610 -49664 161556 45780 -13545
13792 -13545 -23194 -29707 -61214 -69993 -73319 23775 -100627 -190695 -1383 88815 -80440 -101392
13780 -101392 -85205 54940 91680 64322 160194 320335 67983 -126113 -119626 -114527 62223
13769 62223 36740 -188494 -77033 26721 554 -129763 -99512 79631 280838 4073
13759 4073 -122502 -60006 59662 80744 -107575 83016 171543 168916 -127862 -284191 -406032
13748 -406032 -205197 -77509 -21362 -33614 -242557 -99847 -23666 -51073 -97371 -197609
13738 -197609 -358985 -330349 -202164 -45328 -14817 -89756 118088 216380 114492 42648
13728 42648 5322 -96402 -75789 -186361 -124079 -263706 -301359 -235602 51086 59669 154894
13717 154894 11867 -1535 -59045 -256044 -243722 -172570 -214493 35590 -83245 -11820 235614
13706 235614 133561 -17953 -318326 -4182 114508 291745 232432 223313 54726 27057
13696 27057 24101 -72777 86872 167237 116108 -37613 -306853 -141723 -175061 -116078 -226157
13685 -226157 5985 99173 91605 98940 46226 -125268 -46095 -5577 141088 237719 59608
13674 59608 -24862 -66725 24231 23499 -38239 -116088 -104643 -143861 -185359 -82340 224800 -156
13662 -156 -149977 111285 -9960 46737 101375 57159 -37850 -75517 -3898 -261762 -186035
13651 -186035 -44487 -90342 -63420 105588 -37177 54387 109431 -29589 -143801 -117269
13641 -117269 39722 35385 -120220 -57796 -71469 -193886 -61508 -173986 -282702 53240
13631 53240 96423 52045 45446 -176573 -127592 -129489 -113658 -64733 30273 -42786 -248003 -120385
13619 -120385 -68217 -235562 -263150 -46728 13431 -177232 -117126 -118951 -232575 -182466 -100171
13608 -100171 -95194 -495110 -403570 -173406 -50338 -186502 -123869 55187 149047 -70133
13598 -70133 -87950 -140007 42055 271983 -18213 36239 12676 111276 58157 -19945 -179043
13587 -179043 -335315 -155160 -165535 -102798 -127845 37103 -4975 25983 242303 153257 92583
13576 92583 -111438 -290118 -179127 -79920 -167487 -172399 -151754 -185860 -78039 -43091 -150799
13565 -150799 -126803 -43866 31355 171595 94327 -170187 -144618 -100583 78379 115678 11287
13554 11287 25747 -80009 -267723 -209530 -20036 -3832 -72708 -104966 -94395 -27481 -276176
13543 -276176 -135335 144276 -89553 -54436 -105716 -163377 -238671 40555 426606 277874
13533 277874 103140 -101106 -130395 -25526 61964 -170313 -218446 -79177 72543 -81326
13523 -81326 -246688 -190391 80272 -186726 -179758 -99252 11897 47813 -171044 -289085 -214607
13512 -214607 -98535 -171090 -28607 -34766 -278176 -354584 -398669 -435055 -48782 -27730 -167988
13501 -167988 -240825 180317 228805 -44992 64800 91302 81503 -84122 -209509 -93376
13491 -93376 25801 68283 10445 -104740 -159369 -350099 -48544 -119689 -375289 -252796
13481 -252796 21079 9144 -199331 -135949 -180467 -320793 -67343 -112037 -238696 -160066
13471 -160066 -308623 -286189 -367551 -263113 -181507 -195692 -136130 -153750 -19932 20153 75589
13460 75589 101635 146015 122135 -204501 -182739 -277188 -45889 -74441 42675 239338 5187
13449 5187 -54423 4815 78837 56665 76008 82445 -99162 12909 -129796 -93079 -122695
13438 -122695 -283462 -63335 -37431 -28788 358721 176016 69279 93493 16051 258686
13428 258686 217483 30441 42044 -80741 27629 -120046 -127627 17889 -152276 -14172
13418 -14172 46097 -86138 -179511 -137501 -167900 -7886 -86810 -133671 -153483 -41295 -220540
13407 -220540 -77333 117490 21567 -66147 119 18299 114295 -59293 -125990 18720 -50915
13396 -50915 -20942 24608 -131883 -314744 -287796 -182307 -80168 192175 55319 -34759
13386 -34759 4724 -158448 -2607 -38021 27985 116607 27984 -28365 -286114 -178397 -238868
13375 -238868 -265174 -107233 17676 135648 -97307 -121155 -273128 -191851 21123 88164
13365 88164 -3946 3142 -85093 787 197804 369132 156501 -36678 141841 83153 -157412
13354 -157412 -238799 36576 42602 40902 105763 161848 119741 -52012 -100420 -76081 -60438
13343 -60438 -57195 -171726 -319104 -182049 -205317 -5529 -101894 -285505 -328749 -271097 -331576
13332 -331576 -525299 -409934 -322319 -319249 -22131 16734 -29238 -106490 -16798 68812 -40417
13321 -40417 -222671 -137504 102813 22507 -34915 14867 -3366 118157 199483 110720 193280
13310 193280 266767 78261 63083 47613 -108715 -384809 -296386 -130482 -285015 -304945
13300 -304945 -286630 65796 64371 248475 98724 62408 -132898 -357063 -355640 -161695 -112501
13289 -112501 -287681 -394774 -157280 -20536 1673 -94301 -13279 -8230 29301 -100201 -134207
13278 -134207 -227660 -295054 -159658 143923 85715 -29586 46281 180105 13748 -160478
13268 -160478 -23545 -27985 99695 156677 60040 163755 241951 -64097 -78131 -13166 40762
13257 40762 143760 106647 6757 175729 249906 97608 -80868 182846 15717 25664 -74085
13246 -74085 -200256 -140642 4923 85087 -6265 143068 292402 135456 -10075 -164264
13236 -164264 -15152 74224 -61717 -163380 -111150 -141161 -186486 141353 124156 -61311
13226 -61311 -30191 -14833 -35234 -140209 -112885 36099 134402 95884 -164383 -205589 -104286
13215 -104286 -155919 42413 10621 -113920 -108290 -36435 -2997 89723 153304 297558 69774
13204 69774 -94021 -53647 110094 77805 -6384 44670 68180 -6461 -64962 -127359 22013
13193 22013 146309 34012 57247 -49162 69899 54707 -88038 30247 95334 62528
13183 62528 -48292 -137125 -59546 -57294 -53285 -85840 -83573 116349 198191 -43581 654 18047
13171 18047 59079 -117579 -158847 -191661 -128249 -201894 -131632 -74509 -17885 71080 197517
13160 197517 57271 -124679 54880 -94244 -63720 3876 -28928 189293 233577 -24442
13150 -24442 -59878 -18890 -102236 -165986 -163152 -61739 -13097 -73089 -265559 -490703 -387217
13139 -387217 -328783 -430081 -274878 -322548 -260062 -96081 -68573 -12402 118294 115318 93399
13128 93399 -152598 -301086 -283733 -98199 117352 238268 324433 102324 9003 18336 54800
13117 54800 51134 -153193 -126994 -112807 63563 59998 65768 38741 27473 131203 -149047
13106 -149047 44386 76172 -14789 -74718 -2520 196971 338111 106557 -70172 -27066
13096 -27066 -216439 -73750 -70763 -237365 -169217 59842 -165340 3223 260154 14835
13086 14835 82826 23587 -107119 111106 151878 -73955 29731 -61999 -67960 5098 59
13075 59 -117954 -40278 -72569 -91435 194095 72926 26300 27294 -29354 323710 278147 55208
13063 55208 -151798 -105937 -153638 -132247 -228239 66575 113476 107245 -30875 -221803 -326903
13052 -326903 -187782 242771 193397 185407 60933 -122802 -105739 -152963 -62482 -77002 -11722
13041 -11722 167107 -23361 -75422 -10537 -155516 -149366 263112 32284 110017 60381 293239
13030 293239 377501 207555 81507 17112 -3075 92776 5328 36426 103851 -35568 -133608
13019 -133608 -109284 -14878 40359 91476 1087 82931 -58654 -83785 41099 165904 124142
13008 124142 207353 274540 190709 69934 -89626 222340 244749 -184123 -211549 -66040
12998 -66040 -23670 84004 203273 161766 86475 -72868 -182298 -247733 -152592 205728 -6132
12987 -6132 -267021 -164544 -159719 -85861 -104561 -140022 -5254 103541 29447 164179 200313
12976 200313 183123 149085 338093 414998 360750 217318 154299 132992 -42388 -12864 31483
12965 31483 136390 -99764 -200289 2673 -106744 -191702 -43433 52805 71066 -79575
12955 -79575 -136587 -150864 38924 176007 -43757 -18993 -84911 229 18474 1473 51612
12944 51612 13044 -96884 13907 46212 71083 241465 5023 -375709 -235976 -127016
12934 -127016 -162937 -149788 8375 -45350 -92565 35965 134829 176948 119496 78501 -9974
12923 -9974 83083 -337897 -393583 -37600 189432 -32992 -78413 46192 -84608 -127260 -132043
12912 -132043 -361783 -241739 -50641 22431 -113061 -259594 -114591 1781 -272040 -5784
12902 -5784 63726 -64533 -152300 5144 144908 51984 -230400 -271776 -218635 -81273 17439
12891 17439 -187188 -356289 -284891 -94638 -67466 -35313 52 70601 6921 149418 -24655
12880 -24655 -26355 -123215 16075 -108121 9186 133820 -74707 -116012 -148879 379 -140582
12869 -140582 -142116 153094 206767 212353 43077 -70864 -34149 -139844 -288562 -177819 9899
12858 9899 48294 75542 152435 109202 108734 -1881 -128691 43429 331157 192660 78467
12847 78467 166730 138452 -28403 -21703 -25771 34921 -129908 -262766 82936 -41912 -121217
12836 -121217 -309906 -288337 -285836 -368573 -290973 -116961 -209717 -460026 -151533 -122791 -133962
12825 -133962 -251209 -234443 -229637 -128302 228981 355727 233816 1209 -73049 39858
12815 39858 110831 -18426 45847 -99562 90928 228670 34779 -109910 -110810 -124353 75263
12804 75263 286895 43700 90589 196366 286723 41942 77120 171041 204078 187811 237927
12793 237927 56871 -95210 -263728 -36511 -14553 28962 4294 -224212 -226165 -359149
12783 -359149 -320577 -338400 -125263 -74693 47150 -27748 -69842 -279807 -112801 -20303 -72291
12772 -72291 -188916 -149814 -48318 -82039 18374 -6289 127498 73811 33934 29216 144087
12761 144087 190675 134442 87154 163943 144292 125896 105783 -79021 -263601 -34757 113433
12750 113433 84148 -116826 77814 62322 -64384 39759 65629 115325 63590 96060 48306
12739 48306 160402 61388 -107122 39579 -65996 -317770 -191614 -195265 -248948 -328950 -70613
12728 -70613 -179223 -160253 -157109 242052 281629 224898 65068 116407 -42181 -310594 -242238
12717 -242238 -17774 -131534 -219087 -152369 -265151 -170239 -68136 56627 -128919 -52661
12707 -52661 -81992 -186204 -86408 -45174 -38831 -273983 -373494 -225777 -98135 -73920 -223514
12696 -223514 -334003 -233688 49508 198557 55572 5688 -29060 -167067 -173422 -73849
12686 -73849 -81010 -205077 -216455 -44330 -84074 -134684 -208811 -266167 -129431 -191899 27628
12675 27628 13241 -63414 29337 50656 -146679 10510 -6350 844 19207 -35133 36268
12664 36268 102729 51400 -98115 -32903 -117002 -4822 -11022 -151479 62849 94895 36880
12653 36880 95437 267884 92145 78327 -71778 -101703 -44556 -9769 86920 130526 324806
12642 324806 106219 -38586 -78714 -117220 -65759 107545 -9329 65881 150052 17726
12632 17726 116047 380754 524592 198493 99701 -183268 -43800 135964 239995 -167581
12622 -167581 -323667 -192883 -169491 -176593 -132175 -22385 -10175 55169 36889 73580 112642
12611 112642 -100627 -243772 -279915 -2168 133462 114242 149166 84102 86204 158599 240573
12600 240573 214017 231916 230604 249363 -59572 35408 95103 214499 310292 331841 158306
12589 158306 61207 -126452 -184258 -86694 -215917 -14959 -203556 -403412 -316006 -358984
12579 -358984 -279268 -145085 39413 15219 79101 6696 3604 -91126 -257966 -98333 -1402
12568 -1402 -52947 -168014 -55916 -115171 27550 76052 194016 36313 -145716 18932
12558 18932 -62389 -4180 11438 47146 -71373 -55058 -13742 -12996 -210041 -144692 -213166 -223424
12546 -223424 -182588 -44736 -46898 -32619 11204 229427 239150 -22080 -235180 -79142 150271
12535 150271 194015 -36894 -47123 176741 61517 -139048 -317558 -184784 -95806 26608
12525 26608 131009 225683 86032 65688 54274 29113 -142613 -241983 -160062 -30568 -6355
12514 -6355 -52822 -92097 94479 78868 -186042 -111840 93413 209515 346726 315316 193030
12503 193030 163251 77075 19591 56161 129014 133935 -90806 -12540 168823 360128 212904
12492 212904 75373 316205 73130 12348 195091 192883 43404 16786 -49106 -54537 -303670
12481 -303670 -389466 -81753 148070 74957 75386 215975 420743 251950 314419 150802 54250
12470 54250 197464 -30847 110660 -23755 -52539 226451 319182 162360 15079 39421
12460 39421 79627 162057 58094 124507 394692 235511 127685 79807 -46460 -39217 -38101
12449 -38101 -16805 670 -207324 -261667 -232970 -72222 -75170 58085 -74700 -159006 -96816
12438 -96816 -104819 -92715 67651 -107635 -142425 -91428 -102911 77831 -48189 8356 18721
12427 18721 -39280 8141 81741 52047 -32484 150495 202766 70017 74550 269540 317432
12416 317432 355215 115078 -110671 -72649 -122497 -65902 178896 19463 65910 58690 69029
12405 69029 -31401 -191705 -201694 -185267 -191861 -65982 299389 241059 -53793 -112365 82753
12394 82753 -173172 -126023 -79596 273 -49407 42482 30342 4420 117119 133785 106352
12383 106352 140790 -35327 9106 -98917 -91620 -174357 -178720 -135579 -62047 -164257 -186883
12372 -186883 9692 -41829 56222 -83673 23677 -7546 50643 98479 292958 235066 219091
12361 219091 105181 174305 91057 46940 167563 354505 136589 117599 129938 223140 308134
12350 308134 89425 -14602 -65438 -15174 -93924 -59857 -117523 128536 114152 -53115 -281570
12339 -281570 -164205 -81592 -120390 -275244 -120197 -163735 -242518 -97952 2073 -121100
12329 -121100 -61719 99360 150988 24779 -104914 139271 202998 -83955 -39635 30303
12319 30303 47958 44577 126659 16721 -108597 -48812 190600 129287 230034 96123 -18573
12308 -18573 130174 -12022 120004 92074 -111920 -168388 112079 -5257 -17756 65665
12298 65665 79923 -221964 -116129 -118934 114175 181721 150953 49232 1683 -121506 -224058
12287 -224058 157703 364458 162128 147538 260999 148078 263719 174522 139094 50797
12277 50797 -38409 -559 92497 34975 189916 108130 3953 -79025 -79415 69935 75583 126415
12265 126415 -5487 -243109 -65022 105314 170054 68102 50662 66142 29357 48374
12255 48374 240046 255861 300221 220702 -19886 91663 97576 74825 181035 18480 -45001
12244 -45001 -105267 -225727 172048 160007 91050 -97487 -118046 18004 187047 -21885
12234 -21885 -306500 -117572 18005 109810 251333 143740 98215 20842 151621 267935
12224 267935 -61398 8299 -9223 -54754 61253 298271 441961 260243 216710 440309
12214 440309 357887 186588 277183 113813 84330 160881 216594 -3859 28586 77307 173568
12203 173568 187867 182667 223539 61100 59561 111521 85063 143200 290681 178150 250090
12192 250090 132418 225023 195054 284421 400676 140100 152948 49918 110039 91842 -91715
12181 -91715 -34327 96922 223261 244412 56935 153294 171201 129809 -61614 -111194 62274
12170 62274 204117 36428 23554 164831 108863 36459 240071 302373 234896 203716 143909
12159 143909 267518 250988 245879 498937 416564 279204 252113 210504 257966 44364 187554
12148 187554 361350 439160 396669 263094 363329 348923 192370 357294 289385 198197
12138 198197 302807 221177 161919 498849 542834 535035 396547 82832 73216 293084 373835
12127 373835 554763 458922 348028 307651 396428 381779 456870 386325 196334 137340 279123
12116 279123 334408 543686 594394 531827 669219 538502 474957 535629 561057 419553 405883
12105 405883 320448 462589 481533 638357 709934 441005 361775 361912 383888 387478 425543
12094 425543 478472 762749 646048 359757 509687 402819 191345 299033 410405 423225
12084 423225 536114 340390 442891 475131 586978 537253 413600 600989 706539 947186
12074 947186 871149 756341 648040 681745 622312 497539 722005 769451 623148 608826
12064 608826 748019 658926 795996 877919 627596 632766 574827 551783 503383 493139 658362
12053 658362 551822 678314 700161 729923 782134 601677 678934 646032 745646 862661 832458
12042 832458 746091 740153 710510 789747 696127 714399 779988 873203 866908 838070 936583 639472
12030 639472 877855 891804 933232 923364 804682 965237 984650 754909 782378 931954 1147656
12019 1147656 961229 862153 920703 1119597 1125251 1003047 1035556 1157754 1318316 1421328
12009 1421328 1480414 1292422 1151077 1304393 1488177 1450025 1197450 943807 1049117 1167728
11999 1167728 1343066 1286977 1414511 1430021 1378855 1225526 1348984 1461590 1350744 1485992
11989 1485992 1446071 1445822 1507229 1513596 1409410 1494709 1403957 1321578 1301171 1216296 1353546
11978 1353546 1377928 1428230 1548433 1559538 1448152 1435606 1561335 1625227 1724669 1491441
11968 1491441 1582273 1578114 1435639 1540824 1621103 1521684 1432855 1670705 1823993 1888396 1628824
11957 1628824 1694040 1852301 1873512 1890750 2049730 2112805 2075723 2076187 2048575 1903432 1916055
11946 1916055 1952488 2124783 2373091 2346899 2031213 2152571 2240916 2233587 2258915 2466668
11936 2466668 2537745 2383097 2398977 2469582 2682167 2858916 2631998 2676722 2619096 2641792
11926 2641792 2710870 2838118 2713671 2779840 2928513 2770473 2792462 2993787 3218454 3093052
11916 3093052 3270843 3629923 3743389 3646972 3669954 3491858 3390263 3630596 3764384 3862820
11906 3862820 4020406 4059322 4092656 4116525 4298749 4520618 4634304 4580825 4884708 5069075
11896 5069075 5169486 5233009 5256960 5533491 5699872 5790710 5915757 6118645 6265600 6283315
11886 6283315 6431647 6401227 6407114 6440073 6712636 6952585 6898019 6678697 6619976 6820343
11876 6820343 7046818 6998781 7138941 7109875 7222874 7333695 7324960 7471394 7644425 7714491
11866 7714491 7731103 7882926 8070982 8141321 8250691 8259879 8693947 8895430 8937198 9157505
11856 9157505 9407238 9505593 9485186 9841952 10178508 10284017 10565456 10754658 11054811 11511151
11846 11511151 11491354 11769469 11951279 12103763 12594805 13129297 13415732 13884104 14317365
11837 14317365 14433672 14789041 15041151 15550413 16052095 16682424 17175388 17431423 17946230
11828 17946230 18418972 19020859 19625907 20282056 20782452 21403394 22090057 22519653 23367362
11819 23367362 24426786 25441087 26111803 26683632 27924780 29037363 30116531 31076290
11811 31076290 32254019 33376756 34538808 35857307 37223958 38826861 40354462 41938139
11803 41938139 43856085 45782142 47616437 49565786 51670498 53732800 55887063 58251175
11795 58251175 60679171 62708046 64890083 67117310 69069505 70696681 72081835 73497908
11787 73497908 74566443 74863869 75101384 74964239 74378461 73390294 72035070 70370080 68555975
11778 68555975 66316572 64245978 62017988 59631286 57249072 54862261 52616236 50334069
11770 50334069 48143370 46056792 44015875 41992314 40136042 38355947 36663252 35130513
11762 35130513 33585476 32224609 30972957 29862770 28640641 27399584 26578962 25640456
11754 25640456 24519118 23569293 22783914 21807543 21065782 20219783 19487926 18916647 18412111
11745 18412111 17815289 16990979 16407663 16044498 15426240 15034284 14671514 14372608 13962491
11736 13962491 13457310 13080293 12675310 12297534 11939852 11420432 11144448 11028538 10817675
11727 10817675 10558065 10275966 10126550 9725971 9223582 8833333 8902411 8775911 8464223
11718 8464223 8282081 8294744 8112389 7934000 7895785 7569767 7458107 7235569 7070009 6982755
11708 6982755 6891688 6486982 6379707 6160925 5999295 6080991 6105597 5945804 5623991 5661816
11698 5661816 5522220 5369724 5201573 5116043 5238297 4966968 4681077 4482513 4611755 4616540
11688 4616540 4537307 4317638 4185432 4107243 4101307 4037012 3823276 3925795 4114498 3916354
11678 3916354 3804590 3647801 3756101 3637269 3548935 3460225 3429606 3347183 3426455 3445749
11668 3445749 3356799 3271895 3231774 3275588 3257338 3195061 3158821 3260406 3173010 3136565 2908833
11657 2908833 2675443 2804970 3086935 2950926 2833384 2818808 2755697 2650156 2806423 2724329
11647 2724329 2588693 2574464 2542920 2488654 2299174 2268969 2433069 2599178 2515129 2334648
11637 2334648 2490310 2244205 2423169 2481398 2231993 2395041 2179530 2056161 2431641 2274439
11627 2274439 2306717 2284609 2117678 2237203 2207471 2134242 2326897 1996214 1901175 2148169
11617 2148169 2217212 2179565 2146168 1913333 1816231 1870101 1799676 1861083 1816001 1954952 2031058
11606 2031058 2068745 2168088 2008284 2135922 2158992 2158590 2084465 2115781 2085123 1960214 1976416
11595 1976416 2040790 2255582 2224094 2281827 2298637 2124975 2300247 2248380 2169010 2332826
11585 2332826 2273811 2065735 2106700 2149101 2185956 2226361 2073218 2142523 2260243 2204273 2162366
11574 2162366 2425898 2492911 2611581 2773826 2765089 2648148 2810138 2968867 3225281 3507070
11564 3507070 3427665 3420966 3536382 3494450 3628296 3654867 3808509 4090523 3961328 3967577 3889121
11553 3889121 3816930 3999120 4021786 3870433 3896337 3993522 4071867 4110357 4165678 4103733 3894426
11542 3894426 4099708 4074174 3727807 3685758 3535775 3521174 3189326 3191578 3107604 3124224 3042671
11531 3042671 2782835 2930143 2865718 2762377 2581354 2694745 2494374 2403503 2287167 2139236
11521 2139236 1903450 1773495 1951267 1876404 1754476 1647762 1605328 1711867 1525955 1506677
11511 1506677 1344926 1311126 1331700 1567207 1518795 1486509 1596733 1235514 1185381 1080298
11501 1080298 1255319 1158977 995690 1164701 1134474 1108628 1032418 1088297 1050718 1207104
11491 1207104 1196726 1046810 995777 905393 930821 1283165 1077214 929515 933116 985050 1014446
11480 1014446 925469 1002337 1053086 822245 867418 955237 799710 671961 688973 498491
11470 498491 452691 533129 592728 599847 553950 732348 890606 773928 557361 486144 587683
11459 587683 581388 460668 558550 476516 653493 684113 814405 791383 605881 705215 865605
11448 865605 651269 497146 594946 620093 616792 702869 592585 537824 686268 483186 395418
11437 395418 582433 726082 555176 593888 418147 385408 439989 307060 421388 156062
11427 156062 77324 245435 408877 545478 608368 417572 300330 384162 521213 514493
11417 514493 545003 239883 427690 626453 660627 622383 587988 396689 331355 66154
11407 66154 -3127 167025 253821 400975 459503 422531 653942 484484 464116 425779 203411
11396 203411 390953 500486 375272 258093 357714 345936 321802 493562 473039 371351
11386 371351 387047 444693 418140 312781 403834 456617 517951 399317 400258 471860 294830
11375 294830 284691 402152 412502 320916 455676 364284 462970 480952 366754 202449 211196
11364 211196 453365 555515 703421 586846 436919 360433 757953 519032 437054 469631
11354 469631 317190 404328 570957 445359 361932 372887 426762 257736 186733 274370 421526
11343 421526 381393 309869 583476 641975 549748 618569 845281 805550 645268 479089 499151
11332 499151 513606 815472 840837 689076 712755 501560 601652 667875 653627 421887
11322 421887 420110 561684 758146 808638 816041 771034 676059 601349 606182 851673 955200
11311 955200 1178966 1155711 999765 1107142 1067472 1104275 963171 1025053 1038814 1086014 1184986
11300 1184986 1337469 1331920 1204716 1300800 1452841 1334874 1509647 1592787 1714445 1839277
11290 1839277 1708738 1490762 1313772 1279887 1576050 1596532 1512064 1550471 1760137 1831192
11280 1831192 1690542 1802430 1639499 1593542 1529288 1508612 1432311 1102775 1129741 1091714
11270 1091714 928921 1112139 1197183 1143016 1026376 958708 1079856 1155962 989221 1048751
11260 1048751 889392 1078465 870158 640951 540216 631723 657543 611122 522804 658772
11250 658772 437926 347683 559422 536254 476256 394666 518063 508390 488449 520780 320868
11239 320868 465741 660412 407136 305310 331112 291671 275605 439500 346789 425363
11229 425363 521960 331558 132387 249094 560510 604681 441368 473789 360402 332857
11219 332857 318797 270084 307560 86639 164020 269490 154609 351826 503766 337307
11209 337307 234534 441635 518119 407752 494236 423204 497006 671580 469459 73704
11199 73704 87671 90347 99853 428375 326109 471392 598336 383042 268719 249093 233718
11188 233718 185755 44231 260158 342286 247031 400200 408064 438644 300937 114694 77184
11177 77184 76172 124216 157194 139295 203445 126262 132481 -27911 -164297 -354441 -55228
11166 -55228 177103 43889 129110 223743 260276 396799 400788 363273 257952 62110 178298
11155 178298 95799 42934 243209 232165 212373 117518 71515 -55273 16994 15411 -55360
11144 -55360 -187856 -146523 163530 104875 183673 106870 130742 39310 101622 -27242 -39153
11133 -39153 -101467 -40542 21107 -128216 -187740 59695 149214 89271 175226 59471 85201
11122 85201 -14154 146475 128575 32550 94817 191351 122064 78780 -39033 -509 135915
11111 135915 -81422 -189562 -149994 -234178 -47876 19716 114009 68685 3096 96146 -9766
11100 -9766 45686 185138 205054 48440 1171 155711 211714 -90284 -54207 84039 86300
11089 86300 10262 12034 140780 222903 142239 236762 121271 156993 286246 143923 33816
11078 33816 22593 -16552 -242209 -220459 59141 176898 140650 78213 136365 -161514 18112
11067 18112 93777 14966 249976 158222 160800 184050 207334 310672 97691 -61109 45162
11056 45162 78373 119535 121699 -19563 70988 63952 -23427 -12292 74890 -17466 20026 307609
11044 307609 151552 -38133 -34966 -51437 38750 67037 -68284 -146334 29685 10552 -35174
11033 -35174 11041 218276 158044 13244 -121544 -66824 -77168 71806 66502 -170448 60868
11022 60868 169483 20853 -48388 103389 86034 46470 -57085 226310 164686 145358 3547
11011 3547 -172417 -142760 -83499 -9240 28346 259684 295349 107616 121664 -203733 -192412
11000 -192412 191834 181067 -76696 -110899 -212990 -102549 -32074 -54578 153937 74858
10990 74858 -103587 -169838 -45601 43589 -153675 -94866 -131227 -196254 -171204 -319683 -101811
10979 -101811 179483 27309 89186 116653 -173768 -108314 -11338 -212765 -14558 125564
10969 125564 -71585 -261152 -206248 -117943 268319 179820 -77831 -120886 -140330 -73018 -43715
10958 -43715 -279494 -353975 18084 109333 -156621 -123663 -59876 49406 19629 -11489 139558
10947 139558 -50727 -116614 86641 95290 -50105 66617 128513 157581 166169 226024 -209097
10936 -209097 -200492 -14753 -11716 147564 141772 189671 207001 352771 296246 12477 -53535
10925 -53535 75247 114710 144704 59875 -201237 -254689 -122206 -59609 -91175 -147912 -166704
10914 -166704 112266 135152 241293 185443 16162 -75610 -178024 -115415 -43427 -171063
10904 -171063 -4443 93081 -62869 -217231 -33217 48043 -43209 -37728 -358 -216503 -224809
10893 -224809 -69770 -90917 -136634 -9317 -84953 -64457 -172171 -31734 107504 4984
10883 4984 21429 -15771 -71012 -161770 -168241 -238811 -222796 -239824 -65107 -2128 -22394 -48269
10871 -48269 -225608 -318801 -7936 -15315 66285 -123445 -32721 175293 89893 -20506 -60945
10860 -60945 103974 110210 66944 49173 284306 378491 189670 258018 23965 -125434 -14277
10849 -14277 -100743 79556 103838 95747 236703 152389 150290 188540 -159669 -72107 80757
10838 80757 214134 149666 38446 -39456 -55528 -40307 -65457 -135439 -196383 -4866 151104
10827 151104 85715 159142 99341 234839 172620 115874 47 3331 8053 -44888 55272
10816 55272 99461 124823 31708 -170464 -186586 24723 -54456 17082 -145226 -174234 24171
10805 24171 34064 199033 84707 140753 165839 -855 5775 47138 75518 -100236 -167935
10794 -167935 -103935 48177 157813 304626 237335 180164 14004 107898 49416 173691
10784 173691 190005 -18701 -8635 156025 183056 156380 -77104 21547 68223 -8945 -177531
10773 -177531 -64572 163991 181324 -44933 -160436 -34352 109060 -37150 -156572 -130283
10763 -130283 -143568 -195004 -211274 -234869 68802 215680 164623 30280 66107 12426 51726
10752 51726 150577 50720 235604 292195 176956 -6316 58706 8881 191516 175269 103464
10741 103464 267399 174081 141913 277759 75881 57439 160202 209286 154745 156729 140164
10730 140164 -50929 -157067 38753 12898 -57237 -33464 -141383 -240059 12839 95335
10720 95335 39373 137517 75410 40006 78163 274743 121797 -14954 -257916 -262303 -9936
10709 -9936 44467 90615 84112 160398 68107 41797 150989 91959 310646 254945 159017 99221
10697 99221 -147660 -78260 -39916 6814 176223 -10671 -175781 -117068 -17442 240807 163168
10686 163168 160127 57788 152293 140144 8273 -19872 -16359 -49861 -36151 66695 24248
10675 24248 -168579 -96620 -328 -88501 57413 94473 -6168 235945 109236 103299 67200
10664 67200 231939 196655 155967 200046 387186 353134 213035 120429 129027 59126 225109
10653 225109 196110 -2091 -71346 -198681 36852 310465 377256 43629 151342 24783
10643 24783 -251097 -252257 -26935 42402 98213 55888 -102935 -330542 -166269 82711 -135096
10632 -135096 33404 123856 273468 35039 -139814 -124067 -122970 -39019 70680 197000
10622 197000 -91843 -43991 -61582 -137001 45620 197008 244163 211330 246357 252886 272170
10611 272170 96909 90539 -14331 25941 116714 129298 130121 89448 380141 175644 137140
10600 137140 167461 139402 -39788 -49332 69724 203021 99580 79418 72178 -24204 120668
10589 120668 162778 -57782 91131 267530 159892 -29226 126640 135859 119076 191485
10579 191485 166306 147556 123775 -34255 118511 98789 214183 256459 115550 91233 244175
10568 244175 244467 93779 863 26719 125365 275103 333339 219018 89782 -119264 48104
10557 48104 199368 243849 27206 -107411 31136 55755 -75925 18834 35388 -87589
10547 -87589 -96556 12686 134935 47966 -3555 -56677 -138914 -114580 173880 229594 -41611
10536 -41611 1783 203299 151870 172378 148301 206581 254115 168565 289298 217604 164241
10525 164241 110556 91912 135188 218041 392736 254826 268659 280393 -20467 60648 147809
10514 147809 244652 242039 161654 73145 222587 147614 25789 218635 362932 167353 63982
10503 63982 -733 -14624 51417 115454 318801 489788 327730 310339 426813 401500 345627
10492 345627 281532 263029 387423 526461 528769 397584 275687 295580 376780 266666 405446
10481 405446 567848 324600 94534 240588 516557 502959 457892 477810 471400 651408
10471 651408 696553 505629 391568 545719 689751 753755 729158 552089 628290 543482
10461 543482 683494 567903 586139 648536 919287 944049 910309 997204 927521 901136 765325
10450 765325 697409 934791 1158373 1124723 1023451 779782 856861 694137 803165 989557
10440 989557 840271 571796 925683 1210359 1104282 1212185 1284480 1231143 1141390 970792
10430 970792 1136917 1094490 1202072 990918 1026790 1081419 1331844 1292372 1417228 1310147
10420 1310147 1206688 1483026 1765226 1852184 1695430 1954957 2031460 2019679 2002919 2238616
10410 2238616 2236082 2422254 2562952 2822173 2862736 2881861 2780949 2956018 3077640 3300741
10400 3300741 3474349 3607738 3809814 3564179 3213057 3093190 3002667 2959536 2869150 2708681
10390 2708681 2718697 2738043 2498915 2390048 2043122 2009590 1987669 1961099 2005646 1700478
10380 1700478 1566549 1484136 1430167 1338659 1426881 1281763 1353714 1397309 1354163 1239549 936276
10369 936276 772251 477033 651838 802914 1119234 1191492 1093544 1024791 782208 795828
10359 795828 647817 617422 796374 724148 763612 790012 728967 750348 582918 371972 419505
10348 419505 373898 313111 344392 648824 440968 444095 505134 637039 727583 580824 692645
10337 692645 661187 543186 586140 595312 439147 327359 369191 284249 241017 195562 202169
10326 202169 366006 189037 391483 474311 437051 469462 380714 395625 468543 421268 385826
10315 385826 383607 367174 236027 295240 369804 468853 370392 459269 314333 243838 252358
10304 252358 125705 300155 270828 249246 92868 29335 162397 12686 61752 4442
10294 4442 5973 248712 364603 406615 381690 152211 171197 187736 296819 421211 349718
10283 349718 250117 342707 229396 260997 192450 -47837 153160 134487 334898 306060 -3164
10272 -3164 203222 304378 240002 254856 163728 -20493 -21949 -89058 -65290 213765 259096
10261 259096 182704 -121924 -148646 24045 188060 120852 43500 -52916 -52065 -70242 320816
10250 320816 386553 261935 311296 217144 371152 154531 39905 144295 268774 134571
10240 134571 234453 389263 240958 155677 90565 50282 -144539 32671 135741 197836
10230 197836 406326 214680 188943 368856 445784 404444 356977 444257 445130 309124 131321
10219 131321 91801 86092 272181 233383 256543 495950 367540 254346 140451 -22452
10209 -22452 21214 161381 -22545 45061 76486 95622 320075 95835 -122410 -2315
10199 -2315 107507 75493 -87192 78021 -57889 149822 284768 209046 661 -206693
10189 -206693 -113150 -150116 -77407 121881 189025 54040 147912 186906 35424 145531 26020
10178 26020 -49446 21454 81147 313488 273509 -60095 19286 134816 94990 125801 123717
10167 123717 10850 -21132 20757 66713 -38859 -54645 -192159 -24176 115726 -95149
10157 -95149 -14619 176595 117857 107693 -14981 -225011 -83313 -93273 272464 321416 253591
10146 253591 188064 455652 222457 -18843 -61123 39429 69213 12672 56153 6746 -622
10135 -622 -89032 233112 317730 233957 31680 40038 29300 54992 167951 70595 222917
10124 222917 6011 23712 318400 415187 337187 262767 222219 57100 37690 217181 151163
10113 151163 126275 152458 438588 368088 247308 176893 290517 186260 339451 204076
10103 204076 115753 256053 97959 77820 119664 -34961 53081 181949 161415 190097 295877
10092 295877 273480 99743 257305 135108 27638 203457 292481 330629 271909 174165
10082 174165 40360 216314 199353 222142 357183 270162 171735 142154 200389 288884 344183
10071 344183 193044 143562 186537 253651 220392 185891 238711 514805 501108 637098 628254
10060 628254 732149 899690 886313 950249 1050866 1248708 1288683 810669 712807 794548
10050 794548 862481 897007 680959 629115 679442 509582 604412 390126 317319 272342 576520
10039 576520 411856 324199 164655 92776 -80546 15225 158492 103400 234513 323218
10029 323218 337721 227178 228829 268681 347458 400589 460025 269833 339171 252907 334714
10018 334714 247716 201548 231024 134469 331708 311274 419014 299196 21494 -43790 -1906
10007 -1906 121088 160126 248959 423174 490074 468741 605576 479384 249267 227223 -28063
9996 -28063 112845 477823 505268 337601 138979 129339 227004 191445 255417 436112 362055
9985 362055 151295 153698 210424 82769 10861 134825 337299 342987 453996 248462 391472
9974 391472 288642 69067 126063 326614 438013 308637 340379 454478 550351 644701
9964 644701 519465 387417 299802 280158 370921 525322 305890 148137 330543 450060
9954 450060 679262 514288 352512 462718 360195 272626 314173 260372 252023 421017 446173
9943 446173 568527 415706 356043 493209 406293 569145 423239 518688 691546 421118
9933 421118 589622 480356 445171 494154 695784 707366 819657 753911 857851 854685 625845
9922 625845 804430 640588 510664 525921 559646 791931 756536 759580 766233 530747 564920
9911 564920 703917 815297 935605 1179011 1235819 1064607 1062566 1281249 1423464 1543397
9901 1543397 1583500 1673378 1947119 1907030 1704204 1667935 1840273 2064440 2033565 1886994
9891 1886994 2017307 2011951 1780024 1655689 1577822 1625296 1513707 1284233 1149577 938973
9881 938973 709955 832346 869081 1038332 1011011 955846 763713 732122 625895 509717
9871 509717 754313 724282 608087 529704 554007 594547 705435 778336 745277 609124 871829
9860 871829 776343 617255 774700 720963 948065 818663 743131 1009711 940465 608168
9850 608168 533970 820003 950031 816361 731428 664870 736623 735452 660122 393505 553150
9839 553150 734639 482110 554859 597482 663081 667257 824764 832774 667162 814168 861604
9828 861604 677590 698048 789421 836387 948811 845399 929504 831155 848599 997427 989114
9817 989114 1020410 924599 818172 1043737 900946 1003891 968496 863280 875976 1007947
9807 1007947 1069847 1006094 787347 947801 1027554 821716 1035890 1157562 1021675 909442
9797 909442 997670 1099407 1100013 903305 1055185 1096411 1142923 1030359 927711 959048 932154
9786 932154 886063 898655 908485 832561 860759 1132984 866782 840901 1070757 1151709 1145289
9775 1145289 1148191 1223353 1276650 1249779 1270985 1264567 1347176 1412878 1356956 1449381 1574090 1523926
9763 1523926 1339971 1256813 1354973 1503180 1502598 1554780 1523242 1527322 1380882 1481408 1292338
9752 1292338 1314088 1593014 1639260 1627341 1857693 1855547 1696180 1629017 1603247 1754616 1625627
9741 1625627 1719834 1733995 1825852 1666923 1668764 1740614 1684720 1783577 1852218 1547292 1734283
9730 1734283 1906330 1697733 1801338 1690809 1770742 1595874 1553099 1617745 1720639 1789569
9720 1789569 1969696 1969887 1860358 2052766 1980935 1966192 2073101 2190272 2268041 2289880 2176212
9709 2176212 2093233 2127573 2273854 2275849 2307952 2164919 2194062 2088993 1979327 2032113 2279335
9698 2279335 2267736 2351370 2359150 2252136 2377418 2263690 2515949 2304655 1998934 2067136
9688 2067136 2204018 2262170 2480063 2806797 2789392 2739710 2896448 2818034 2754317 2697517 2742637
9677 2742637 3022460 2999911 2860713 2989540 3090997 2921200 3155090 3148185 3099533 3071175
9667 3071175 3103284 3266685 3380742 3480882 3363110 3334328 3353578 3430766 3390246 3556368
9657 3556368 3668523 3851977 3855961 3718183 3921957 3988465 3997760 4280759 4266427 4151448 4431300
9646 4431300 4697705 4705712 4589601 4561400 4608252 4736994 4842486 4813041 4795492 4902626 5042124
9635 5042124 5171559 5156130 5171727 5409479 5543705 5649275 5789528 5956062 5930499 6109201
9625 6109201 6077087 6203121 6549258 6649867 6781942 6791158 7142893 7265305 7373257 7452862
9615 7452862 7563128 7960694 8330274 8350761 8501011 8666412 9043281 9227200 9297867 9568288
9605 9568288 9782831 9999567 10491263 11052227 11390573 11428422 11644363 12009170 12383637 12584771
9595 12584771 12965063 13248399 13719109 14317458 14638664 15211404 15726635 16156571 16568763
9586 16568763 16788073 17347420 17994570 18563820 19336618 20014377 21182235 22524492 23664958
9577 23664958 24660182 25684756 26453761 26850054 27323984 28087173 28507420 29259803 30135169
9568 30135169 31017587 31440168 32050700 32461824 32929686 33201230 33919482 34591740 35144008
9559 35144008 35620466 36335773 37414754 38502490 39564363 40814319 42009716 43382073
9551 43382073 44994387 46830435 48538391 50306346 52315825 54460136 56883430 59532935
9543 59532935 62555183 65618396 69174504 73064426 77725987 83060966 89379559 96887882
9535 96887882 105834229 116486955 129360544 144624852 163404953 184938991 207913013
9528 207913013 230313703 249898665 263761388 270826310 272584955 271141731 269542601 269882254
9520 269882254 271640985 273117573 271777624 264936149 251865409 232964499 209981288 185973118
9512 185973118 163421576 143746195 127279433 113765862 102887181 94213021 87033407
9505 87033407 80840599 75715590 71167922 67013077 63609739 60556897 57381255 54515830
9497 54515830 51715031 49177137 46764001 44607259 42702968 41087688 39523171 37654210
9489 37654210 35980446 34519180 33367773 32137985 30787688 29750408 28678673 27546110
9481 27546110 26554276 25960675 25347279 24837856 24639809 24529629 24516813 24293157 24432815 24623676
9471 24623676 24765552 24776373 24428326 24267611 23888781 23283247 22921194 22574287 22167515 21405992
9461 21405992 20699838 19995943 19536806 18960929 18416777 17920581 17688289 17547023 17389912
9452 17389912 17328650 16986229 16581533 16220846 15796598 15544023 15046285 14522035 14133410 13981565
9442 13981565 13499540 13071702 12865719 12515176 12303763 12120139 11887947 11975740 11889421 11890738
9432 11890738 12262362 12258223 12468049 12831524 13256838 13886199 14319084 15202910 16521899 17842217
9422 17842217 18944189 19957727 20499473 20658172 20788920 20868647 20924642 20955227 20783622 20236444
9412 20236444 19493088 18344532 16910810 15316753 14052948 12983810 11859036 11146044
9404 11146044 10587120 9836322 9335537 8899890 8547182 8292020 7990628 7700703 7335369
9395 7335369 6911338 6769830 6745084 6606821 6539727 6362140 6121241 5940189 5717661 5490512
9385 5490512 5427855 5470538 5587095 5303531 4978947 4965774 4904005 4933860 4975367 4895734 4478154
9374 4478154 4571785 4580388 4315456 4260525 4215755 3909068 4133753 4312815 4235240 4053439 3912235
9363 3912235 4050032 4123393 4181426 4228566 4058324 4197077 4130527 4267998 4086812 4237813
9353 4237813 4444527 4278094 3916629 3886352 3798225 3811260 3968794 3984427 3819285 3784614
9343 3784614 3669994 3558016 3508694 3349435 3175057 3075622 3109589 3162855 3016370 2989059
9333 2989059 2792245 2690954 2856927 2884937 2548955 2618567 2864016 2698262 2745495 2743015
9323 2743015 2929071 2736220 2866986 2852816 2841687 2947686 2882167 3064183 3177459 2960501
9313 2960501 3056865 3135250 3108764 3021983 3153195 3103584 3028144 2935812 2899633 2912590 2841583
9302 2841583 2764284 2610339 2470357 2409582 2527207 2613415 2380894 2518277 2444896 2499161
9292 2499161 2427142 2391066 2378095 2232005 2091753 2208009 2331960 2286162 2123781 2119356 2226506
9281 2226506 2198726 2079993 1961135 2136476 2300895 2112251 2145070 2252267 2263812 2449882
9271 2449882 2326557 2330675 2261415 2320545 2388523 2380443 2404938 2528297 2732357 2472770 2402853
9260 2402853 2480449 2514276 2406633 2520513 2479839 2499227 2545430 2511999 2617420 2723963 2780562
9249 2780562 2797349 2887388 2794058 2792919 2597395 2834346 3051065 2869929 2864393 2829062 3112742
9238 3112742 3301579 3141895 3307231 3560773 3652809 3861553 3761219 3789291 3950851 4130316
9228 4130316 4419557 4708234 4931757 4546965 4210659 4258327 4140053 3750453 3554628 3673680
9218 3673680 3731902 3954687 3933072 4005414 3931142 3912163 3733104 3727760 4109088 4328224 4454142
9207 4454142 4338405 4269459 4233131 4376673 4497422 4738934 4709110 4728243 4686338 4559111
9197 4559111 4593473 4603485 4879280 4955984 5031870 5300600 5371789 5422939 5554564 5581693 5442369
9186 5442369 5278061 5183869 5186708 5244471 5329943 5308086 5307389 5251771 5368168 5391231 5505270
9175 5505270 5400977 5682180 6047549 6287461 6337727 6386099 6625702 6821499 7315844 7725775
9165 7725775 8205192 8544857 8983935 9776190 10616328 11918338 13559840 15007479 15841693
9156 15841693 16050878 15707355 15316304 14919896 15351332 15913803 16212225 16056584 15286052
9147 15286052 14002221 12888872 11848957 10834434 9904964 9455333 9265209 8900347 8847265
9138 8847265 8434823 8172971 8071149 7893965 8021050 8391222 8540205 8861527 9079341 8754895
9128 8754895 8328391 8205864 8284977 7990021 7832802 7928903 8061496 7831531 7473368 7166259
9118 7166259 6856228 6681711 6372802 6059386 5903197 5848376 5792617 5839011 5954872 5891815
9108 5891815 5668492 5652336 5649454 5783967 5907395 5833399 5720587 5828111 6226088 6162573
9098 6162573 5767023 5792921 6013592 5971912 5716945 5965037 6228588 6285228 6129139 6092158
9088 6092158 6295602 6367924 6214954 6114161 6425128 6475540 6640939 6760415 6864945 6847365
9078 6847365 6473457 6683685 7003241 7051092 7014434 7230861 7445464 7451079 7386742 7769511
9068 7769511 7925979 7995829 8218600 8497916 8466633 8421634 8600067 8846193 8886309 8983087
9058 8983087 9232313 9475127 9528693 9784339 10029135 10014486 10069472 10254158 10487714 10792057
9048 10792057 10884886 11033345 11303702 11401942 11656755 11885911 12083906 12071929 12389261 12692936
9038 12692936 12966183 13187218 13476975 13763754 14058714 14692164 15024605 15068902 15217486 15818203
9028 15818203 16203063 16597317 17161173 17487235 18102148 18533429 19058467 19705271 20183368
9019 20183368 21049393 21755943 22302097 22817743 23517936 24102356 24695875 25486005 26180866
9010 26180866 26831740 27604951 28441635 29272907 30236519 31054203 31976096 33169725 34168245
9001 34168245 35029098 36135602 37605061 38774615 40478254 42506247 44445190 46693918
8993 46693918 49135285 51922359 55105931 59265198 64134170 69636855 76126913 84199376
8985 84199376 94225125 106267701 118079756 126279595 129140836 127931886 125170073 123070591
8977 123070591 122812393 125205846 129589428 133721852 133964030 129609737 122048408 113268346
8969 113268346 105070899 98216421 92723025 88488571 85653852 83515094 81935489 81235305
8961 81235305 81296465 81707079 82585244 83830776 85617961 87542333 89853011 92748041 96138647
8952 96138647 100685641 106522723 113740257 122764701 133921689 147928335 165495799 185958477
8944 185958477 206534221 221301333 226215047 223335226 217199308 211797311 210426383 214488758
8936 214488758 222549535 230076836 230966550 222749775 207988280 191116934 176176844 165006277
8928 165006277 157069965 149005649 138984990 127625208 116312613 106290484 97714794
8921 97714794 90636036 84962521 80735817 77364276 74113884 71073438 68091761 65533506
8913 65533506 63105557 60797306 58921742 57172573 55917178 54629075 53983149 53360876
8905 53360876 52637092 52301026 51751567 51060370 50622082 50573306 49879221 49448421 49227077 48975918
8895 48975918 48957184 49014457 49096270 49421418 49950020 50564145 51096537 51868750 52672069 53360342
8885 53360342 54164912 54848351 55874662 57012495 58101541 59221684 60650196 61727848
8877 61727848 62936673 64050124 65575778 67785455 70194464 72931374 76278505 80210520
8869 80210520 85071095 90825274 97593498 105842081 115646581 128103832 142641443 159817018
8861 159817018 180853276 206077641 234124668 260794966 280362492 288800093 283701022
8854 283701022 265334916 238758457 209638394 182120162 158432845 139134912 123989871
8847 123989871 112367829 103259448 95803367 90160247 85273681 81278002 78034212 74845063
8839 74845063 72093362 69759738 67893250 66895516 66111981 65677381 65489460 65760644 66313145
8830 66313145 67257461 68716405 70878771 73926896 77827983 82732269 88629940 96609696
8822 96609696 106483454 118817068 132918020 146535248 156572913 160853031 157537126 147376752
8814 147376752 132555720 116233113 100927256 87716414 76887258 68385728 61835366
8807 61835366 56364382 51980150 48491794 45290439 42660997 40191694 37824417 35902728
8799 35902728 34202971 32453069 31015958 29599829 28501007 27544671 26345671 25604019
8791 25604019 24743160 23969140 23171732 22170059 21529222 20688483 19920715 19160374 18461458
8782 18461458 17843444 17460913 16937856 16725898 16442700 16105010 15521033 14934373 14759651
8773 14759651 14355734 14082833 13575395 13498447 13300347 13122674 12923062 12721515 12447729 12166057
8763 12166057 12029771 11608152 11370861 11210697 10970739 10638684 10551491 10432574 10176061 10341651
8753 10341651 10076342 9903224 10053032 10039136 9975937 9907916 10097680 10187189 10095075 10231684
8743 10231684 10522149 10783341 10845673 10927256 10970547 10981624 11249842 11611993 11506239 11486154
8733 11486154 11489769 11195012 10674455 10470529 10400132 9827709 9335568 8998279 8702519 8801992
8723 8801992 8774493 8470907 8186146 8132973 7994069 7844986 7783014 7984847 8384117 8404519
8713 8404519 8545417 8776276 8838528 9009306 9493581 9817801 10206331 10699791 11088058 11464608
8703 11464608 11221221 11293198 11267139 11211515 10937205 10479509 10046867 9619368 9042600 8728143
8693 8728143 8240873 7521041 7130385 6770775 6509458 6190923 6195743 6234081 6112259 6043202
8683 6043202 5938850 5899905 5910912 5850136 5948859 5885651 6032407 6180855 6263908 6290169 6232135
8672 6232135 6384704 6592619 6475863 6617006 6468595 6087677 5962640 5618282 5488965 5311769
8662 5311769 5129603 4675657 4355109 4197418 4057622 3922905 3793955 3721815 3642121 3566859
8652 3566859 3240081 3150876 3176325 3101643 2943852 2947382 3014991 3087912 3005847 3010138 2704842
8641 2704842 2615152 2747957 2571506 2575661 2504673 2594271 2495257 2385285 2212187 2263371 2496781
8630 2496781 2314092 2186457 2056039 2128850 2197373 2169508 1937748 1804738 1799355 1820317 1959490
8619 1959490 2002780 2110411 1987055 1733370 1929338 1975219 1819391 1886852 1973101 2088907
8609 2088907 2072765 2158842 1896142 2023817 2220918 2343789 2441271 2724342 2496394 2331392
8599 2331392 2514489 2434441 2554651 2454222 2322415 2280636 2220792 2009669 2030205 2032736 2183291
8588 2183291 2047900 2023421 1952190 1650677 1526646 1816946 1901944 1947173 1651133 1642272 1442595
8577 1442595 1520937 1678736 1687906 1456344 1635776 1866742 1631534 1614997 1538647 1708381
8567 1708381 1735511 1859306 1916958 2028926 2062748 2129867 2138026 2003735 2089989 1953043 1971490
8556 1971490 2154606 1962514 1796013 2083031 1786130 1420967 1642951 1659189 1466424 1219106
8546 1219106 1321920 1318743 1315790 1478641 1293769 1164843 1410323 1509462 1478846 1211528 1254684
8535 1254684 1311918 1149218 1217108 1397470 1331939 1096736 1190886 1126592 1118764 962557 897409
8524 897409 1078477 1071715 995072 919273 1133671 1197196 1012607 1036282 975774 790460 861028
8513 861028 796284 860788 762372 964766 1013271 1005689 1099927 1095133 965152 958109 1079171 920747
8501 920747 905069 1013366 985258 1045358 1222278 1358623 1562140 1679269 1623249 1501807
8491 1501807 1662445 1791017 1885820 1850228 1802161 1895296 1910568 1767480 1488075 1296684
8481 1296684 1295657 964761 899006 980618 772418 894838 810323 844898 765904 923029 987764
8470 987764 945281 1057428 1269483 891355 730658 840991 937671 805960 827162 748923
8460 748923 697795 897868 993474 1017663 1096838 1150867 1189093 1290811 1288541 1295473 1547929
8449 1547929 1653643 1510677 1583557 1493270 1493495 1297000 1070066 925445 901886 885901 835425
8438 835425 721792 593035 549918 435747 663551 697696 580546 581577 681456 643227 406559
8427 406559 476531 349504 527965 745218 665217 669352 779088 659482 508360 394294
8417 394294 355044 388764 425589 457467 528822 667570 545167 428792 543482 374866 572802
8406 572802 594719 504491 511715 521743 487364 552484 568825 505302 528242 351346 307276 338556
8394 338556 237997 372344 127332 390316 226525 212710 358347 274099 193843 49166
8384 49166 107647 197112 485524 380538 298983 317330 317390 556949 407884 444186 361298 270908
8372 270908 293152 318075 278758 89562 365264 388503 436666 467295 669519 518581 487924
8361 487924 466090 387130 298733 378049 395000 191723 290887 492376 416249 395196 458848
8350 458848 277498 118115 295462 288446 110437 87536 -53640 -50102 106972 236580 35975
8339 35975 180691 83792 16937 87474 -79141 114519 151823 -37583 194941 218862 333788
8328 333788 403933 199345 356442 179682 75376 226421 226589 76431 11307 90507 236806
8317 236806 -158842 121749 341016 412805 211250 75063 255039 112964 281142 341371
8307 341371 336947 207813 71539 78227 212878 193936 138028 245046 325208 367272 460019
8296 460019 445212 439655 356094 190919 71494 64495 116252 143306 327384 130311 -23217
8285 -23217 26665 119134 134406 170034 114661 -137788 -30940 290882 389933 392852 262806
8274 262806 215814 64636 -122599 6811 294551 390029 184880 118513 95135 228801
8264 228801 123160 119713 357511 370206 316797 162546 140616 136058 98349 179753 220086
8253 220086 311671 105930 44005 1054 -127666 40408 -114037 -190795 -201045 -164656 166732
8242 166732 222700 149810 154462 248823 51264 -128883 32368 168399 107923 28635 -113564
8231 -113564 -122062 -121264 4129 73231 30591 142176 106543 246376 155396 156857 90175 -23153
8219 -23153 -198485 -113282 -248859 -356162 -312659 -202152 163256 198639 -10269 -60663 -11604
8208 -11604 -76576 94234 -61319 114433 -1491 -89719 -123803 -218954 -247544 -264851 -110773
8197 -110773 -113118 43778 -64944 -58001 248121 1023269 884860 232010 50008 -43593 86627
8186 86627 188280 54147 67489 -39835 -34617 239255 228442 190272 -12296 130695 109298
8175 109298 -25533 40141 -12038 -137864 53240 95895 -105433 -216918 -156790 -134588 -90813
8164 -90813 -83316 -82887 -125983 -13 -41081 -42111 82959 -74785 -225174 -32312 52040 -11864
8152 -11864 -159844 -459894 -216380 -52710 65594 66208 -138615 -47936 23001 44755 7371
8141 7371 -5805 -20772 -34244 -22060 -52476 -106517 -144502 -530 7790 -165757 -171594 -55869
8129 -55869 -122137 -46058 48800 129646 74467 -26834 143166 203206 -96795 -144327 -18906
8118 -18906 -36529 -185450 -120219 -185481 -63885 -1942 -108388 -165807 -239304 -262097 -92245
8107 -92245 -258026 -199327 -113191 -294141 -318955 -128083 83581 -79259 -386 16584 27868
8096 27868 -98073 -31709 -230668 -130313 86067 -61002 17165 35246 -91797 -11202 -8947
8085 -8947 -108085 -103093 -74584 -13995 244495 210829 -22614 -47586 5269 -99146 -267935
8074 -267935 -17953 163432 70152 89988 -68512 -33931 -25166 -58243 -49074 18845 -117111
8063 -117111 -189137 -168603 -126128 -136301 -177261 -229640 -331641 -174186 -143139 -165116 -159075
8052 -159075 -253031 -75789 -62581 -188445 -109936 34397 270753 124467 -63502 -177518
8042 -177518 -25211 36573 -32409 -708 122052 -61804 -329137 -89526 292852 178526
8032 178526 -50730 -79223 -146211 -66021 89574 12521 -102023 71854 153723 -82520 -34297
8021 -34297 3063 68513 -14087 -255298 -222547 -113011 17785 98173 74544 277554 244633
8010 244633 46251 181714 168106 165952 220491 332730 331123 62482 -112900 -267433 -112131
7999 -112131 56563 131468 253619 260504 76334 -48238 -191614 -122441 -74481 188330 77799
7988 77799 -20886 35162 -196709 -80517 121564 -27636 13768 27542 -75785 55912 84351
7977 84351 137003 200389 46524 -84827 -16026 28052 27907 13829 14913 77189 78070 53408
7965 53408 -10588 -89111 -16305 34201 -124952 -99724 48361 13390 -171662 -181533 -129315
7954 -129315 -299 56846 -13645 -150621 -224046 26785 119330 51957 28729 23922 -85977
7943 -85977 18336 -255121 -363736 -223751 -111528 62241 281043 42395 -134968 -211450
7933 -211450 -205893 -358059 -372615 -192346 -136221 -292704 -152043 -147474 -118650 -198903 -145472
7922 -145472 -92473 -137307 -107402 -152708 -28336 -46816 -124944 -158193 -55374 -13446 -176605
7911 -176605 -15398 37216 -52040 -163656 -336173 -102636 -68554 141664 57355 -134305
7901 -134305 -110248 -134177 -78410 -35196 -307652 -62466 -96448 -131653 -87489 64136 84959
7890 84959 -6620 233961 109512 -189087 -316896 -177783 -224350 -20915 -51030 -95658 -26501
7879 -26501 -56689 -244660 126452 15520 -152552 -358930 -430451 -288444 -307398 -229929 -141975
7868 -141975 -98950 -378471 -187147 25125 20117 -169890 -112507 63430 123539 -101145 -90846
7857 -90846 -81573 46337 -67826 -134467 -422038 -370264 -161425 -209440 -1594 -42269 -23162
7846 -23162 -217897 -277778 -164273 20185 -147062 -100943 74592 181601 -66013 -145038
7836 -145038 -57936 -133244 -269622 -83803 -96653 -256022 -121579 105109 336472 140056
7826 140056 36960 155940 156147 118313 -1805 -145023 36524 -13188 33711 -261518 -277091
7815 -277091 61163 -9235 -112768 -71368 -183590 -246245 -217711 -61895 -118619 14638 -24497
7804 -24497 12903 -173090 -401063 -455914 -163078 52882 -200807 -345582 -244960 -155287
7794 -155287 -148492 -25432 31946 20115 -15710 19152 2785 16888 -92934 -88126 -81386 -80063
7782 -80063 -89492 -186561 -335191 -60344 206038 144360 62129 44667 83908 62435 21845
7771 21845 7895 3753 78948 102320 -174491 -281627 -129811 136211 -71063 -166214 -94203
7760 -94203 -25574 -204658 -53624 54275 87120 40257 -8676 108121 54695 68665 134277
7749 134277 -80608 -255352 -100785 -47191 105804 -6799 -251181 -363600 -125669 87369
7739 87369 101920 -54195 -59209 -2743 98204 29942 158362 87255 -43755 -74404 -158492
7728 -158492 -71126 -181940 -60694 129366 -106991 -272837 -130433 10881 -83534 -92011
7718 -92011 -211586 32371 53112 -203239 -171639 -146286 -315452 -319744 -354529 -309592 -107218
7707 -107218 -26354 -186709 8045 -87159 -80963 -17606 -70430 -192654 -97795 -180449 -119463
7696 -119463 167079 166991 33250 -72882 -139544 -115751 -32472 91898 92110 -51780 15367 -69463
7684 -69463 -63874 -23388 -44429 -274736 -202930 -210609 -50597 -136591 -190250 -44162 -25939 42739
7672 42739 -109240 43439 -85831 -131720 -52315 -197987 -370380 -405263 -107640 -264208
7662 -264208 -333376 -116073 3845 -17273 -126736 -219335 -119024 -99556 -91964 209196 294986
7651 294986 -30418 -206808 -102764 -116890 -121477 -187449 -210770 -122609 -47410 36181 42274
7640 42274 191957 187611 145184 -9137 -29722 -371141 -233208 -353944 -144574 -134459 -19400
7629 -19400 87967 77963 -153745 -208139 -18498 -6371 112092 135673 276616 -177229 -145053
7618 -145053 20475 -65678 75909 -118583 -288075 -263125 -342679 -92511 -5373 -76897 -188039
7607 -188039 36970 -276638 -355713 -134243 40381 -41763 -121971 -206151 -42281 -62793 -124379
7596 -124379 32134 147846 -393 -410214 -178843 -36165 181527 103600 -107685 -344323
7586 -344323 -480791 -182067 -59126 -76271 -296582 -248900 -45167 -25573 -54243 -36891 -128743
7575 -128743 -213976 -331997 -210439 -190222 -251027 -144444 -73951 204020 160900 69859 91347
7564 91347 -6828 -152118 -59470 -92422 40236 -74767 -259619 -335914 -329968 -94823 -1669
7553 -1669 146753 202607 -50740 -27840 -115441 -4184 -18240 -255981 -104103 64530 -127541
7542 -127541 -7570 -93815 -214045 -252475 -230654 -427954 -397818 -155404 -92385 -194016 -362240
7531 -362240 -399947 -417434 -306459 -225376 -30586 -79040 -47154 -213037 -204469 -84446 -28852
7520 -28852 61521 -29784 -52013 -56148 -511536 -297116 -13154 -135577 -189867 99926 79136
7509 79136 -22532 -229514 29355 -134543 -244905 -50212 -35745 -252630 -222944 87326
7499 87326 110261 -23273 26911 5035 -259867 -95808 -93003 -51225 -120297 -105035 53331
7488 53331 -131794 -100212 242380 138466 -62577 -119314 -86485 -238613 -268162 -103510 -257454
7477 -257454 -156851 -38766 49269 -8023 59751 221793 81843 302347 283920 111110
7467 111110 312648 169663 71587 12229 -215128 -175928 -63530 -110692 -134948 -121047 -174972
7456 -174972 -264177 -144664 -41855 104643 129108 -96150 39251 -227242 -368679 -402776
7446 -402776 -307960 -311947 -317706 -249504 -101636 -51582 -221534 -101007 -104221 -107079 -69398 -81369
7434 -81369 40049 120572 159153 15799 -146445 -115039 82928 -167558 -135098 -242169 -218843
7423 -218843 -175368 -157481 -75685 -169427 -118736 -101396 -40092 59981 14771 -48215 -56258 -115378
7411 -115378 32583 38370 106424 -102849 -106271 7332 -269948 -203678 48327 -23072 -238802
7400 -238802 -249228 -117434 21350 272639 305084 33063 -109774 20891 104580 10926
7390 10926 -119674 -137266 -124191 -280822 -254203 -182391 -174027 -173924 -302704 -214146 47456 212641
7378 212641 162338 48310 69804 -29075 -40241 25881 -88997 19289 -91111 -95512 79587
7367 79587 -12003 -151488 -75608 -59708 -121450 -106622 -209652 -172272 74503 174256 94601
7356 94601 53891 -38041 132046 242443 108613 -292620 -439910 -107370 -58218 -158434
7346 -158434 -172013 -156506 -24516 1959 -219316 -212556 -218078 -28393 32636 120206 24053
7335 24053 -269956 -309865 -353087 -184337 -148738 -137655 -89093 -196694 -56202 -97382 -26176
7324 -26176 20821 -45809 21983 108290 -45862 -91640 42185 -58437 -55449 -97170 -144381
7313 -144381 -38490 -190730 -4277 306837 127719 -26822 -41204 34487 55215 161716
7303 161716 -154221 -76532 -65717 -199074 -183376 -186966 -230645 -68751 11771 37504 155706
7292 155706 -123240 -92659 2830 100962 -29132 -235173 -162075 14317 60845 -5634 -216223
7281 -216223 -177816 -44407 -211303 -233626 -43277 4349 -89593 -50028 34100 -19464 9024
7270 9024 16019 -79195 -165057 -248353 -49816 -83033 -345771 -280636 -417568 -441519 -424533 -397862
7258 -397862 -114721 -165235 -57989 -190186 -111059 -119841 14952 194879 105366 90319 -203074
7247 -203074 -314189 -215153 -26464 -70621 -135456 -196124 -261073 -269498 -350975 -269923 -117316
7236 -117316 -87232 38077 186513 -28377 86497 149250 -183494 -213997 -282229 -244584 -238432
7225 -238432 -88109 -39734 -15836 -106382 -65271 -105187 -97160 -77741 -267156 15771 -33745
7214 -33745 -388926 -474437 -168599 -25598 153427 150166 104329 171621 197367 -123955 -218521
7203 -218521 -18910 -2927 153769 98345 -15583 45328 35764 -98790 26269 -82582 -112740
7192 -112740 -19077 -21477 -58177 131725 26243 -26824 29134 170764 241054 -101147 -245580
7181 -245580 -106101 33903 -117409 -232561 -201643 -162093 -218446 -75671 114386 -1964
7171 -1964 -133172 34972 -84449 -319599 -28700 31764 -130375 -15693 -194485 -300114
7161 -300114 -121527 101330 -71697 -109119 -118464 -111478 119670 145742 -42411 59547 16920
7150 16920 20179 -12661 -63571 84724 179648 94263 -210370 -64673 -36815 -225383 -114237
7139 -114237 125384 -69673 -375175 -559906 -385918 -195131 183353 118745 113214 146956
7129 146956 -132330 -213452 -107335 -28530 -149254 -219914 -32730 56915 -46065 -110855 -45422
7118 -45422 -184671 -208865 -284124 -279179 -197755 -260124 -94471 -56006 45442 -146541 135054
7107 135054 322915 128154 10053 -9058 -72865 -73766 -223417 114002 271747 94428 36925
7096 36925 -124249 -185114 -222911 -322664 -179031 43071 -44468 -36332 110490 -41196 -188869
7085 -188869 -196564 -525062 -554148 -233620 -69880 -80618 110018 107120 -170081 -259796 -130139
7074 -130139 -227949 -237623 -380084 -127359 155993 148570 97549 -148552 -295815 -72442 -42122
7063 -42122 -100165 -54767 -75388 38154 27958 -12866 -127042 -138757 -103369 -186023 -189724 167920
7051 167920 234918 -80358 -139822 -168170 -201727 -131426 -153634 -283336 -368009 -269360 -285228
7040 -285228 -109302 -153312 54196 -33468 -60806 26482 52429 -28195 32172 100962 80336
7029 80336 70427 -270167 -133557 8674 -110281 -227370 -83608 44242 -53208 9026 24626
7018 24626 -166940 30762 -105091 -178943 -136074 -43559 -213677 -197331 78341 13691 -107915
7007 -107915 22922 39025 -87756 -154884 -19634 115437 43017 111732 21868 -151206 -275838
6996 -275838 -212997 -61502 -190037 -137629 -129065 -186319 -85231 -128111 -1690 60864 61779
6985 61779 -146844 -87754 -54003 -182145 -52329 -122127 164413 -57261 -224960 -225596 -262668
6974 -262668 -145797 75973 -26451 -16779 28913 76865 134757 -10520 -3590 -255465 -51944
6963 -51944 -145400 -48923 -149869 -210717 -25354 -98167 -12957 -110823 -220497 -122586 15061
6952 15061 -25876 -154786 -31453 -74382 -174386 97637 37175 -35156 135447 69432 -35119
6941 -35119 -33550 -209534 -263024 -169778 -166478 -9608 -189899 -306828 -217808 -106530 -82904
6930 -82904 -13843 50841 27491 106372 64723 -111158 -248697 -211412 -56315 164123 156390
6919 156390 44124 -166949 -124028 205994 58401 97540 -79079 -131477 -98044 -219809
6909 -219809 -358507 -267244 -409004 -342067 -194600 -42254 153533 36107 -131797 -163785
6899 -163785 80711 434028 361544 -29042 64678 312330 416995 433522 349761 298330 314197
6888 314197 265831 494643 183545 203485 181317 144304 -47820 -79407 250240 185735 52475
6877 52475 109516 -48765 -279357 -302585 -56081 79487 -26217 -120530 -135233 105513 208676
6866 208676 -1020 -68862 -178917 -86155 -37664 -123598 -263281 -140323 -36874 -237705
6856 -237705 66245 111707 -72870 613 54906 -95038 -24940 -57203 -253929 -208822 -119553
6845 -119553 -177376 -290483 -332642 15489 58061 -188010 -432632 -272201 -111750 -106772 -21715
6834 -21715 -37328 -72555 -246229 -92959 -135651 -152166 -153974 -129338 -157831 -136162 13583
6823 13583 34851 60877 170606 107125 -79095 -75242 -160895 -169231 -129879 -259724 -157385
6812 -157385 -221052 -87660 27881 6445 52182 8685 -1315 -206674 -32274 73876 40617
6801 40617 -134682 -219309 -162343 -61376 -125689 -120815 -65746 115043 -35011 40952 -107607
6790 -107607 -287345 -49031 -71764 -148173 -145614 -101415 -126488 -146707 -297660 -240063 -449034
6779 -449034 -312134 -216878 -94304 -47653 2515 77753 -99229 -90650 -83680 45527 -155068
6768 -155068 -148349 -21438 120109 289895 -2321 57516 -66538 -53878 160492 262307
6758 262307 -8884 -183017 -81914 -124793 -434023 -294919 -33967 -227761 -184187 -204655
6748 -204655 -235084 -271716 -246884 -157808 31444 -115951 79793 287081 157116 50819
6738 50819 17187 -309941 -195953 -85346 4447 81439 -108164 -141955 -120164 -234607 -224463
6727 -224463 -59422 -19322 -22120 -43566 32252 108613 113679 -268022 -194812 -135495 -355689
6716 -355689 -233536 -226577 -256351 -195112 -92620 -121458 -48020 -60091 -53115 31979 -239920
6705 -239920 -159762 -256469 -486167 -127559 -159334 -204005 -82193 -5213 103398 191172 218601
6694 218601 143109 47022 10647 -102111 -19744 46664 89875 1074 -55075 28734 -45000
6683 -45000 157672 162890 28151 102599 46489 -146805 -160642 -343717 -221225 -156335 -179254
6672 -179254 -177471 -90711 18928 -95975 -285338 -209002 -317935 -238895 -147390 -105006 -122027
6661 -122027 -237892 -69433 10430 -23132 -5694 34972 60091 -180681 -197710 -281761 -276170
6650 -276170 -290602 -190833 -313122 -366257 -284812 -85377 -47333 -194805 -39370 -110361 -84359
6639 -84359 -327251 -257928 -192756 -192100 -32746 -72830 -220444 -16010 -40086 -197007 -101920
6628 -101920 -128498 32795 83989 49138 -106602 -282229 -194442 -161374 7964 -54530 -161685
6617 -161685 -109403 -17699 86447 67881 161040 -19219 -241314 -352804 -247614 -160671 -52391
6606 -52391 -76111 -182127 -195333 -368261 -179135 -59350 -104364 -63489 -105170 -59272 -59431
6595 -59431 -52745 156582 -84740 -23685 -73903 -210957 -271039 -206448 -62519 -52535 -191309
6584 -191309 -144961 -10851 -91159 -209324 -102453 8002 2046 -67158 -82640 -149844 -46494
6573 -46494 -129385 -285314 -137604 -91862 22823 138941 -153512 2284 17584 -132034
6563 -132034 -48331 -318266 -282754 57384 116067 14919 -63157 -126418 -35107 -5511 -112025
6552 -112025 -30470 109821 -158884 -302684 -186839 -65792 -210504 -84737 62152 -30142
6542 -30142 95082 143578 33593 49079 -94211 -247799 58413 15647 -182446 -21231
6532 -21231 -74753 -70164 -56192 -118266 -131831 -63882 -113861 -2175 -85025 -336742 -338959 -44052
6520 -44052 -4841 63459 89469 100917 -28694 -176118 -52916 66024 212222 -20802 -119178
6509 -119178 -122923 -88620 -68679 -163920 -50127 95432 102294 148802 154047 50783 -11864 -138956
6497 -138956 -139397 -144620 -251618 -101290 -54908 -343806 -343977 -192198 -151901 -21040 20252 -227823
6485 -227823 -207190 -262506 -303152 -169009 -165303 -197146 -279688 -142201 46012 -32372 22391
6474 22391 124009 70194 -39071 -236885 -256097 -121900 85010 -95964 -116838 -221361
6464 -221361 -275686 -158383 -252912 -304540 -89902 -185808 -331935 -210139 -75961 109716
6454 109716 -130943 -200708 -69028 -125579 -101595 -238783 -422419 -201465 51540 28045
6444 28045 51754 -4585 -151301 -29394 -81968 -70166 -234633 -92569 84019 187513 -34895
6433 -34895 -158362 -61554 -257780 -81973 -19003 -44625 -89220 -172651 -352364 -333783 -128002
6422 -128002 -221789 -140287 27245 -187158 -85403 28779 -86392 -156363 -273294 -126629
6412 -126629 -145227 -182686 -62256 -30628 40395 -80183 -56536 -74676 -1848 -162948 -221103
6401 -221103 52244 -99709 -102485 -31919 12019 -217877 -332210 -388401 -291065 -347222 -302959
6390 -302959 -95153 -72462 82217 28597 29787 66528 -77314 -167290 227197 212461 222847
6379 222847 80124 156611 253140 2102 125425 -26495 -207045 53445 216588 88606
6369 88606 -142193 -137588 -1986 4387 -3394 76607 56794 -103286 -159724 138991 80285 32369
6357 32369 -57575 -72723 -29971 -144313 -48276 270548 213130 -46387 -35783 -44364 -51182 -73860
6345 -73860 108187 -17382 -169290 6477 -47197 -94159 70522 22658 -57951 -63697 -161639
6334 -161639 -275152 -149539 -7524 106379 34309 47688 -9204 -100636 -153489 -75861 -158676
6323 -158676 8596 63943 -50595 -188560 -153146 -51685 -150690 -209734 56415 114439 -61240
6312 -61240 -18649 -116079 12448 15479 187534 77276 -57584 -121985 17319 97830 119098
6301 119098 -3546 -41957 -4328 -74471 -192718 -181783 35390 -19506 -177715 -102757 -97161
6290 -97161 31263 -63500 -27776 -71353 49837 -9043 -15861 114179 43232 -67446 -181056
6279 -181056 -180894 -7790 -151218 -458821 -155527 -34725 -37425 11836 -111145 -52026 265
6268 265 -54405 96524 -171629 -69039 -269736 -222356 -285004 -183015 -259506 -186662 -209989
6257 -209989 -171495 -230884 -74265 -9805 -13747 -10626 188210 8224 -33018 -126484 -164534
6246 -164534 -64474 -240018 42152 69442 -219416 -460281 -185512 -83073 -184810 -40394
6236 -40394 41672 100341 99618 57119 138439 72784 -130101 12586 -28831 -347718 -179821
6225 -179821 -284266 -92647 -186290 -190578 -295837 -413036 -114603 -187621 -191198 -278121 -265484
6214 -265484 -323543 -266107 -220440 -137156 83280 -281230 -93636 118340 117938 47397 -2007
6203 -2007 149083 98812 47024 65838 144559 13859 14171 80260 -116637 -42980 -224108 -338189
6191 -338189 -301649 -157765 19000 80942 -275366 -262596 -229568 -168250 -129629 -294396 -262163
6180 -262163 103915 -26758 25237 68672 -194810 -328777 -335146 -155951 32541 -7162 -16459
6169 -16459 -223636 -199616 -85513 -318665 -319412 -179280 -474396 -462479 -169820 -36380 -46936
6158 -46936 -24495 136154 69980 -132180 -40194 15650 81869 104329 -114045 -166758 -146298
6147 -146298 185710 4871 54090 57215 -77155 -178851 -154033 -227682 -97392 -139633 -285563
6136 -285563 -185377 -121690 26711 20761 -38940 52776 -28130 40553 111623 74136 -118467
6125 -118467 -38975 182050 72102 163155 155995 3776 4292 -107881 -8752 40153 88447
6114 88447 134203 90100 -136329 -190188 -80819 -90957 -121295 -141829 131253 -49575 -157081
6103 -157081 65411 -38545 -92038 69741 12531 -33929 -651 88259 -87819 -294308 -149661
6092 -149661 -45634 157396 153404 42860 -111703 -145143 -31638 77190 43150 -79141
6082 -79141 -218736 -130849 -244289 -111621 -86223 -190518 -31805 134414 13072 61934
6072 61934 24765 115434 50277 -183963 -139619 -75867 -255407 -332020 -269257 -252733 -75299
6061 -75299 -285916 -105875 -51795 -76645 -106010 -116827 -69140 -126338 -313679 -315776 -46576
6050 -46576 -228887 -42167 -23936 -36399 -27083 -226135 -39195 35617 -68863 -154544 -135707
6039 -135707 17353 12299 52774 93214 -6693 -9071 118431 310731 172797 260427 -41483
6028 -41483 -220320 -282166 -53970 -60430 -226257 -20432 210737 179146 229096 261498 220185
6017 220185 57745 18828 -189003 -76820 62651 32838 83428 16306 17907 41828 287588
6006 287588 250088 263579 -67062 -94664 96758 -28455 -14038 -144776 3076 -25115 -215008
5995 -215008 -222814 -121457 -206755 -173997 -213045 -136813 -88785 -335953 -297723 -255899 -147134
5984 -147134 -41816 -18835 -64264 -201673 -282470 -151636 -207081 -199540 -3515 -142470 -222685
5973 -222685 -76574 -150741 -132572 16191 124771 -160069 -263672 -13977 -4477 -101119 -197879
5962 -197879 -219148 -273264 -216269 -245139 -196842 -262508 -106808 140897 -44264 -29772 -12344
5951 -12344 -78239 -90155 -246877 -310258 -200645 -228604 -52110 -207525 -244517 -31212 -29346
5940 -29346 -159320 -71370 36603 -73092 -254865 -136201 -122098 910 -24953 -102676 -26397
5929 -26397 158119 44573 -273022 -302181 -157165 -5298 -75794 -121972 46378 87117 216270
5918 216270 300308 163269 80824 153954 219921 50873 42902 -139561 -277255 -160866 -65981
5907 -65981 -146354 -224673 -229737 -209148 -19520 149471 180723 113336 -54726 -78314 -4820
5896 -4820 -49114 49909 42237 -17707 -71046 -95777 139066 190716 18377 -92672 72543
5885 72543 -68796 29852 253393 149328 54560 -132 8233 -163039 -144578 61126 -25230
5874 -25230 47434 56019 -175786 -11762 77061 -78836 -15089 -23216 -261963 -109365 -113424
5863 -113424 -59115 66898 -85269 -189394 -38713 135086 119410 -81132 -7770 126780
5853 126780 -48004 -16072 -94900 -47043 217874 226360 -39865 -259228 -311569 -157447 46393
5842 46393 96215 -188805 -153407 -110004 -35695 6447 128393 56075 226357 169974 216302
5831 216302 12042 -164993 -117324 -93942 -217314 -292570 -65526 -151930 -53439 -253970 -323397
5820 -323397 -222372 -26363 33251 76277 -149473 -60134 54914 85138 64101 102584 -60109
5809 -60109 41744 33494 -94938 -31514 -40542 -48226 -84882 108683 -171157 -183919 -58903
5798 -58903 85595 -34354 45477 146258 200801 159031 -31926 91260 77671 44872 135273
5787 135273 188769 160059 222689 133084 55138 151163 161654 40323 53106 76489 -29476
5776 -29476 -162885 -174844 -99039 69480 -12669 -227976 -103624 -149044 -290689 -163601 -183640
5765 -183640 48788 181370 121751 11534 -101126 121111 61495 95976 116186 70293 -107488
5754 -107488 -144724 32999 113248 -177362 -188561 -38870 -7215 -16885 73304 151537 116403
5743 116403 29299 74861 82150 88442 64023 -35776 -167948 -160607 -1817 -104208 -131918 -140251
5731 -140251 174682 71977 31955 -144277 -133664 -239569 -199157 -128601 173347 101936 154808
5720 154808 127602 40752 111623 4839 -35266 143069 323747 346499 169190 54945 -3815
5709 -3815 78307 229965 234383 162706 90270 230540 313658 221281 -7368 361106 369037 166351
5697 166351 31627 102197 5146 14820 -102259 -193460 -146870 -97695 70338 86463 283692
5686 283692 262066 245305 470963 197439 -116151 -163236 71108 165115 151307 268922 252615
5675 252615 346162 304438 95488 1869 -194629 -93369 -28880 193691 146602 126650 166871
5664 166871 91702 -33856 -70431 -55761 141588 153725 -70589 -66861 -42163 -199584 -272818
5653 -272818 -61535 45238 43012 48971 77936 198322 247583 4353 -186868 -70368 -89648
5642 -89648 200899 101358 -13597 -119552 -328153 -73595 -136721 -101518 16373 274901
5632 274901 4527 -71261 30191 -103028 -133291 -123242 4607 45268 -250915 76886
5622 76886 193575 92805 -75232 -324497 -188438 -101736 17146 -47848 51133 14566 -28848
5611 -28848 -237624 -71411 196492 137196 74978 28951 220641 68016 75988 49077 186579
5600 186579 232844 85597 39283 331938 181988 26247 76196 105425 159646 189320 195464
5589 195464 154384 -44988 -148238 -26452 -45937 26613 219068 280750 16346 143906
5579 143906 57110 24156 205012 279697 378218 315278 28406 19976 115806 67112 220352
5568 220352 122632 -96865 -3045 89464 201294 207751 373374 434409 319747 353034 250282
5557 250282 256826 -44386 49840 226491 174352 139909 118391 102438 101655 -71832 196442
5546 196442 280428 73190 104096 97914 196809 115202 188203 52835 52339 -114681 202837
5535 202837 317783 256377 253505 146251 211463 514149 457463 338430 110489 339021 530316
5524 530316 410507 560228 515172 350583 215786 369449 408170 318791 276118 380519
5514 380519 467597 329615 88095 -53468 151782 231661 206856 305004 217942 395396 503856
5503 503856 149187 221792 462516 239318 354348 226463 373299 425823 435670 315161
5493 315161 483790 465056 557168 532574 393629 471430 552974 487076 559310 440076 299113
5482 299113 328013 169834 209606 143043 415440 100514 -98833 74086 318609 395817
5472 395817 494248 269330 298776 543545 350420 234648 198919 122189 289393 303410 184157
5461 184157 169212 339652 482299 474950 416155 223984 206176 141310 65476 188963 223930
5450 223930 246914 -31303 -112710 127593 112649 38457 199733 302635 69006 66998 119193
5439 119193 190583 41273 229158 137604 29790 -72515 21195 148572 48038 51017 -82492
5428 -82492 34535 188667 236638 249613 227389 205712 -55242 -94000 69591 87093 184153
5417 184153 189516 309344 343388 154573 98024 125606 123097 182930 255094 85846 51012
5406 51012 196588 -10849 83529 152314 403814 316140 46993 -63516 1015 305510 491891
5395 491891 365919 290332 101748 186559 294315 149148 214772 172330 145607 299689 316290
5384 316290 243704 153859 157711 272099 183341 202807 91032 154822 254281 105008 3972
5373 3972 159874 160076 225419 306699 350649 254621 171146 37802 229969 395612 312492 195128
5361 195128 161559 259159 230847 190966 -45836 73100 177012 215892 149080 120915 121786
5350 121786 256759 213306 84815 199322 84317 170880 324485 411105 345439 298021 214013
5339 214013 150555 252654 260354 268341 158368 226618 177450 94119 114549 225576 259352
5328 259352 43242 -85218 -91446 275850 288677 233170 387532 258496 92086 136645 98664
5317 98664 -25168 -76281 -25069 -44002 139754 157353 78258 -109555 198730 141873 258674
5306 258674 363251 81103 76471 42244 120686 -35519 65789 -101681 -251528 -103968
5296 -103968 157565 175347 132909 115439 138043 161030 158473 106140 331618 208667 32784
5285 32784 141429 18301 -35460 -74348 278015 492247 402205 393155 283906 366590 276005
5274 276005 208662 140204 266914 497760 349582 201590 329235 242824 150104 51885 49403
5263 49403 -110598 128302 165364 95916 119151 115665 182666 117291 52483 -33648 244800
5252 244800 230395 -104486 -231523 -187528 -50632 12499 -18996 -30101 20289 -250714 -303593
5241 -303593 -218425 -171158 -64755 -137843 139293 -254805 -138361 174462 40656 26883
5231 26883 254506 319819 117934 71378 17955 -5249 52070 -283579 -56330 233228 207967
5220 207967 119072 201064 165807 57346 42407 134926 192482 279852 235481 20488 -76659
5209 -76659 -52201 55669 144470 224021 208148 187031 55729 109186 10652 214824 280488
5198 280488 333353 48587 25812 175044 906 34407 -97888 118288 153243 111536 97604
5187 97604 -227346 -106822 60525 168395 106578 162586 142734 50926 302561 187131 222157
5176 222157 190088 314409 179965 -93476 -202067 -38326 181669 229640 10001 -129797
5166 -129797 176629 462586 356258 412210 133301 -72701 102891 45272 -29043 45465
5156 45465 187380 -13826 21862 114788 62522 129714 62834 209959 298646 84827 118466
5145 118466 -58476 247322 303957 207122 30436 -173927 -347247 -32277 25739 136194
5135 136194 152397 58370 129108 103726 42862 17027 135676 105441 266760 123508 14878
5124 14878 278835 280851 366221 349471 297116 256409 347159 316318 267117 220437 78880 65202
5112 65202 -151404 -32754 37385 212641 158541 211144 126057 225957 171460 -78136 11797
5101 11797 -47885 17580 71343 139852 316624 471242 245180 307054 558216 430331 331655
5090 331655 252129 168932 148942 -84246 79153 219196 232822 243877 203240 62698 327962
5079 327962 253405 415573 649571 555713 258265 124571 271939 353237 578362 396828
5069 396828 443643 544878 451777 237708 322182 488298 468562 112133 -85284 103366
5059 103366 305257 318656 491985 445698 337232 243749 255243 178686 328591 437510 329661
5048 329661 139761 331208 440095 379443 280503 143793 170460 110604 263881 385789
5038 385789 314339 375504 287199 308394 220311 398449 385319 376286 413973 422254 414847 387376
5026 387376 523714 473604 494379 512325 609349 441742 391962 451292 256215 254996 592237
5015 592237 515023 321887 366106 368648 448721 338056 524800 753960 489070 606255 587680
5004 587680 523276 479753 325765 547366 666025 742912 808240 748403 726474 855065 628936
4993 628936 660739 626215 698946 718205 524385 674532 675258 684536 675297 954503 920240 788006
4981 788006 551983 776247 836068 1049289 1181997 933162 766578 913960 1116778 988713
4971 988713 1066234 910770 891558 1058227 996704 1033802 1023591 1001582 1140617 1241404 1171052
4960 1171052 1265187 1375084 1210438 1106690 1147221 1140918 1437174 1404997 1378389 1456476 1222969
4949 1222969 1116846 1199158 1433172 1417070 1647795 1779278 1623151 1607064 1828710 1976614
4939 1976614 1819114 1687598 1651518 1944786 2098629 1935084 2175102 1965911 2091262 2381749
4929 2381749 2181908 2202199 2131917 2321916 2195218 2211989 2254330 2272924 2508573 2616473
4919 2616473 2580805 2598424 2840171 2966664 3032122 3268514 3237956 3273035 3232797 3409699 3620308
4908 3620308 3741894 3678056 3943540 4010124 3918943 3921912 4037698 4352725 4441416 4931899 4932186
4897 4932186 4853917 4851075 5149559 5388593 5604436 5846303 6122233 6068911 6110280 6479174
4887 6479174 6550468 6556663 6835913 7315827 7377099 7615373 7935732 8117742 8606378 8925165
4877 8925165 9303023 9764442 10036681 10378144 10795393 11321677 11904435 12488963 13145330 13554403
4867 13554403 13997522 14702154 15689792 16501829 17244797 18003854 18647025 19521421 20297354
4858 20297354 21406161 22243957 22808079 23567122 24192673 24554969 24867425 25084350 24934965
4849 24934965 24459318 23858044 23539460 22532443 21701192 20942510 20099499 19270664 18435768
4840 18435768 17402637 16596377 15793948 14756710 14235240 13561592 13029472 12353019 11585468
4831 11585468 11059597 10462306 9896773 9539348 9160716 8806397 8382551 8049876 7841022
4822 7841022 7449221 7087407 6662537 6467709 6480829 6387311 6036402 5513549 5211900 5201841
4812 5201841 5047109 4931094 4742828 4683574 4648338 4516885 4292044 3958302 3795378 3750469
4802 3750469 3612081 3431553 3439404 3313067 3284343 3349815 3168101 2994096 2894919 2917017 2955357
4791 2955357 2748175 2683152 2673783 2578728 2293322 2193037 2121176 2044732 1969340 2066502 1918748
4780 1918748 2192767 2356046 2174375 1890049 1642521 1608368 1641699 1601823 1535529 1454968
4770 1454968 1320339 1256247 1368145 1600212 1604545 1531717 1506405 1385804 1078177 1268544
4760 1268544 1364669 1404064 1298619 1200449 1230034 1240349 1092103 1110946 1169343 1105562 1142202
4749 1142202 1133397 1174086 1170978 1059835 1310731 1184134 1069565 1205158 1083916 1010134 1000708
4738 1000708 946820 1019584 1002837 1057804 1189067 1090477 850969 651013 806932 782669 703666
4727 703666 718661 707033 691649 747701 707379 725028 825453 907675 1056286 1088237 955540
4716 955540 822850 857450 892448 790919 799008 825880 745582 699503 633693 543126 702391
4705 702391 572271 773620 678251 540778 650650 686052 623960 648755 591878 587825 644816
4694 644816 635999 775553 793809 673120 528019 548837 679583 713136 667592 644260 420478
4683 420478 466225 493796 460612 533592 640474 607343 638402 733630 424356 361527 594364
4672 594364 800272 765666 415730 398658 456564 494469 440694 452655 473639 490151 554567
4661 554567 528172 664782 700008 626153 414295 266308 546412 700972 630947 798364
4651 798364 590208 438029 496778 418855 333012 371922 372672 239384 464406 630116 459589
4640 459589 498394 470790 463771 524753 409479 518860 510770 350818 399974 395624 453424 507506
4628 507506 571457 694139 502764 462148 568286 720009 706821 739576 584592 535355 448533
4617 448533 476876 566369 444154 457185 595945 616762 612654 556530 610164 545674 693816
4606 693816 754179 547087 560922 652750 580267 524011 488769 647497 866863 776948 879575
4595 879575 731225 609736 698972 818848 862640 834551 784634 810615 588025 541469 610068
4584 610068 955250 927416 779014 805114 892068 1074864 924542 1078528 896771 748048
4574 748048 961957 853761 803016 815939 1122835 1240126 1122368 1383894 1394461 1266907
4564 1266907 1396532 1342814 1483938 1576448 1596546 1667806 1754970 1639380 1766708 1873890
4554 1873890 1705105 2032803 1987592 1955737 1941298 1942626 1907517 2056178 2352362 2515122 2548967
4543 2548967 2909245 2998119 3035549 3366304 3362233 3425956 3696083 3824288 4373757 4893367
4533 4893367 5288912 5483774 5848822 6333072 6682829 6774535 7045596 7517988 8040218 8708749
4523 8708749 9174624 9377504 9608592 9929627 9919041 10032068 10230409 10393524 10687291 10852618
4513 10852618 10959229 10823770 10573668 10238884 9996903 9739477 9645021 9453355 9066661 8749995
4503 8749995 8257445 7909325 7315792 6977126 6711950 6218298 5814517 5619160 5245633 4862323
4493 4862323 4576702 4218045 3933123 3642451 3271238 2956564 2694179 2606136 2516637 2286174
4483 2286174 2117622 2215542 2167035 1976290 1766549 1768978 1669928 1676087 1562310 1665847 1516136
4472 1516136 1524553 1520493 1435814 1314654 1433013 1190939 1358043 1277349 1288333 1315287 1133292
4461 1133292 1131796 1083391 979679 916629 1023653 1121223 1278422 1178064 1041223 883614
4451 883614 943783 783396 648763 611575 617201 613594 610043 576618 525921 617730 606248 420061
4439 420061 454002 569414 634762 410898 524810 352786 312352 426524 394440 402773 344540
4428 344540 242566 198735 306698 311941 436272 636701 715737 425222 294429 383824 430535
4417 430535 340690 387410 440683 306808 332799 402858 223506 294677 184370 192058 260831
4406 260831 35279 51204 171086 373578 220065 57614 314557 306952 -58797 99929
4396 99929 115495 205977 362353 199981 152694 302475 380889 411506 292220 206811 -60315
4385 -60315 -37382 62553 232321 76643 27283 42048 -18734 32507 176384 137159 182577
4374 182577 86572 107187 105210 95924 262954 201981 -150565 -59393 -130077 -49238 69994
4363 69994 54067 15518 13071 -26492 64417 124373 263718 326755 34615 29307 40975 110112
4351 110112 -56986 62435 261900 190705 167484 113574 284147 395554 116879 261699
4341 261699 67663 -204988 -74236 34047 -85105 -53269 48234 -108597 1591 71549
4331 71549 8800 201220 185252 -47663 16910 -15212 -33577 -49208 -159723 -157293 -107280
4320 -107280 189351 103960 137973 112420 269640 352952 259236 216570 286687 194801 121030
4309 121030 8995 108005 287935 293305 410575 399605 217498 99217 -14715 -136436
4299 -136436 -225651 -52763 -4205 -67321 -72576 110632 144460 153665 -223428 -278166 -310887
4288 -310887 -240668 -87117 -39388 30151 7560 -24275 -48098 150389 7821 -148957 -63366
4277 -63366 93582 213734 307259 105794 -79404 -116433 -104499 145855 128283 -209751 -365133
4266 -365133 -143357 -18362 16456 61360 -80326 18613 -7328 89748 178718 81347 293378
4255 293378 197568 160705 225280 6742 116646 133494 266758 290659 408853 355740 282084
4244 282084 304312 182471 159964 90773 299460 156790 50419 70635 209122 225589 246266
4233 246266 71233 59102 281693 9737 35509 -7512 140884 165417 77480 -18 159462
4222 159462 242641 145440 96872 23908 -2209 -5566 123915 -15084 -19821 57973 87800 107881
4210 107881 -104654 -54875 -144503 -20978 217449 33361 104881 292430 337567 93921
4200 93921 -120408 6042 43573 210117 100762 -5086 -108626 58694 154636 210753
4190 210753 141486 -19849 90022 293167 279709 192615 110495 -35402 36187 -134308 -255474
4179 -255474 -195770 171076 43542 -17277 231797 392851 351129 281209 251329 149503 82954
4168 82954 -106759 -110823 63719 76085 -25402 -42661 -89874 5101 19208 33411 306193
4157 306193 350468 266164 313542 79815 -9286 247266 115205 199447 207926 157813 105233
4146 105233 46237 90808 117984 318643 263715 313011 379385 371430 290518 217791 132128 -47029
4134 -47029 27263 70683 112120 215509 206422 180500 11273 -67983 36968 76597 147943
4123 147943 179582 -85570 -15184 24231 -41483 -24599 -35178 -57680 5246 -47695 119528
4112 119528 161734 43896 -71348 -43852 -279370 -310823 -87652 13848 82022 -642 158306
4101 158306 57317 165939 174651 -12621 -41595 -170030 -181018 25435 136384 2098
4091 2098 -25061 -54740 -275545 -523410 -452213 -215372 93857 -26895 -50999 7274 -63248
4080 -63248 -115462 57391 136348 -7859 -191206 -98245 3107 -33832 114469 -21164 45677
4069 45677 33139 8437 -48222 -28154 131812 -58189 -119979 -232613 -148007 30296 -84960
4058 -84960 95428 -163439 -60869 184279 -4182 -43273 173603 -7386 180400 140619
4048 140619 125012 -107046 48830 140778 10432 56448 163462 69293 86469 23497 -30630
4037 -30630 -79758 -72057 -142217 -70838 41248 87646 293055 162137 95639 114253 131916
4026 131916 47522 -147126 -265215 55692 95178 246566 45350 -178298 -153464 -169360
4016 -169360 44154 -135512 -14290 106440 134592 203628 193022 212287 93987 4715 192153
4005 192153 83357 -165613 -90105 -3056 82754 100169 56595 -22287 121641 -140841 -202777
3994 -202777 -240462 36055 -145629 -162754 -115771 -27887 -139929 -194880 -26003 52362 -75183
3983 -75183 -11849 -22082 -103444 -133287 -43573 -28090 -51240 13609 9765 86007 -112426 -179233
3971 -179233 -154181 22751 -91820 741 158902 18640 -108356 -84484 -169078 -123715 -57704
3960 -57704 7894 38528 49927 -60449 -24505 -180236 -216067 -93376 29478 228851 142045
3949 142045 -166612 -49911 142070 -6617 -86106 19426 -148258 -32551 138668 74523
3939 74523 51743 9395 51133 96126 118262 -9955 -40728 201097 144921 39344 67697
3928 67697 -14134 -118086 -176126 -96166 103200 1262 -210360 -145087 -75900 -56883 -367112
3917 -367112 31079 -62671 -443913 -293739 -159672 -222303 -86459 -29788 1958 246171
3907 246171 60480 -58356 193954 329072 230329 57033 138863 -144490 -97504 -238617
3897 -238617 -233449 17872 -10406 -219517 -203758 -169346 -236951 -16740 70993 24759 180238
3886 180238 142044 186765 117127 111406 35583 -11116 143026 355522 140464 154970 238488
3875 238488 349494 316384 246048 -10969 -33636 209147 15253 146991 290827 230457
3865 230457 -62085 31559 -13557 67366 -10399 218909 221971 80151 133977 147092 -13990
3854 -13990 224718 311168 98921 57733 101759 160098 28036 -143097 25194 -6339 31613
3843 31613 -34268 117299 32290 80572 119948 80431 144782 224651 191550 -21576 118990
3832 118990 208289 -12617 10897 91076 313248 165591 131195 385599 296159 86297 64066
3821 64066 51461 60671 22711 -113764 -114941 -131898 -137285 -216276 98312 409260 129423 110526
3809 110526 107335 31864 118082 -26871 -234737 -19725 106071 215 -116185 -184813 -39257
3798 -39257 98165 89760 104312 118155 -21176 42728 169213 -69779 -189539 -156465 -43426
3787 -43426 64476 121037 -73918 -193933 82853 119588 306682 242408 71397 79230 359222
3776 359222 190977 130300 -118090 -228422 17606 37172 -2354 -235532 -147615 104787
3766 104787 25977 132730 34135 -255238 -37453 141864 22291 -91674 -65045 -90051
3756 -90051 2462 113733 193571 106244 -128952 -118320 -42 -7286 -85795 -88252 72395
3745 72395 207044 -53253 -262307 -83061 87168 187001 299894 158305 105481 25540
3735 25540 -109362 82305 96593 -1598 5903 -174266 719 37925 159931 89195 142665
3724 142665 184567 95370 -65990 117735 128120 147813 110900 42004 50762 -148452 264099
3713 264099 338136 401957 229329 -54355 12028 146475 358621 279192 205861 -13205 48612
3702 48612 310673 435800 189639 5092 169984 307386 236719 119089 224007 435261
3692 435261 210055 -60803 74499 190043 148476 7497 9971 46430 126865 73195 175238
3681 175238 86413 131649 73843 -58983 -90083 55497 52117 -21886 174870 120752 -20219
3670 -20219 2245 -113136 -161321 91028 157731 126450 61259 46896 -38271 -44879 -154019
3659 -154019 -221251 -18263 43546 -66706 13361 -87123 -260558 -359454 -232391 -226118 -408677
3648 -408677 -443829 -157682 28962 -169620 -157731 -1924 139107 220197 137366 81617 268524
3637 268524 98833 135115 134435 180083 51094 40487 -199333 -53479 9988 -4458 418422
3626 418422 228332 -157748 4093 9968 178382 44213 -198317 -52257 -3329 180677
3616 180677 199950 115118 -191469 -164839 -18810 43921 -109672 -54892 106294 111909 149974
3605 149974 -47900 -79129 -107216 -236154 -318205 -437748 -286647 -110728 3065 62973
3595 62973 -79568 -260258 -279260 -12522 -38904 -137885 53692 -39073 75696 146361 -153266
3584 -153266 -170855 -211761 -124644 154271 96948 -151552 -140268 19064 83816 116497 240234
3573 240234 131382 69973 -98950 -133641 -69091 -60839 -93240 53210 -250739 -360135 30842
3562 30842 -286849 -191631 71459 -84014 118614 27880 -123468 -111491 -82416 12059 169098
3551 169098 86004 -53386 -76689 -149775 -151518 -245700 84667 175168 10417 -73321 36786
3540 36786 51393 137802 19642 -99961 -25155 -74025 -10836 -3367 -95621 -119816 -200322 -136900
3528 -136900 -112234 -176071 -133703 195993 168439 201436 33991 -35728 -55455 -96130 5561
3517 5561 -89340 39135 187145 238648 218301 18487 13768 -6586 -75234 393 -160406
3506 -160406 -132131 -175751 -12510 -22223 57983 -5971 -252269 -81131 -104450 192061 144278
3495 144278 -15942 -63553 -138786 132985 30092 -251213 -204028 -258919 -281938 -219926 -157509
3484 -157509 118967 162411 -192985 -58886 221382 26771 -55494 161288 40649 -89203
3474 -89203 50492 118473 171912 45563 -45614 -146064 -224350 -254264 -59244 -58766 9857
3463 9857 143808 -55647 -81565 139698 -17568 69237 76822 -25763 77331 118301 175966
3452 175966 220973 147843 -107340 114 -157594 -163745 -9205 -42177 -35526 86171 -85888
3441 -85888 189027 126032 130031 119623 100392 143979 65471 323900 297074 212675 247191 102869
3429 102869 -9279 -72059 111778 195689 74233 128190 -119777 -125987 109843 11364 -199681
3418 -199681 58872 -157241 -256464 -272292 -166288 -182962 45220 144034 -23449 247140
3408 247140 240777 107076 236384 120339 37685 239649 376794 179350 190089 198692 69959
3397 69959 63096 240577 351767 138511 167442 231303 174820 171176 220128 289732 336057 87852
3385 87852 218642 402950 235988 267971 453572 447767 454393 307234 219990 134816 184806
3374 184806 389198 483690 455103 389889 418124 375864 483833 663284 655969 612932 516746
3363 516746 607307 730099 404201 507140 593767 584457 538485 574846 535238 550632 312668
3352 312668 400321 504627 443506 535048 619196 541625 586648 774621 853135 825022 885927
3341 885927 727737 703666 933979 917238 911903 877214 917581 860473 1099583 948187 952229
3330 952229 978046 1126028 1253599 1219174 1312051 1535793 1667421 1555260 1743267 2019346
3320 2019346 2120408 2084330 2169967 2130700 2363275 2378766 2313331 2249798 2386333 2430969 2094213
3309 2094213 2079813 1956433 1730715 1396123 1440476 1391895 1189925 1078119 1121920 1126822 1046863
3298 1046863 909553 1042334 983512 1026767 916465 664625 605739 719751 652015 450771
3288 450771 540158 489804 718426 1042549 1122342 1039285 1103104 1185906 1037560 936135 725100
3277 725100 703782 771936 661977 649347 669767 492648 324350 319225 209773 403268 534084
3266 534084 369027 265078 321427 215300 -14634 73197 216747 -293 272367 403332
3256 403332 334687 360883 298288 253824 315331 267888 128190 298260 578572 479862 257536
3245 257536 108453 295829 449728 399760 353478 192214 25004 34403 -12581 143910 323830
3234 323830 302816 478897 409411 120992 51111 35039 -107870 21644 14614 3400 -184484
3223 -184484 -55043 31539 -140660 11799 153974 90053 37914 -165987 75558 16074
3213 16074 76773 73207 112672 160807 -45327 -45683 -95955 -173265 -1849 -107322 -165018 -22001
$$ [...]
##END NTUPLES=NMR SPECTRUM
##END=
