##TITLE=1H_CA-9239-1
 CDCl3
 8 sc, 
 8.2.2024
##JCAMPDX= 6.0         $$ Bruker NMR JCAMP-DX V2.0
##DATA TYPE= NMR SPECTRUM
##DATA CLASS= NTUPLES
##ORIGIN= UXNMR, Bruker Analytische Messtechnik GmbH
##OWNER= root
$$ XWIN-NMR		Version 3.5
$$ Thu Feb  8 14:20:20 2024 Russian Standard Time (UT+4h)  she@DPX200
##.OBSERVE FREQUENCY= 200.1313
##.OBSERVE NUCLEUS= ^1H
##.ACQUISITION MODE= SIMULTANEOUS
##.ACQUISITION SCHEME= undefined
##.AVERAGES= 8
##.DIGITISER RES= 18
##SPECTROMETER/DATA SYSTEM= spect
##.PULSE SEQUENCE= zg30
##.SOLVENT NAME= CDCl3
##.SHIFT REFERENCE= (INTERNAL, CDCl3, 0, 15.5717)
##AUDIT TRAIL= $$ (NUMBER, WHEN, WHO, WHERE, WHAT)
$$ ##TITLE= Audit trail, XWIN-NMR		Version 3.5
$$ ##JCAMPDX= 5.01
$$ ##ORIGIN= Bruker BioSpin GmbH
$$ ##OWNER= she
$$ F:/spectra/data/she/nmr/H-F/1/pdata/1/auditp.txt
$$ ##AUDIT TRAIL=  $$ (NUMBER, WHEN, WHO, WHERE, WHAT)
(   1,<2024-02-08 14:19:09.54 +0400>,<she>,<DPX200>,
      <created by zg, POWCHK disabled, PULCHK disabled
       configuration hash MD5:
       00 E9 B6 7A A2 85 ED C7 34 08 36 98 17 FE 4E 26
       data hash MD5: 16K
       B2 B9 26 EE EC 18 7E A4 CD F8 E9 FF 75 E5 5C 30>)
(   2,<2024-02-08 14:19:14.93 +0400>,<she>,<DPX200>,
      <Start of raw data processing
       efp BC_mod = 2 LB = 0.24 FT_mod = 6 PKNL = 1 PHC0 = -24598.26 PHC1 = 16.05268 SI = 16K 
       data hash MD5: 16K
       1A 22 49 7F 00 BB 85 DF DF BA 9E D2 42 C4 44 FC>)
(   3,<2024-02-08 14:19:32.70 +0400>,<she>,<DPX200>,
      <pk PHC0 = 7.410657 PHC1 = -9 
       data hash MD5: 16K
       FE E7 6D 4F DE 64 0A 7F 7D 0D C8 AB A6 B2 86 E7>)
(   4,<2024-02-08 14:19:35.23 +0400>,<she>,<DPX200>,
      <abs ABSG = 5 
       data hash MD5: 16K
       D1 EA F9 EE EE B4 B8 46 9C 7F 9D DC BB 5C 61 BC>)
$$ ##END=
$$ 
$$ hash MD5
$$ C1 7B F3 F9 87 81 D3 2C DE 78 8F 7B A8 01 76 C8
##$RELAX= 
##$RELAX= 
##$RELAX= 
##$RELAX= 
##$RELAX= 
##$RELAX= 
$$ Bruker specific parameters
$$ --------------------------
##$DU= <F:/spectra>
##$EXPNO= 1
##$NAME= <H-F>
##$PROCNO= 1
##$TYPE= <nmr>
##$USER= <she>
##$AMP= (0..31)
100 100 100 100 100 100 100 100 100 100 100 100 100 100 100 100 100 100 
100 100 100 100 100 100 100 100 100 100 100 100 100 100 
##$AQSEQ= 0
##$AQ_mod= 1
##$AUNM= <au_zg>
##$AUTOPOS= <>
##$BF1= 200.13
##$BF2= 200.13
##$BF3= 200.13
##$BF4= 200.13
##$BF5= 200.13
##$BF6= 200.13
##$BF7= 200.13
##$BF8= 200.13
##$BYTORDA= 1
##$CFDGTYP= 0
##$CFRGTYP= 5
##$CHEMSTR= <none>
##$CNST= (0..31)
1 1 145 1 1 1 1 1 1 1 1 1 1 1 1 1 1 1 1 1 1 1 1 1 1 1 1 1 1 1 1 1 
##$CPDPRG= <>
##$CPDPRG1= <>
##$CPDPRG2= <>
##$CPDPRG3= <>
##$CPDPRG4= <mlev>
##$CPDPRG5= <mlev>
##$CPDPRG6= <mlev>
##$CPDPRG7= <mlev>
##$CPDPRG8= <mlev>
##$CPDPRGB= <>
##$CPDPRGT= <>
##$D= (0..31)
0 1.2 0 0 0 0 0 0 0 0.06 0 0.03 0 0 0 0 0.0002 0 0 0 0 0 0 0 0 0 0 0 0 
0 0 0 
##$DATE= 1707387548
##$DBL= (0..7)
120 120 120 120 120 120 120 120 
##$DBP= (0..7)
150 150 150 150 150 150 150 150 
##$DBP07= 0
##$DBPNAM0= <>
##$DBPNAM1= <>
##$DBPNAM2= <>
##$DBPNAM3= <>
##$DBPNAM4= <>
##$DBPNAM5= <>
$$ [...]
##$SUBNAM3= <"">
##$SUBNAM4= <"">
##$SUBNAM5= <"">
##$SUBNAM6= <"">
##$SUBNAM7= <"">
##$SUBNAM8= <"">
##$SUBNAM9= <"">
##$SW= 18.0517328524113
##$SWIBOX= (0..15)
0 0 2 0 0 0 0 0 0 0 0 0 0 0 0 0 
##$SW_h= 3612.71676300578
##$TD= 16384
##$TD0= 1
##$TE= 0
##$TE2= 300
##$TE3= 300
##$TEG= 300
##$TL= (0..7)
0 120 120 120 120 120 120 120 
##$TP= (0..7)
150 150 150 150 150 150 150 150 
##$TP07= 0
##$TPNAME0= <>
##$TPNAME1= <>
##$TPNAME2= <>
##$TPNAME3= <>
##$TPNAME4= <>
##$TPNAME5= <>
##$TPNAME6= <>
##$TPNAME7= <>
##$TPOAL= (0..7)
0.5 0.5 0.5 0.5 0.5 0.5 0.5 0.5 
##$TPOFFS= (0..7)
0 0 0 0 0 0 0 0 
##$TUNHIN= 0
##$TUNHOUT= 0
##$TUNXOUT= 0
##$USERA1= <user>
##$USERA2= <user>
##$USERA3= <user>
##$USERA4= <user>
##$USERA5= <user>
##$V9= 5
##$VALIST= <valist>
##$VCLIST= <CCCCCCCCCCCCCCC>
##$VD= 0
##$VDLIST= <DDDDDDDDDDDDDDD>
##$VPLIST= <PPPPPPPPPPPPPPP>
##$VTLIST= <TTTTTTTTTTTTTTT>
##$WBST= 1024
##$WBSW= 4
##$XGAIN= (0..3)
0 0 0 0 
##$XL= 0
##$YL= 0
##$YMAX_a= 75256
##$YMIN_a= -102449
##$ZGOPTNS= <>
##$ZL1= 120
##$ZL2= 120
##$ZL3= 120
##$ZL4= 120
##$ABSF1= 15.49348
##$ABSF2= -2.55837
##$ABSG= 5
##$ABSL= 3
##$ALPHA= 0
##$AQORDER= 0
##$ASSFAC= 0
##$ASSFACI= 0
##$ASSFACX= 0
##$ASSWID= 0
##$AUNMP= <proc_1d>
##$AZFE= 0.1
##$AZFW= 0.1
##$BCFW= 0
##$BC_mod= 2
##$BYTORDP= 0
##$COROFFS= 0
##$CY= -3
##$DATMOD= 1
##$DC= 0
##$DFILT= <>
##$DTYPP= 0
##$F1P= 0
##$F2P= 0
##$FCOR= 1
##$FTSIZE= 16384
##$FT_mod= 6
##$GAMMA= 0
##$GB= 0
##$INTBC= 1
##$INTSCL= 3.70164e-10
##$ISEN= 128
##$LB= 0.24
##$LEV0= 0
##$LPBIN= 0
##$MAXI= 10000
##$MC2= 0
##$MEAN= 0
##$ME_mod= 0
##$MI= 1.114404
##$NCOEF= 0
##$NC_proc= -8
##$NLEV= 6
##$NOISF1= 3.799351
##$NOISF2= 2.8
##$NSP= 0
##$NTH_PI= 0
##$NZP= 0
##$OFFSET= 15.5717
##$PC= 1
##$PHC0= -24590.85
##$PHC1= 7.052679
##$PH_mod= 1
##$PKNL= yes
##$PPARMOD= 0
##$PSCAL= 0
##$PSIGN= 0
##$REVERSE= no
##$SF= 200.129989993428
##$SI= 16384
##$SIGF1= 3
##$SIGF2= 2
##$SINO= 5.538805
##$SIOLD= 16384
##$SREGLST= <1H.CDCl3>
##$SSB= 0
##$STSI= 16384
##$STSR= 0
##$SW_p= 3612.71676300578
##$SYMM= 0
##$S_DEV= 0
##$TDeff= 16384
##$TDoff= 0
##$TI= <>
##$TILT= no
##$TM1= 0
##$TM2= 0
##$TOPLEV= 0
##$USERP1= <user>
##$USERP2= <user>
##$USERP3= <user>
##$USERP4= <user>
##$USERP5= <user>
##$WDW= 1
##$XDIM= 16384
##$YMAX_p= 316970847
##$YMIN_p= -23930866
$$ End of Bruker specific parameters
$$ ---------------------------------
##NTUPLES= NMR SPECTRUM
##VAR_NAME=  FREQUENCY,     SPECTRUM/REAL,   SPECTRUM/IMAG
##SYMBOL=    X,             R,               I
##VAR_TYPE=  INDEPENDENT,   DEPENDENT,       DEPENDENT
##VAR_FORM=  AFFN,          ASDF,            ASDF
##VAR_DIM=   16384,         16384,           16384
##UNITS=     HZ,            ARBITRARY UNITS, ARBITRARY UNITS
##FACTOR=    0.220516191357247, 1,           1
##FIRST=     3116.36418441923, 0,            0
##LAST=      -496.352578586547, 0,           0
##MIN=       -496.352578586547, -23930866,   0
##MAX=       3116.36418441923, 316970847,    0
$$ Real data points
##PAGE= N=1
##DATA TABLE= (X++(R..R)), XYDATA
$$ [...]
12387a256576N59223N27349m00758k63487k59447L53621P43662O39698l78839
$$ -1256576 -697353 -170004 -570762 -834249 -1093696 -740075 3587 643285 264446
12378B64446j99922j123429P27527j45856P78590J40291l4593j287861N23826
$$ 264446 64524 -1058905 -331378 -477234 301356 441647 407054 -880807 -356981
12369c56981J295864k13175q77169M50948k49206o02745k0658J81119k51085l38849
$$ -356981 938883 725708 -151461 299487 50281 -552464 -573122 -392003 -643088 -981937
12359i81937L31608m28081J171005M29103P14287J30429j186884j1877j480186
$$ -981937 -650329 -1078410 92595 521698 1235985 1366414 179530 167653 -1312533
12350a312533J282055J492694r87216L46788k492453N79633J65941J38003Q70131
$$ -1312533 -30478 1462216 475000 821788 -1670665 -1091032 -925091 -787088 83043
12341H3043K03573q0052j085356M02597r8071n32196R82247O5168J27843L88276
$$ 83043 286616 206564 -878792 -476195 -574266 -1106462 -124215 -59047 68796 457072
12331D57072m5997k27551K66611M90096K27094o97928k95269J17546o68011k59712
$$ 457072 411075 183524 450135 940231 1167325 469397 174128 291674 -376337 -636049
12321f36049q573K81885J129340K66285j91420r92990N91704o25428q38549k12319
$$ -636049 -644622 -362737 766603 1032888 841468 -151522 440182 -185246 -1023795 -1236114
12311a236114M29646N28016N3661n58073J31066K23742j490541k86238K138564
$$ -1236114 -806468 -278452 -224791 -782864 -651798 -428056 -1918597 -2204835 -66271
12302f6271K94580k64535j03196j442976J085369Q68270N22896k72175O01745
$$ -66271 228309 -36226 -139422 -1582398 -497029 371241 894137 621962 1223707
12293A223707j767597J34474N58575o02703R1985P14360J30958o45527O66922
$$ 1223707 -543890 -409416 149159 -453544 -361559 352801 483759 -161768 505154
12284E05154k58290K65122K60566o60288r92614q27521K68086J26244L65837L3596
$$ 505154 246864 511986 772552 112264 -880350 -1707871 -1439785 -1313541 -947704 -914108
12274i14108R76201r37445l59321J432286n33426J171257n00699m86985O55956
$$ -914108 62093 -875352 -1234673 197613 -335813 835444 334745 -152240 503716
12265E03716J63486K35824j30113m41237r71702L68116Q21676j59256j93282O9355
$$ 503716 667202 903026 772913 331676 -640026 -271910 549766 390510 197228 266583
12255B66583J27691J026531m19631j536300l25284j18817p1692q34842K42798
$$ 266583 394274 1420805 1001174 -535126 -860410 -979227 -1050919 -1885761 -1642963
12246a642963J53641L41911P1270O36328k91439k09713K030476q24137j507036
$$ -1642963 -1489322 -1147411 -1076141 -439813 -731252 -940965 1089511 265374 -1241662
12237a241662j20606P35688K94131P06657L45783n71482N03301p05477k88047
$$ -1241662 -1362268 -626580 -332449 374208 719991 148509 651810 -53667 -341714
12228c41714J64478J013985j474587K43975J023009o86677m28751m69555P52094
$$ -341714 -177236 836749 -637838 -393863 629146 -57531 -486282 -955837 -203743
12219b03743m62502j167317r63367J12309J868039J20426l82106K94999L70894
$$ -203743 -666245 -1833562 -2796929 -2684620 -816581 -696155 -1078261 -783262 -412368
12210d12368p0969K42185L73989k95532J7031K08966L00401O38118N30984k027068
$$ -412368 -483337 -241152 132837 -162695 -145664 63302 363703 1001821 1532805 -494263
12200d94263O6619N42318j99498J621642j235181J121391o34118o24704m6861
$$ -494263 -427644 114674 -84824 1536818 301637 1423028 788910 164206 117345
12191A17345P35655O78523j670947m55673j138410J520158p98863j308152R80896
$$ 117345 853000 1531523 -139424 -595097 -1733507 -213349 -1012212 -2320364 -1339468
12182a339468M55389o33804R87958J87281p3427Q22344n20745m71592j66864q95171
$$ -1339468 -884079 -1517883 -529925 -342644 -416071 406273 -114472 -586064 -752928 -1648099
12172a648099R98410O23698o65165l05573J948394p39868j64816L00386p88716
$$ -1648099 -649689 -25991 -691156 -996729 951665 211797 46981 347367 -441349
12163d41349j174773J312374R6262j21156l26118n619K34483j31237j175053P02899
$$ -441349 -1616122 -303748 -207486 -328642 -654760 -660379 -425896 -557133 -1732186 -1029287
12153a029287Q61553j105675P07233j17859J554535J18113r75549j172029J05369
$$ -1029287 -167734 -1273409 -566176 -684035 870500 988613 13064 -1158965 -1053596
12144a053596k69496p4698k19741N60993Q47887K682o34464j84169k10376N77685
$$ -1053596 -1323092 -1397790 -1617531 -1056538 -208651 -205969 -840433 -1024602 -1234978 -657293
12134f57293P39736n32894j33634N17516l78478j84545P38265l17065K19688l47066
$$ -657293 82443 -450451 -584085 -66569 -445047 -629592 108673 -208392 11296 -335770
12124c35770q5259l8896l08192k55042j20372J20746L70433Q3144Q18893M25495
$$ -335770 -421029 -459925 -768117 -1023159 -1143531 -1022785 -652352 -569208 249685 675180
12114F75180M72953q41661m11383J06580Q48927o89459j146371P95019K54202
$$ 675180 1148133 306472 -104911 1669 850596 161137 -985234 -190215 63987
12105F3987l56655m26650J214660n48266l96934L60284J83521j456904R42084
$$ 63987 -292668 -719318 495342 -52924 -449858 -89574 93947 -1362957 -420873
12096d20873j605089M46279Q46501N47176j4284N43833l01899k96291J255040
$$ -420873 -2025962 -1579683 -733182 -186006 -200290 343543 41644 -254647 1000393
12087A000393o1454m84711j090139q42678J427375R69688N63509j088899m85573
$$ 1000393 938939 454228 -635911 -1478589 -51214 918474 1481983 393084 -92489
12078i2489O32592K56721m45823O08747p77842m00270M82830j161043P5137l97294
$$ -92489 540103 796824 351001 959748 181906 -218364 264466 -896577 -821440 -1218734
12068a218734N55605m07264J053076K00356n42642R74351k77725q24869J50440
$$ -1218734 -663129 -1070393 -17317 183039 -359603 614748 337023 -487846 -337406
12059c37406K30065R93057k25391M16424R17131P8249j068724m31269j00352J152102
$$ -337406 -107341 885716 660325 1076749 1993880 2072129 1003405 572136 471784 1623886
12049A623886k44056j292873o15649J86331q8564M35926j07999n3780m2217r0676
$$ 1623886 1379830 86957 -528692 -342361 -430925 5001 -102998 -156778 -198995 -289671
12039b89671j29609K90265O39631m8283K22908m27860q46213P26927P13355j007700
$$ -289671 -419280 -129015 510616 462333 685241 257381 -588832 138095 851450 -156250
12029a56250M85396J048759o33142O5420P5570j174362L53044q33489l4836L33701
$$ -156250 329146 1377905 744763 810183 885753 -288609 64435 -769054 -803890 -470189
12019d70189L70003l17113p50194J226027N26806J073144j887017r45672L42816
$$ -470189 -100186 -417299 -1167493 58534 585340 1658484 -228533 -1174205 -831389
12010h31389k30979M28924K63204K87823J130620m24568n72338P59672J24718
$$ -831389 -1062368 -633444 -370240 -82417 1048203 623635 51297 810969 935687
12001I35687k43868K47359m37016K61926p59118n92401Q89716N49631j417968
$$ 935687 691819 939178 502162 764088 4970 -587431 302285 851916 -566052
11992e66052j256820J417755P44871o55076n4497L0813j21855n51680j02690J001358
$$ -566052 -1822872 -405117 339754 -315322 -369819 -339006 -460861 -1012541 -1115231 -113873
11982a13873L14866m37839K31439J073064K51949J00600k22362p01164l69400
$$ -113873 200993 -236846 -5407 1067657 1319606 1420206 1197844 496680 127280
11973A27280j51118L73830P22548o72355K54479p38485O0405O36458n32197J83484
$$ 127280 -23838 349992 1072540 400185 654664 -83821 -23416 613042 80845 264329
11963B64329J26742m9834K55144P8887Q6412n19202l5647o83758P86768k53398
$$ 264329 391071 341237 596381 675268 761680 242478 206831 -476927 309841 56443
11953E6443J323777n49486j621634R85920L97430p81936J081539Q48633j405931
$$ 56443 1380220 830734 -790900 195020 592450 -189486 892053 1740686 334755
11944C34755j125489Q43548N05907K8774l50752j3615l76138k05050M81535N49965
$$ 334755 -790734 52814 558721 587495 236743 223128 -153010 -358060 123475 673440
11934F73440Q31900o40016K83002K01448n92428k65413k53528m4417P03961m68455
$$ 673440 1505340 865324 1148326 1349774 757346 491933 238405 193988 897949 429494
11924D29494M36724l00465k49077l28492Q08838J32907l24240K31206m10231l62626
$$ 429494 866218 565753 316676 -11816 797022 929929 605689 836895 426664 64038
11914F4038n52526M485n31912j32552J414028k57326o32837J91250J409270L86787
$$ 64038 -488488 -484003 -1015915 -1148467 265561 8235 -624602 -433352 975918 1362705
11904A362705m65828O7231j11629Q22141j185723q58466k96557O15708M28142
$$ 1362705 896877 964108 852479 1674620 488897 -369569 -666126 -50418 377724
11895C77724O70884R08902q526o10982j504408n99179J094243J032633J28313
$$ 377724 1048608 1957510 1948984 1338002 -166406 -765585 328658 1361291 1489604
11886A489604o71022J79183j89999o06210L56539P10414P69174q07992n17791
$$ 1489604 818582 997765 807766 201556 558095 1268509 2037683 1229691 711900
11877G11900q15011l7243j80799M96800P48285j83551L55756q12618n4288J57991
$$ 711900 -103111 -140354 -321153 175647 923932 740381 1096137 283519 229231 387222
11867C87222Q19063k31896n68291J83146r09417N60218M97442J74575o9190P1280
$$ 387222 1206285 974389 406098 589244 -320173 240045 737487 912062 842872 914152
11857I14152p10966Q00546J080446j53006j871246l6456O52791k06264R4571J80146
$$ 914152 203186 1003732 2084178 1931172 59926 23470 676261 469997 564568 744714
11847G44714n88683N65835J96648K02247j099404k74356k04461L07545J241342
$$ 744714 156031 721866 918514 1120761 21357 -252999 -457460 -149915 1091427
11838A091427q9121k85280L37192O50618n96737L04454N74919J188149l91477
$$ 1091427 1002306 717026 1054218 1704836 1108099 1412553 1987472 3175621 2784144
11829B784144J00254n77553o99972o09065N02716L48580j45835K72268M45746
$$ 2784144 2884398 2306845 1606873 997808 1500524 1849104 1703269 1975537 2421283
11820B421283l66335j79289P6331M54427k96172M22988m45502o29592M1333N42985
$$ 2421283 2054948 1875659 1951990 2406417 2110245 2533233 2087731 1458139 1499472 2042457
11810B042457K42658r47998J69045K07518O00583o22850j182046J32749K468548
$$ 2042457 2285115 1337117 1506162 1713680 2314263 1691413 509367 642116 3110664
11801C110664p48637q53153L23971M47529r08074k5867O07192p57687J374190
$$ 3110664 2362027 1508874 1832845 2280374 1372300 1346433 1953625 1195938 2570128
11792B570128n33777o60523O77553p57733n67543J182271N56326q38806l72784
$$ 2570128 2036351 1375828 2053381 1295648 728105 1910376 2466702 1627896 1255112
11783A255112Q21719O25920N39568j119343q45582O4992J36213m30405P38861
$$ 1255112 2076831 2702751 3242319 2122976 1277394 1342386 1478599 1048194 1787055
11774A787055j52132P44603j02085o32719J3369l69634O86023j18564k86319N04489
$$ 1787055 1634923 2379526 2277441 1644722 1658091 1288457 1974480 1855916 1569597 2074086
11764B074086j82547J053509R4205p89041k93263N90229J186402j632188K26896
$$ 2074086 1891539 2945048 3039253 2250212 1956949 2547178 3733580 2101392 2328288
11755B328288R92085r14147K48466j026046o23810J106704Q28098P7500m61814
$$ 2328288 3320373 2406226 2654692 1628646 1004836 2111540 2939638 3017138 2555324
11746B555324J397114l42840n26035P29199q06753l07721M9774j52052j34061
$$ 2555324 3952438 3609598 3083563 3812762 3006009 2698288 2748062 2596010 2461949
11737B461949j125757J27320J419399J555608m324j412545r12720R67998q1060
$$ 2461949 1336192 1463512 2882911 4438519 4434195 3021650 2108930 3076928 2995868
11728B995868P58778J484367k48032j884860q57600O95817J228377j98186o13252
$$ 2995868 3754646 5239013 4990981 3106121 2248521 2944338 4172715 3974529 3361277
11719C361277j362479J525300m4371j83923J34202k54865k14575L3661J051916
$$ 3361277 1998798 3524098 3479727 3295804 3430006 3175141 2960566 2994227 4046143
11710D046143J325644R19195q87781j09609l82182n92465o31542O16121M16168
$$ 4046143 5371787 6290982 5403201 5293592 4911410 4318945 3687403 4303524 4719692
11701D719692M97782j006601j327511P20104R96452Q76891J71541r5402L07458
$$ 4719692 5217474 4210873 2883362 3603466 4599918 5476809 5648350 5552948 5860406
11692E860406l13202N52892j92207Q4461L27948M91279K34380q0798p31795j21766
$$ 5860406 5547204 6100096 5907889 5992350 6320298 6811577 7045957 6965159 6233364 6111598
11682F111598J027706M31530m15857k53691q60451Q33148K6331L22901N57226
$$ 6111598 7139304 7570834 7154977 6901286 6040835 6873983 6900314 7223215 7780441
11673G780441J82965J99421m86836P13971m01706Q94723R04398r6155M91277n12041
$$ 7780441 7963406 8162827 7675991 8389962 7988256 8882979 9787377 9691222 10182499 9670458
11663I670458n0578l35878M885n89200M61568O32830l12050M20511M67838O41408
$$ 9670458 9619880 9284002 9288887 8699687 9161255 9794085 9482035 9902546 10370384 11011792
11653A1011792M07420k22991M05177O97938p28740m87753p62086K45955J634889
$$ 11011792 11419212 11196221 11601398 12299336 11570596 11082843 10320757 10566712 12201601
11644A2201601Q44362o22263k55822P12635Q33644O3565P54835P82964k46327
$$ 12201601 13045963 12423700 12167878 12880513 13714157 13777722 14532557 15315521 15069194
11635A5069194p0986p09041R91466K33798k40702K5153P98798J175352l2534j09041
$$ 15069194 14998208 14289167 15280633 15514431 15273729 15298882 16097680 17273032 17240498 17131457
11625A7131457K90543J262425O75118k45982n17967N34385K47205j64583J405103
$$ 17131457 17422000 18684425 19359543 19113561 18595594 19129979 19377184 19212601 20617704
11616B0617704J290389o4197j87510P34944J545986K57214R5449j94661P39507
$$ 20617704 21908093 21843896 21656386 22391330 23937316 24194530 24289979 24095318 24834825
11607B4834825l72610J320713O77325l30139K93499L96924N50786j57318J063118
$$ 24834825 24462215 25782928 26460253 26130114 26423613 26820537 27371323 27214005 28277123
11598B8277123Q88399M01231K00238M88120j38951J857559J394520P95648j227193
$$ 28277123 29165522 29566753 29766991 30255111 30116160 31973719 33368239 34163887 32936694
11589C2936694J61872O17016N53887L71394p23527O18599k96910J02484q81606
$$ 32936694 33098566 33715582 34269469 34640863 33917336 34535935 34239025 34341509 33459903
11580C3459903K77417L49553P18046J956952M9146j248498K49474R88273M35871
$$ 33459903 33737320 34086873 34804919 36761871 36811017 35562519 35811993 36800266 37236137
11571C7236137r27037l49718m55132l11696k020695o21050K54673J111972J168103
$$ 37236137 36309100 35959382 35504250 35192554 33171859 32550809 32805482 33917454 35085557
11562C5085557J24897k12486j89864j057906j711794L05538J49031j346930j720529
$$ 35085557 35210454 34997968 34808104 33750198 32038404 32343942 32492973 31146043 29425514
11553B9425514l05281q37013p36972k7927L66655r81720j335904j70766j040438
$$ 29425514 29120233 28283220 27546248 27518321 27884976 26903256 25567352 25396586 24356148
11544B4356148o85589L20419m18016K07483j02827M66621p31013j857078p93402
$$ 24356148 23670559 23990978 23572962 23780445 23677618 24144239 23413226 21556148 20762746
11535B0762746p23402m3428j311984L64576j55439n53005j129753k49710j6928
$$ 20762746 20039344 19995916 18683932 19048508 18893069 18340064 17210311 16960601 16943673
11526A6943673j233649l25464J229630K26360n94437o63364r84485p66620k7368
$$ 16943673 15710024 15384560 16614190 16840550 16246113 15582749 14598264 13831644 13804276
11517A3804276j67656j316859j42040j33279k31035R313m04346p71272J465697
$$ 13804276 13636620 12319761 12177721 12044442 11813407 11822720 11418374 10647102 12112799
11508A2112799K49378R2033r37996o72639j202939j10541j36900J127747P18700
$$ 12112799 12362177 12454210 11516214 10843575 9640636 9530095 9393195 10520942 11239642
11499A1239642j032434r86360o09803J39840p23300p9951M90544J64990l83888
$$ 11239642 10207208 9220848 8611045 8750885 8027585 7947634 8438178 8603168 8219280
11490H219280j93838O72331R06864J82042o34506j095645o23527K65078n28058
$$ 8219280 8025442 8697773 9604637 9786679 9152173 8056528 7433001 7698079 7170021
11481G170021j305082n76456N83209J00021n14568J95210J82038O47972j70516
$$ 7170021 5864939 5288483 5871692 5971713 5457145 5652355 5834393 6482365 6311849
11472F311849p92580K92903p1293L77721O25906j214690m96178Q22293J78795
$$ 6311849 5519269 5812172 5740879 6118600 6744506 5529816 5033638 5855931 6034726
11463F034726j64669q3980j56197n01181P06821q19677o97007K70242O60091M86849
$$ 6034726 5870057 5786077 5629880 5128699 5835520 5015843 4318836 4589078 5249169 5736018
11453E736018j419915o71065P49029K78125L2985j7856K9462o05887J93724q64176
$$ 5736018 4316103 3645038 4394067 4672192 4705177 4687321 4716783 4110896 4304620 3440444
11443C440444m91140J24089Q0061P6661n10260M57725P81638J476973j568078
$$ 3440444 2949304 3073393 3153454 3230115 2719855 3177580 3959218 5436191 3868113
11434C868113O83878M50452q24379N17448M49255Q1091m45010l5282m97720j71226
$$ 3868113 4551991 5002443 4178064 4695512 5144767 5225858 4780848 4745566 4247846 4076620
11424D076620O62533j270897P1572o72648j52211O73258P777j33253k13445o07295
$$ 4076620 4739153 3468256 3539828 2867180 2714969 3388227 3396004 3262751 3049306 2442011
11414B442011k06468L45201k51335J430270k60110n87183j27743k91513j21836
$$ 2442011 2235543 2580744 2329409 3759679 3499569 2912386 2784643 2493130 2371294
11405B371294k01993l00368L81285J548449O3592j418081L02089N45742m23158
$$ 2371294 2169301 1868933 2250218 3798667 3862259 2444178 2746267 3292009 2868851
11396B868851q70893J34362j127733J057019l78012L27191P3836J77426m7480
$$ 2868851 1997958 2132320 1004587 2061606 1683594 2010785 2084621 2262047 2214567
11387B214567j238446N58593Q21868J041945j692981o02041o88127K70712l60807
$$ 2214567 976121 1534714 2356582 3398527 1705546 1103505 415378 686090 325283
11378C25283N89404K33155J006173K51148n01395K32647m18110J100869M87393
$$ 325283 914687 1147842 2154015 2405163 1903768 2136415 1718305 2819174 3306567
11369C306567j261787J47893K52293m99506p45608J23266O9300M83946m29809
$$ 3306567 2044780 2192673 2444966 1945460 1199852 1323118 1392418 1876364 1446555
11360A446555M16432n9954K2385M48219r36652J2943R0166j79364L06597l80267
$$ 1446555 1862987 1803033 1825418 2273637 1336985 1349928 1440094 1260730 1567327 1187060
11350A187060n41273N55760n21042j24206Q1608n72919M2035Q92450R43676Q46886
$$ 1187060 645787 1201547 680505 556299 637907 64988 107023 999473 1943149 2790035
11340B790035m50188L23924K07543k31917o58720k13212Q41374n57953o35884
$$ 2790035 2339847 2663771 2871314 2639397 1980677 1767465 2608839 2050886 1415002
11331A415002M08606M41537L93183m18424n34033l69931j148332O02105K29314
$$ 1415002 1823608 2265145 2658328 2239904 1705871 1335940 187608 789713 1019027
11322A019027R84882N83827m88077p77146m30142J171354q42593j430637O6524
$$ 1019027 2003909 2587736 2099659 1322513 892371 2063725 1221132 -209505 -142981
11313a42981P86177J539073l35962m56299M76697J105769k13228J25851l54244
$$ -142981 643196 2182269 1846307 1390008 1866705 2972474 2759246 2885097 2530853
11304B530853j51360L13745j195486n87159J0693j166024r32010R34932P36739
$$ 2530853 2379493 2693238 1497752 910593 921286 -244738 -1176748 -241816 494923
11295D94923J163680L15678o94723l02379o08136n7030J329706K39633j1313p04295
$$ 494923 1658603 1974281 1279558 977179 369043 312013 1641719 1881352 1870039 1165744
11285A165744K4532n32642M20762J99186k61451M1711R52485l46917q76449O86185
$$ 1165744 1190276 657634 1078396 1277582 1016131 1057842 2010327 1663410 786961 1473146
11275A473146O38313J12166p0435k71322L16369L43541J1651M74941j087868p27111
$$ 1473146 2111459 2223625 2153190 1881868 2198237 2541778 2553429 3028370 1940502 1213391
11265A213391j75718j238513J204570o47414j9140l45624M54536J528160J318023
$$ 1213391 1037673 -200840 1003730 356316 337176 -8448 446088 1974248 3292271
11256C292271j008429m52933K0801O76690p14681j843419J328317Q76122P39652
$$ 3292271 2283842 1830909 1851710 2528400 1813719 -29700 1298617 2174739 2914391
11247B914391j519668n72884J55624k17069j23825N44536Q14840r53284l61061
$$ 2914391 1394723 821839 977463 760394 636569 1181105 1995945 1042661 681600
11238F81600j17557O45644Q97651o51550l61361j33729J068845o77861L5264p59876
$$ 681600 564043 1209687 2107338 1455788 1094427 960698 2029543 1351682 1386946 627070
11228F27070m88477R1380K16615P16449m33346r50431J80582L53787J09052N04985
$$ 627070 138593 229973 446588 1163037 729691 -220740 -40158 313629 422681 927666
11218I27666N45206Q4771L40074o66840o35815K26564l34264K99447l77447N11755
$$ 927666 1472872 1557643 1897717 1230877 595062 821626 487362 786809 409362 921117
11208I21117Q8991P36551n23208k89896q2444R9172Q77126j06787J56064M7965
$$ 921117 1010108 1746659 1223451 933555 851111 950283 1827409 1720622 1876686 1924651
11198A924651j9267m73o22410j59961k40587q8874M87548L35883J370649o72970
$$ 1924651 1905384 1904911 1282501 1122540 881953 793079 1280627 1616510 2987159 2314189
11188B314189j71490l98712j148485L0121L67443M51927O97511j175849r09271
$$ 2314189 2142699 1743987 595502 625623 993066 1444993 2142504 966655 57384
11179E7384M37230P56348o19158q63216K91971J078230Q50613J03075o64242N27754
$$ 57384 494614 1250962 631804 -231412 60559 1138789 1989402 2092477 1428235 1955989
11169A955989J105422m53229j059897j772126J148169R21383j009556j00237n8692
$$ 1955989 3061411 2608182 1548285 -223841 924328 1845711 836155 735918 677226
11160F77226m49730L14309O87994n98011p25673J445981o50033l98414r04203
$$ 677226 227496 541805 1229799 631788 -93885 1352096 702063 303649 -600554
11151f00554R22993K57406j354864j28483O11169P02459j55394l50586P32864
$$ -600554 322439 579845 -775019 -903502 -292333 410126 254732 -95854 637010
11142F37010R68760p40151k38342o02409j68497j34988L85652l5523O82832n80795
$$ 637010 1605770 865619 627277 24868 -143629 -278617 107035 71512 754344 173549
11132A73549o34694q72202K71479R43147O84039j84303q41913r26404p445j29263
$$ 173549 -461145 -1333347 -1061868 -118721 565318 381015 -460898 -1387302 -1394747 -1524010
11122a524010O35210l59027O95257o74688m22327j81990J195208L84716r8073
$$ -1524010 -888800 -1247827 -552570 -1227258 -1649585 -1831575 -636367 -251651 -349724
11113c49724l62569m51289M32818N93543K53815O85543K06114j038840L81420
$$ -349724 -712293 -1163582 -730764 -137221 116594 802137 1008251 -30589 350831
11104C50831j43136k34982O69601M86115l50019K87223m37332M92123n9966q61495
$$ 350831 207695 -27287 642314 1128429 778410 1065633 628301 1120424 1060458 198963
11094A98963r43861n29114K7106R75787K96961k57796k08903J144701l39212j475657
$$ 198963 -744898 -1274012 -1246906 -271119 25842 -231954 -440857 703844 364632 -1111025
11084a111025L03851J171232Q61303j266540J536369M07699n90742N2508j80455
$$ -1111025 -807174 364058 1225361 -41179 1495190 1902889 1312147 1364655 1184200
11075A184200M238q35553O3760r28760L79729n1646K91911O91102O14902o29032
$$ 1184200 1188438 352885 416645 -512115 -132386 -184032 107879 798981 1413883 784851
11065G84851r93198L70107Q34169o27155J059128p45271j32343o01226k00502
$$ 784851 -208347 161760 995929 368774 1427902 682631 550288 -50938 -251440
11056b51440q90395N82106M84822j79373j64990o29735L42629P67368J253351
$$ -251440 -1141835 -559729 -74907 -254280 -419270 -1049005 -706376 60992 1314343
11047A314343k0347j07113O39549j254031k4610q73204o00087K43305L55724O67053
$$ 1314343 1293996 1186883 1826432 572401 547791 -325413 -925500 -682195 -326471 340582
11037C40582m2993J59124r57972N90913M00212M49103q51708J48286o4810j4957
$$ 340582 297589 456713 -501259 89654 489866 938969 87261 235547 170737 155780
11027A55780o4430n26530M2176L14006J01217n37316L11579O0949j188286O0153
$$ 155780 91350 -435180 -393004 -78998 22219 -515097 -203518 -142569 -1330855 -1270702
11017a270702O16896M1818J8288P79658r81786j5577M61874L47714Q99540K27792
$$ -1270702 -653806 -611988 -593700 185958 -795828 -811405 -349531 -1817 897723 1125515
11007A125515J54003R310m5740j129663J107926q02421k15785o07146l13142O30839
$$ 1125515 1279518 1288828 1243088 113425 1221351 418930 203145 -404001 -717143 -86304
10997h6304k45956J115123j118456p93527J223873K32338j543327j74388J931451
$$ -86304 -332260 782863 -335593 -1129120 94753 327091 -1216236 -1390624 540827
10988E40827r1302m39566R56680M94471J504l11903j879803K60302j77419J011932
$$ 540827 449525 9959 966639 1461110 1462614 1150711 -729092 -468790 -646209 365723
10978C65723J85793r04459J05812q12805R19440n55196R31027N20082l2942j85237
$$ 365723 551516 -352943 -247131 -1059936 -140496 -695692 235335 755417 722475 537238
10968E37238l65973q60243o21475K04367M51006K25335k24951k29312j17036L58718
$$ 537238 171265 -688978 -1310453 -1106086 -655080 -429745 -654696 -884008 -1001044 -642326
10958f42326J161949L58670O47275n39185j593504O06116o572r18274j07427J557269
$$ -642326 519623 878293 1525568 986383 -607121 -1005 -7577 -925851 -1033278 523991
10948E23991l77266k032351R91562J07269J330463j7548m55434o57967m43063
$$ 523991 146725 -1885626 -894064 -786795 543668 526120 70686 -587281 -1030344
10939a030344N82244P6462k5370o55320M0173M04726R67030P83360m25627j72442
$$ -1030344 -448100 -371638 -397008 -1052328 -1012155 -607429 359601 1142961 717334 544892
10929E44892q6930M37323k23858l96256N91260m88857n44736K38157n89794l70142
$$ 544892 457962 895285 671427 275171 866431 377574 -167162 70995 -518799 -888941
10919h88941K92147m454J221976R87257j047597p85789M702O28774n04406k80828
$$ -888941 -596794 -601248 620728 1607985 560388 -225401 -220699 408075 -96331 -377159
10909c77159K42284M33182n34752p0052l92201k41535J6205p75002Q8855N55231
$$ -377159 -134875 298307 -236445 -306497 -698698 -940233 -924028 -1699030 -1610175 -1054944
10899a054944J44961j021949j67585O76467N37593J87644J72592R30829l61992
$$ -1054944 -909983 -1931932 -2099517 -1423050 -885457 -697813 -525221 405608 43616
10890D3616L0428o64730M46612k11674l84327j30886J186498K19621m41888N82727
$$ 43616 74044 -590686 -144074 -355748 -740075 -870961 315537 535158 93270 675997
10880F75997j150709p02023n0021Q14608j0906K23925O9991j379417p80088L10154
$$ 675997 -474712 -1176735 -1226756 -412148 -423054 -199129 -129138 -1508555 -2288643 -1978489
10870a978489Q75828L46646r49482O92108l04185J15110j01962J91497M50616
$$ -1978489 -1102661 -756015 -1705497 -1013389 -1317574 -1202464 -1304426 -1112929 -662313
10861f62313O83684j014990l17083L989J472245j179025j152248J104366N0524
$$ -662313 21371 -993619 -1310702 -1306713 165532 -1013493 -2165741 -1061375 -1010851
10852a010851J32306m88290n20902J57013J71658Q05195N80764r5951r79686r00844
$$ -1010851 -878545 -1366835 -1887737 -1730724 -1559066 -753871 -173107 -269058 -1248744 -2149588
10842b149588o65468J035308K58985l42520J52690K49839O24965l0945N59904
$$ -2149588 -2815056 -1779748 -1520763 -1863283 -1710593 -1460754 -835789 -866734 -306830
10833c06830o02983k03938l66609M45344J63427N7330k59098J139696o431j338663
$$ -306830 -909813 -1113751 -1480360 -1035016 -871589 -814259 -1073357 66339 59908 -1278755
10823a278755k39353Q23530J054934p62874J18637j125622M46133n59902L80458
$$ -1278755 -1518108 -694578 360356 -402518 -283881 -1409503 -963370 -1523272 -1142814
10814a142814J188068n60918R82875j4728l64124m22542q41290R74522J10528
$$ -1142814 45254 -515664 467211 452483 88359 -334183 -1175473 -200951 -90423
10805i0423R74198p83105l88020j472L02305M93622j59168O88318r52017k043701
$$ -90423 883775 100670 -287350 -288822 13483 507105 347937 1036255 84238 -1959463
10795a959463L00855J783203K86987o83016j094290k32902J049040p26254O88828
$$ -1959463 -1658608 124595 411582 -271434 -1365724 -1598626 -549586 -1275840 -587012
10786e87012N99636N74422r96857j164547J800624M97343j40782q64273P10417
$$ -587012 12624 587046 -409811 -1574358 226266 723609 582827 -281446 428971
10777D28971n61300o2836j444091J135054Q25052j99762K61470n93704J73455
$$ 428971 -132329 -195165 -1639256 -504202 320850 121088 382558 -211146 -37691
10768c7691q82537N48405N70919l136r46811n00530M82797J15420N37306J78326
$$ -37691 -920228 -371823 199096 195960 -750851 -1251381 -768584 -653164 -115858 62468
10758F2468n46084o93273j98209M01406p3357J58572P62085J047190m10052n40977
$$ 62468 -483616 -1176889 -1375098 -973692 -1047049 -888477 -126392 920798 510746 -30231
10748c0231M04344Q79008j58841j711150j36823J76895K87889L19809L8760k51327
$$ -30231 374113 1253121 1094280 -616870 -753693 -576798 -288909 30900 69660 -181667
10738a81667P35227j83703j29892j048707P02132Q85335n25290j031319j41041
$$ -181667 553560 369857 239965 -808742 -106610 778725 253435 -777884 -918925
10729i18925P57778J1095p2694l39545j82661l91124j68768J648722j578350L04804
$$ -918925 -161147 -150052 -222746 -562291 -744952 -1136076 -1304844 343878 -1234472 -929668
10719i29668J08627M92780N54324k59490J1888R9661L1216j422246J83427R59200
$$ -929668 -821041 -328261 226063 -33427 -21539 78122 109338 -1312908 -1129481 -170281
10709a70281J35057j364771m60060M91089K17700O90342K74423l56833M59554
$$ -170281 -35224 -1399995 -1860055 -1368966 -1151266 -460924 -186501 -543334 -83780
10700h3780Q0254j42581j013844P27918J29899q91204M16907p5827l28540k63933
$$ -83780 -3526 -146107 -1159951 -432033 -302134 -1193338 -776431 -852258 -1180798 -1444731
10690a444731M42119K55871K54491J069512o483M70329j448458j313568K33343
$$ -1444731 -1002612 -746741 -492250 577262 570779 1041108 -407350 -1720918 -1487575
10681a487575N92730Q50817M98029q66334J38531J420153j54084q30506k188760
$$ -1487575 -894845 -44028 454001 -412333 -273802 1146351 992267 161761 -2026999
10672b026999O57519o2241J48162R647J485153M94072n19376P53271r45987j10597
$$ -2026999 -1369480 -1431721 -1283559 -1273912 211241 705313 185937 939208 -6779 -117376
10662a17376L62373K21040j429066K30988n1091R99849k26334j22151P03423n40774
$$ -117376 244997 466037 -963029 -732041 -783132 216717 -9617 -131768 571655 30881
10652C0881k91231O11848L83990n91809m14693Q3933K05430Q75633N05376k08560
$$ 30881 -260350 351498 735488 143679 -271014 -187081 18349 893982 1399358 1190798
10642A190798j10663n10061p83707Q77342m13632j011859j256500P04494O18135
$$ 1190798 1080135 570074 -213633 663709 250077 -761782 -2018282 -1313788 -695653
10633f95653J51871O14501K09527o17906m13286N76153O93218N51229L0235j092552
$$ -695653 -543782 70719 280246 -337660 -750946 -174793 518425 1069654 1099889 7337
10623G337j199915M41527m42771k66070n4663R42042J12604Q42009k0573l09722
$$ 7337 -1192578 -751051 -1193822 -1459892 -1514555 -572513 -459909 382100 361527 51805
10613E1805M71107M79834n40744j224527K95195j7980l27212J481530k46440J7826
$$ 51805 522912 1002746 462002 -762525 -467330 -485310 -812522 669008 422568 440394
10603D40394j035705m22822N99016P47686o59921K26307Q10952j194943n61525
$$ 440394 -595311 -1018133 -419117 328569 -331352 -105045 705907 -489036 -1050561
10594a050561J094902L82904o45543O59326J040611L12299j621422J14595n09635
$$ -1050561 44341 427245 -218298 441028 1481639 1793938 172516 287111 -222524
10585b22524r85036j69956Q34240n54730m52834J519031N87429n99948M41641
$$ -222524 -1207560 -1377516 -543276 -1098006 -1550840 -31809 555620 -44328 397313
10576C97313p09242M20306j115067l18538J280044M0389j128836m07378j87551
$$ 397313 -311929 108377 -1006690 -1325228 -45184 -4795 -1133631 -1541009 -1728560
10567a728560j65677J413271J458549j674833o64970J61377K73258J040934L15591
$$ -1728560 -1894237 -480966 977583 -697250 -1362220 -1200843 -927585 113349 428940
10558D28940L457O9665M1108l75603j4451n22238K36797j33213J68038q26856
$$ 428940 432397 502062 543170 167567 153116 -369122 -132325 -265538 -97500 -924356
10548i24356m33781J584937M74159q88044m5192R44049P65413o39553o13507o54752
$$ -924356 -1358137 226800 700959 -187085 -232277 711772 1477185 837632 224125 -430627
10538d30627j52863J063722l84517j241857K97885O37322P7419q4712k87999J218447
$$ -430627 -583490 480232 95715 -1146142 -848257 -210935 -133516 -218228 -506227 712220
10528G12220l80386k71723q51436N2509l38514J57146N42261L59203q1012m51045
$$ 712220 331834 60111 -791325 -738816 -1077330 -920184 -377923 -18720 -99732 -550777
10518e50777J009826r45420J45313P95881M47045R6287n02474j109061J055858
$$ -550777 459049 -486371 -341058 454823 901868 998155 495681 -613380 442478
10509D42478M16985m81284j240962k15399J039693l32809J09220n21274O38556
$$ 442478 859463 378179 -862783 -1078182 -38489 -371298 -262078 -783352 -144796
10500a44796K50353r58070M87324o13041M76096O01542M74239K04544l39294q22509
$$ -144796 105557 -852513 -365189 -978230 -502134 99408 573647 778191 438897 -383612
10490c83612r5907o91498J16983O09060k43605K11763K93867P31644L5643M61387
$$ -383612 -479519 -1171017 -1054034 -444974 -688579 -476816 -182949 548695 584338 1045725
10480A045725J74619r22131n32751l63593q2075R21570O37768r68525k87202m99186
$$ 1045725 1220344 298213 -234538 -598131 -680206 241364 879132 -89393 -376595 -875781
10470h75781L89474N77506J226968j292039j028168Q85607m01435k78238N44654
$$ -875781 -486307 91199 1318167 26128 -1002040 -116433 -517868 -796106 -251452
10461b51452J912672j181607o48522M37098m79946N55937M89137j26844r82237
$$ -251452 1661220 479613 -168909 268189 -211757 344180 833317 706473 -275764
10452b75764j532960j82834J71897J021285J121931j4100K68928p24151o2662
$$ -275764 -1808724 -1991558 -1819661 -798376 323555 309455 578383 -145768 -208430
10443b08430j22800M1698o17289l05238P08513L82460j137135K67849O60625J682002
$$ -208430 -331230 -289532 -906821 -1212059 -503546 -121086 -1258221 -990372 -329747 1352255
10433A352255o07706j031733o07941N95226q32823K03654N68537M72612K40637
$$ 1352255 744549 -287184 -895125 -299899 -1132722 -929068 -360531 112081 352718
10424C52718m08943n42257j23292k00056o94266O61767l35245J268182N50233
$$ 352718 -56225 -598482 -721774 -921830 -1616096 -954329 -1289574 -21392 528841
10415E28841L42272p56209p18996n52287O06201Q01269Q70302m19224j634362
$$ 528841 871113 114904 -604092 -1156379 -550178 251091 1121393 702169 -932193
10406i32193j58051n83614j00398Q81533N28037J129950j014127m5011q61K81606
$$ -932193 -1090244 -1673858 -1774256 -892723 -364686 765264 -248863 -293874 -294735 -13129
10396a3129k35787L53793Q64996l00919j897561k046115N14812J290235J183752
$$ -13129 -248916 104877 969873 668954 -1228607 -3274722 -2759910 -1469675 -285923
10387b85923j90568P79413m90851j204892n64959J261549J171820L49964p24271
$$ -285923 -476491 302922 -187929 -1392821 -1957780 -696231 475589 825553 101282
10378A01282j595381O88414m02587R15288N12528l28346m55892N8450l5307N62274
$$ 101282 -1494099 -805685 -1208272 -292984 219544 -108802 -564694 -506244 -541551 20723
10368B0723o08925P8803o83189M43075P9469R37699L99494m52350K89807m27799
$$ 20723 -588202 -509399 -1192588 -749513 -670044 267655 667149 214799 504606 76807
10358G6807r39450N0866j28227k1662j66085j26594M7858P41289P6194Q41610
$$ 76807 -862643 -811777 -940004 -961666 -1127751 -1254345 -1206487 -465198 -389004 452606
10348D52606N62328m69001l39107m86934l78621O38821O55957p52301l17338l35562
$$ 452606 1014934 545933 206826 -280108 -658729 -19908 636049 -116252 -433590 -769152
10338g69152L51769n82233j78843M82315M89978o95064k11845R76596J55640n12439
$$ -769152 -417383 -999616 -1178459 -696144 -206166 -901230 -1113075 -136479 19161 -493278
10328d93278L4316J814570k41514n89186q28630P22211N54217q05150j24090r9725
$$ -493278 -458962 1355608 1114094 524908 -303722 418489 972706 167556 43466 -56259
10318e6259r52841M27155j96701k73066J405242O31790j014351j387469k51568
$$ -56259 -1009100 -581945 -778646 -1051712 353530 985320 -29031 -1416500 -1668068
10309a668068K85270P68574Q19979k33469J5414m93756K6081j20783J125638J012640
$$ -1668068 -1382798 -614224 205755 -27714 -12300 -506056 -479975 -600758 524880 1537520
10299A537520p78703l4680j565619K30387o24156J370569j60866j62851j042494
$$ 1537520 758817 724137 -841482 -611095 -1235251 135318 -25548 -188399 -1230893
10290a230893O66875J011792r85638k47508P99328P35345o43602l64344R06494
$$ -1230893 -564018 447774 -537864 -785372 13956 749301 105699 -258645 647849
10281F47849r40008J91133O9777M21116k95290O66332L58740m57324K02904N35754
$$ 647849 -292159 -101026 -31249 389867 94577 760909 1119649 662325 865229 1400983
10271A400983J028062n50421l63974j294292J58579K87330K37713p44403o61085
$$ 1400983 2429045 1878624 1514650 220358 378937 666267 903980 159577 -501508
10262e01508K3850n20625P49749j94945K39469l51672k29205J108308J333652
$$ -501508 -477658 -998283 -248534 -443479 -204010 -555682 -784887 323421 1657073
10253A657073M7764O8280j121137J70155R05355L94154k95017k3721L02716J54835
$$ 1657073 1704837 1773117 651980 822135 1727490 2121644 1826627 1802906 2105622 2260457
10243B260457P81454O77402q74187l15464j235511P18309l38557P89265n25629
$$ 2260457 3041911 3719313 2845126 2529662 1294151 2012460 1673903 2463168 1937539
10234A937539j51207j039902q5120O79171J031939J052678j352349o74217n54527
$$ 1937539 1786332 746430 661310 1340481 2372420 3425098 2072749 1398532 844005
10225H44005O88545L82662J46347l15149j047179M62680R70708n36038J93520
$$ 844005 1532550 1915212 2061559 1746410 699231 1161911 2132619 1596581 1790101
10216A790101M40176J36744o85708K94381j071044o2525K65298J85406M35734
$$ 1790101 2230277 2367021 1681313 1975694 904650 842125 1107423 1292829 1728563
10207A728563j88937Q58265R82402m90688j71794J44902Q95388J42152n05986
$$ 1728563 1539626 2397891 3380293 2889605 2717811 2862713 3758101 3900253 3394267
10198C394267q80378n9931O02244R37346l77812M01692o8467L8645m57452k86448
$$ 3394267 2513889 2453958 3056202 3993548 3615736 4017428 3948961 3987606 3530154 3243706
10188C243706j96753N50202K3918j78223L92979K67051J058076Q42697p120M23916
$$ 3243706 3046953 3597155 3621073 3442850 3835829 4102880 5160956 6003653 5996533 6420449
10178F420449M42521M12316K26462m39267n52662O67893K85083K87193n11560
$$ 6420449 6862970 7275286 7501748 7062481 6509819 7177712 7462795 7749988 7238428
10169G238428J820264J017003J90306l48642M82267P87670l07254j79434K83755
$$ 7238428 9058692 10075695 10266001 9917359 10399626 11187296 10880042 10700608 10984363
10160A0984363N12745r64693o78207R57283L98270j56770k148142p59589r45798
$$ 10984363 11497108 10532415 9854208 10811491 11209761 11052991 8904849 8145260 7199462
10151G199462K76485R8724o629j78491q82333K19047p62971m85888p68446Q16753
$$ 7199462 7475947 7574671 7568042 7389551 6507218 6726265 5963294 5477406 4708960 5525713
10141E525713J111397j389359o01887j441947j217404q6128L47115J96927K56289
$$ 5525713 6637110 5247751 4645864 3203917 1986513 1900385 2247500 2444427 2700716
10132B700716M01480o84798q3816P074L09456M54694o36918l74803O28050m74013
$$ 2700716 3102196 2417398 2333582 2340656 2650112 3104806 2467888 2093085 2721135 2247122
10122B247122j55999Q66659N76484j553453l38767l9430Q50607q45238l78710
$$ 2247122 2091123 2957782 3534266 1980813 1642046 1602616 2453223 1607985 1229275
10113A229275O26411L92748n09254k38264M65632n16671R88045n61919m49619
$$ 1229275 1855686 2248434 1739180 1500916 1966548 1449877 2437922 1876003 1426384
10104A426384J05234n77399l21340M52322K66533k198098J031033n30731P7899
$$ 1426384 1531618 954219 632879 1085201 1351734 -846364 184669 -346062 -268163
10095b68163J345568J56162P19235l32573j444580q14688M96291J225161m02845
$$ -268163 1077405 1233567 1952802 1620229 175649 -639039 -142748 1082413 679568
10086F79568p19643j17807m66845L29239M07634K24638Q60574q58496o91441O29131
$$ 679568 -40075 -157882 -624727 -295488 112146 336784 1197358 338862 -352579 276552
10076B76552n23249m11158J66521P34391P98982l76266l5823l64060j249141Q30987
$$ 276552 -246697 -657855 -491334 243057 1042039 665773 629950 265890 -983251 -152264
10066a52264m48357K16548j27954O0035k07776J69096k58669j009038K493229
$$ -152264 -600621 -384073 -512027 -451992 -659768 -490672 -749341 -1758379 734850
10057G34850K28146j85112n24245j48909K73417K01397o85372L35883M80203l99169
$$ 734850 962996 777884 253639 104730 378147 579544 -105828 230055 710258 311089
10047C11089J44587k40635L65640J03709m07890j10160J30345p77112o17244P47378
$$ 311089 455676 215041 580681 684390 276500 166340 296685 -480427 -1097671 -350293
10037c50293j50493j31985J65508N03493L48154p40815K95014M27188J714224
$$ -350293 -500786 -632771 -467263 36230 384384 -356431 -61417 365771 2079995
10028B079995j009485m64341J143972o46145r45685j6226N34869k5115q15673
$$ 2079995 1070510 606169 1750141 1103996 158311 142085 676954 651839 -163834
10019a63834L87996K83241L22245l75950r64471J226676j471632o47646q8068
$$ -163834 224162 507403 829648 453698 -510773 715903 -755729 -1403375 -1491443
10010a491443O07461L15340l13280r3175k7903M55845p14396J14169J035553J26931
$$ -1491443 -883982 -568642 -881922 -975097 -1003000 -547155 -1261551 -1147382 -111829 15102
10000A5102P29674k72473J119102o21505J08896j083015O63725Q70564j329368
$$ 15102 744776 472303 1591405 969900 1078796 -4219 659506 1530070 200702
9991B00702l84883j31134J55196n1373q6743L95950n47709o61899L44599J466777
$$ 200702 -184181 -315315 -160119 -211492 -298235 97715 -449994 -1111893 -767294 699483
9981F99483o95367n29040k8991o613O14644L2038n8270j64770N31423R14724k66422
$$ 699483 4116 -524924 -553915 -560528 54116 86154 27884 -136886 394537 1309261 1042839
9970A042839M04469R01416L58312M78685l03376l10294j102801l54899Q13563
$$ 1042839 1447308 2348724 2707036 3185721 2882345 2572051 1469250 1114351 1927914
9961A927914p5106l98803J54190j416539N74627m28944M62613j73236J43642j545393
$$ 1927914 1852808 1454005 1608195 191656 766283 337339 799952 626716 770358 -775035
9951g75035P82282Q0602l00351k30504N75645N71221o48656m98288K99142L69771
$$ -775035 7247 87849 -212502 -443006 132639 703860 55204 -443084 -143942 225829
9941B25829m77378R72586m5148o09599p13732j29053K078686L54472M6207p97872
$$ 225829 -251549 721037 675889 66290 -647442 -776495 1302191 1656663 1702870 904998
9931I04998O36196r59730o4229l26146o3476O11789j316083J018306m22521P78755
$$ 904998 1541194 581464 517235 191089 127613 739402 -576681 441625 19104 797859
9921G97859r18149N4559M89385j029765L48128j059799J081391J313019n29836
$$ 797859 -120290 -65731 423654 -606111 -257983 -1317782 -236391 1076628 546792
9912E46792r26844R25153m99121O35253R17212N09500M09289l14596p73457l48797
$$ 546792 -380052 545101 45980 681233 1598445 2107945 2517234 2202638 1429181 1080384
9902A080384l540p31943n56103O12447K48544J022912K68628p18539L5431o57568
$$ 1080384 1076844 344901 -211202 401245 649789 1672701 1941329 1222790 1258221 600653
9892F00653m46385L81241m95491o70140J51690J023441J564157l91247l99980
$$ 600653 154268 535509 40018 -630122 -478432 545009 2109166 1717919 1317939
9883A317939O42984m03963o9422k76383l62980l25843l8603l9112l10501m78305
$$ 1317939 1960923 1556960 1487538 1211155 848175 522332 483729 444617 134116 -344189
9873c44189K22500L40039J68745R36244M04283R50645j459027o77992k34209R47465
$$ -344189 -121689 218350 387095 1323339 1727622 2678267 1219240 541248 307039 1254504
9863A254504j59156L43191k04398m60626n82319o59787J041965p142j85810O54531
$$ 1254504 1095348 1438539 1234141 773515 191196 -468591 573374 566232 380422 1034953
9853A034953j305430L01047k42475Q22715K92791L10969r56318j68348J308851
$$ 1034953 -270477 30570 -211905 610810 903601 1214570 258252 89904 1398755
9844A398755p80307L07507j117580j030528N76497K00492P46833r4645m83546
$$ 1398755 618448 925955 -191625 -1222153 -645656 -445164 301669 207024 -276522
9835b76522j44078J50238J117718K57243r45882p24621N18862Q86163Q71827j233190
$$ -276522 -420600 -270362 847356 1104599 158717 -565904 -47042 839121 1710948 477758
9825D77758L75699r29462J97154P83250j55220l61240o17742j48113n85887M50703
$$ 477758 853457 -76005 121149 904399 749179 387939 -229803 -377916 -963803 -513100
9815e13100l22092M65653Q0273J319949j553885K23444K52231J053733M48894
$$ -513100 -835192 -369539 -289266 1030683 -523202 -299758 -47527 1006206 1455100
9806A455100j902287m58077J178042q50358M54495J133865j34523r53099J687690
$$ 1455100 -447187 -905264 272778 -577580 -123085 1010780 876257 -76842 1610848
9797A610848J202222o83415j88797m94468M0989K55157o20454M88993j17351j10956
$$ 1610848 2813070 2129655 1940858 1446390 1487379 1742536 1122082 1611075 1493724 1382768
9787A382768k86665J355135J852831j279400o95981n74251J54236l61094m65145
$$ 1382768 1096103 2451238 4304069 3024669 2328688 1754437 1908673 1547579 1082434
9778A082434J96229j021624O45960M22627p8058P37324j406733j13396P18633
$$ 1082434 1278663 257039 902999 1325626 1247568 1984892 578159 464763 1183396
9769A183396K81485p03838j18692K46794j28325k71198J090483m1251q0409o9120
$$ 1183396 1464881 761043 642351 889145 760820 489622 1580105 1538854 1458445 1389325
9759A389325m01479K28572J253960R9124j392756j197703K067214k51429k66327
$$ 1389325 987846 1216418 2470378 2569502 1176746 -20957 2046257 1794828 1528501
9750A528501Q45705l80955l9689r24819n50846Q1862j211700o29336Q94177J840094
$$ 1528501 2374206 1993251 1953562 1028743 477897 559759 -651941 -1281277 -387100 1452994
9740A452994n2366k60220O46276L33673Q2063m96674j68357J169413p09837j29047
$$ 1452994 1400628 1140408 1786684 2120357 2202420 1705746 1537389 2706802 1996965 1867918
9730A867918J01478n69968P80424J26026J943271N5171l03862r3747j053170l43188
$$ 1867918 1969396 1399428 2179852 2305878 4249149 4304320 4000458 3906711 2853541 2510353
9720B510353N94498k1716j208706J8250N9660J536787m00189J226146k41037M32866
$$ 2510353 3104851 3083135 1874429 1892679 1952339 3489126 3088937 4315083 4074046 4506912
9710D506912P07060j416102j14762L5187p7691o37279N7570J75254J457537P6066
$$ 4506912 5213972 3797870 3683108 3718295 3640604 3003325 3060895 3236149 4693686 4769752
9700D769752q50073J241037L81338L96471O88671O20692q98184j20405l95056
$$ 4769752 3919679 5160716 5542054 5938525 6627196 7247888 6349704 6229299 5834243
9691E834243N51127J706957k16455M77455k56802q24981O22253p9935o08462M62688
$$ 5834243 6385370 8092327 7875872 8353327 8096525 7271544 7893797 7813862 7205400 7668088
9681G668088M55876p10635J031901R42570K98900M01406m88641K41423L56933
$$ 7668088 8123964 7413329 8445230 9387800 9686700 10088106 9599465 9840888 10197821
9672A0197821m78280K70405K16409N08269P86535K08053p31829j20889J156617
$$ 10197821 9719541 9989946 10206355 10714624 11501159 11709212 10977383 10856494 12013111
9663A2013111M30036P79968M56510r56135N72471J524996k44489P96526R55215
$$ 12013111 12443147 13223115 13679625 12723490 13295961 14820957 14576468 15372994 16328209
9654A6328209R21312P73262j085262J884517R03046J43780N73119L75682j40272
$$ 16328209 17249521 18022783 16937521 18822038 19725084 19868864 20441983 20817665 20677393
9645B0677393Q91375K864683l10853P37758N41559J45248R55056Q52430l56759
$$ 20677393 21568768 24433451 24122598 24860356 25401915 25547163 26502219 27354649 26997890
9636B6997890P78456J612579j33776M93160k802J544392O08759P18920K253332
$$ 26997890 27776346 29388925 29255149 29748309 29745507 31289899 31898658 32617578 34870910
9627C4870910l28683K66197J148335J771088O71031J425737R53237J205575K280689
$$ 34870910 34542227 34808424 35956759 37727847 38398878 39824615 40777852 41983427 44264116
9618D4264116J588553J157804L201731J588950L156542L165812K372546K887086
$$ 44264116 45852669 47010473 50212204 51801154 54957696 58123508 60496054 63383140
9610F3383140L302225M308288M357690O425077P503712P521646R716333J1483507
$$ 63383140 66685365 70993653 75351343 81776420 89280132 96801778 106518111 118001618
9602A18001618J4939260J7514292K3003934K6947622K6765604K6267780K0557561
$$ 118001618 132940878 150455170 173459104 200406726 227172330 253440110 273997671
9595B73997671Q040365k027371p276787r108346l653530M425981Q688430P844734
$$ 273997671 282038036 280010665 272733878 263625532 259972002 264397983 273086413 280931147
9587B80931147l435451j3968997k3523968k9443542l1787124k5850504k1919512
$$ 280931147 277495696 263526699 240002731 210559189 178772065 152921561 131002049
9580A31002049j6819365j1101132q927448q009172n879148n267204n480480l147380
$$ 131002049 114182684 103081552 94154104 86144932 80265784 74998580 69518100 66370720
9572F6370720m618333l234762k376807k284488k526309j918627j380816l137586
$$ 66370720 61752387 58517625 56140818 53856330 51330021 49411394 48030578 44892992
9564D4892992k712700j738472j192166k683668j217215j490716l370058j134934
$$ 44892992 42180292 40441820 39249654 36565986 35348771 33858055 30487997 29353063
9556B9353063p48440l08891k43216j91022j524200j003038k52980K41943l19883
$$ 29353063 28604623 28295732 28052516 27861494 26337294 25334256 25081276 25323219 25003336
9547B5003336n53027M77359K23292J44559M14552O81372J857466k20425o37338
$$ 25003336 24450309 24927668 25150960 25295519 25710071 26391443 28248909 28028484 27391146
9538B7391146j206155l69663k235005p85734L16062L15165K62482P96379j184482
$$ 27391146 26184991 25815328 23580323 22794589 23110651 23425816 23688298 24484677 23300195
9529B3300195j177337m78982m69120P91389p97847j046853J78881l38322M12670
$$ 23300195 22122858 21643876 21174756 21966145 21168298 20121445 20300326 19962004 20374674
9520B0374674L16827J497197J32520J134220R70396J181489K281109K787689J733363
$$ 20374674 20691501 22188698 22321218 23455438 24425834 25607323 27888432 30676121 32409484
9511C2409484L713440K782087J614679K145221Q83703K53492j196660l54989n06390
$$ 32409484 36122924 38905011 40519690 42664911 43548614 43802106 42605446 42250457 41744067
9502D1744067O28409J19145j454119l466749k777478l323387m116711k791320
$$ 41744067 42372476 42491621 41037502 37570753 34793275 31469888 27353177 24561857
9494B4561857j186793l195720k322070Q9309j533450p13032O9794l31462j470548
$$ 24561857 23375064 20179344 17857274 17946583 16413133 15700101 15769895 15438433 13967885
9485A3967885m37402j321265n32380j03106k142684L70582j055681K29274j245655
$$ 13967885 13530483 12209218 11676838 11573732 9431048 9801630 8745949 8975223 7729568
9476G729568j729124j75459R22979O78347r03804K52130k62466n09596p8398J36296
$$ 7729568 6000444 5824985 6747964 7426311 6522507 6774637 6512171 6002575 5924177 6060473
9466F060473k59222J454023l18408k82251r00182K0639J185634q28873j574450
$$ 6060473 5801251 7255274 6936866 6654615 5754433 5775072 6960706 6131833 4557383
9457D557383n45243j82617k8912R4530M61381n98334R05016L1262j100200J37174
$$ 4557383 4012140 3829523 3800611 3895141 4356522 3758188 4663204 4694466 3594266 3731440
9447C731440J85611j130761m43707n22377l78814J894168l77382K05416Q53776
$$ 3731440 3917051 2786290 2342583 1820206 1441392 3335560 2958178 3163594 4017370
9438D017370Q84222l90330k28836R95328l57754m20394M18873k20125l19497J43690
$$ 4017370 4901592 4511262 4282426 5277754 4920000 4499606 4918479 4698354 4378857 4522547
9428D522547r9859l26424N12456N39698L17383l38988l79666r75942m3998K46436
$$ 4522547 4422688 4096264 4608720 5148418 5465801 5126813 4747147 3771205 3727207 3973643
9418C973643J09501P6630O65851j386430j421020O46856j29120J257975l86747
$$ 3973643 4083144 4159774 4825625 3439195 2018175 2665031 2535911 3793886 3407139
9409C407139n76206m52661N3752N78795k66586O58022N02156j90797P6104r06520
$$ 3407139 2830933 2378272 2432024 3010819 2744233 3402255 3904411 3713614 3789718 2883198
9399B883198n88943J702430K91479p65814m77311k38261O04476N68764m64021
$$ 2883198 2294255 3996685 4288164 3522350 3045039 2806778 3411254 3980018 3515997
9390C515997k98892L31547O28034j244943m61024J40989R02712k78389n1074n41730
$$ 3515997 3217105 3548652 4176686 2931743 2470719 2611708 3514420 3236031 3184957 2643227
9380B643227l47477k43989q40451J600131L12257K67582q05963K83397K4995j603904
$$ 2643227 2295750 2051761 1211310 2811441 3123698 3391280 2585317 2868714 2893709 1289805
9370A289805P99137j60046K33561m94576L81734j007201j6988Q58275K785l82781
$$ 1289805 2088942 1928896 2162457 1667881 2049615 1042414 1025426 1883701 1886486 1503705
9360A503705k74898P10936M2383R89336r0582q15880O65291j055509l28088N45417
$$ 1503705 1228807 1939743 1982126 2971462 2880880 2065000 2730291 1674782 1346694 1892111
9350A892111M90758r23685Q70334j80443p77983J216512K72920Q7810m19003m32097
$$ 1892111 2382869 1459184 2329518 2149075 1371092 2587604 2860524 2948334 2529331 2097234
9340B097234L12751J24228n73456J170283J195810M85174R56680N2702j250301
$$ 2097234 2409985 2534213 1960757 3131040 4326850 4812024 5768704 5821406 4571105
9331D571105M92O70723j380503q77652J071423L29705n41581j204692Q1767J004378
$$ 4571105 4571597 5242320 3861817 2984165 4055588 4385293 3843712 2639020 2720787 3725165
9321C725165K207942l82676n07278j305196p86915P36145q5659P49043j70879
$$ 3725165 5933107 5550431 5043153 3737957 2951042 3687187 3601528 4350571 4179692
9312D179692k90254Q8495K05832l40311O79590k39957J730260N86947r72852j174529
$$ 4179692 3889438 3977933 4183765 3843454 4523044 4283087 6013347 6600294 5627442 4452913
9302D452913P2274J449788l97043N40254L09274j15721j30629l57979Q87714J83608
$$ 4452913 4525187 5974975 5577932 6118186 6427460 6311739 6181110 5823131 6710845 6894453
9292F894453j11516m86860J5432m77183N2438j36257J34200R46153K71095O4355
$$ 6894453 6782937 6296077 6311509 5834326 5886764 5750507 5884707 6830860 7101955 7166310
9282G166310k11478L84588n36067J400807l73064J82528p56780M07780J175198
$$ 7166310 6954832 7339420 6803353 8204160 7831096 8013624 7256844 7664624 8839822
9273H839822L89090k11357o17276j423101R86837J821889N89384j5549n70231
$$ 8839822 9228912 9017555 8400279 6977178 7964015 9785904 10375288 10359739 9789508
9264I789508m37322Q11017J230357J490478m93317J099151Q68253P86449J696410
$$ 9789508 9352186 10163203 11393560 12884038 12390721 13489872 14358125 15144574 16840984
9255A6840984K507983K747474K416232L884949M640893L315451L864591J463653
$$ 16840984 19348967 22096441 24512673 28397622 33038515 36353966 40218557 41682210
9247D1682210n16154j937537j324191o68448N56674J164130J37647j766026l997098
$$ 41682210 41166056 39228519 37904328 37235880 37792554 38956684 39094331 37328305 33331207
9238C3331207n900940m169431l118036l568744j695845j020535J80703o05036
$$ 33331207 27430267 23260836 20142800 16574056 14878211 13857676 14038379 13433343
9230A3433343r06144r78014l52412j7624m44221l54734j028500R29585P71119
$$ 13433343 12527199 11549185 11196773 11179149 10734928 10380194 9351694 10281279 11052398
9221A1052398o51263L08307P46612j332261n72713j37695j240616J280361J525938
$$ 11052398 10401135 10709442 11456054 10123793 9551080 9413385 8172769 9453130 10979068
9212A0979068j13826n9439J335927K130225P73740K76313j324599k126420J78267
$$ 10979068 10865242 10805803 12141730 14271955 15045695 15322008 13997409 11870989 12049256
9203A2049256M8208k13649j68388m62360J8843K74562j530943j188246j201860
$$ 12049256 12097464 11883815 11715427 11253067 11271910 11546472 10015529 8827283 7625423
9194G625423N3110o00675j115145J09997M50098j354800n47615p25259J766931
$$ 7625423 7678533 7077858 5962713 6072710 6522808 5168008 4620393 3895134 5662065
9185E662065n0218j18078j041709L9247j629046M81874N60656J56943j81077O57013
$$ 5662065 5611847 5493769 4452060 4491307 2862261 3344135 3904791 4061734 3880657 4537670
9175D537670o09171O05112J692561l36663o86233j129057P7600l66227R18962
$$ 4537670 3928499 4533611 6226172 5889509 5203276 4074219 4151819 3785592 4704554
9166D704554K314477r74468n92946K02957n26255K86533k29025q92427r4799J86897
$$ 4704554 7019031 6044563 5451617 5654574 5128319 5414852 5185827 4293400 4198601 4385498
9156D385498k53468J011664L14989R66891l4202J243928M48701r31213p79662
$$ 4385498 4132030 5143694 5458683 6425574 6391372 7635300 8084001 7152788 6373126
9147F373126q0652P49349N74719n91743n69999O93874K45215N50563K85543L2430
$$ 6373126 6292474 7041823 7616542 7024799 6454800 7148674 7393889 7944452 8229995 8262425
9137H262425L83119O30702N2738r846q2425K47151J18432L39756m91328N34716
$$ 8262425 8645544 9276246 9328984 9319138 9236713 9483864 9602296 9942052 9450724 9985440
9127I985440M49667p364o4018L16129q2948m96082Q83135Q04734M6045K49757
$$ 9985440 10435107 10427743 10363725 10679854 10596906 10100824 10983959 11788693 11834738 12084495
9117A2084495J47645m63201Q67211N66604K80999p19268M16275p10231N42217
$$ 12084495 12232140 11768939 12636150 13202754 13483753 12764485 13180760 12470529 13012746
9108A3012746M63448J036540J937638L16107r79509L32655P77686J220077K67525
$$ 13012746 13476194 14512734 16450372 16766479 15786970 16119625 16897311 18117388 18384913
9099A8384913O18242O75842Q66734k69062N71273J083694O7620k90942K78233
$$ 18384913 19003155 19678997 20545731 20276669 20847942 21931636 21999256 21708314 21986547
9090B1986547J083369N30466O67706P06404M12346j10563L37004Q82667O36360
$$ 21986547 23069916 23600382 24268088 24974492 25386838 25276275 25613279 26495946 27132306
9081B7132306l15090N26215J812736J323972j51571R38203P08656J962125P51985
$$ 27132306 26817216 27343431 29156167 30480139 30328568 31266771 31975427 33937552 34689537
9072C4689537J147760J269604Q33812K648176K641866J992893L473755M926907
$$ 34689537 35837297 37106901 37940713 40588889 43230755 45223648 48697403 53624310
9064E3624310K781643M497311O037127P787926Q524368J0072800J2669158J2547596
$$ 53624310 56405953 60903264 66940391 74728317 83252685 93325485 105994643 118542239
9056A18542239R688300K920675k820029n683621m563917k80707J996143M942981
$$ 118542239 128230539 131151214 128331185 122647564 118083647 117802940 119799083 124742064
9048A24742064M137240J298058m091601q914158j1422627r932187p950236n180338
$$ 124742064 128879304 130177362 126085761 117171603 105748976 95816789 87866553 82686215
9040H2686215m583559j807206j267705j398848j558976n31601J137316J851984
$$ 82686215 78102656 76295450 75027745 73628897 72069921 71538320 72675636 74527620
9032G4527620K006010K760295J960370K341907M552149M657162N629352O396633
$$ 74527620 76533630 79293925 81254295 83596202 88148351 92805513 98434865 104831498
9024A04831498M790743Q508625J1403738J3918045J7865651K1137051K1921476
$$ 104831498 109622241 118130866 129534604 143452649 161318300 182455351 204376827
9017B04376827J5944432N213008p307804j1892766r879272k324170L396755Q205668
$$ 204376827 220321259 225534267 218226463 206333697 196454425 194130255 197527010 205732678
9009B05732678Q942027L315167j0330507k0289358k3878732k1995779j8395516
$$ 205732678 214674705 217989872 207659365 187370007 163491275 141495496 123099980
9002A23099980j3028783j0646203q482629o720544m346176l821068m682200l828515
$$ 123099980 110071197 99424994 90942365 84221821 79875645 76054577 71372377 67543862
8994F7543862j666409k447122j877519r63708j849877j134957j363871j066325
$$ 67543862 65877453 63430331 61552812 60589104 58739227 57604270 56240399 55174074
8986E5174074r88153N71877m5759k084404p59284j033270p62222J09173l8447
$$ 55174074 54185921 54757798 54712039 52627635 51868351 50835081 50072859 50182032 50143585
8977E0143585J340085p26266k81714J123512N68034l33393J126206Q09085o66532
$$ 50143585 51483670 50757404 50475690 51599202 52167236 51833843 52960049 53769134 53102602
8968E3102602P32900J327078J989668m76553P46451K65325J015130J681041J853523
$$ 53102602 53835502 55162580 57152248 56675695 57422146 57687471 58702601 60383642 62237165
8959F2237165J369985J375688L311218K911596K634494L956473L723041N476920
$$ 62237165 63607150 64982838 68294056 71205652 73840146 77796619 81519660 86996580
8951H6996580M640407P052236R785503J2227963J3666674J6928621K3111395K6671296
$$ 86996580 91636987 98689223 108474726 120702689 134369363 151297984 174409379 201080675
8943B01080675L1393095L4436705K9982882J7401344K676146j4683870k6614667
$$ 201080675 232473770 266910475 296893357 314294701 316970847 302286977 275672310
8936B75672310l4030317l2367478k5500469j8799855j2811951n641742p84461
$$ 275672310 241641993 209274515 183774046 164974191 152162240 146520498 145736037
8929A45736037R14401N225502P040459J235794o090759j3886991j6695854j4920923
$$ 145736037 146650438 151875940 158916399 160152193 154061434 140174443 123478589 108557666
8921A08557666j0709574o290333n582595n296964l292726k890777q79701j599527
$$ 108557666 97848092 91557759 85975164 80678200 77385474 74494697 73614996 72015469
8913G2015469K49624P05608J31963K989024K971295M691139P143751Q302808J1269963
$$ 72015469 72265093 72970701 73102664 76091688 79062983 83754122 90897873 99200681 110470644
8904A10470644J3713314J5495225J4915518Q690595J512826o893138j4701427
$$ 110470644 124183958 139679183 154594701 163285296 164798122 157904984 143203557
8897A43203557j9410293j8494988j5660858j0904929r691583p731045o324770
$$ 143203557 123793264 105298276 89637418 78732489 69040906 61309861 54985091
8890E4985091n298521l431176k428801j566398k791942l381186k536017j671226
$$ 54985091 49686570 46255394 43826593 42260195 39468253 36087067 33551050 31879824
8882C1879824n18196j084210k315737j570001k77188n26202q39341j860845q04766
$$ 31879824 31361628 30277418 27961681 26391680 26114492 25588290 24748949 22888104 22083338
8873B2083338j457602j34948j355001j398354l89062j90068l77450j140213l24953
$$ 22083338 20625736 20490788 19135787 17737433 17348371 17158303 16780853 15640640 15315687
8864A5315687m46685L43120l62158R61539o43476m69292r5900j133835L83818
$$ 15315687 14869002 15212122 14849964 15811503 15168027 14698735 14602835 13469000 13852818
8855A3852818j243970l42036R29156j717910k46842j12690n66129j875114J609405
$$ 13852818 12608848 12266812 13195968 11478058 11231216 11118526 10552397 8677283 10286688
8846A0286688J9718r95311K64581q08032r66974r9319Q41931O05784k353298L25557
$$ 10286688 10306406 9311095 9575676 8767644 7800670 7701351 8543282 9149066 6795768 7121325
8836G121325M86191O18217r90909J62069q51635J63454L46888p17282J064580
$$ 7121325 7607516 8225733 7234824 7396893 6545258 6708712 7055600 6338318 7402898
8827G402898j40659j142095m92313Q72741N83059l56917N93128q5083k42788k19065
$$ 7402898 7262239 6120144 5627831 6500572 7083631 6726714 7319842 7234759 6991971 6772906
8817F772906j771242l53355R37052K96469j166020P77298o77797k02822k94959
$$ 6772906 5001664 4648309 5585361 5881830 4715810 5493108 4815311 4612489 4317530
8808D317530j33440J03636m26080m3516p67338l34999M90667n81983J081609J486138
$$ 4317530 4184090 4287726 3861646 3818130 3050792 2715793 3206460 2624477 3706086 5192224
8798E192224J47132p32019j42282p93410k24236k36118M71601l99174O12648J4698
$$ 5192224 5339356 4607337 4465055 3671645 3447409 3211291 3682892 3283718 3896366 3911064
8788C911064l63622J58642K29789L44858K92725J38365l73247r53849j92892J35386
$$ 3911064 3547442 3706084 3935873 4280731 4573456 4711821 4338574 3384725 3191833 3327219
8778C327219m05019l62732R35497P9376j188424j759644J301286M34777j96642
$$ 3327219 2922200 2559468 3494965 3574341 2385917 626273 1927559 2362336 2165694
8769B165694p42507N78241N8441N37836R92246J9314o1140P4481q72505q0797
$$ 2165694 1423187 2001428 2059869 2597705 3589951 3609265 3548125 3622606 2750101 2669304
8759B669304K98559p00453q87959P94168J179256p03485o36727N31728M9757j110032
$$ 2669304 2967863 2267410 1379451 2173619 3352875 2649390 2012663 2544391 2594148 1484116
8749A484116R59934K54514P17627l65215k72810j75457K86708l78826M1516M50883
$$ 1484116 2444050 2698564 3416191 3050976 2778166 2602709 2889417 2510591 2552107 3002990
8739C002990l02457k11533O75231j02564p20718p31111o92395k07288J565734
$$ 3002990 2700533 2489000 3164231 3061667 2340949 1609838 917443 710155 2275889
8730B275889M83921j249582p32416N81689M88927m59855P53324N30119p81105
$$ 2275889 2759810 1510228 777812 1359501 1848428 1388573 2141897 2672016 1890911
8721A890911j349680m54351O56685P1136R81796q81262M46258j92372k96697P96606
$$ 1890911 541231 86880 743565 814701 1796497 915235 1361493 1169121 872424 1669030
8711A669030N66312q41531o67055L61690N27905O23633o31165l82248J22234j77685
$$ 1669030 2235342 1393811 726756 1088446 1616351 2239984 1608819 1226571 1348805 1171120
8701A171120N69330p35196j30267j406917p04418N65151J405084L42484M16275
$$ 1171120 1740450 1005254 874987 -531930 -1236348 -671197 733887 1076371 1492646
8692A492646J78727j544681k47537P80771N01868R14404j148337J79531m14501
$$ 1492646 1671373 126692 -120845 659926 1161794 2076198 927861 1107392 692891
8683F92891P45700Q91817M73952l13629m15066L89156p79961O34931k68601j98347
$$ 692891 1438591 2330408 2804360 2490731 2075665 2464821 1684860 2319791 2051190 1852843
8673A852843p67644M16243j079950P8736J189592R33729o55561j57105L87687
$$ 1852843 1085199 1501442 421492 500228 1689820 2623549 1967988 1810883 2198570
8664B198570m93211o43376J76585p37780L02003k59763J777258j99160q73269
$$ 2198570 1705359 1061983 1238568 500788 802791 543028 2320286 2121126 1247857
8655A247857K72379l94190l79772L12344M45862N86020m67335k99147K1577m28624
$$ 1247857 1520236 1126046 746274 1058618 1504480 2090500 1623165 1324018 1345595 916971
8645I16971R98769J02549J93450p98649J18696N11873m64580j627727J14058K95345
$$ 916971 1915740 2018289 2211739 1413090 1531786 2043659 1579079 -48648 65410 360755
8635C60755j1262L4082j41978L93477O21316M47656l01766k18854k03804L22385
$$ 360755 349493 383575 241597 635074 1256390 1704046 1402280 1183426 979622 1302007
8625A302007O65002p55106j602551K64742J018446j019551n44434J585514j687530
$$ 1302007 1967009 1211903 -390648 -125906 892540 -127011 -671445 914069 -773461
8616g73461N14310K93044J132428k2648K15562L80888m11609j337537k92181P51180
$$ -773461 -259151 33893 1166321 1143673 1359235 1740123 1328514 -9023 -301204 449976
8606D49976K63736L2759K95107o39901j175978Q0686J39024L38218K09847l15508
$$ 449976 713712 746471 1041578 401677 -774301 -693615 -554591 -216373 -6526 -322034
8596c22034J413195p51452p607J575507n00982o62354j266397M69844M94667R2079
$$ -322034 1091161 339709 332102 1907609 1406627 744273 -522124 -52280 442387 534466
8586E34466K02993p0564r31151J2748m08108J209893j49459J83070J795115n50907
$$ 534466 737459 666895 -264256 -251508 -659616 550277 400818 583888 2379003 1828096
8576A828096q69212n19903Q19391J357796n75885j96767j691325l54266O22277
$$ 1828096 958884 438981 1258372 2616168 2040283 1843516 152191 -202075 420202
8567D20202O33630L62694O439l55023q58129j80793r30589J13723J276596M4838
$$ 420202 1053832 1416526 1422965 1067942 209813 29020 -901569 -787846 488750 533588
8557E33588j976387J125204l05072o98563J562370o50016K78522r40589L01466
$$ 533588 -1442799 -317595 -622667 -1321230 241140 -408876 -130354 -1070943 -769477
8548g69477N21190K38761M49091l54686r82151O83676j23241N44503P58494K61818
$$ -769477 -248287 -9526 439565 84879 -897272 -213596 -336837 207666 966160 1227978
8538A227978l74497R44225K90858p22325J35973j21952j427492P1512K26393R32
$$ 1227978 853481 1797706 2088564 1366239 1502212 1380260 -47232 24280 250673 251605
8528B51605l11680P66232j075634q52825O73824p97291J082P30923l02550J525639
$$ 251605 -60075 706157 -369477 -1222302 -548478 -1345769 -1344687 -613764 -916314 609325
8518F09325M39352j535430L49642m41827L1448J010078m48155R19303n54359j316914
$$ 609325 1048677 -486753 -137111 -578938 -547490 462588 14433 933736 379377 -937537
8508i37537K74914n38769O28803O78009L50630p04153J86007K92264L14288k73522
$$ -937537 -662623 -1201392 -572589 105420 456050 -248103 -62096 230168 544456 270934
8498B70934j5850o67271l71070m78305P03325Q10618j003496J290071Q65853q96512
$$ 270934 255084 -412187 -783257 -1261562 -558237 252381 -751115 538956 1404809 508297
8488E08297p75601N96179N02250m52172J84895m35031J97119R1784m77875j127321
$$ 508297 -267304 328875 831125 378953 563848 128817 325936 417720 -60155 -1187476
8478a187476N82521R66376R39292l62401J4433J13477r18434k90084N90110r13910
$$ -1187476 -604955 361421 1300713 938312 952745 1066222 147788 -142296 447814 -466096
8468d66096o44398j59614M4466K89153L061O32047K23916L71139l85257K63270
$$ -466096 -1110494 -1270108 -1225642 -936489 -933428 -301381 -77465 293674 -91583 171687
8458A71687r44518n56191J859040l90959L51466k43839L86813m07382r96538j18755
$$ 171687 -772831 -1329022 530018 139059 490525 246686 633499 226117 -770421 -889176
8448h89176L54039J53546j191234K5918J168136L66439j91868J98895n9071K64574
$$ -889176 -535137 -381591 -1572825 -1546907 -378771 -12332 -204200 -5305 -64376 200198
8438B00198J77961l64368k1538k86529n93154l6214J04129L82815N24359m89006
$$ 200198 378159 13791 -7747 -294276 -887430 -923644 -819515 -436700 87659 -401347
8428d01347K25592o63531j09618M03010O80378Q62120j68117j298596m30910J452896
$$ -401347 -175755 -839286 -948904 -545894 134484 996604 828487 -470109 -901019 551877
8418E51877q2891n53910l28169o01506J71677Q05294L4944p32825P25935M139
$$ 551877 468986 -84924 -413093 -1014599 -842922 -37628 -2684 -735509 -9574 -5435
8408e435L18020L73352k44485k94360o28075M16030P00887o73489l37417P57484
$$ -5435 312585 685937 441452 147092 -480983 -64953 635934 -37555 -374972 382512
8398C82512M90327q5121j067961J42612J01335L12560o21830r31569L84119L95259
$$ 382512 872839 787718 -280243 -137631 -36296 276264 -345566 -1277135 -893016 -497757
8388d97757J336496m63902j670364N77566l9106k11994P74045o78291L69062K96674
$$ -497757 838739 374837 -1295527 -717961 -757067 -969061 -195016 -873307 -504245 -207571
8378b07571L66360M39819j24406L08659j184774O84850m40932k02169N81795L31301
$$ -207571 158789 598608 474202 782861 -401913 282937 -157995 -360164 221631 552932
8368E52932q21668j52500o36895K56034M01758M77542O9386r51299L30525P6044
$$ 552932 -268736 -421236 -1058131 -802097 -400339 77203 146589 -804710 -474185 -398141
8358c98141k89606P91882l98671L75570p96782j44283K65076n19229p10310P42083
$$ -398141 -687747 104135 -294536 81034 -715748 -860031 -594955 -1114184 -1824494 -1082411
8348a082411P89392K2096m67172o4496O87214n10557N91188j481957M44115m45504
$$ -1082411 -293019 -270923 -738095 -802591 -115377 -625934 -34746 -1516703 -1072588 -1518092
8338a518092J280182m33404L51892O37116k75558q73r22662M02609K71514K40694
$$ -1518092 -237910 -671314 -319422 317694 42136 41263 -881399 -478790 -207276 33418
8328C3418l15569j781345K07944J563878Q99878J23099j560684j647555M27251
$$ 33418 -282151 -2063496 -1855552 -291674 608204 731303 -829381 -2476936 -2049685
8319b049685k72315K80335J599117J260954l54933k419212M45317j007729K126318
$$ -2049685 -2322000 -2041665 -442548 818406 463473 -1955739 -1510422 -2518151 -391833
8310c91833J256663p26993j568190l28456R44960L28669O9572l67804j69227J413100
$$ -391833 864830 137837 -1430353 -1758809 -813849 -485180 -415608 -783412 -952639 460461
8300D60461j1793j032567l75048K57036K23797r74918j182505M66966N99167l00307
$$ 460461 448668 -583899 -958947 -701911 -478114 -1453032 -2635537 -2168571 -1569404 -1869711
8290a869711j74011J44745P53543j25254P50959R82344o84131j928725J8689K76703
$$ -1869711 -2043722 -1898977 -1145434 -1270688 -519729 462615 -221516 -2150241 -2131552 -1854849
8280a854849R32088k44273Q38795r4833o97980L8471K03892k26190r42537Q98893
$$ -1854849 -922761 -1167034 -328239 -423072 -1121052 -1082581 -878689 -1104879 -2047416 -1148523
8270a148523P46492M48477j188343q9839n56056P65584K82102k07160m92145Q35623
$$ -1148523 -402031 46446 -1141897 -1231736 -1787792 -1022208 -740106 -947266 -1439411 -603788
8260f03788r9793r21803l23377L83221O33189J041514O61174m39690q0396l08117
$$ -603788 -703581 -1625384 -1948761 -1565540 -932351 109163 770337 330647 250251 -57866
8250e7866o2603J583939K27835q89063j727350K12498K20791l0387L75204r7428
$$ -57866 -120469 1463470 1691305 802242 -925108 -712610 -491819 -522206 -147002 -244430
8240b44430M01045r06856k02315j36741J170119l52791J337098j162542L08426
$$ -244430 156615 -750241 -952556 -1089297 80822 -271969 1065129 -97413 211013
8231B11013k14734n11015O45747l94784p64309K83044J25314N03370j255981J199441
$$ 211013 -3721 -514736 131011 -263773 -1028082 -745038 -619724 -116354 -1372335 -172894
8221a72894k81526L34091j979392J308708K92040j68142P8452J114773P86790
$$ -172894 -454420 -120329 -2099721 -791013 -498973 -667115 -588663 526110 1312900
8212A312900j384626k2695j11449r7396Q3116n73306k59482j551278r09643J439465
$$ 1312900 -71726 -94421 -205870 -303266 -220150 -793456 -1052938 -2604216 -3513859 -2074394
8202b074394J949921k25613K4411o69953n78107N43853J657324n14374j431042
$$ -2074394 -124473 -350086 -325675 -995628 -1573735 -1029882 627442 113068 -1317974
8193a317974o287179j6325713J5309693N995691j26224J204291j298742J673364
$$ -1317974 -7605153 -23930866 -8621173 -2625482 -2751706 -1547415 -2846157 -1172793
8185a172793K25999p47717k31100R16777J73580Q32727j250626Q21510J829102
$$ -1172793 -946794 -1694511 -1925611 -1008834 -835254 -2527 -1253153 -431643 1397459
8176A397459p78444k398267K47315N11404J736521l39653r66982j738612P15725
$$ 1397459 619015 -1779252 -1531937 -1020533 715988 376335 -590647 -2329259 -1613534
8167a613534M31908J231197r70771J67279J46771J091721q01096k18689J210133
$$ -1613534 -1181626 49571 -921200 -753921 -607150 484571 -316525 -535214 674919
8158F74919K28753o532J24m66069j012833j63956K61548N43983j320544m85404
$$ 674919 903672 897140 897264 431195 -581638 -745594 -484046 59937 -1260607 -1746011
8148a746011J804292Q11300j57224j432534J233219k45950J68412j87677l12104
$$ -1746011 58281 869581 712357 -720177 513042 267092 435504 247827 -64277
8139f4277K53213j021818J055962j31694k54842J182945n37261k57059M69103
$$ -64277 188936 -832882 223080 91386 -163456 1019489 482228 225169 694272
8130F94272N9025j300959m09101J601414M59370j043197n04072M73107Q4635J93486
$$ 694272 753297 -547662 -956763 644651 1104021 60824 -443248 29859 114494 307980
8120C07980p22104J54398K47567j25992l93647r14441J090476P42797n10305q54049
$$ 307980 -414124 -259726 -12159 -138151 -531798 -1446239 -355763 387034 -123271 -977320
8110i77320o71164j89796J148109Q46561k57696P68707k48043l16450N15449M56501
$$ -977320 -1648484 -1838280 -690171 156390 -101306 667401 419358 102908 618357 1074858
8100A074858r92577l24652K20411p6795J55527p47158m39180l39992p43723J188869
$$ 1074858 82281 -242371 -21960 -98755 56772 -690386 -1129566 -1469558 -2213281 -1024412
8090a024412J314671M47807j570336J34201q78800J052051l852M439Q69902J12156
$$ -1024412 290259 738066 -832270 -698069 -1576869 -524818 -528670 -524231 345671 457827
8080D57827q81640j8023j028122L56844J063084K70136O89264k61068n36786r3604
$$ 457827 -423813 -441836 -1469958 -1113114 -50030 220106 909370 648302 111516 17912
8070A7912l90526J127341O51518L58272q20592j413577k78982l10791j81374J119076
$$ 17912 -372614 754727 1406245 1764517 943925 -469652 -748634 -1059425 -1240799 -121723
8060a21723P32334P59746K13789p97942l26489o50901l50937K8296o2624J86499
$$ -121723 610611 1370357 1584146 786204 459715 -191186 -542123 -513827 -576451 -389952
8050c89952j32836N65137k8825l79007R00181M38517p7768k97286K03253l34968
$$ -389952 -522788 42349 13524 -365483 534698 973215 895447 598161 801414 466446
8040D66446j343149J50390Q52176L46830l25290j084796L54283J73592l09851
$$ 466446 -876703 -726313 125863 472693 147403 -937393 -583110 -409518 -719369
8031g19369K97987O08019J01959n78954k85762n76384q8101L58565N79422J789899
$$ -719369 -421382 186637 288596 -290358 -576120 -1152504 -1240605 -882040 -302618 1487281
8021A487281n43018P8316j132580J25817J102952o83967j424562k52725Q82122
$$ 1487281 944263 1022579 -110001 15816 1118768 434801 -989761 -1242486 -360364
8012c60364N78223j083626r60619Q24410J164420n83473K07285J85136q90772
$$ -360364 217859 -865767 -1826386 -1001976 162444 -421029 -213744 -28608 -919380
8003i19380Q39154O79367j04799p70314j81292m32145N39569M35921j560845J727723
$$ -919380 -80226 599141 494342 -275972 -457264 -889409 -349840 86081 -1474764 252959
7993B52959J44203J02106r22290k65792N2679J036146J2232j19944m72352l43273
$$ 252959 397162 499268 -423022 -688814 -636135 400011 412243 292299 -180053 -523326
7983e23326J68175J58297r99479M46830Q88072o66083m53252P86326M5783M82952
$$ -523326 -355151 -196854 -1196333 -749503 138569 -527514 -980766 -194440 -148657 334295
7973C34295q25669P51855p404o20319N87279J330647r52735J97775J471584j368029
$$ 334295 -491374 260481 253077 -367242 220037 1550684 597949 795724 2267308 899279
7963H99279m09977R59980l26501j302073M19477m9936m87348L66533k93069j45586
$$ 899279 489302 1449282 1122781 -179292 240185 190249 -297099 69434 -223635 -369221
7953c69221J046998r67447J64526j30621J36159j450089J97426J149843r31248
$$ -369221 677777 -289670 -125144 -255765 -119606 -1569695 -1372269 -222426 -1153674
7944a153674n80997J400239K74762l96600l30909O01430R1114N87959m6268j275929
$$ -1153674 -1734671 -334432 -59670 -456270 -787179 -185749 -94635 493324 447056 -828873
7934h28873L72909L34320j84406j69931J031232l55774J100237O10239k040601
$$ -828873 -455964 -121644 -306050 -475981 555251 199477 1299714 1909953 -130648
7925a30648k3911j278939o32070M85683P39692L13491k35676P84378J51233R8267
$$ -130648 -154559 -1433498 -2065568 -1579885 -840193 -526702 -762378 22000 173233 271500
7915B71500j08825R4361j609006j23931j79701l23254J006949l83699j2246M47456
$$ 271500 162675 257036 -1351970 -1475901 -1655602 -1978856 -971907 -1355606 -1367852 -920396
7905i20396J999140n18517o6872m26386j03906l6905j98836j48868l95212r36682
$$ -920396 1078744 560227 493355 66969 -36937 -73842 -272678 -421546 -816758 -1753440
7895a753440O19259K25025K8791o35368N23382N26271O41192n23167n89374P62569
$$ -1753440 -1134181 -909156 -880365 -1515733 -992351 -466080 175112 -348055 -937429 -174860
7885a74860J135673j92869k54570j736951r76579O92595J052231j81411l53668
$$ -174860 960813 767944 513374 -1223577 -2200156 -1507561 -455330 -636741 -990409
7876i90409M60554l92052J547627q84928p45465l77346P61567l0033l08410l9822
$$ -990409 -529855 -921907 625720 -259208 -1004673 -1382019 -620452 -650485 -958895 -998717
7866i98717p78522J248477m99223N05853M77826j67043j75267o04993N33598n10461
$$ -998717 -1777239 -528762 -1027985 -522132 -44306 -211349 -386616 -991609 -458011 -968472
7856i68472Q3106J519758l9324o26658o37306O08293n41755l49092P6905R42296
$$ -968472 -885366 634392 595068 -31590 -668896 -60603 -602358 -951450 -874545 67751
7846F7751J83347q67266j191685N37221P69250l04541K29332J28471k82085k10517
$$ 67751 251098 -616168 -1807853 -1270632 -501382 -805923 -576591 -448120 -730205 -940722
7836i40722O8386N9976P50165j3489k5774j015584M3399O47424m3469J895579
$$ -940722 -872336 -812360 -62195 -75684 -101458 -1117042 -1073643 -426219 -469688 1425891
7826A425891m86076l14791k79468p80296P27716p44774j581296j66717J460088
$$ 1425891 939815 625024 345556 -434740 292976 -451798 -2033094 -2199811 -739723
7817g39723L56463L07383M64519O67295r64207n43886q2833j76520l36225L96292
$$ -739723 -383260 -75877 388642 1055937 91730 -452156 -534989 -711509 -1047734 -651442
7807f51442K13917l58161k05621J221094o95494J208557N34324j391289M91947
$$ -651442 -437525 -795686 -1001307 219787 -475707 732850 1267174 -124115 367832
7798C67832K78395k19811P30015M8379j32346j004693K94657o43288P49974M22549
$$ 367832 646227 426416 1156431 1204810 1072464 67771 362428 -280860 469114 891663
7788H91663M1928j217691l18233k0359J49158q44474j21048J224801O51905Q0902
$$ 891663 933591 -284100 -602333 -622692 -473534 -1318008 -1439056 -214255 437650 518552
7778E18552j137745j185831l17476j92495J166711j49066L66930Q76177N01166
$$ 518552 -619193 -1805024 -2122500 -2314995 -1148284 -1297350 -930420 -54243 446923
7769D46923o84806j390013N80182J28246p5087K42166Q60467j07182n76975M41348
$$ 446923 -237883 -1627896 -1047714 -919468 -994555 -752389 108078 896 -576079 -134731
7759a34731k48850q40527J0445m9376q28423j259632K39573O44918J055993J774189
$$ -134731 -383581 -1224108 -1213663 -1263039 -2091462 -3351094 -3111521 -2466603 -1410610 363579
7749C63579j23945l80239q03641l26830j07354m30339o8349P6922K59718M5647
$$ 363579 239634 -140605 -944246 -1271076 -1378430 -1808769 -1877118 -1800196 -1540478 -1494831
7739a494831l6532k1176J025401N49704o84411M56098K63655m06151O94136m20295
$$ -1494831 -1531363 -1552539 -527138 22566 -661845 -205747 57908 -348243 345893 -74402
7729g4402l55850j9470Q35831k9145o94058n88413o4816n70078N93884m53085
$$ -74402 -430252 -449722 386109 356964 -337094 -925507 -990323 -1560401 -966517 -1419602
7719a419602O79040k98333P40606N31466j331160N70871J130496k27943j427041
$$ -1419602 -740562 -1038895 -298289 233177 -1097983 -527112 603384 375441 -1051600
7710a051600Q95997M05359q91561k45375l0305m74166J321959J68983j581325
$$ -1051600 -155603 249756 -641805 -887180 -917485 -1391651 -69692 99291 -1482034
7701a482034J232052M37529O77222j99856n77290k58820l53350n1184O35948o98449
$$ -1482034 -249982 187547 864769 664913 87623 -171197 -524547 -575731 60217 -638232
7691f38232k36810q20079M50823L80274M94107K73168K26728K46368o59221j297405
$$ -638232 -875042 -1695121 -1244298 -864024 -369917 -96749 129979 376347 -282874 -1580279
7681a580279M61410k31541J050186Q04891j80953O46549q19800J46927n46969
$$ -1580279 -1118869 -1350410 -300224 504667 323714 970263 150463 297390 -249579
7672b49579k39987N93573K51219k64412o48045L11074K47452j87153K70680n01216
$$ -249579 -489566 104007 355226 90814 -557231 -246157 1295 -185858 84822 -416394
7662d16394n51736m1963P10119L67027N27008j111855n72390J200899J000073
$$ -416394 -968130 -1010093 -299974 67053 594061 -517794 -1090184 110715 1110788
7653A110788J47459j793670k52216r7604N52753P04038j11159m11000j040166
$$ 1110788 1258247 -535423 -787639 -885243 -332490 371548 260389 -150611 -1190777
7644a190777n32619k7742K066275N91982j289138k65774l04569M03722P1514Q92841
$$ -1190777 -1723396 -1751138 315137 907119 -382019 -647793 -952362 -548640 -477126 415715
7634D15715J99539K11113j089906j451597L90328P67407l7944j373544P24437
$$ 415715 615254 826367 -263539 -1715136 -1324808 -557401 -595345 -1968889 -1244452
7625a244452L77431j47858J32818N53862j36023l6526O5819P87328N57017j725852
$$ -1244452 -867021 -1014879 -882061 -328199 -464222 -500748 -434929 352399 909416 -816436
7615h16436j037741L83381J158105N53250L28170j78385j175778P16038n99774
$$ -816436 -1854177 -1470796 -312691 240559 568729 390344 -785434 -69396 -669170
7606f69170J88517J630018l52672j72470m89475R8832L24182L15974n65830q58917
$$ -669170 -480653 1149365 796693 624223 134748 233580 557762 873736 307906 -551011
7596e51011O99002l83377j10121r28056m89780K96921J403999M17152j32123o15277
$$ -551011 147991 -235386 -345507 -1273563 -1763343 -1466422 -62423 354729 222606 -392671
7586c92671P04958l47117q36163N95240L70268q87072R05032O53239k82916r76596
$$ -392671 312287 -34830 -870993 -275753 94515 -792557 112475 765714 482798 -493798
7576d93798Q31616o57456n46929R82846O86831P45512j99513j461880K18256J74041
$$ -493798 337818 -319638 -866567 116279 803110 1548622 1349109 -112771 105485 279526
7566B79526J253543J034346j253633j143908j028413k54850j44984J613368q2166
$$ 279526 1533069 2567415 1313782 169874 -858539 -1113389 -1258373 354995 272829
7557B72829n36799k28115L34653K16752J47616j77555R83346p51088L70299n64289
$$ 272829 -263970 -492085 -157432 59320 206936 29381 1012727 261639 631938 67649
7547F7649N6632R40740n10069n78951M24549J230189j320863j13197p30981J39095
$$ 67649 124281 1065021 554952 -23999 400550 1630739 309876 196679 -534302 -395207
7537c95207Q69207N80715k12557o5135K44520p43876R80347j02896k444487M42332
$$ -395207 474000 1054715 842158 777023 1021543 277667 1258014 1155118 -1289369 -847037
7527h47037Q46364k95308q37079N683j341437n22457J363060J583611R77891j081161
$$ -847037 -673 -295981 -1133060 -1127377 -2468814 -2991271 -1628211 -44600 933291 -147870
7517a47870p20472m02475J36619J449898N55869m6596j354930j739908K16751
$$ -147870 -868342 -1270817 -1134198 315700 871569 824973 -529957 -2269865 -2053114
7508b053114L8399M63355L63632J080767M2250k32805m42922n14753l90574J277066
$$ -2053114 -2014715 -1551360 -1187728 -106961 -64711 -297516 -740438 -1255191 -1645765 -368699
7498c68699P14820p55746q59058N0942k1093J03720k30346R66817K74868J63594
$$ -368699 346121 -409625 -1268683 -1217741 -1238834 -1135114 -1365460 -398643 -123775 39819
7488C9819n43333M8328k86137L0840J924921q61989l69424o42738n71231J117689
$$ 39819 -503514 -455186 -741323 -710483 1214438 352449 -16975 -659713 -1230944 -113255
7478a13255J36213J290j009535N77381J009731n60964N27592M07972q50286r1409
$$ -113255 22958 24248 -985287 -407906 601825 40861 568453 976425 126139 34730
7468C4730K62569J264831j24956o72074o17081j531306n33246L14697J068185
$$ 34730 297299 1562130 1437174 765100 148019 -1383287 -1916533 -1601836 -533651
7459e33651N71504M18713n9269q74331q75364K28896J464621J111012n35778o05152
$$ -533651 37853 456566 397297 -477034 -1352398 -1123502 341119 1452131 916353 311201
7449C11201K54758p52613o21523O49547N63652J71403j213832o20691J040809
$$ 311201 565959 -186654 -808177 -158630 405022 576425 -637407 -1258098 -217289
7440b17289k17491M13780J362309J226537q18873j375294k91444j210762J527495
$$ -217289 -434780 -21000 1341309 2567846 1748973 373679 82235 -1128527 398968
7431C98968L21071n28837J86219m6885r91446j84059Q94843L92150k05325o84914
$$ 398968 720039 191202 377421 330536 -660910 -844969 49874 442024 236699 -448215
7421d48215L40412j33881O00500r4011J95424P85424M71184O6416m84939k19774
$$ -448215 -107803 -241684 358816 264805 460229 1245653 1716837 1783253 1298314 1078540
7411A078540o00236l29717R31160o4777r05603r14259K7129l76290J88662J176463
$$ 1078540 478304 148587 1079747 1014970 109367 -804892 -777763 -1154053 -965391 211072
7401B11072K23586J037379j2666m07892m04925k67043l48652J05840J29841L5751
$$ 211072 434658 1472037 1459371 1051479 646554 379511 30859 136699 266540 302291
7391C02291M44071N19035k58848j605562P33291O00780L09102L45931l19115O2979
$$ 302291 746362 1265397 1006549 -599013 134278 735058 1044160 1390091 1070976 1133955
7381A133955k21579J68034j238971J07994n9189K08278k04815M90497L57606r91121
$$ 1133955 912376 1080410 -158561 -50567 -109756 98522 -106293 384204 741810 -249311
7371b49311k29865J44028J084348l48760K00290m85702n98457N03303P20532O16421
$$ -249311 -479176 -335148 749200 400440 600730 115028 -483429 19874 740406 1356827
7361A356827N33467q04304r80877k8029K95306K55410Q53480R99802q63432r63115
$$ 1356827 1890294 1085990 105113 77084 372390 627800 1481280 2481082 1617650 654535
7351F54535m18478o84092Q7193k81530R44423L09905l97175P73048j283558P46375
$$ 654535 236057 -448035 -360842 -642372 302051 611956 214781 987829 -295729 450646
7341D50646l60082L26146N81158J175305p1769p74161p31488l68035J17452p63559
$$ 450646 90564 416710 997868 2173173 2101404 1327243 595755 227720 345172 -418387
7331d18387O30311P09092K14567l72488k64162q9805l01837J353967n16136n12844
$$ -418387 211924 921016 1135583 763095 498933 409128 107291 1461258 945122 432278
7321D32278o25684Q76877J287644l23660P2072M19377q30088n73093L55359m11797
$$ 432278 -193406 683471 1971115 1647455 1719527 2138904 1308816 735723 1091082 679285
7311F79285j23767R8448L30308n0417M38929P2703o45565r46382K88262P49411
$$ 679285 555518 653966 984274 933857 1372786 1445489 799924 -146458 141804 891215
7301H91215O51308o7894k75974p23943j345678R9206Q52459K45903R22814k68824
$$ 891215 1542523 1474629 1198655 474712 -870966 -771760 80699 326602 1249416 980592
7291I80592M79304p90297j94161L60441k81323k8556J015659o89624Q7614P70362
$$ 980592 1459896 669599 475438 835879 554556 526000 1541659 852035 939649 1710011
7281A710011r53196K78372o08219P84260K61278L05197j81811j064633j01879
$$ 1710011 756815 1035187 426968 1211228 1472506 1777703 1595892 531259 429380
7272D29380K0238R85480Q29510q06777l9275K09940m09633j08699M06325P79865
$$ 429380 449618 1435098 2264608 1457831 1418556 1628496 1218863 1110164 1516489 2296354
7262B296354l67j235303l53380N04284n43748R867N34621L07873N92439o33874
$$ 2296354 2295987 1060684 707304 1211588 667840 677707 1212328 1520201 2112640 1478766
7252A478766l93619j09605k28317M41249K45677R18552r07860O18690o04888J129557
$$ 1478766 1085147 975542 747225 1188474 1434151 2352703 1444843 2063533 1458645 2588202
7242B588202K83286l4635p51305p67286P76378o24528n37478J4928O74535k04934
$$ 2588202 2871488 2836853 2085548 1318262 2094640 1470112 932634 947562 1622097 1417163
7232A417163m91183J00133q4874N3225P53431l01469p93507j22416L16860P51544
$$ 1417163 925980 1026113 941239 994464 1747895 1446426 652919 530503 847363 1598907
7222A598907J013484r26467q59824K42144R06508m67228J06349J80617O37690
$$ 1598907 2612391 1685924 826100 1068244 1974752 1507524 1613873 1794490 2432180
7213B432180K84655L17591m61900q43107J48771P95906N18155J13454r26093m84809
$$ 2432180 2716835 3034426 2572526 1729419 1878190 2674096 3192251 3305705 2379612 1894803
7203A894803N06636j23194p4228j72943k35641q56944J002490J73386N4666R94860
$$ 1894803 2401439 2278245 2204017 2031074 1795433 938489 1940979 2114365 2169031 3163891
7193C163891K01583j218322O43991P09004K62806k8817L18588l42112k90135o74366
$$ 3163891 3365474 2147152 2791143 3500147 3762953 3734136 4052724 3710612 3420477 2746111
7183B746111J239523J04466j64362Q16289J75049L29760j221966q51116l32001
$$ 2746111 3985634 4090100 3925738 4742027 4917076 5246836 4024870 3173754 2841753
7174B841753N33952k48377N84870N16082l11341P95996M01490k6732O03382L99324
$$ 2841753 3375705 3127328 3712198 4228280 3916939 4712935 5114425 5087693 5691075 6090399
7164F090399q71455o42424J572606p22759M40987k07357N27871K552o3652p48538
$$ 6090399 5218944 4576520 6149126 5426367 5867354 5659997 6187868 6190420 6126768 5378230
7154E378230Q7289r9055j416418Q83106J445766m35620L89106j124365j245252
$$ 5378230 5465519 5366464 3950046 4833152 6278918 5843298 6232404 5108039 3862787
7145C862787M92360P12993N33980N66940J083807j190505j012499k477J469033
$$ 3862787 4355147 5068140 5602120 6169060 7252867 6062362 5049863 5047386 6516419
7136F516419O13200M0551P71833L95649p00787n36983j082778N10278L12778m8029
$$ 6516419 7129619 7170170 7942003 8337652 7636865 7099882 6017104 6527382 6840160 6792131
7126F792131O847P19063k84255k59978J94363N29280P94503J28568q01368m87463
$$ 6792131 6798978 7518041 7233786 6973808 7168171 7697451 8491954 8620522 7819154 7331691
7116G331691J333415K55301q40595M11459l47205k00037J368471P94148o22358
$$ 7331691 8665106 8920407 8079812 8491271 8144066 7944029 9312500 10106648 9484290
7107I484290p58021J586667J789071O43175l92023J91970j319289k07909Q37508
$$ 9484290 8726269 10312936 12102007 12745182 12353159 12545129 11225840 11017931 11855439
7098A1855439J226379k93383k96446M28821R04648j92803q906M90489l12084k93
$$ 11855439 13081818 12788435 12491989 12920810 13825458 13632655 13623749 14114238 13802154 13801861
7088A3801861l9389J384765M65437j65988J279142J73664q24986P49137R93955
$$ 13801861 13762472 15147237 15612674 15446686 16725828 16899492 16074506 16823643 17817598
7079A7817598K45698J48392R79503j15289o88970O36385O16747J120446k24364
$$ 17817598 18063296 18211688 19191191 19075902 18386932 19023317 19640064 20760510 20536146
7070B0536146P76631Q97930j415076R40183J716648O8479n14027P30043Q74271
$$ 20536146 21312777 22210707 20795631 21735814 23452462 23520941 23006914 23736957 24611228
7061B4611228J76678J041261O61896J331856P03258n4716M30576L01836P97797
$$ 24611228 24787906 25829167 26491063 27822919 28526177 28471461 28902037 29203873 30001670
7052C0001670J029949J090991M64378P61251m0156L05120J817576J134298J279401
$$ 30001670 31031619 32122610 32586988 33348239 33308083 33613203 35430779 36565077 37844478
7043C7844478M17447Q67673K72870J888457K428707L47051J169234q21149J680661
$$ 37844478 38261925 39129598 39402468 41290925 43719632 44066683 45235917 44414768 46095429
7034D6095429K255085J114358J541140N96002J837746Q82695J136952K565713
$$ 46095429 48350514 49464872 51006012 51602014 53439760 54322455 55459407 58025120
7026E8025120J938096K186911J054727J136364K516017K619848O54641K043656
$$ 58025120 59963216 62150127 63204854 64341218 66857235 69477083 70131724 72175380
7018G2175380K292286P44328K092172K964631J452845K366415L038960K994359
$$ 72175380 74467666 75211994 77304166 80268797 81721642 84088057 87127017 90121376
7010I0121376L020339L021715K229818K952183K845703K860521J715531L980016
$$ 90121376 93141715 96163430 98393248 101345431 104191134 107051655 108767186 112747202
7002A12747202L429878J742160K587607J728336K415498K219484J303219J208417
$$ 112747202 116177080 117919240 120506847 122235183 124650681 126870165 128173384 129381801
6994A29381801L81924P75494J25374J97604o52569l59596p33782l34935j261968
$$ 129381801 129763725 130539219 130664593 130862197 130209628 129850032 129116250 128781315 127519347
6985A27519347l426840k305869k072110j756126k912856m728019m160598j385599
$$ 127519347 124092507 121786638 119714528 117958402 115045546 110317527 106156929 104771330
6977A04771330j698051j639355m185394l903405k642362j013068k110565m951551
$$ 104771330 103073279 101433924 97248530 93345125 90702763 89689695 87579130 82627579
6969H2627579l440842j788141l196052l091325j929700j297004j134151k470395
$$ 82627579 79186737 77398596 74202544 71111219 69181519 67884515 66750364 64279969
6961F4279969l198769k066810j365938j388996k797208j337526j874178j175444
$$ 64279969 61081200 59014390 57648452 56259456 53462248 52124722 50250544 49075100
6953D9075100j109675k208060j132105k034154R1344j041437q78925k372927j191291
$$ 49075100 47965425 45757365 44625260 42591106 42682450 41641013 40762088 38389161 37197870
6944C7197870j74576j753240j720495r56443q9722o36229j59920k360084p04978
$$ 37197870 37023294 35270054 33549559 32593116 32503394 31867165 31707245 29347161 28642183
6935B8642183m64531j043789p09579j240621n74281m62711m54851m53115m77026
$$ 28642183 28177652 27133863 26424284 25183663 24609382 24146671 23691820 23238705 22761679
6926B2761679o09830o95078J330110j996080r36542k37885l0788p66014k63211
$$ 22761679 22151849 21456771 22786881 20790801 19854259 19616374 19585586 18819572 18556361
6917A8556361L51806r83129l39176k95934j354530o34664P13967P2011M85327
$$ 18556361 18908167 17925038 17585862 17289928 15935398 15300734 16014701 16086712 16572039
6908A6572039r19038j154394q49632O54063M57000m35280r72224p52801M37816
$$ 16572039 15653001 14498607 13648975 14303038 14760038 14324758 13352534 12599733 13037549
6899A3037549p36649r98600n66059l45801J097935j34294M73770m60673j88740
$$ 13037549 12300900 11302300 10736241 10390440 11488375 11354081 11827851 11367178 11178438
6890A1178438M5647J03733r24244N02760j83544j208175L34691j114752R99611
$$ 11178438 11224085 11327818 10403574 10906334 10722790 9514615 9849306 8734554 9734165
6881I734165j44620n96932k124826j22520J028226Q7496L69849l01131J4856M52551
$$ 9734165 9589545 8992613 6867787 6745267 7773493 7860989 8230838 7929707 7944563 8397114
6871H397114j92347K75657j710323N54706J10095q08k07407k61850K64325n34630
$$ 8397114 8204767 8480424 6770101 7324807 7434902 7434094 7226687 6964837 7229162 6694532
6861F694532J42739q19243L90435q9912j7942l30535K24394l83821L84545j030034
$$ 6694532 6837271 6018028 6408463 6318551 6300609 5970074 6194468 5810647 6195192 5165158
6851E165158o09785L20294J170255p30781o02811j90903n612K81011J109017j423278
$$ 5165158 4555373 4875667 6045922 5315141 4712330 4521427 4515815 4796826 5905843 4482565
6841D482565Q60956Q2593n29018Q19678m07700p87861o33934J021187J222136
$$ 4482565 5343521 5426114 4897096 5716774 5309074 4521213 3887279 4908466 6130602
6832F130602q51846N99901j84230j464925K73095R57442n68401l26024M61437
$$ 6130602 5278756 5878657 5694427 4229502 4502597 5460039 4891638 4565614 5027051
6823E027051j726357k62983r33690j93103R03651R95751m07512M07537L61007
$$ 5027051 3300694 3037711 2104021 1910918 2814569 3810320 3402808 3810345 4171352
6814D171352j70910K30094j005627n8809Q25083M670q44341j052143P68500K21404
$$ 4171352 4000442 4230536 3224909 3166100 3991183 3995853 3151512 2099369 2867869 3089273
6804C089273r96148n129L96800O40097K20303K84012p78583M2143k30045N929
$$ 3089273 2093125 2087996 2484796 3124893 3345196 3629208 2850625 2892768 2662723 2668652
$$ [...]
##END NTUPLES=NMR SPECTRUM
##END=
