##TITLE=1H_CA-9238-3
 CDCl3
 8 sc, 
 8.2.2024
##JCAMPDX= 6.0         $$ Bruker NMR JCAMP-DX V2.0
##DATA TYPE= NMR SPECTRUM
##DATA CLASS= NTUPLES
##ORIGIN= UXNMR, Bruker Analytische Messtechnik GmbH
##OWNER= root
$$ XWIN-NMR		Version 3.5
$$ Thu Feb  8 16:05:16 2024 Russian Standard Time (UT+4h)  she@DPX200
##.OBSERVE FREQUENCY= 200.1313
##.OBSERVE NUCLEUS= ^1H
##.ACQUISITION MODE= SIMULTANEOUS
##.ACQUISITION SCHEME= undefined
##.AVERAGES= 8
##.DIGITISER RES= 18
##SPECTROMETER/DATA SYSTEM= spect
##.PULSE SEQUENCE= zg30
##.SOLVENT NAME= CDCl3
##.SHIFT REFERENCE= (INTERNAL, CDCl3, 0, 15.5816)
##AUDIT TRAIL= $$ (NUMBER, WHEN, WHO, WHERE, WHAT)
$$ ##TITLE= Audit trail, XWIN-NMR		Version 3.5
$$ ##JCAMPDX= 5.01
$$ ##ORIGIN= Bruker BioSpin GmbH
$$ ##OWNER= she
$$ F:/spectra/data/she/nmr/H-F/1/pdata/1/auditp.txt
$$ ##AUDIT TRAIL=  $$ (NUMBER, WHEN, WHO, WHERE, WHAT)
(   1,<2024-02-08 16:03:57.71 +0400>,<she>,<DPX200>,
      <created by zg, POWCHK disabled, PULCHK disabled
       configuration hash MD5:
       00 E9 B6 7A A2 85 ED C7 34 08 36 98 17 FE 4E 26
       data hash MD5: 16K
       20 AC BB CB 7D D7 A6 64 D3 5D D3 4F 9C 64 E7 E8>)
(   2,<2024-02-08 16:04:00.20 +0400>,<she>,<DPX200>,
      <Start of raw data processing
       efp BC_mod = 2 LB = 0.24 FT_mod = 6 PKNL = 1 PHC0 = -24582.51 PHC1 = 8.652672 SI = 16K 
       data hash MD5: 16K
       78 52 DC 9C 59 37 5B 01 10 42 09 B6 C0 79 CA C7>)
(   3,<2024-02-08 16:04:15.59 +0400>,<she>,<DPX200>,
      <pk PHC0 = -3.866295 PHC1 = 0 
       data hash MD5: 16K
       CA 97 43 36 23 14 34 0F 1E 36 F8 17 4C FA 75 DB>)
(   4,<2024-02-08 16:04:19.65 +0400>,<she>,<DPX200>,
      <abs ABSG = 5 
       data hash MD5: 16K
       B9 68 42 65 16 40 92 F1 73 EE EE FD 25 98 BD 3A>)
$$ ##END=
$$ 
$$ hash MD5
$$ 2A 5B 32 11 EC EE D9 C6 5A 32 F6 48 F4 27 7A 12
##$RELAX= 
##$RELAX= 
##$RELAX= 
##$RELAX= 
##$RELAX= 
##$RELAX= 
$$ Bruker specific parameters
$$ --------------------------
##$DU= <F:/spectra>
##$EXPNO= 1
##$NAME= <H-F>
##$PROCNO= 1
##$TYPE= <nmr>
##$USER= <she>
##$AMP= (0..31)
100 100 100 100 100 100 100 100 100 100 100 100 100 100 100 100 100 100 
100 100 100 100 100 100 100 100 100 100 100 100 100 100 
##$AQSEQ= 0
##$AQ_mod= 1
##$AUNM= <au_zg>
##$AUTOPOS= <>
##$BF1= 200.13
##$BF2= 200.13
##$BF3= 200.13
##$BF4= 200.13
##$BF5= 200.13
##$BF6= 200.13
##$BF7= 200.13
##$BF8= 200.13
##$BYTORDA= 1
##$CFDGTYP= 0
##$CFRGTYP= 5
##$CHEMSTR= <none>
##$CNST= (0..31)
1 1 145 1 1 1 1 1 1 1 1 1 1 1 1 1 1 1 1 1 1 1 1 1 1 1 1 1 1 1 1 1 
##$CPDPRG= <>
##$CPDPRG1= <>
##$CPDPRG2= <>
##$CPDPRG3= <>
##$CPDPRG4= <mlev>
##$CPDPRG5= <mlev>
##$CPDPRG6= <mlev>
##$CPDPRG7= <mlev>
##$CPDPRG8= <mlev>
##$CPDPRGB= <>
##$CPDPRGT= <>
##$D= (0..31)
0 1.2 0 0 0 0 0 0 0 0.06 0 0.03 0 0 0 0 0.0002 0 0 0 0 0 0 0 0 0 0 0 0 
0 0 0 
##$DATE= 1707393837
##$DBL= (0..7)
120 120 120 120 120 120 120 120 
##$DBP= (0..7)
150 150 150 150 150 150 150 150 
##$DBP07= 0
##$DBPNAM0= <>
##$DBPNAM1= <>
##$DBPNAM2= <>
##$DBPNAM3= <>
##$DBPNAM4= <>
##$DBPNAM5= <>
$$ [...]
##$SUBNAM3= <"">
##$SUBNAM4= <"">
##$SUBNAM5= <"">
##$SUBNAM6= <"">
##$SUBNAM7= <"">
##$SUBNAM8= <"">
##$SUBNAM9= <"">
##$SW= 18.0517328524113
##$SWIBOX= (0..15)
0 0 2 0 0 0 0 0 0 0 0 0 0 0 0 0 
##$SW_h= 3612.71676300578
##$TD= 16384
##$TD0= 1
##$TE= 0
##$TE2= 300
##$TE3= 300
##$TEG= 300
##$TL= (0..7)
0 120 120 120 120 120 120 120 
##$TP= (0..7)
150 150 150 150 150 150 150 150 
##$TP07= 0
##$TPNAME0= <>
##$TPNAME1= <>
##$TPNAME2= <>
##$TPNAME3= <>
##$TPNAME4= <>
##$TPNAME5= <>
##$TPNAME6= <>
##$TPNAME7= <>
##$TPOAL= (0..7)
0.5 0.5 0.5 0.5 0.5 0.5 0.5 0.5 
##$TPOFFS= (0..7)
0 0 0 0 0 0 0 0 
##$TUNHIN= 0
##$TUNHOUT= 0
##$TUNXOUT= 0
##$USERA1= <user>
##$USERA2= <user>
##$USERA3= <user>
##$USERA4= <user>
##$USERA5= <user>
##$V9= 5
##$VALIST= <valist>
##$VCLIST= <CCCCCCCCCCCCCCC>
##$VD= 0
##$VDLIST= <DDDDDDDDDDDDDDD>
##$VPLIST= <PPPPPPPPPPPPPPP>
##$VTLIST= <TTTTTTTTTTTTTTT>
##$WBST= 1024
##$WBSW= 4
##$XGAIN= (0..3)
0 0 0 0 
##$XL= 0
##$YL= 0
##$YMAX_a= 159794
##$YMIN_a= -220952
##$ZGOPTNS= <>
##$ZL1= 120
##$ZL2= 120
##$ZL3= 120
##$ZL4= 120
##$ABSF1= 15.48026
##$ABSF2= -2.571589
##$ABSG= 5
##$ABSL= 3
##$ALPHA= 0
##$AQORDER= 0
##$ASSFAC= 0
##$ASSFACI= 0
##$ASSFACX= 0
##$ASSWID= 0
##$AUNMP= <proc_1d>
##$AZFE= 0.1
##$AZFW= 0.1
##$BCFW= 0
##$BC_mod= 2
##$BYTORDP= 0
##$COROFFS= 0
##$CY= -3
##$DATMOD= 1
##$DC= 0
##$DFILT= <>
##$DTYPP= 0
##$F1P= 0
##$F2P= 0
##$FCOR= 1
##$FTSIZE= 16384
##$FT_mod= 6
##$GAMMA= 0
##$GB= 0
##$INTBC= 1
##$INTSCL= 3.70164e-10
##$ISEN= 128
##$LB= 0.24
##$LEV0= 0
##$LPBIN= 0
##$MAXI= 10000
##$MC2= 0
##$MEAN= 0
##$ME_mod= 0
##$MI= 1.114404
##$NCOEF= 0
##$NC_proc= -7
##$NLEV= 6
##$NOISF1= 3.799351
##$NOISF2= 2.8
##$NSP= 0
##$NTH_PI= 0
##$NZP= 0
##$OFFSET= 15.58162
##$PC= 1
##$PHC0= -24586.38
##$PHC1= 8.652672
##$PH_mod= 1
##$PKNL= yes
##$PPARMOD= 0
##$PSCAL= 0
##$PSIGN= 0
##$REVERSE= no
##$SF= 200.129988009509
##$SI= 16384
##$SIGF1= 3
##$SIGF2= 2
##$SINO= 5.538805
##$SIOLD= 16384
##$SREGLST= <1H.CDCl3>
##$SSB= 0
##$STSI= 16384
##$STSR= 0
##$SW_p= 3612.71676300578
##$SYMM= 0
##$S_DEV= 0
##$TDeff= 16384
##$TDoff= 0
##$TI= <>
##$TILT= no
##$TM1= 0
##$TM2= 0
##$TOPLEV= 0
##$USERP1= <user>
##$USERP2= <user>
##$USERP3= <user>
##$USERP4= <user>
##$USERP5= <user>
##$WDW= 1
##$XDIM= 16384
##$YMAX_p= 323801967
##$YMIN_p= -2443416
$$ End of Bruker specific parameters
$$ ---------------------------------
##NTUPLES= NMR SPECTRUM
##VAR_NAME=  FREQUENCY,     SPECTRUM/REAL,   SPECTRUM/IMAG
##SYMBOL=    X,             R,               I
##VAR_TYPE=  INDEPENDENT,   DEPENDENT,       DEPENDENT
##VAR_FORM=  AFFN,          ASDF,            ASDF
##VAR_DIM=   16384,         16384,           16384
##UNITS=     HZ,            ARBITRARY UNITS, ARBITRARY UNITS
##FACTOR=    0.220516191357247, 1,           1
##FIRST=     3118.34946707078, 0,            0
##LAST=      -494.367295935003, 0,           0
##MIN=       -494.367295935003, -2443416,    0
##MAX=       3118.34946707078, 323801967,    0
$$ Real data points
##PAGE= N=1
##DATA TABLE= (X++(R..R)), XYDATA
$$ [...]
12564A19403n4847k97161j80418k3002j881J7432J77767n2744J45988J29965n0583
12553g0081L9885j08952M9841J21428K6816m28968K88651J96294o7707L13168
12543C60375n6623P7389j52519K0841j19743m99604J17531K68520K64938J18180
12533C99285k67600J986l230M1296k9402P3911k83726q3099J28800j04961M7713
12522g9027j39931L92560K21883l12478j92978J92031R5336j85414J60882j84566
12512c1702j54645m8948n6491K29566k72737J72833J17470L06036j10551j21605
12502B9226j82987R0129R114J73379M6478n04658J39108K07275p7995R2662k00259
12491a78528j54676L13474K30550n9870K25330K4511J5234k19250j98972j80165
$$ y = [119403, 64556, -232605, -413023, -436025, -437906, -420474, -242707, -295451, -149463, -19498, -70081, -30196, -139148, -89307, 32121, 58937, -370031, -81380, 114914, 47207, 360375, 303752, 381141, 228622, 249463, 129720, -369884, -252353, 16167, 281105, 399285, 131685, 133671, 130441, 171737, 142335, 216246, -67480, -150579, -21779, -126740, -79027, -218958, 173602, 395485, 83007, -109971, 82060, 177396, -8018, 152864, -31702, -186347, -235295, -291786, -62220, -334957, -162124, -44654, 261382, 150831, 29226, -153761, -63632, -54518, 118861, 165339, -339319, -200211, 7064, -70931, 21731, -178528, -333204, -19730, 210820, 150950, 376280, 400791, 416025, 196775, -2197, -182362]
12481a82362N0804j21184L65059k13045k8806J37318J46618J73590r5907O5259
12471B97344k81378K04528J72424N0524j73399k71918O1472j28790O0975q8672
12461i6890O0303j28927m8409K57648k10927J68009L4770J55078r3137j14461
12451a6943O4645m240j43690J05406K83593j55022l4843j45733n5525O7193j32401
12440a67560L0279Q8453k9857l28958J58664L8110n0242N8004L4260K26536q4176
12429b6487l1905L20635k64458l39279R5662N09415p7163n75376j05877M27592
12419f7241R9686K6827R6480j56524o3207K86096Q7434k72438j18742K4680J78490
12408A21541L51964l01753q9749o9588n3114O2201K18505n20874J19210O6091
$$ y = [-182362, -131558, -252742, 112317, -100728, -129534, 7784, 154402, 327992, 232085, 297344, 15966, 220494, 392918, 443442, 270043, -1875, 59597, -69193, -8218, -96890, -36587, -165514, -213923, 43725, -167202, 807, 35577, 190655, 97518, -16943, 47702, 43462, -100228, 5178, 288771, 133749, 98906, -46827, -102352, -35159, -167560, -137281, -48828, -78685, -407643, -248979, -210869, -261111, -203107, -168847, 57689, -26487, -58392, 262243, -2215, -341494, -245832, 263583, 186420, -388956, -494833, -67241, 32445, 59272, 155752, -772, -63979, 222117, 309551, 37113, -81629, -56949, 121541, 473505, 171752, 82003, 12415, -40699, 21502, 240007, -280867, -161657, -95566]
12398i5566j51481m6908J95418j96446j50390J47484J0575J15368P4207l6576
12388a34315K0566J65090k73372J86044J19323r4642K13601j45412k28231J09857
12378f1491K28308j75777n27747J22311K65864l3597m0434K44932K785j15105
12368h9951J17167Q7956k70456p6580J64111N1323M9978K74589j35206k64803
12358i1872K2316j13351K29104J35079j99928k38564m5999K00812n5498n768K2563
12347a41106j00772J09102K45921j33898J90843R0564j37319k2890k34886J40827
12337F386j2247p2727k2678J9186P9956l20896M28059k6056l6037j52976J15422
12326E392j22053j11227J03030L17906j5871l66836J2838J7508P6642M1148j670
$$ y = [-95566, -247047, -293955, -98537, -294983, -445373, -297889, -287314, -171946, -97739, -134315, -113749, 51341, -222031, -35987, 83336, -11306, 202295, 56883, -171348, -61491, 166817, -8960, -536707, -414396, -148532, -182129, -222563, 22369, 25154, -89951, 27216, 115172, -155284, -231864, -67753, -16430, 33548, 308137, 172931, -91872, -69556, -182907, 46197, 181276, -18652, -257216, -303215, -102403, -157901, -163669, -141106, -241878, -132776, 113145, -20753, 170090, 260654, 123335, 100445, -134441, 6386, -5861, -78588, -101266, -82080, -2124, -323020, 105039, 78983, 42946, -110030, 5392, -116661, -227888, -124858, 193048, 177177, -189659, -176821, -159313, -82671, -41523, -43193]
12315d3193j43679K04613p988k41644o2243K28027K06914j5219o4873j67505J80026
12304G3236L09623j89302j40780M25439j05744p3739k04133r7471P6395j48853
12294g5329K068j43599p081J22346k85393J85021J84415j30061j1344k9749J50311
12283c8395J14928m566l44492K79475j70484m3810K61407O9589J99610j42440
12273A80822m73894m2603K63608K19625L03616m26644k79747j1216N6268L50447
12263A40282o4178j66171N5443p1734Q1402J26189j00639J69705K6791p6565k60545
12252a40020J81099Q0493j49008n1553J68562j076j73053j21400N6394J05483
12242d4079L966L70094k28378K0384m01334K8478L6927Q8512J86527k27178K1146
$$ y = [-43193, -186872, 17741, 9753, -231891, -294134, -66107, 140807, 125588, 60715, -106790, 73236, 382859, 193557, 52777, 478216, 372472, 298733, 94600, -2871, 73524, -75329, -73261, -216860, -223941, -101595, -386988, -201967, -17552, -147613, -158957, -188706, -38395, 76533, 71967, -272525, 6950, -163534, -207344, 54063, 123652, 323262, 180822, -293072, -335675, -72067, 147558, 451174, 24530, -255217, -266433, -210165, 140282, 76104, -90067, -34624, -106358, -24956, 101233, 594, 170299, 197090, 120525, -140020, 41079, 121572, -27436, -78989, 89573, 88497, -84556, -205956, -149562, -44079, -40113, 329981, 101603, 121987, -279347, -250869, -213942, -125430, 61097, -166081, -144935]
12231a44935J11045K58741M902k57152k9751o5168k06216M6307Q7285J43702J4744
12220c6496j51697J40685L20191k51814J59219j26451l36442r539M23470K0410
12210A51536j27229K8890L3991K07959k48524k60978J77577J30333n3737M2978
12200H2796J20966p8183o3500O3699M25224l76428j92484K29472J93686K02572
12190F07820q9692r7408k12088M5567L7812k24579j41348r3717J27132M38145
12180C97644l16266j70395n8187J16637K14032n6458K5964k06311O9174J47068
12170A62902k12696K6289K04178M5441k5550l2127J2090j03767n5037N5622L7720
12159A15065o9671J98438k18716M742J28750k7650L3278L8061k55275j2736L1260
$$ y = [-144935, -33890, 224851, 229753, -27399, -57150, -122318, -328534, -282227, -194942, -51240, -36496, -188193, -47508, 272683, 20869, 180088, 53637, -282805, -292344, 131126, 151536, 24307, 53197, 87188, 295147, 46623, -214355, -36778, 93555, 39818, 82796, 203762, 125579, 62079, 125778, 551002, 174574, -17910, 211562, 405248, 607820, 518128, 420720, 208632, 254199, 292011, 67432, -73916, -167633, -40501, 397644, 81378, -89017, -147204, -30567, 183465, 127007, 152971, -53340, 15834, 162902, -49794, -23505, 180673, 226114, 200564, 168437, 180527, 76760, 21723, 77345, 115065, 45394, 243832, 25116, 29858, 158608, 130958, 164236, 202297, -52978, -65714, -34454]
12148c4454j99166L45650k54006K79031K63044k57793J97980K77213k97106j78494
12138A41899j11382N7434K29890j54803o4075k40148J77985N2409r3646K61137
12128B56700o6650p8384j22686J74342J98415j26595k07984N5510K40457p5863
12118B47262l23470K72722L63772J6114k76995j38867J15344j95635K18071q7078
12108B11240j68639P6733K71999n4691j66849p0724k75289K2453K57730O9764
12098A73727R5758k2836l01625m2059o1069J07793j21855m2388m5346J48013J56402
12087D4515R8338k34923n9306K76830K50725k99886j51265J40476J89673n1733
12077B03444j59985J1574K44929m5683k70690r9501L17738P0288q3166J88456
$$ y = [-34454, -233620, 112030, -141976, 137055, 400099, 142306, 340286, 617499, 320393, 141899, 30517, 87951, 317841, 163038, 98963, -141185, 36800, 89209, -4437, 256700, 190050, 111666, -11020, 163322, 361737, 235142, 27158, 82668, 323125, 247262, -76208, 196514, 560286, 576400, 299405, 160538, 275882, 80247, 298318, 211240, 42601, 119334, 391333, 336642, 169793, 99069, -176220, -153767, 103963, 173727, 269485, 246649, -54976, -97035, -158104, -50311, -172166, -214554, -259900, -111887, 44515, 142853, -92070, -151376, 125454, 376179, 76293, -74972, 65504, 255177, 203444, 43459, 55033, 299962, 254279, -16411, -115912, 201826, 272114, 188948, 377404]
12067C77404o9956j40888p4802M74357m25871m36361J21642L60000M7366J15151
12057C48042p0541l3340P4932k8431J44680o2084k609j59490m8764J98646j88897
12046A72144o10k94578m6020K48690L01251k09983j19018J60445p9829P8656k09975
12035A173R9965n6788K701K45402R860J11095j33809J992M60146k63972j19710
12024C58055k47239L03422o8900K65059J09663j53482J18629m01287J01166m45703
12014f0617j33822j02205M89463K34344j12901l77853k64939N54622K22491J92727
12004F41310j32567k3254j75277k38767M7837K37703m9953M5783K25209p4925
11994E03099r4202j46976J33509J75894j32072n5747K40293J41972j89521m4982
$$ y = [377404, 307448, 166560, 91758, 566115, 140244, -296117, -174475, 185525, 232891, 348042, 277501, 244161, 319093, 290662, 435342, 373258, 370649, 211159, 162395, 361041, 172144, 171534, -123044, -169064, 79626, 380877, 170894, 51876, 212321, 132492, 211148, 1173, 101138, 44350, 47051, 292453, 302313, 413408, 279599, 281591, 741737, 477765, 358055, 110816, 414238, 345338, 610397, 720060, 566578, 685207, 283920, 385086, -60617, -194439, -296644, 192819, 427163, 314262, -63591, -328530, 226092, 448583, 641310, 508743, 485489, 310212, 71445, 119282, 356985, 307032, 352815, 578024, 503099, 408897, 261921, 395430, 571324, 439252, 383505, 623798, 765770, 576249, 531267]
11984E31267k30460j30918N4927k68077N3707K72609o5114J84011M1776k09690
11974B34038L9404R8812r8802l6586k9134k5381r7042J97480R7577l13415J66103
11963B33054K35764j08176J91849M34282m31121m70290l8887P9614R4940j02811
11953A18218J61302K00837k1005R2111K76414k23950m0676Q8793l6278p2719p0078
11942D72969K1956r2175j2109M3821Q6947l9985m2750J94625K1183n5232k49551
11931C49699m1078L69436m03578j4375J99887k1417j02092J07429p7331j07948
11921B58632K27559J4381K60415J40878m48778J03581k91118L60491L27346j95953
11911G57434q2867p2949l63914l3251O0689K96688R4563p3666k2584P9151j62513
$$ y = [531267, 300807, 169889, 224816, -43261, 10446, 283055, 217941, 401952, 443728, 234038, 273442, 372254, 273452, 236866, 207732, 182351, 85309, 282789, 380366, 66951, 233054, 468818, 360642, 552491, 986773, 555652, 85362, 46475, 126089, 221029, 118218, 279520, 480357, 459352, 551463, 827877, 603927, 563251, 652044, 615766, 543047, 472969, 494925, 402750, 390641, 434462, 521409, 481424, 438674, 633299, 654482, 599250, 349699, 308621, 678057, 274479, 260104, 459991, 438574, 336482, 443911, 366580, 258632, 486191, 500572, 760987, 901865, 453087, 556668, 265550, 626041, 953387, 757434, 674567, 601618, 237704, 204453, 265142, 561830, 656393, 582727, 560143, 639294, 476781]
11900D76781k1819J66051K1555J1570p007R1736L7140N7329j26616K8310l62252
11889C72778n229O90293j69492l6125L2112l39664J25359J81208R5553J83886
11879A130679l3657l97915J04223R3167J16257K13422j32811q7470n6071r1023
11869H58801J72585K16253J7544m69048J37819o3685j27766K78239J5173k86899
11859G49016j03981K46663M8634J9764K26397k27221o9460k931K50044q2155j62259
11848H92511K4314N32501J57481k34612k84535m4755n8277J06730J4510J4338
11838A120206L68610K28348O8395k23432k69551K67828P5731n1599n9938K6636
11828A551234P1445J69037K9176j22367j71901m03905J17616L19377k56061L6487
$$ y = [476781, 454962, 621013, 642568, 654138, 647131, 738867, 776007, 833336, 706720, 735030, 372778, 367549, 1057842, 888350, 852225, 884337, 544673, 670032, 851240, 946793, 1130679, 1097022, 699107, 803330, 896497, 1012754, 1226176, 1093365, 1005895, 949824, 858801, 1031386, 1247639, 1265183, 796135, 933954, 870269, 742503, 1020742, 1035915, 749016, 645035, 891698, 940332, 960096, 1186493, 959272, 889812, 886881, 1136925, 1054770, 892511, 916825, 1449326, 1606807, 1372195, 1087660, 1042905, 984628, 1091358, 1105868, 1120206, 1488816, 1717164, 1785559, 1562127, 1292576, 1560404, 1636135, 1584536, 1524598, 1551234, 1622679, 1791716, 1820892, 1698525, 1526624, 1122719, 1240335, 1559712, 1303651, 1340138]
11818A340138Q1868J15515j01119J01278J7934J27300J76334n2920N0160l04014
11808A552474P8265K83951K28839k96047m49068J30238K12161J52714q6575p3546
11798A733406k41816m2061L78068P8076n9044P1256j52880N6700J06623n0369
11788A877959K97246K03856K905j94592j07161O3047M51553J09564p8147j30328
11778B495902J91922q9854l55164p2977M82196j93340p904J14242J37454q1641
11768B620836J26192k15437M9696J76990l4905j44585L14317k87423M4634K06034
11758B856349J43985j03481r3581K76294K6583J31269L2149J16018l14190m6372
11748C025023m2664K8091J88508J30M959O4049K92353N4112j45177J79037K49855
$$ y = [1340138, 1422006, 1537521, 1436402, 1537680, 1555614, 1682914, 1859248, 1806328, 1856488, 1552474, 1630739, 1914690, 2143529, 1847482, 1398414, 1528652, 1740813, 1893527, 1806952, 1733406, 1491590, 1449529, 1827597, 1905673, 1846629, 1917885, 1765005, 1821705, 1928328, 1877959, 2175205, 2379061, 2381966, 2187374, 2080213, 2143260, 2594813, 2704377, 2626230, 2495902, 2687824, 2597970, 2242806, 2169829, 2652025, 2458685, 2450781, 2565023, 2702477, 2620836, 2747028, 2531591, 2581287, 2758277, 2723372, 2578787, 2893104, 2605681, 2650315, 2856349, 3000334, 2896853, 2803272, 3079566, 3106149, 3237418, 3269567, 3385585, 3071395, 3025023, 2982359, 3010450, 3198958, 3199088, 3204047, 3268096, 3560449, 3614561, 3469384, 3648421, 3898276]
11737C898276j84126o077L34563K05107N83763L483k3685O5592j00512k65195
11727D511189j34670J20042N07110r0112j12318M6161L3615P0192K30244J21133
11717E302586l27234P17282K12854J37036J95827j33474K42151Q7328K07147J71929
11707F813432K32022j70504K99676J00059K03299J49241M7015L79164L795L16961
11697H374160K91054R0926J62126K95301K3892K20371K16960J82824O37058N12660
11687A1007332M53127Q2329K18760J45068J29074J98757J42174M18037O37117
11678A3431775P72224l3205R0602M47320K33544L47953L55267L52224K59508M71444
11668A6728656k2427M32808N87678Q6209M66304K12077M89844N96967M51103M62373
$$ y = [3898276, 3714150, 3708073, 4042636, 4247743, 4831506, 4834989, 4811304, 4876896, 4776384, 4511189, 4376519, 4496561, 5003671, 4913559, 4801241, 4847402, 4881017, 4951209, 5181453, 5302586, 4975352, 5692634, 5905488, 6042524, 6238351, 6104877, 6347028, 6434356, 6641503, 6813432, 7045454, 6874950, 7174626, 7274685, 7477984, 7627225, 7674240, 8053404, 8057199, 8374160, 8665214, 8756140, 8918266, 9213567, 9237459, 9457830, 9674790, 9857614, 10494672, 11007332, 11460459, 11542788, 11761548, 11906616, 12035690, 12234447, 12376621, 12794658, 13431775, 14203999, 14170794, 14261396, 14708716, 14942260, 15290213, 15645480, 15997704, 16257212, 16728656, 16706229, 17139037, 17726715, 17812924, 18279228, 18491305, 18981149, 19578116, 20029219, 20491592]
11658B0491592O96539O35004N33845N15339M91942K66683O20862O45678R27967
11649B5825451P33863P64142Q41529P85195P67891J067486J228725R34552R11747
11640C3860581J273070J109082J197666J324475J196396J610624J419782J707476
11632D4699152J269101J754851J545509J811290J908784J985493J661677K272280
11624E8908137K080381K219116K145952J819939K102262K015753K089014J794065
11616G5174619J751931J080643J338190J211969N63432L26763K97248j96612n35192
11607H1012991l74381j165565j469866j571823j667147j846664j876530k009155
11599F9031860k395782k319589k435888k432302k212108k103516k059784k085613
$$ y = [20491592, 21188131, 21823135, 22356980, 22872319, 23364261, 23630944, 24251806, 24897484, 25825451, 26559314, 27323456, 28164985, 28950180, 29718071, 30785557, 32014282, 32948834, 33860581, 35133651, 36242733, 37440399, 38764874, 39961270, 41571894, 42991676, 44699152, 45968253, 47723104, 49268613, 51079903, 52988687, 54974180, 56635857, 58908137, 60988518, 63207634, 65353586, 67173525, 69275787, 71291540, 73380554, 75174619, 76926550, 78007193, 79345383, 80557352, 81120784, 81447547, 81744795, 81548183, 81012991, 80638610, 79473045, 78003179, 76431356, 74764209, 72917545, 71041015, 69031860, 66636078, 64316489, 61880601, 59448299, 57236191, 55132675, 53072891, 50987278]
11591E0987278j957850j985061j940758j777164j885287j569198j281975j514766
11583C7075219j444777j213467j378022j472843j251488r97070p91036j212910
11575B7313606r37870o82636r35937j022133l53021o23971j095263q13404q26986
11566B0022385o43386m27879l08322m35109o51520n11851m24605p38715l20097
11557A5560901k80695l11135q05189n54831l12070n5651k52075j18337m27502
11548A2443416m69400k71673l48180j74668p8714n85290m7237k68872k49424r798
11538I940160o52891m05815J78063l82157L6804j45249k42211k29455L4296J7275
11528H148820j16556r6443p68979j14360k48475M811j29954k33754j34635J50410
$$ y = [50987278, 49029428, 47044367, 45103609, 43326445, 41441158, 39871960, 38589985, 37075219, 35630442, 34416975, 33038953, 31566110, 30314622, 29317552, 28526516, 27313606, 26375736, 25693100, 24757163, 23735030, 23382009, 22758038, 21662775, 20849371, 20022385, 19378999, 18951120, 18642798, 18207689, 17556169, 17044318, 16619713, 15880998, 15560901, 15280206, 14969071, 14163882, 13609051, 13296981, 13241330, 12989255, 12870918, 12443416, 11974016, 11702343, 11354163, 11179495, 11100781, 10515491, 10468254, 10199382, 9949958, 9940160, 9287269, 8881454, 9059517, 8677360, 8714164, 8568915, 8326704, 8097249, 8131545, 8148820, 8032264, 7935821, 7166842, 7052482, 6804007, 6808818, 6678864, 6445110, 6310475, 6460885]
11518F460885l98306o7218j03293j95908j6018J37601j37825k06022q523r4493
11508E370880j57291J66983j941l73726J54485m13627K01032k15911k5159q138
11498D697587l07532m45186M5549M30195j85834l72439n6708L0342l4866k20806
11488C580302K07885L00857l11445j88004L7667Q5179j28636k55012R7624j71194
11478C255223j4703k2163l64916N7316k41738Q0500j48129L47887J43798j90806
11468B902269l5776r2673K43331l6590k05247K23604k73776k53539P2701J00885
11458B645189L82757j48669k42139M1552n0483J6925p597J00545o8301j57323
11448B512456j34137l7522K3444j49292K3427K85773j79189m84983N7666M47606
$$ y = [6460885, 6062579, 5995361, 5892068, 5696160, 5680142, 5817743, 5679918, 5473896, 5465373, 5370880, 5213589, 5380572, 5378631, 5004905, 5159390, 4745763, 4946795, 4730884, 4705725, 4697587, 4390055, 3944869, 3990418, 4420613, 4234779, 3862340, 3805632, 3835974, 3801108, 3580302, 3788187, 4089044, 3777599, 3589595, 3627262, 3712441, 3583805, 3328793, 3426417, 3255223, 3240520, 3218357, 2853441, 2910757, 2669019, 2749519, 2601390, 2949277, 3093075, 2902269, 2866493, 2773820, 3017151, 2980561, 2775314, 2998918, 2725142, 2471603, 2544304, 2645189, 3027946, 2879277, 2637138, 2678690, 2628207, 2645132, 2637535, 2738080, 2669779, 2512456, 2378319, 2340797, 2364241, 2214949, 2238376, 2524149, 2344960, 1859977, 1917643, 2365249]
11438B365249j00551m5886L4056L68965j55911K0981K51618m19541Q251J918J25336
11427B454485K28787l32195j30883P758J87629j38416L18504J63017m39840j8808
11417B300038p0113k7284K50603J3721j67367L2584J25068R5472P1212M4797K04550
11406B873281J26975m0543J5469L7328r5722j67354o9663K46184o9799n6289K51070
11395C050937J23826J05118j13934J40804K07978n7797J55057j63867j29678K39041
11385C557485M4506k97538J56901K17082j8087K62410j28982R092J10273K67520
11375D180662J96225J62989k78295j7592j729L45000K22109J05172j30756k03612
11365D580173K21810J08101J86803J69340P5859L77187J22743L05521O2520P4038
$$ y = [2365249, 2264698, 2218812, 2252868, 2621833, 2465922, 2486903, 2738521, 2318980, 2327231, 2329149, 2454485, 2683272, 2351077, 2220194, 2227952, 2415581, 2277165, 2595669, 2758686, 2318846, 2300038, 2229925, 2202641, 2453244, 2466965, 2299598, 2332182, 2457250, 2552722, 2623934, 2668731, 2873281, 3000256, 2959713, 2975182, 3012510, 2916788, 2749434, 2679771, 2925955, 2856156, 2799867, 3050937, 3174763, 3279881, 3165947, 3306751, 3514729, 3456932, 3611989, 3448122, 3318444, 3557485, 3601991, 3304453, 3461354, 3678436, 3660349, 3922759, 3793777, 3802869, 3913142, 4180662, 4376887, 4539876, 4261581, 4243989, 4242260, 4587260, 4809369, 4914541, 4783785, 4580173, 4801983, 4910084, 5096887, 5266227, 5342086, 5719273, 5842016, 6147537, 6210057, 6284095]
11355F284095O1190J65386K83931J06144M43654J53647J06822L00622J22498K25345
11345H253334j09026k9438K78497n345M5596O2770j98204Q7112J4351l7238O2563
11334H424972m22026m1768J00912l71048j20679j55150j07627j75069l19776n5655
11324F757086k44711l33659L6568r0738j57592p9084m10721l55188l41502j7736
11314D762723m8502M9422n9999o99260J00421n5482j6324j58242k37067j58271
11304C479419q7301J3168n80876M05405j92913l9038k68779l80816K6504J70365
11294B545138L9121J17868L0423k79632K0028j76818P7713m5408j09835J86989
11284B405587k32878O4094n2068j50707l66780K86325m0717j97528j92294k10470
$$ y = [6284095, 6345285, 6510671, 6794602, 6900746, 7344400, 7498047, 7604869, 7905491, 8027989, 8253334, 8144308, 8114870, 8393367, 8388022, 8433618, 8496388, 8298184, 8385296, 8399647, 8362409, 8424972, 8002946, 7961178, 8062090, 7691042, 7570363, 7415213, 7307586, 7132517, 6812741, 6757086, 6512375, 6178716, 6215284, 6124546, 5966954, 5887870, 5477149, 5121961, 4780459, 4762723, 4714221, 4763643, 4703644, 4004384, 4104805, 4049323, 4032999, 3874757, 3637690, 3479419, 3392118, 3405286, 2824410, 3229815, 3036902, 2997864, 2729085, 2348269, 2374773, 2545138, 2584259, 2702127, 2732550, 2452918, 2472946, 2296128, 2373841, 2328433, 2218598, 2405587, 2172709, 2236803, 2184735, 2034028, 1667248, 1953573, 1912856, 1715328, 1523034, 1312564]
11274A312564L96439r1548m0508r1120L28243R342J3717j00942p7515o7574q0671
11263A510427O3739r7249k77019J31674P0039j1290r4999k790n2768j17887K2938
11252A144815k02972r4331L6142L87284j577L8722j77517k68901j65992K24826
11242I20499m1749l0428R4631l7449K22068m5873j41874k92751p4237K97042L68510
11231A238389Q2346K248j94660p4500j75502k1513J35068O7324k16123J14461
11221I57538p6136q7237J45402J3955l4700k22099N9392J80259l3280k60144J10247
11210G53197Q4014N5710p9493k92028K05941K43350J52174r1545j96971O830M9894
11199H91073L0527j15016j27401L50381R2255l57900k4720J87981O7100j96107
$$ y = [1312564, 1709003, 1617455, 1576947, 1485827, 1814070, 1823412, 1837129, 1736187, 1658672, 1591098, 1510427, 1574166, 1476917, 1199898, 1331572, 1401611, 1390321, 1295322, 1292532, 1239764, 1121877, 1144815, 941843, 847512, 883654, 1270938, 1269361, 1308083, 1130566, 861665, 695673, 920499, 878750, 848322, 942953, 905504, 1127572, 1081699, 939825, 647074, 572837, 869879, 1238389, 1320735, 1322983, 1128323, 1053823, 878321, 856808, 991876, 1059200, 843077, 957538, 881402, 794165, 939567, 953522, 918822, 696723, 756115, 936374, 903094, 642950, 753197, 837211, 892921, 813428, 521400, 727341, 970691, 1122865, 1031320, 834349, 841179, 891073, 921600, 806584, 679183, 1029564, 1121819, 763919, 739199, 927180, 994280, 798173]
11189G98173k82682l7768K17697J08842k03068j62299J55910L01030J74621k70551
11179G99905j13552J3888j24171K25230J08635j14636p9547K09094J62619j29674
11169I57791j71860J7492l8885K15549K85175l35685n5160M9145n3297k60732
11159F09533q7172J54936K60780q8893J24371q9881O0974j21697M0992q4362r9302
11148F80279J14264Q9723j33958m1422J26616N9514k05758P6391J64152J44183
11138A073984j52528k84360j5203N19974J17371l22436K3883K6233R347k33197
11128G63068J75588K22603j05502N5846J74985j75108J56830j63929m6622K70843
11118A328602K11259k80685j01183K23679j65107l09792K79161P5457k69188J10928
$$ y = [798173, 515491, 477723, 695420, 804262, 601194, 438895, 594805, 895835, 1070456, 799905, 686353, 700241, 576070, 801300, 909935, 795299, 715752, 924846, 1087465, 957791, 785931, 803423, 764538, 980087, 1265262, 929577, 874417, 923562, 870265, 609533, 522361, 677297, 938077, 849184, 973555, 883674, 944648, 822951, 863943, 779581, 680279, 794543, 884266, 750308, 708886, 835502, 895016, 689258, 765649, 929801, 1073984, 921456, 637096, 621893, 1141867, 1259238, 936802, 960685, 986918, 996265, 763068, 938656, 1161259, 1055757, 1111603, 1286588, 1111480, 1268310, 1104381, 1057759, 1328602, 1539861, 1259176, 1157993, 1381672, 1216565, 906773, 1185934, 1261391, 992203, 1103131]
11108A103131J27138j85036L44164J89195J09936r9302M1427n5545P3343N7156
11098A705607R3123n3552q7795j86590o609M34640J01029K445L0332j12086n7473
11087A863071K61000J05421j74361J60415Q7517J3101J77882J31760Q6752j53470
11077B559088O0439p086j5048N1808L52564J54444M8386J19696k3493K67554K37851
11066C806203j14675J15547J63487K73010J68300k744m7449k13370j20469L52848
11056D380688K3790j22467K02556k68448K20031J95296q4072m28865J53354j32095
11046D139768R1420J53372K01167N403l66771j22439j06131j6127j62325j76829
11036C640508K58360j47530n036j91751k97506m586l67734n0928L9470Q2576j87675
$$ y = [1103131, 1230269, 1045233, 1389397, 1578592, 1688528, 1589226, 1630653, 1575108, 1648451, 1705607, 1798730, 1745178, 1657383, 1470793, 1464184, 1898824, 1999853, 2002298, 2032630, 1920544, 1863071, 2124071, 2229492, 2055131, 2215546, 2303063, 2316164, 2494046, 2625806, 2712558, 2559088, 2619527, 2612441, 2597393, 2649201, 3001765, 3156209, 3204595, 3324291, 3300798, 3568352, 3806203, 3691528, 3807075, 3970562, 4243572, 4411872, 4409128, 4361679, 4148309, 4027840, 4380688, 4404478, 4282011, 4484567, 4216119, 4436150, 4631446, 4547374, 4118509, 4271863, 4139768, 4231188, 4384560, 4585727, 4591130, 4224359, 4101920, 3995789, 3979662, 3817337, 3640508, 3898868, 3751338, 3746302, 3554551, 3257045, 3252459, 2884725, 2833797, 2873267, 2955843, 2768168]
11025B768168R763l94300J57167l21593J14412o8621k65602R1166O7911J7480
11015B175951Q4888J92934l96880l80030O1576K8664n8996q7924m1071l03343
11005A275769m7109J7776p5365o5455l159J1927r5318J24730j59263j25720j02452
10994G56361K45380J49464m01594K75641K7715r0118p7587p1950p4969K26420
10984I64763O7140k31285m8656q1018J01828k04838j2022p3357R2382J45446K28774
10973I49157k068l10078j85159K4960Q9594j89305P469L66267K4251Q0975O9296
10962I25359j18025q028k13726L7188K133R0429l13031m5328q2317Q3452Q3085
10951D41191J07049m64007N63356R0230k88574J37736k04873l03881J8774J21682
$$ y = [2768168, 2777931, 2383631, 2540798, 2219205, 2333617, 2264996, 1999394, 2090560, 2158471, 2175951, 2260839, 2453773, 2056893, 1676863, 1738439, 1767103, 1708107, 1620183, 1579112, 1275769, 1228660, 1246436, 1171071, 1105616, 1102457, 1114384, 1019066, 1143796, 984533, 858813, 756361, 1001741, 1151205, 749611, 1025252, 1052967, 962849, 885262, 813312, 738343, 964763, 1031903, 800618, 751962, 670944, 772772, 567934, 555912, 482555, 574937, 720383, 949157, 947089, 637011, 451852, 476812, 566406, 377101, 384570, 750837, 775088, 856063, 925359, 807334, 799306, 585580, 622768, 624901, 715330, 402299, 356971, 274654, 358106, 441191, 548240, 84233, 647589, 737819, 449245, 586981, 382108, 78227, 97001, 218683]
10941B18683Q694J40970k5441m081q3350k2749l11111K96910M99527j21749n05184
10930I1119K28190m1088J15327K07167j21497o61287O8891O6669J73614K4756
10920A51861k8584K2495K57986K1961j06622m8340r8966J08684J2045r3876N6128
10909B54772k9284J46169J19342j63501j19467r6645n6660J31631N7536J03312
10899C47205j99302J55294K06145k41922j56922p078j94229k4667K81642j4572
10889A51594J23603K72198o7906J39199j24641m8113p7614J7298j10280P4284
10879C49622n7477J91982J77810j23483o7761k6892P9228j49874k6946p7983j15382
10868A52844K39343J66675m90803k4220K35648K26848l22688L5690n1441J765
$$ y = [218683, 227377, 368347, 342906, 338825, 255475, 232726, -78385, 218525, 718052, 596303, 91119, 319309, 278221, 393548, 600715, 479218, -182069, -113178, -46509, 127105, 151861, 123277, 145772, 403758, 425719, 319097, 270757, 171791, 280475, 292520, 198644, 254772, 225488, 371657, 490999, 327498, 208031, 111386, 54726, 186357, 243893, 347205, 147903, 303197, 509342, 267420, 110498, 103420, -90809, -115476, 166166, 151594, 275197, 547395, 479489, 618688, 494047, 445934, 368320, 385618, 275338, 349622, 292145, 484127, 661937, 538454, 470693, 443801, 523029, 373155, 346209, 268226, 152844, 392187, 558862, 68059, 43839, 279487, 506335, 183647, 219337, 167896, 169661]
10858A69661k03451M3611J06672O2564J43724k41559N6509L0804J24763J93237
10848D86535j33492p5856o2383N9457m7285j17683J63012j55187n4765K48318
10838C10671j30934q5500P6396J77972l59758o7723J14889Q6851K61117k57661
10828A26320J0017L37004k11765j93076K14031j04769j92441l7330q1406M13053
10818B79638j88024o6695p2787J2538Q2243l2691L14097r2315k66951K36455n0566
10807A54942K21Q5890k47773L01243J50654k14021k72966L31107Q0079j68354
10797B01022J74678k94120J43359k26379J24507p6497r6183m7136r8789J01044
10787i4494J53160J29259K6944o0667k22771K07911J8509k38811J01375J42447
$$ y = [169661, -33790, 9821, 116493, 179057, 322781, 81222, 137731, 168535, 293298, 486535, 353043, 277187, 214804, 274261, 226976, 109293, 272305, 117118, 62353, 310671, 179737, 94237, 170633, 348605, -11153, -78876, 36013, 122864, 383981, 126320, 136337, 473341, 261576, 68500, 282531, 177762, -14679, -52009, -133415, 279638, 91614, 24919, -47868, -35330, 46913, 14222, 328319, 236004, -30947, 205508, 154942, 155163, 241053, -6720, 294523, 445177, 231156, -41810, 289297, 369376, 201022, 375700, 81580, 224939, -1440, 123067, 46570, -49613, -96749, -195538, -94494, 58666, 187925, 214869, 154202, -68569, 139342, 157851, -80960, 20415, 162862]
10777A62862O2403O3333N0746k2338j20756j3481j18049K22823j30011J65271
10767C22803K44406n4077j25613M4650m33225l61530K90858K43650J36733l65621
10757e6966k3841J64375l2694M7286k27118P3612K26190P2508P6647p7910Q9843
10746C31932n6747q3444j03937k53446j9397k54070L21497l5202l24133J97337
10736b79610K95112J0928J43654j04278L7686J98689j84418L4447k6001m16519
10726b90310O7595M12508r6588Q2391p9376K32000J74656n33943j19183r4931
10716b45181Q9476J35896J15105j04282L2254k70449p9153J99135k62856K86068
10706a03987L19311l29271Q5621L106l0163J39493n6042p0154O8036J4776m8709
$$ y = [162862, 225265, 288598, 339344, 317006, 196250, 182769, 64720, 287543, 157532, 322803, 567209, 513132, 387519, 432169, -1056, -362586, -71728, 171922, 308655, -56966, -80807, 83568, 50874, 98160, -128958, -55346, 170844, 243352, 319999, 242089, 331932, 275185, 191741, 87804, -165642, -185039, -439109, -117612, -152814, -476947, -279610, 15502, 26430, 170084, 65806, 103492, 302181, 117763, 152210, 126209, -290310, -222715, 189793, 93205, 175596, 96220, 328220, 502876, -31067, -150250, -245181, -155705, -19809, 95296, -8986, 23268, -247181, -326334, -127199, -390055, -103987, 215324, -113947, -28326, -25220, -55383, 84110, 28068, -42086, 25950, 40726, -7983]
10695g983L40112j01527l93618O5870l4291J46855p5893J48388k1123l20073q5253
10684c38536q8051R6396M63217q1177k3610M833j24632J57163J51111L7456o0254
10673A93916N7181q2455k9081j05414J88897j0997r7512n5754o4635j02442J12504
10662D208N8024J57269R781k80465P2910k5076J55476J85013Q007j70626p4401
10651A00120J92167k13946K27633K18787K5446k77710L5070R0299k63274K479
10641A37071k35195J21438K18496k78917L01683j36380K62792k26771J27106M088
10631B95411j95556j80688j78817K45376K31999r9919k78990L29792J6051k28409
10621d3750q1276m251K62441K06020J02769p1657k96264J00071P7721o7850j98804
$$ y = [-7983, 332129, 230602, -163016, -97146, -131437, 15418, -60475, 87913, 66790, -253283, -338536, -426587, -330191, 133026, 51849, 28239, 33072, -91560, 65603, 216714, 254170, 193916, 251097, 168642, 139561, 34147, 223044, 212047, 114535, 58781, -5854, -108296, 4208, 62232, 219501, 229282, -51183, 21727, -3349, 152127, 337140, 345147, 174521, 100120, 292287, 78341, 305974, 524761, 550207, 272497, 307567, 397866, 134592, 137071, -98124, 23314, 241810, -37107, 264576, 128196, 390988, 164217, 291323, 295411, 99855, -80833, -259650, -14274, 217725, 117806, -161184, 168608, 184659, -43750, -125026, -129277, 133164, 339184, 441953, 370296, 74032, 174103, 251824, 183974, -14830]
10610a4830K85572J12498n7578k00774l57506N3428p1204L21485n4094l6327J17767
10599I8437m9234K328K24888J15237k68900n2543L3288k91000r4290K18108n9940
10588a23621J01306Q8561n3112K51933P8289l83517K57757j21237k23305P3199
10578e3747J84880J50117J8014R2072o3105k26509R8544K820k04239J11378J62560
10567B72785o7235K13908k21521j04505j02857O0996k74040k97941P3690J03574
10557c43146K05994K75848J60745K23041J39137l66221k00027l08560L8358N18450
10547C43619J22998l18168m9826O7524M5392l51596j527J01312k1397L9746k78675
10536c00598K94211K89452k8539j34314Q060R4909K60528m8735m83527k8902Q875
$$ y = [-14830, 270742, 383240, 325662, 124888, -232618, -179190, -250394, 71091, 16997, -19330, 98437, 49203, 51531, 276419, 391656, 122756, 70213, 103501, -187499, -281789, -63681, -123621, -22315, 66246, 13134, 265067, 343356, -40161, 217596, 96359, -126946, -53747, 131133, 281250, 299264, 391336, 328231, 101722, 200266, 203086, -1153, 110225, 272785, 205550, 419458, 197937, 93432, -9425, 51571, -222469, -520410, -446720, -343146, -137152, 138696, 299441, 522482, 661619, 295398, 95371, -213189, -174831, 343619, 466617, 148449, 98623, 166147, 211539, -140057, -141584, -40272, -61669, -21923, -300598, -6387, 283065, 254526, 120212, 128272, 223181, 483709, 434974, -48553, -77455, -68580]
10525f8580J24975K39153m0636k29613l06042k1380K19732L6358j19207M0484
10515a24756m0115j7118K03610J43228L94595l03022l00280J18430J59394j28610
10505A05356k04767K25486q8504J3585N0949N3981J91944j44634l45390J77898
10495C5904o3909K40337J40482k22869j76277j80122N16606K62599k51577k74047
10485B7127L13446J5350K3465J38077o7967k72617j35991j67521K06847J24464
10475B04680j60668j87255j08009k2242L4931L10664l12180J92217L88386j50947
10465A89577j77746J45446m45835j9033K32604M4441o3364P6679J02241j15498
10455c0488J24726P1204j28718o920L48796l27941N0356K98591o101l81330P8311
$$ y = [-68580, 56395, 295548, 254912, 25299, -280743, -302123, -82391, -46033, -165240, -124756, -164871, -181989, 21621, 164849, 559444, 256422, -43858, 74572, 233966, 105356, -99411, 126075, 37571, 51156, 102105, 156086, 348030, 203396, -141994, 35904, -28005, 212332, 352814, 129945, -46332, -226454, 290152, 552751, 301174, 27127, 340573, 355923, 379388, 517465, 449498, 176881, 40890, -126631, 80216, 204680, 44012, -143243, -251252, -273494, -238563, 72101, -240079, -47862, 340524, 189577, 11831, 157277, -288558, -307591, -74987, -30546, -93910, -17231, 85010, -30488, 94238, 165442, 36724, 29804, 378600, 50659, 101015, 399606, 393505, 12175, 90486]
10444I0486J50224K8587o4530m10285Q9320R7253L99771L2512q2073j21440j73155
10433C6670J63678J31976K81513m00533m06623j34927K42040K97289p3831j66443
10423b9191k11486l4706J69248J25336P0238j8151J69836J07526k55732j23517
10413c0599K76108J94555j0523J0147j55002K91335r6412k64012Q9642m699k77562
10402B2978j33895J24796K32548n584l5832K53290J44183m27337n30991J147K98879
10391e5818K81676J80542K5926j55882l40329J21809K93136K96936l65889l23638
10381d1531n2296J31955k03286K81387L794j87338K59675J17024m9128j42534
10371A17722M88600j65036J1804k73635j30623k55685J88567K40934R6352L49628
$$ y = [90486, 240710, 269297, 204767, -205518, -116198, -18945, 380826, 413338, 331265, 209825, 36670, 200348, 332324, 613837, 213304, -193319, -328246, -86206, 211083, 137252, -29191, -240677, -275383, -106135, 19201, 89439, 71288, 241124, 348650, 92918, -30599, 245509, 440064, 429541, 439688, 284686, 576021, 479609, 215597, 305239, 300540, 22978, -110917, 13879, 246427, 240843, 205011, 458301, 602484, 175147, -355844, -354697, -55818, 225858, 406400, 432326, 276444, -63885, 57924, 351060, 647996, 282107, -41531, -93827, 38128, -165158, 116229, 120023, -67315, 192360, 309384, 260256, 117722, 606322, 441286, 453090, 179455, 48832, -206853, -18286, 222648, 319000, 668628]
10361F68628o4996k64836k03887j85715J46025M58746J49432R473l15956J08048
10351E04962m358l06727L3436Q0133j97532N6296L27226l25268M890J50802k2932
10340C00928j03087O6100q9208K09441r0108j74861L5429J60436j10507R760q712
10329B05611J91N1533j6517K03184J59159j04965m19409R7214O1345K13065P5783
10318E26194k04858p9647M6478K04369M3067o8310L16137k2034l11545L99272
10308H49123k3987j33526m19538j763O4589R8859J73091j7787K76511n9770j74018
10297F31784P6185K21372j3875J18915k01928j08723j96419K72600K57221l12488
10287G44644n968N35239k3920k07237l7693L5881j4172J3797J02627M634P6487
$$ y = [668628, 603632, 338796, 134909, -50806, 95219, 553965, 703397, 712870, 396914, 504962, 500604, 193877, 227313, 307446, 109914, 166210, 493436, 168168, 173058, 323860, 300928, 197841, 263941, 174733, 384174, 294066, 119205, 154634, 315070, 204563, 214323, 205611, 205802, 257335, 240818, 444002, 603161, 498196, 78787, 176001, 237346, 450411, 526194, 321336, 241689, 288167, 492536, 535603, 467293, 783430, 761396, 449851, 849123, 825136, 691610, 272072, 270309, 334898, 433757, 606848, 589061, 865572, 805802, 631784, 707969, 929341, 915466, 1034381, 832453, 723730, 527311, 799911, 1057132, 744644, 738676, 1273915, 1249995, 1042758, 1005065, 1040946, 1026774, 1040571, 1143198, 1147832, 1224319]
10276A224319J14145l5261Q6751l51417L56796K89314j50680m1700J47900J46264
10266A786431j57525N9537j51112L6974K681k12911N2525J48481P7925j46986
10256A496020N8038L47713R4087k72435J1755K38049r2050j57051J18346k97383
10246A545089J77837K70590k19532K40085J31071L3885J13178j02850K97027q9553
10236B396827k9575o3391J08793Q4103q1066R2874K70113J77825L69405J31704
10226C457612j22313Q0865L2004J5996J78251L38619l09808L15422R2302K68768
10216D347718J87886O5778m0798k80276K86589L82458k7257J86806l38523j39366
10206D631015l2815l42569M2346j05433m09978j1175k37397j20519j20686j35207
$$ y = [1224319, 1338464, 1303203, 1389954, 1038537, 1395333, 1684647, 1533967, 1492267, 1640167, 1786431, 1628906, 1688443, 1537331, 1574305, 1576986, 1364075, 1416600, 1565081, 1643006, 1496020, 1554058, 1901771, 1995858, 1723423, 1735178, 1973227, 1881177, 1724126, 1842472, 1545089, 1722926, 1993516, 1773984, 2014069, 2145140, 2179025, 2292203, 2189353, 2486380, 2396827, 2367252, 2303861, 2412654, 2496757, 2415691, 2508565, 2778678, 2956503, 3325908, 3457612, 3335299, 3416164, 3448168, 3464164, 3642415, 3981034, 3671226, 3986648, 4078950, 4347718, 4535604, 4601382, 4560584, 4280308, 4566897, 4949355, 4922098, 5108904, 4770381, 4631015, 4598200, 4255631, 4297977, 4192544, 3782566, 3771391, 3533994, 3413475, 3292789, 3157582]
10196C157582N3741l3519j94704J2927m43296j13246L2296n14816K3444J57807
10186B138216k26049O0339k47439l07570L90485l09669J64388Q7189J01764k67853
10176A583801J67757j00374l71687K42527k02184j78323k144L21044L01351l0561
10166A731207k99780N2071J57221j96198k58654J42471j11772l30064O6822r9777
10156H53547l54110r7359L55965j00453J43291J41204q6226J95669j82089L04461
10146A173900p7871l94268j19735K33625k52362L9630O6259L17991R7297K05720
10136A290186j37376k74380l9462J92777k9924o2253K09759j8776J99308O095
10126A335954J54270M8463R6080L04853p038l43769J7200q5934j50922n4650m2038
$$ y = [3157582, 3211323, 3177804, 2983100, 2996027, 2552731, 2439485, 2471781, 1956965, 1980409, 2138216, 1912167, 1972506, 1725067, 1417497, 1807982, 1498313, 1662701, 1749890, 1851654, 1583801, 1751558, 1651184, 1279497, 1522024, 1319840, 1141517, 1139373, 1460417, 1761768, 1731207, 1431427, 1483498, 1640719, 1444521, 1185867, 1328338, 1216566, 886502, 953324, 853547, 499437, 402078, 758043, 657590, 800881, 942085, 855859, 1051528, 869439, 1173900, 1096029, 701761, 582026, 815651, 563289, 602919, 669178, 987169, 1084466, 1290186, 1152810, 878430, 838968, 1031745, 1001821, 939568, 1149327, 1130551, 1329859, 1335954, 1490224, 1538687, 1634767, 1939620, 1932582, 1588813, 1606013, 1520079, 1369157, 1314507, 1272469]
10115A272469M4678J89528k4190P1434j58915m03947o7121K59711Q3515m53381
10105H13781j18058j6256N0094J91747J17904m8301j05927j2197P3824j77851
10095G68760j34463L72505k6587r8742k06331R324R1384J20923R924k1355l4457
10084H50885l694l66263l9918L2619J01974J18522k84832J7950Q3066l94056K06650
10073C22903K75087j21646j75266J99514L7506m1108o4067k62429q004P5160K398
10062B40048K5303J63634L30154k47042k92569j25740p7574l1484M26116m1120
10052C69726l22480K33100p442j09251J01764K66125j71189l00059J65209J7081
10042B42584q6844Q3533r1237o5877K56421o4383J83971N6896R583M34897m23573
$$ y = [1272469, 1317147, 1506675, 1482485, 1553919, 1395004, 991057, 923936, 1183647, 1267162, 813781, 695723, 679467, 729561, 921308, 1039212, 990911, 884984, 872787, 946611, 768760, 634297, 1006802, 980215, 881473, 675142, 684466, 775850, 896773, 906697, 885342, 850885, 847191, 480928, 441010, 473629, 575603, 694125, 409293, 427243, 510309, 116253, 322903, 597990, 476344, 301078, 500592, 538098, 496990, 432923, 170494, 162490, 237650, 240048, 265351, 428985, 759139, 512097, 219528, 93788, 16214, -15270, 410846, 369726, 47246, 280346, 272904, 163653, 265417, 531542, 360353, 60294, 225503, 242584, 155740, 239273, 148036, 82159, 338580, 274197, 458168, 515064, 524647, 959544, 535971]
10031E35971j40294m7437l4006k2691N1822K49098j14257k25162L60134J44413
10021G57591m34594l1591K4368n0694M4272n0872k40888J71321J63302K25980
10011E78195K61239k37925J15997l7072Q6736l49381K0345K75415k4546K0106
10001G09109j80063m9232R0980Q8615k80233l323M1837n4L47108J34447j50497
9990G48694l3943N2858n7859q7806K59735Q7541j471M5462l15411J26095J90560
9979A014455L0703n71643J99810R4630j7429o1716l3741k93848J0601J00496K44938
9968G17256J18627J73371M0651n2273L61644k9347J73643J23754K03963L6931
9958A868220J16080k234J90709j50315m5918J74499J54089J9604K81273j46242
$$ y = [535971, 395677, 348240, 314234, 291543, 343365, 592463, 478206, 253044, 613178, 757591, 322997, 291406, 315774, 265080, 309352, 258480, 17592, 188913, 352215, 578195, 839434, 601509, 717506, 680434, 767170, 417789, 438134, 713549, 689003, 709109, 529046, 479814, 570794, 659409, 379176, 375853, 417690, 417636, 764744, 899191, 748694, 714751, 767609, 709750, 621944, 881679, 969220, 967749, 1013211, 697800, 823895, 1014455, 1045158, 473515, 673325, 767955, 750526, 688810, 655069, 361221, 371822, 472318, 717256, 835883, 1009254, 1049905, 997632, 1359276, 1329929, 1503572, 1627326, 1831289, 1868220, 1984300, 1982066, 2172775, 2022460, 1976542, 2151041, 2305130, 2324734, 2606007, 2459765]
9948B459765k49079K93500j78003K04358j72819p9422l2453k96259Q1251j25708
9938A905131m73132o1848k38391j97793L5520K17253Q5375o9383q2454J0629j307
9927A129600m2033r0040j54230J22246K38179j90768r4340J63514j06952R4898
9917A070074j15966r7348j47782J93424K3893o0046N906j4790R2129j58330L1160
9906H22324K5229J87292j41603M0106J81628j73990P7694k69947M01054m5272
9896A104515M0932j02518o9534p8044M4705J13783L52298j58932j10398o5419
9886A071388l90494r0702R6981J58225R9718l3117J9634K98090J87734q0770j01409
9875A235278j16320l9705J37395J14134M1787J72015j49454j56266K64243J8706
$$ y = [2459765, 2210686, 2504186, 2326183, 2530541, 2357722, 2278300, 2245847, 1949588, 2030839, 1905131, 1431999, 1370151, 1131760, 933967, 969487, 1186740, 1272115, 1202732, 1120278, 1130907, 1129600, 1087567, 997527, 843297, 965543, 1203722, 1012954, 918614, 1082128, 975176, 1070074, 954108, 856760, 708978, 902402, 926295, 866249, 872155, 857365, 949494, 791164, 822324, 847553, 1034845, 893242, 933348, 1114976, 940986, 1018680, 748733, 1149787, 1104515, 1145447, 1042929, 973395, 895351, 940056, 1053839, 1406137, 1247205, 1136807, 1071388, 680894, 590192, 687173, 845398, 945116, 911999, 931633, 1229723, 1417457, 1336687, 1235278, 1118958, 1079253, 1216648, 1330782, 1372569, 1544584, 1395130, 1238864, 1503107, 1521813]
9865A521813M3846J04392k195m7891l2568J37085L7644l54750j30484j67596l1783
9854A077513O6905R9612n1832q0565K6691L37880q0204k93037J68896j69259l9323
9843A063277J29041k5767J35989k02531J60555K16039k76552k73799J22121l5999
9833A012374J35144o2945J48969M3208q4054J42490p8690L26397O553N6167j45278
9822A500335l13975j87281O9630J71597J27176n7243J91097j39860O3807J66782
9812A592065j17940L62383l87157L5260r7599j60739J40619K8866m4303J53552
9802A505007K37901j94466l16313J30320N81365N756l5291p0200l01837M38146
9792A980388K001j49320k25585j62957K0777K64572L7530L0650J59461N6075r0589
$$ y = [1521813, 1565659, 1670051, 1667856, 1619965, 1587397, 1724482, 1762126, 1407376, 1276892, 1109296, 1077513, 1144418, 1244030, 1192198, 1111633, 1138324, 1476204, 1396000, 1102963, 1271859, 1102600, 1063277, 1192318, 1166551, 1302540, 1100009, 1260564, 1476603, 1200051, 926252, 1048373, 1012374, 1147518, 1084573, 1233542, 1276750, 1192696, 1335186, 1256496, 1582893, 1589446, 1645613, 1500335, 1186360, 999079, 1068709, 1240306, 1367482, 1310239, 1501336, 1361476, 1425283, 1592065, 1474125, 1836508, 1449351, 1484611, 1387012, 1226273, 1366892, 1395758, 1351455, 1505007, 1742908, 1548442, 1232129, 1362449, 1943814, 1949570, 1914279, 1844079, 1542242, 1980388, 1982389, 1833069, 1607484, 1444527, 1465304, 1729876, 1767406, 1798056, 1957517, 2013592, 1923003]
9781A923003l7953J05783J42687L62372l94688k28893K54572R4780p4681K86716
9771B433698j15859k83442K48967j06780k20088J64850J81170K41494j08274o8633
9761B367103K37372K44034m8482o9191j63161K51471K60485J9112n6450j31964
9751B910329N07543k09108j70214n0098L01218J79307k30640Q4778M5604j34619
9741C234100p1142L58675j81037K56569k41408j76365J96055j43193k0746K67173
9731C478681R8518j00537N8582k1109R6478j2247j8625J49844O4309M37644K01943
9720D433481M4436J40519j43167M0313L27675l53445j12192M10703N5340l41362
9710D502301J75869j10630J28527L62382j74812o8692J88476j61032J7632J75494
$$ y = [1923003, 1885050, 1990833, 2133520, 2495892, 2101204, 1872311, 2126883, 2221663, 2146982, 2433698, 2317839, 2034397, 2283364, 2176584, 1956496, 2121346, 2302516, 2544010, 2435736, 2367103, 2604475, 2848509, 2800027, 2730836, 2567675, 2819146, 3079631, 3098743, 3042293, 2910329, 3417872, 3208764, 3038550, 2988452, 3289670, 3468977, 3238337, 3323115, 3368719, 3234100, 3162958, 3521633, 3340596, 3597165, 3355757, 3179392, 3375447, 3232254, 3211508, 3478681, 3577199, 3476662, 3535244, 3514135, 3610613, 3598366, 3579741, 3729585, 3793894, 4231538, 4433481, 4477917, 4618436, 4475269, 4515582, 4843257, 4489812, 4377620, 4788323, 4843663, 4502301, 4678170, 4567540, 4696067, 5058449, 4883637, 4814945, 5003421, 4842389, 4860021, 5035515]
9700E035515K87352K54242K1947j08555j65211O44628j40844J38369K49835l9035
9690F178243K28462L10960q2212J80470o5125K22718M38905j23867K85934O36185
9680H210673l9371L30907P3804M93749K9612K24543K62175J74994J74320L53618
9670A0289024L87933L25903K34954K06627L09352M48720N67642O17612Q337K65403
9660A3661507L01342K09196M51883M12614P79066L43632P80280O62659P08898
9651A8311077J79001O84380R05850J179440J012842R64991J420722J252234J478265
9642B7388802J895211J689175J498931J426520J321426J191217R47128N27083
9634C7885493P15248L99669J039742P53370L84086J00106J78306l62271k66439
$$ y = [5035515, 5322867, 5577109, 5599056, 5490501, 5325290, 5969918, 5829074, 5967443, 6217278, 6178243, 6406705, 6717665, 6635453, 6815923, 6750798, 6973516, 7412421, 7288554, 7574488, 8210673, 8171302, 8502209, 8576013, 9069762, 9099374, 9323917, 9586092, 9761086, 9935406, 10289024, 10676957, 11002860, 11237814, 11444441, 11753793, 12202513, 12770155, 13387767, 13396104, 13661507, 13962849, 14172045, 14623928, 15036542, 15815608, 16159240, 16939520, 17602179, 18311077, 18490078, 19174458, 20080308, 21259748, 22272590, 23237581, 24658303, 25910537, 27388802, 29284013, 30973188, 32472119, 33898639, 35220065, 36411282, 37358410, 37885493, 38600741, 39000410, 40040152, 40793522, 41177608, 41277714, 41456020, 41093749, 40827310]
9625D0827310k12492M2884l15209p3674O35348N37523P06031P32168J057118J137546
9615D5074553J392851J465398J145861R84821J818211J676683J704032K139177
9607E7401587K017702J912115K390699K597914K997657K942564K957238L305003
9599G8522479L623985M256361M889737N197176N841464O979971Q012805R317198
9591A26641176J0901272J3234892J5795457J8431734K0994195K3139881K3512897
9584B52651504K2111171J8963629J4246593Q341289L286884O61388N6990R09598
9576C21229046J892800O80121l169582q202126j5258725k0274082k3457664k4843021
9568B28596767k3165668k0538730j8214420j5555224j3439452j1320082r932534
$$ y = [40827310, 40614818, 40657702, 40342493, 40268819, 40904167, 41441690, 42147721, 42879889, 43937007, 45074553, 46467404, 47932802, 49078663, 50063484, 51881695, 53558378, 55262410, 57401587, 59419289, 61331404, 63722103, 66320017, 69317674, 72260238, 75217476, 78522479, 82146464, 86402825, 91292562, 96489738, 102331202, 109311173, 117323978, 126641176, 137542448, 150777340, 166572797, 185004531, 205998726, 229138607, 252651504, 274762675, 293726304, 307972897, 316314186, 319601070, 320262458, 320319448, 321229046, 323121846, 323801967, 320632385, 312430259, 297171534, 276897452, 253439788, 228596767, 205431099, 184892369, 166677949, 151122725, 137683273, 126363191, 116430657]
9561A16430657q671203p237912o518191o151781n344815m708361l985358l402724
9553G0410312l189533k733018k834314k291485k127439k261153j672432j537451
9545E1763487j705804j467942j293405j114237n08737l73354p28246l83255k74759
9536D3913748j94854m47773m68356p99966j184552o71379o59476j187457j449045
9527C6850890j207265j292192r23613o81337q94907k90011k60403l47562m487
9518C0949113q3736J42723p0955M9761L5703j30716J29672l62983p10556m00120
9508B9547906j070495j264703q98784r26103j004812j111739p78601p79472p33901
9499B0979296n43918m11835l49427n36061P5587k71502l48604N6595r2267n6967
$$ y = [116430657, 107759454, 100521542, 94003351, 87851570, 82506755, 77798394, 73813036, 70410312, 67220779, 64487761, 61653447, 59361962, 57234523, 54973370, 53300938, 51763487, 50057683, 48589741, 47296336, 46182099, 45673362, 45300008, 44571762, 44188507, 43913748, 43718894, 43271121, 42802765, 42002799, 40818247, 40146868, 39487392, 38299935, 36850890, 35643625, 34351433, 33427820, 32746483, 31851576, 31561565, 31301162, 30953600, 30949113, 30865377, 31008100, 30937145, 30986906, 31022609, 30891893, 31021565, 30658582, 29948026, 29547906, 28477411, 27212708, 26313924, 25387821, 24383009, 23271270, 22492669, 21713197, 20979296, 20435378, 20023543, 19674116, 19138055, 19213642, 18942140, 18593536, 18650131, 18557864, 18500897]
9489A8500897J22325L36258J94247K58652M90800R84188O55843Q37486J051722
9480B3432418R97046R67270J185202J096422J038289J282877Q50415M71154N20938
9471C1842031K5526m66392o48972q64442q06242o45534j003000j196535r79675
9462B5256765j326413j543910j867144j672808j407648j282814j007915r03915
9454A4244198r36884o85918o09604n41644o85533l24104r3018l71346n95377k68425
9444I132345l22561o04356J49828m64674l27139J15772o00926R6387J62497p08806
9434F628367l16849m9090j01125J45515j39591m07270m4329k17511M518k5641
9424E476994j04584j71447j72861j31038j9935M16977j78274J78103R5288l01967
$$ y = [18500897, 18623222, 18959480, 19153727, 19412379, 19903179, 20887367, 21543210, 22380696, 23432418, 24429464, 25396734, 26581936, 27678358, 28716647, 29999524, 30849939, 31321093, 31842031, 31867557, 31401165, 30752193, 29887751, 29081509, 28435975, 27432975, 26236440, 25256765, 23930352, 22386442, 20519298, 18846490, 17438842, 16156028, 15148113, 14244198, 13307314, 12621396, 12011792, 11470148, 10784615, 10460511, 10367493, 9996147, 9400770, 9132345, 8809784, 8205428, 8355256, 7890582, 7563443, 7679215, 7078289, 7174676, 7337173, 6628367, 6311518, 6262428, 6161303, 6306818, 6167227, 5759957, 5715628, 5498117, 5502635, 5476994, 5372410, 5200963, 5028102, 4897064, 4877129, 5294106, 5115832, 5293935, 5389223, 5087256]
9414E087256N8602k9878R9618k82838p92j00368m5820o8505j24825J88591j05851
9403D675190k79246m7936n5325L847R861M1408k20454j1771k80201p0123L22038
9392D087288j71937o5456O1907k74697K11940L60223k35456j89730r3784K81360
9382C971658j28435l1575m4994P886k82093n5584J41341M35405J00264j11739
9372D002134o583j64065l59020p8937K52181J41416j50662j77385J83494k61937
9362C380636K53919j53710j82265j61052k1745M6549j04212J3546k71317P3936
9352B874285J68973r6164J9934K45461l69588j41121K88009K00115l00358j28452
9342B761094J22680p026n2633L5849j89430k18423L78863k6935p4153L2305j76840
$$ y = [5087256, 5145858, 5115980, 5215598, 4932760, 4931968, 4831600, 4785780, 4717275, 4592450, 4781041, 4675190, 4395944, 4348008, 4292683, 4296530, 4306391, 4347799, 4127345, 4115574, 3835373, 3765250, 4087288, 3915351, 3849895, 3911802, 3637105, 3849045, 4209268, 3973812, 3784082, 3690298, 3971658, 3843223, 3811648, 3766654, 3774540, 3492447, 3436863, 3578204, 4013609, 4113873, 4002134, 3995551, 3831486, 3472466, 3393529, 3645710, 3787126, 3636464, 3459079, 3642573, 3380636, 3634555, 3480845, 3298580, 3137528, 3115783, 3162332, 3058120, 3071666, 2800349, 2874285, 3043258, 2947094, 2967028, 3212489, 2842901, 2701780, 2989789, 3189904, 2889546, 2761094, 2883774, 2876748, 2824115, 2859964, 2670534, 2452111, 2830974, 2804039, 2729886, 2762191, 2585351]
9331B585351J02458J15272L2820P2462j61559M049K28092R3149j07464r4418J99107
9320C069319J52386l19800K14468Q3506k98268j6542J31400J68085n9458j22686
9310C002410M3134q5710J47857m7879o806L3440k95664K20924L71905r026J64655
9299C539240J76183k9277Q9757L47186J55545q6803R401j3638L52101L46411M24997
9288E311103M5758O6522k51797r4655j43942J13711L4694p8958L8183K1786K88862
9277E351267K1961j17223K98691J71619J80751o0202k34647J82628j36752J25324
9267E783417q3326J4773j4503j94621j74325L77390L8321J13627m6376k83764
9257E530613N1716K1122M0296J60801J64453N6087J0651L21720R2005l1577q9037
$$ y = [2585351, 2687809, 2803081, 2835901, 2908363, 2746804, 2750853, 2978945, 3072094, 2964630, 2870212, 3069319, 3221705, 2901905, 3116373, 3199879, 2901611, 2885069, 3016469, 3184554, 3125096, 3002410, 3045544, 2959834, 3107691, 3059812, 3053006, 3086446, 2790782, 3011706, 3383611, 3374585, 3539240, 3715423, 3686146, 3775903, 4123089, 4278634, 4191831, 4201232, 4187594, 4539695, 4886106, 5311103, 5356861, 5423383, 5171586, 5076931, 4932989, 5046700, 5081394, 5002436, 5040619, 5062405, 5351267, 5373228, 5256005, 5554696, 5726315, 5907066, 5846864, 5612217, 5794845, 5658093, 5783417, 5700091, 5714864, 5700361, 5505740, 5331415, 5708805, 5747126, 5860753, 5814377, 5530613, 5582329, 5603451, 5643747, 5804548, 5969001, 6025088, 6035739, 6357459, 6449464, 6417887, 6328850]
9246F328850j02091J50208L9550L89232J81559L55000L32221L50624M5653K11289
9236H282095L21864Q2502L36546L17455L44132L41972L48354O81464N45877O47937
9226A2250198Q63370J130434J533751J439177J167917J325315J012396L29852
9218B1052410l12813n16114K73417Q4062L50376J01139l76102p87300j427150
9209A8441925j398529j280121j190819q39972n26548o13383k26454l84136n09897
9200A1472066l47678j82283n6229k52368j04500m3486n2806K68733j41074J13281
9190A0673656K5571j1838j524l61034l21694j58208J47289l58485k13079m20933
9180H999721o39039j77407m7367l16349k91325o680J08653j64020j46715J63276
$$ y = [6328850, 6226759, 6376967, 6416517, 6805749, 6987308, 7342308, 7674529, 8025153, 8070806, 8282095, 8603959, 8686461, 9023007, 9340462, 9684594, 10026566, 10374920, 11056384, 11602261, 12250198, 13113568, 14244002, 15777753, 17216930, 18384847, 19710162, 20722558, 21052410, 20739597, 20223483, 20496900, 20580962, 20931338, 21032477, 20656375, 19869075, 18441925, 17043396, 15763275, 14572456, 13732484, 13205936, 12592553, 12366099, 11981963, 11472066, 11124388, 10942105, 10885876, 10633508, 10529008, 10485522, 10432716, 10701449, 10560375, 10673656, 10699227, 10687389, 10685865, 10324831, 10003137, 9844929, 9992218, 9633733, 9420654, 8999721, 8360682, 8183275, 8135908, 7819559, 7528234, 7521554, 7630207, 7466187, 7319472, 7482748]
9170G482748j38632L5192j19671k18993l55659j43857k56653K31453J69586j75603
9160F509911J52250M9222p5700K03914K43528L4772m3951l11831K15286n6995
9150F920406O871K48768J03331m05807J91005J81393l0255J81394L09299K16986
9140G923391Q8956K12441j57936l55107N94754k13499j16337J23607K08720J67442
9130H476432j03162K73744J25687M22455r1771Q2492L67705J27680j37861O7014
9120I610415J08273K22638R7132q5505L30721N14450K05519L57101L58012l02389
9110A1416367R8631N06525K04163L89703M84031K34419K88114L84371K01205K79847
9100A4487376J13398K67554M59279M77633L93122L13072L29648Q68931L92260
$$ y = [7482748, 7344116, 7379308, 7259637, 7040644, 6684985, 6541128, 6284475, 6515928, 6685514, 6509911, 6662161, 6711383, 6635683, 6839597, 7083125, 7117897, 7073946, 6762115, 6977401, 6920406, 6927277, 7176045, 7279376, 6873569, 7064574, 7245967, 7215712, 7397106, 7706405, 7923391, 8012347, 8224788, 8066852, 7711745, 8306499, 8093000, 7976663, 8100270, 8308990, 8476432, 8373270, 8647014, 8772701, 9195156, 9103385, 9185877, 9553582, 9681262, 9543401, 9610415, 9718688, 9941326, 10038458, 9952953, 10283674, 10798124, 11003643, 11360744, 11718756, 11416367, 11514998, 12021523, 12225686, 12615389, 13099420, 13333839, 13621953, 14006324, 14207529, 14487376, 14600774, 14868328, 15327607, 15805240, 16198362, 16511434, 16841082, 17710013, 18102273]
9091A8102273R7665N33843M39117N73709L32261O48929P97133N78177N30904O39868
9081B3273879N49622Q23995J004364R41811R64553O23406O56726J108123Q49377
9072C0795856O28466J122250J053558J272925J015453J288122J220103R96388
9064C9393121J262678J524013J439511J472099J474618J555360J896599J986589
9056E2004588J981725K501506L026417L073794L604922M294641M905083N672801
9048H1065477O870697Q350179R632364J0459970J0932526J0382221Q737846N365467
9040A51796747J025070r56719o28626P77347K982800L149402K831030J074045
9032A62051096k423097o095419p813142p820524o678120n201126m193722l370710
$$ y = [18102273, 18199938, 18733781, 19172898, 19746607, 20078868, 20727797, 21524930, 22103107, 22634011, 23273879, 23823501, 24647496, 25651860, 26593671, 27558224, 28181630, 28838356, 29946479, 30795856, 31424322, 32546572, 33600130, 34873055, 35888508, 37176630, 38396733, 39393121, 40655799, 42179812, 43619323, 45091422, 46566040, 48121400, 50017999, 52004588, 53986313, 56487819, 59514236, 62588030, 66192952, 70487593, 75392676, 81065477, 87936174, 96286353, 105918717, 116378687, 127311213, 137693434, 146431280, 151796747, 152821817, 151865098, 151236472, 152013819, 154996619, 158146021, 160977051, 162051096, 159627999, 153532580, 145719438, 137898914, 131220794, 126019668, 121825946, 118455236]
9024A18455236k888628k303673j613627o88917n48171J02434P22823J139158J671160
9015A14047795K064633L390030L803498M987292O287870P950720J0275006J2512551
9007A65319395J5270063J6591101J7568446J6594410J4222070Q273960J746121
9000B55585566k150053j686829J392436L752670N354687N044057J440688n287470
8992B63445752j2746235j6630123j7294882j5408470j3477294j2373692j1146783
8985A64368273r754209q532763p887885o698145o300850n448461n172038m994285
8977A09579637n019918n168661m363544m062648l339873l209904k906412k285010
8969G9223667k207230j799064j428007r26522p75802n59434n93798j103999r34772
$$ y = [118455236, 115566608, 113262935, 111649308, 110960391, 110412220, 110514654, 111237477, 112376635, 114047795, 116112428, 119502458, 123305956, 128293248, 134581118, 142531838, 152806844, 165319395, 180589458, 197180559, 214749005, 231343415, 245565485, 253839445, 255585566, 253435513, 251748684, 253141120, 256893790, 262248477, 267292534, 268733222, 263445752, 250699517, 234069394, 216774512, 201366042, 187888748, 175515056, 164368273, 154614064, 146081301, 138193416, 131495271, 125194421, 119745960, 114573922, 109579637, 104559719, 99391058, 95027514, 90964866, 87624993, 84415089, 81508677, 79223667, 77016437, 75217373, 73789366, 72862844, 72087042, 71527608, 70933810, 69829811, 68895039]
8960F8895039m49588q50163q79093q33517p50729q46780J03859n4221M59048L93093
8950F5186948N25780J029128L59315M48632J17504J19531Q49098P81367O62939
8941G0080242L14225L06729R20300R80123J430270J921109K320603L001612M228491
8932H5503704M987337N765433O597910O239530O146781M895459J402787k452473
8924A19086468m062346l490284k912594j665807n06620P95473J581012K648042
8916A11473344L665201M948590O249045P224140R056424J0213311J2384314J4782575
8908A79996944J7164895J9638133K1569864K2722108K2115223J8304328J0695665
8901C12207160M69744j0065891j8812124k4864511k6361232k4517016k0827438
$$ y = [68895039, 68445451, 67595288, 66716195, 65882678, 65131949, 64285169, 64389028, 64334807, 64793855, 65186948, 65712728, 66741856, 67101171, 67549803, 67667307, 67786838, 68635936, 69417303, 70080242, 70394467, 70701196, 71621496, 72601619, 74031889, 75952998, 78273601, 81275213, 85503704, 90491041, 96256474, 102854384, 109093914, 115240695, 120136154, 121538941, 119086468, 115024122, 111533838, 108621244, 106955437, 106448817, 107244290, 108825302, 111473344, 115138545, 120087135, 126336180, 133560320, 142616744, 152830055, 165214369, 179996944, 197161839, 216799972, 238369836, 261091944, 283207167, 301511495, 312207160, 312676904, 302611013, 283798889, 258934378, 232573146, 208056130, 187228692]
8894A87228692j7188733j4762764j2284394j0277648q512975p407864o212374
8887A10581940m966725m049516l404343k993998k420570k104480j027894p43244
8879H8871170k30021K40557Q94706J277164J642637K307216L282167M266287N510128
8870A08062011O819923Q266535J0093591J1308524J2340731J1718831J0323707
8863A78933853N839104k23729n880857j1182441j4948129j5755707j4463956j3004363
8855A09313775j0893345r065070p836430o416685n689201m696037m048579l852708
8847E6815720l557824k916869k378438k531415j910725j773797j650129j309831
8839C8786692j355286j353997j562319j222482j042585j151885j214421j052769
$$ y = [187228692, 170039959, 155277195, 142992801, 132715153, 124202178, 116794314, 110581940, 105615215, 101565699, 98161356, 95167358, 92746788, 90642308, 89614414, 88871170, 88641149, 88881706, 89776412, 91053576, 92696213, 95003429, 98285596, 102551883, 108062011, 114881934, 123148469, 133242060, 144550584, 156891315, 168610146, 178933853, 184772957, 184549228, 178668371, 167485930, 152537801, 136782094, 122318138, 109313775, 98420430, 89355360, 81518930, 75102245, 69413044, 64717007, 60668428, 56815720, 53257896, 50341027, 47962589, 45431174, 43520449, 41746652, 40096523, 38786692, 37431406, 36077409, 34515090, 33292608, 32250023, 31098138, 29883717, 28830948]
8831B8830948o90861p96196o37650l46082o02231r08860r35112m72459j09655
8822B3331842k19876l64626k56165j42987k95859j84852k91534m3187J33660j20389
8812B1546027P3384P86689O28306N38057L45011Q51592N40236J30720L11169l7055
8802B5714136k78459j27926L5050r6293m07348q4925l67532o19028j190109j235518
8792B1342048j120135m25532n91819m84736l83j40946k76860j98114K61819K06809
8782A8572151J73920K18091O33461N22069L76089M90201R82624O25776P60996
8773B3355378O44772M57069J086353N30820J54185j52425m90462n49038r23901
8764B4112751p51495m23505n67054j319469q89313j404228j503814q40719j007539
$$ y = [28830948, 28140087, 27343891, 26706241, 26360159, 25757928, 24849068, 23913956, 23441497, 23331842, 23111966, 22747340, 22491175, 22348188, 22052329, 21867477, 21575943, 21532756, 21666416, 21546027, 21619411, 22406100, 23034406, 23572463, 23917474, 24769066, 25309302, 25440022, 25751191, 25714136, 25435677, 25307751, 25342801, 25246508, 24839160, 24754235, 24386703, 23767675, 22577566, 21342048, 20221913, 19796381, 19204562, 18719826, 18719443, 18578497, 18301637, 18103523, 18365342, 18572151, 18746071, 18964162, 19597623, 20119692, 20495781, 20985982, 21968606, 22594382, 23355378, 24000150, 24457219, 25543572, 26074392, 26228577, 26076152, 25585690, 25036652, 24112751, 23361256, 22937751, 22370697, 21051228, 20161915, 18757687, 17253873, 16413154, 15405615]
8755A5405615p96540q37656n60922m65747J479K0953o7824q9620j68067K68512
8745A2710183J74290L03630K1848J62540L66743J06250k79019J72994N3598P0991
8735A3864048l64003n47825k88538k79483n12011m70884q21433o49308p14444
8726I216119n34331m20280q27572l17840k79164k40649j66552j33176k01256l77677
8716E717622k00454o2207l31937k99674R3721k44488j04932K95202j12234l31584
8706D419035j87992j11321j48391k98947J08625j57175J78919j95212k2535P252
8696C592258j96791J39280k56911o6112J33297J3853j68400k23115k72368J22112
8686B817103j39287J11388m4997L50517J60966k71340k6103o8851K63782k0283
$$ y = [15405615, 14609075, 13771419, 13210497, 12744750, 12746229, 12767182, 12699358, 12609738, 12441671, 12710183, 12884473, 13188103, 13209951, 13372491, 13739234, 13845484, 13566465, 13739459, 13793057, 13864048, 13500045, 12952220, 12663682, 12384199, 11872188, 11401304, 10579871, 9930563, 9216119, 8681788, 8261508, 7433936, 7116096, 6836932, 6596283, 6429731, 6296555, 6095299, 5717622, 5517168, 5454961, 5123024, 4823350, 4917071, 4672583, 4567651, 4862853, 4750619, 4419035, 4231043, 4119722, 3971331, 3672384, 3781009, 3623834, 3802753, 3607541, 3585006, 3592258, 3395467, 3534747, 3277836, 3211724, 3345021, 3358874, 3190474, 2967359, 2694991, 2817103, 2677816, 2789204, 2744207, 3094724, 3255690, 2984350, 2958247, 2889396, 3153178, 3132895]
8676C132895N6450J76730k00565k49866j04212J66900J79062Q9743n1296J67709
8666C363550m3325o8768M1767K04506l62066M3748r895j11067j30880j70220K8047
8655B785397J38974j6157J88924j34973R74J40615m9663j75945l82912K07124
8645B702358j9097l92043J23233K43957l05449j77667k7981j3394K77795J82462
8635B594174k11529k07788J19440l2569j32321k0056j4660k6974j6805J75280
8625B226192J4519j78410R8559L28018k04928L10054N68l29796J49682k25938
8615B188520K17772J87788J3354K3312m14703l43360J78922P9200k26240J1376
8605A915941j08200j38574n0173R1010j42618P9819M2348j61465k27365Q4886
$$ y = [3132895, 3189345, 3366075, 3165510, 2915644, 2811432, 2978332, 3157394, 3247137, 3195841, 3363550, 3320225, 3251457, 3293224, 3497730, 3135664, 3179412, 3169517, 3058450, 2927570, 2757350, 2785397, 2924371, 2908214, 3097138, 2962165, 2963139, 3103754, 3054091, 2878146, 2495234, 2702358, 2683261, 2291218, 2414451, 2658408, 2352959, 2175292, 2147311, 2133917, 2411712, 2594174, 2382645, 2174857, 2294297, 2261728, 2129407, 2109351, 2094691, 2067717, 2050912, 2226192, 2240711, 2062301, 2160860, 2488878, 2283950, 2594004, 2594572, 2264776, 2414458, 2188520, 2406292, 2594080, 2607434, 2630746, 2216043, 1872683, 2051605, 2130805, 1904565, 1915941, 1807741, 1669167, 1618994, 1710004, 1567386, 1647205, 1689553, 1528088, 1300723, 1385609]
8595A385609J1342m6709l5401K32867O3567l21900l2116j37827K29017P0654J54801
8584A573904L84618j86021l08599m43685N0341L08623R5060l53229J07709R9666
8574A328387k12564P90N7899Q228l24391K02861r9998J71349J26176j18878j11884
8563A027975m6922L17441J38321J579J47798l26534j86830J53790p9222K9384
8553A176780P9233q9120J3255R8126K42J70022q2239J2811L34922l78742p3102
8542A262188L20895j79190k1511K21543K8778R0916m0525K92240O7490N2221Q594
8531B103639k84522Q4727R8991k03430k33853k18785j13969J42595P1896k30497
8521A216792k97348J13181J31938K08542k74294J7763K06716J33765l64612R289
$$ y = [1385609, 1396951, 1350242, 1314841, 1547708, 1611275, 1289375, 1257259, 1119432, 1348449, 1419103, 1573904, 1958522, 1772501, 1463902, 1020217, 1070558, 1379181, 1474241, 1121012, 1228721, 1328387, 1115823, 1116613, 1174512, 1182740, 858349, 1061210, 961212, 1132561, 1258737, 1139859, 1027975, 981053, 1298494, 1436815, 1438394, 1586192, 1259658, 1072828, 1226618, 1147396, 1176780, 1256013, 1166893, 1180148, 1278274, 1278516, 1448538, 1366299, 1379110, 1714032, 1335290, 1262188, 1583083, 1403893, 1382382, 1603925, 1632703, 1723619, 1683094, 1975334, 2042824, 2095045, 2103639, 1819117, 1903844, 2002835, 1799405, 1565552, 1346767, 1232798, 1375393, 1447289, 1216792, 919444, 1032625, 1164563, 1373105, 1098811, 1116574, 1323290, 1457055, 1092443, 1101732]
8511A101732k27166J188l5882L69199K37528j14642k28334J593j95147J02635
8501A012704R5680K24153J7238J11142L55870j94041Q0600j31771K69364j49997
8491A690942o0148j66578k19848l6119n1177M1133j0188l48218J78519k42206
8481G76112k0518J03435J30523J63524P0842M6513o8988n67428j00521L31912
8471H65406p6581L9090o2697k68966n1259q9550K45647L0057L13979j7456o5181
8460H62489j91362p5001J14133j07125J43828k6783L6594m3878L25040q9339q5884
8449H62712K2768J14859P7989j73219k42265R5574m9747l53383j69277J17660
8439C03671K16061O9860j65519J20308n4294k2520O678o823J25983n0765l66920
$$ y = [1101732, 874566, 875754, 839872, 1209071, 1446599, 1331957, 1103623, 1105216, 910069, 1012704, 1108384, 1332537, 1349775, 1460917, 1816787, 1622746, 1703346, 1571575, 1840939, 1690942, 1630794, 1464216, 1244368, 1208249, 1157072, 1198205, 1188017, 839799, 1018318, 776112, 755594, 859029, 989552, 1153076, 1223918, 1270431, 1201443, 634015, 533494, 865406, 788825, 827915, 765218, 496252, 444993, 355443, 601090, 631147, 945126, 927670, 862489, 671127, 596126, 710259, 603134, 746962, 720179, 756773, 712895, 1037935, 948596, 862712, 885480, 1000339, 1078328, 905109, 662844, 758418, 708671, 355288, 186011, 303671, 519732, 589592, 424073, 544381, 490087, 467567, 474245, 467422, 593405, 542640, 175720]
8428A75720J01510J1315K26616M1234J51520k52238j62621K62553k27713k8704
8418B99192J66700J07286J6241j40447M0881m0446J42988M20930l59482j99731
8408D54112j45023M63813J10737r1039l44270j06968N2677J46166j36382J53761
8398E57584J27470o0149l02932k93482j54063K76368K58910J28663q0918k5471
8388D31980L6477k10875K2745J74038K9511k56988l8163J91167j29863j58967
8378I1062l0163L76248l5974n41605J26413N2272j68473p6220L55927J85201J17512
8367D52200j80180k28267j77384L24781M0234K7900J79960N0672j70118q89j42706
8356A76203J38867k09686k06630K34415K23597l4202J7628l81948P6035K14217
$$ y = [175720, 277230, 288545, 515161, 556395, 707915, 455677, 293056, 555609, 327896, 299192, 465892, 573178, 589419, 448972, 489853, 449407, 592395, 1013325, 653843, 454112, 309089, 772902, 883639, 792600, 448330, 341362, 394039, 540205, 403823, 557584, 685054, 624905, 321973, 28491, -125572, 150796, 409706, 538369, 457451, 431980, 468457, 257582, 280327, 454365, 483876, 226888, 188725, 379892, 250029, 91062, 60899, 437147, 401173, -140432, -14019, 38253, -130220, -206440, 149487, 334688, 452200, 272020, 43753, -133631, 191150, 231384, 259284, 439244, 489916, 319798, 318909, 176203, 315070, 105384, -101246, 133169, 356766, 322564, 340192, -41756, 34279, 248496]
8346B48496o8154K8443J86K14710J93318j99350k11522J70176j59428k1193K03753
8335C99435l13644j14501n4892j72794J83540J90586J67244j56062j15166J42938
8325A56684J54655k2451l057l40697K26346K46290k65267L0455Q693K31228k22776
8314B00103k21715R3598l8001Q862j7736K79627Q3165j23486k06557m8484J86008
8303A95384J70524q4937P8295k17013k88595K46481L24443l9598j37361L104j6256
8292B34471J60185l27745j68464J13460j25773K64731j12981r7119J68057L5566
8282A44388j37458m7150p3584L44136J10049k43171N1490O616k02114K01873q2032
8271G3043k78732L74474j4364K7082K895j35683J33846k02227J70849K88244J12182
$$ y = [248496, 180342, 208785, 208971, 423681, 616999, 417649, 206127, 376303, 216875, 195682, 399435, 85791, -28710, -83602, -256396, -72856, 117730, 284974, 128912, 13746, 156684, 311339, 288888, 285831, -54866, 171480, 417770, 152503, 182958, 191651, 422879, 200103, -21612, 71986, 33985, 42847, 25111, 304738, 387903, 264417, 57860, 9376, 195384, 365908, 280971, 359266, 142253, -146342, 100139, 424582, 384984, 247623, 250727, 234471, 394656, 66911, -101553, 11907, -113866, 150865, 37884, -59235, 108822, 144388, 6930, -40220, -113804, 230332, 340381, 97210, 148700, 155316, -46798, 155075, 73043, -205689, 168785, 154421, 181503, 184398, 48715, 182561, -19666, 151183, 439427, 551609]
8260E51609j20524n41289j377L2990n772n8538k72053K06967J79435k13465j65643
8249d07660L86245J49565L2923k02341O6219J23419J56545j78218k20596K04254
8239A10355J76954j99351o5666K63442J9446o8382j93993k15951j66378Q1285
8229b58239J32136L1264R0163K30638l45957K03279o8952j63098k80320j50523
8219e79609M15545J3372K08498Q9069l41826m1911J21244r8018J49158K12552
8209A48074j97270J56687J3577n2344j30730J27756j31384L44651l5337k40192
8199C488l02100L05943J72265M4018l18362l11171j202262q35235K304708K64830
8189A26122o1102J30029J39853N7070m457k3793K1981K2849j82081q7713k5689
$$ y = [551609, 431085, -110204, -111581, -78591, -84363, -142901, -414954, -207987, -28552, -242017, -407660, -21415, 128150, 161073, -41268, 24951, 148370, 304915, 126697, -93899, 110355, 287309, 87958, 22292, 285734, 305180, 236798, 42805, -173146, -339524, -258239, -126103, -94839, -4676, 225962, -119995, 83284, 14332, -148766, -429086, -579609, -164064, -150692, 57806, 146875, -194951, -236862, -115618, -213636, -64478, 148074, -49196, 107491, 121068, 68724, -62006, 65750, -65634, 279017, 243680, 3488, -298612, 7331, 179596, 223614, -94748, -405919, -1608181, -2443416, -138708, 126122, 65020, 195049, 334902, 391972, 387515, 363722, 385703, 408552, 226471, 138758, 113069]
8178A13069n326R60j45807L1813J57329J39416j70585k66519k61055J47809K34916
8167b3980k63205J14280k50610J29161J76775J98390J38265k82781L9812J45934
8157A22041Q0800j33017j05416K4692p9082L36547K60843j25536N5618J45942
8147E83432k60131j11331p5401j30023K49917j0276l90561n5358r2539K56889
8137c5382J68725m5281p5097J9676J1220k08896j6826o574J38465P6136j52143
8126a25977J01572N2891L3113q0421n5587N8869J70792r328K3328l60116p6022
8115b66886k8895K11770n3479k1656J67293j22356j31278K27268J09271l02631
8105b11579j27554R8680L13978l59878j89007K23678J38444J20319K08591j97805
$$ y = [113069, 107743, 108703, -37104, -5291, 152038, 291454, 120869, -145650, -406705, -258896, -23980, -287185, -172905, -423515, -294354, -117579, 80811, 219076, -63705, -23893, 122041, 202841, 69824, -35592, -10900, -89982, 246565, 507408, 381872, 437490, 583432, 323301, 211970, 136569, 6546, 256463, 246187, -144374, -199732, -292271, -35382, 133343, 88062, 12965, 32641, 43861, -165035, -181861, -188435, -49970, 26166, -125977, -24405, 28486, 61599, -18822, -74409, -15540, 155252, 145924, 169252, -190864, -266886, -295781, -84011, -137490, -159146, 8147, -114209, -245487, -18219, 91052, -211579, -339133, -240453, 73525, -286353, -475360, -251682, -113238, 7081, 215672, 17867]
8095A7867k66763J53767m1498l0638q5851j06854P6141J94607L2057O2267J91520
8084A96622k01147P820L3916R4338J24444l00346l02556O98506k23739j33231
8074e373o4021L57517n8801n7136k11195k4938K66954k87313j35241K56581l0462
8063F572K84789P6683k67943k86361Q944k30692N8521N9737l06321K15639L00424
8052h0008n7482M249J34639k7195Q494j84811j47721r1621N2169K75581J83709
8041G0003L12206j7935k70838m6529j53703J06403r229j6236j02809j79553j08673
8030d16893N00550L53603k68028l76699J03766M7573P8361j41133M3110K08216
8020A32426j69716J29683K11147k74867j50627M6077k78443R509J43731j39643
$$ y = [17867, -248896, -95129, -136627, -167265, -253116, -359970, -283829, -89222, -57165, 5102, 196622, -4525, 3295, 37211, 131549, 255993, -44353, -346909, 351597, 127858, -5373, -69394, 288123, 229322, 172186, -39009, -63947, 203007, -84306, -219547, 37034, 6572, 291361, 368044, 100101, -186260, -177316, -408008, -349487, -289750, -596071, -380432, -80008, -137490, -133241, 1398, -25797, -17303, -202114, -349835, -441456, -389287, -113706, 70003, 382209, 364274, 93436, 46907, -106796, -393, -9622, -25858, -128667, -308220, -416893, 83657, 437260, 169232, -207467, -103701, -56128, 22233, -118900, -75790, 132426, -37290, 92393, 303540, 28673, -121954, -75877, -354320, -344811, -201080, -340723]
8010c40723J31041J11787j48754n5040K45259j68066J4184J34750m9804J34803
8000I437k30199p5170J60132j77589O2871k7279J90432L6854r0256k05060R6935
7989b48892k60096J70040j73468P0008K34575L3765J32428M7957J03932N4114
7979A64363k20349j21205J31450K97350j51717n8828q5302j84416K31549r7923
7969i5028J89163J19369j57265J13520l4935J0488n9946M2525J8670j88660k6451
7958f8550O0700j04296K62625j38755l07864K84412J57836J92512l6938k57125
7948D4557q6882l1473j59079J0820P7958K18023J07163O9462l51692k17102j08624
7937d26869P9337L63454l30019K43771R485k73079M38340l87947j11132J33709
$$ y = [-340723, -209682, -97895, -246649, -301689, -56430, -224496, -210312, -75562, -125366, 9437, -220762, -295932, -135800, -313389, -250518, -277797, -87365, -50511, -140767, -345827, -248892, -508988, -338948, -512416, -442408, -207833, -174068, -41640, 6317, 110249, 164363, -55986, -177191, -45741, 251609, 99892, 41064, -44238, -228654, 2895, -95028, 94135, 213504, 56239, 169759, 134824, 145312, 85366, 127891, 146561, -42099, -68550, -7850, -112146, 150479, 11724, -296140, -11728, 146108, 338620, 301682, 44557, -42325, -73798, -232877, -222057, -144099, 73924, 181087, 250549, -101143, -318245, -426869, -347532, 15922, -314097, -70326, -60841, -333920, 104420, -283527, -394659, -260950]
7927b60950k4507p7564L79164K04989l38731P9168K4296k60846J02572j66991
7917c39400K44857j23011p795j34361J83865N237k2540o6035N7038P2145m4985
7906a74985J59303J09601R048j58842J65906n6959r3712L3778M4015k21435k10880
7895c95162j823k12023K18400J90559K18500l31197P943K9939K36998J48379k80592
7884a70079n5819K72395j7792L9342J20686K63j8508k64784j48562J18692J01808
7873b2358K0111J48726k09391L9202q5308j27665j05346N83367L2313j98100P9030
7862A54581j2014k0831l58613Q197M55163r518j07990J30479j94533m0991K06024
7851B09954r8520j05068o3872n597M99j14141P8836J51551J49435k83831m45788
$$ y = [-260950, -285457, -363021, 16143, 221132, -117599, -38431, -14135, -274981, -172409, -339400, -94543, -217554, -225349, -359710, -175845, -170608, -193148, -259183, -202145, -130000, -174985, -15682, 93919, 102967, -55875, 110031, 53072, -40640, -6862, 37153, -184282, -395162, -396985, -609008, -390608, -200049, 18451, -312746, -304803, -274864, -37866, 110513, -170079, -225898, 46497, 28705, 68047, 188733, 188996, 170488, -94296, -242858, -124166, -22358, -2247, 146479, -62912, -23710, -109018, -236683, -342029, 241338, 273651, 75551, 154581, 142567, 121736, -236877, -228680, 226483, 216965, 108975, 239454, 44921, 3930, 209954, 111434, 6366, -57506, -63103, -62604, -176745, -97909, 53642, 203077, -80754, -526542]
7840e26542L22795k08140R6177o2196J07497p6681L53651j05121j06721O8793
7830a36488R2759j1869P8449K704k84276K05238M8778N2330P6092K44792k25240
7819A43269r0502J0707j55404o0516N1702p5046P301J24784j83641K04858J30504
7808A08016j12656P7383k1968j13820P0050r1178l6928l99262M63307N18886k87850
7797A73980J748j99135j71227R3018K42452j24203K23276J6704l21920L73188
7787C07881m6737k41239J6261j23794J66479j24438j954R2139j37281J38506J04777
7776A50600o1980j45414j05989q9760J01018K27782m19532J38789J31698j44802
7766b17590l14072j42408J69302L24155M7069L14575k69241M5678J31850m3359
$$ y = [-526542, -203747, -411887, -315710, -377906, -270409, -347090, 6561, -98560, -205281, -136488, -43729, -55598, 22851, 25555, -258721, -53483, -4705, 47625, 123717, 368509, 143269, 52767, 63474, -91930, -152446, -100744, -175790, -168489, -43705, -227346, -22488, 108016, -4640, 72743, 50775, -63045, 7005, -84173, -121101, -520363, -57056, 461830, 173980, 175728, -23407, -194634, -101616, 140836, 16633, 239909, 256613, -65307, 307881, 261144, 19905, 36166, -87628, 78851, -45587, -47541, 44598, -92683, 45823, 150600, 88620, -56794, -162783, -252543, -151525, 76257, -343275, -204486, -72788, -217590, -531662, -674070, -504768, -180613, -133544, 181031, -88210, -42532, 89318, 45959]
7756D5959K14035l53052p9841m0317K37136k1244J35514k8745n77101M45011R66
7745b1679J01261r94k20978Q8483J7277j452l45168J0491J68268K23822N7236
7734G6567R4959o6600k54160J31012L13417K3625j95628j24524k72825J87086
7724h7071M9810p9977q1289r4579J0770k09223J73284L11L1977R3129P5648j52186
7712b69396j51682J65616K69930n0185Q9154j44017j11472N7079k05473q577J95846
7701a63177N8231J56552l85199j17798L37883J27606O1626l41051j18908L29293
7691e4942j39027K35848N6609j22247M1184q2937M25j80354k30066K59551q355
7680b24311J29733j87906m5409J87822k05010J92442m362M8234j9304Q8960J60519
$$ y = [45959, 259994, -93058, -172899, -213216, 23920, 2676, 138190, 109445, -467656, -22645, -21679, 79582, 78588, -142390, -53907, -36630, -38082, -383250, -372759, -204491, 19331, 76567, 171526, 104926, -149234, -18222, 295195, 318820, 123192, -1332, -274157, -87071, -37261, -117238, -198527, -293106, -282336, -491559, -318275, -317964, -285987, -192858, -117210, -269396, -421078, -255462, 14468, -35717, 53437, -90580, -202052, -144973, -350446, -359023, -163177, -104946, 51606, -333593, -451391, -113508, 14098, 75724, -265327, -384235, -54942, -193969, 41879, 98488, -23759, 17425, -65512, -65087, -245441, -475507, -215956, -224311, -94578, -282484, -327893, -140071, -345081, -152639, -157001, -108767, -128071, -39111, 121408]
7669A21408j7368j5001j61379j72710J58210k17966J38539O151l8994l31544k2215
7658e52869N6470J32106L9540L17895q780l8067L25322R0359j22282q0801k15342
7647e6449l3670R9723k18212J34893J452P3884n1338k10919j67215K05427K32651
7636A0227J98016J70840P2707m14447K01156p2109m9533P9073m14836j03389j0085
7625c32380K43396J06181O8669j41813K7824J3197N197n5290K12604n4665M2774
7614A35694K9000k11222l6359j88385m0539M86751k9391k15613P5884j29941j64726
7603b88847r9200J73134l0317L417J97840K43588j22138J42807k1958p5312m6880
7592G6134J1812j81872R3708m6726P1418j80555p260J02127k20629J91121J04052
$$ y = [121408, 104040, 89039, -72340, -245050, -86840, -304806, -166267, -160116, -199110, -530654, -552869, -496399, -364293, -324753, -6858, -15638, -53705, 271617, 361976, 239694, 158893, -56449, -90119, 9604, -208608, -73715, -72263, 1621, -49717, -260636, -427851, -222424, 10227, 208243, 379083, 451790, 37343, 238499, 166390, 116857, 195930, -218906, -322295, -332380, -88984, 17197, 85866, -55947, -28123, -14926, -9729, -65019, 147585, 92920, 135694, 164694, -46528, -82887, -271272, -311811, 174940, 145549, -70064, 5820, -124121, -288847, -388047, -214913, -245230, -241813, -43973, 199615, 77477, 220284, 198326, 123014, 76134, 87946, -93926, -218, -46944, 24474, -156081, -163341, -61214, -281843, -90722, 13330]
7581A3330k66748m3379L79808L74845J3798l27561k7507l37891N5877J38823R3373
7570F6768L00761j90219n2501j04396N099J51749K5711L3178j93364j28452n4822
7559a40488q2225M02310j66207m3126k94120j48436J68613J35292J61071r6693
7549a04009J27421l6969j493k03864J81902j5650J85619n0178k07302j33246J9222
7538b38547k41472k5347M77817J08732k50502q4577j28190J83031K84022o1600
7528B3367j551j6920k40269J96182Q4772J1149r1809J54258l31886k6999J04318
7517a35388J09123L0890j78851L18840P1402k69152k1347J050j92988K9789k4149
7506b60781J92616n0812r1333j9296j0160M379J15973J11906K10912l80184k49862
$$ y = [13330, -253418, -296797, 83011, 457856, 471654, 144093, 116586, -221305, -165428, -26605, 66768, 367529, 177310, 124809, 20413, 25512, 177261, 202972, 236150, 42786, -85666, -140488, -222713, 179597, 13390, -29736, -323856, -472292, -303679, -168387, -7316, -104009, 23412, -13557, -15050, -218914, -37012, -52662, 132957, 82779, -124523, -257769, -238547, -480019, -505366, -27549, 81183, -169319, -253896, -382086, -199055, 84967, 23367, 21816, 4896, -235373, -39191, 45581, 56730, -35079, 119179, -212707, -239706, -135388, -26265, 4625, -174226, 144614, 216016, -53136, -74483, -73433, -266421, -236632, -260781, -68165, -118977, -210310, -229606, -239766, -235387, -119414, -7508, 203404, -176780, -426642]
7495d26642m8249L42933j4494r497j2624p440j0353n0670O6000j08579n0555j02876
7483d33046K14072J73282k12819J29159O8867K04916j55616J65077j18769l99310
7473c64187R094Q4359L209J37212K00407O9206N4028l54219j1314K86786M7505
7462A62086j22318J49111n9353J73066j971j61687k61029j90211N6552R8736N12834
7451C55816l4687j0454j56841l90041J77618L54276k22109l2916m44010J3504
7441c89844N17776R0391l15806Q1652M2337m2674p0327J9545K09618m06881J22027
7430a42186J45776P4604n6764J39597k16830j07634L083Q5268n8954l8063k4472
7419a96575J73607j34133J80464J38723L8506q6909j95623J23744O3595j1313
$$ y = [-426642, -474891, -131958, -146452, -155949, -168573, -176013, -186366, -237036, -171036, -279615, -330170, -433046, -218974, -45692, -258511, -129352, -60485, 144431, -11185, 153892, 35123, -364187, -355093, -270734, -267525, -130313, 70094, 139300, 193328, -160891, -172205, 114581, 162086, 39768, 188879, 129526, 302592, 300621, 138934, -122095, -312306, -255754, -157018, 355816, 321129, 310675, 153834, -236207, -58589, 295687, 73578, 40662, -403348, -389844, 127932, 218323, -97483, -15831, 26506, -16168, -86495, -66950, 142668, -264213, -142186, 3590, 78194, 21430, 161027, -55803, -163437, -160354, -75086, -134040, -172103, -196575, -22968, -157101, 23363, 162086, 200592, 113683, -81940, 41804, 105399, 94086]
7409I4086r833k35631J74571J39389j43479j0385j48976j18298Q4216J26209k24994
7398b73125K584K16448J10013L29978l660p50585J97786J5955k53692L01713J31485
7387B4900J32305j77075j3504r5068r5095K29373M3983j95541q9927L61534J1386
7376A37271j92339q7410j62443J8722K51595l1882l06360J58423K79088L6289
7366A00954n89795J70910L37958P1209j34277K66205N6834l24882J89024o6002
7356G8138r1257l26732J59675K08124m2218L95223k13323m5639N6678k24323J08250
7345F2596K8189l58960p5645N06988L42319J60039k60012m13457j22540J27847
7335b636j6278j19617k21850M536J92292K28628j41089O5877k9785p1323j27635
$$ y = [94086, 84253, -151378, 23193, 162582, 19103, 8718, -140258, -258556, -174340, -48131, -273125, -270541, -54093, 55920, 385898, 382238, -368347, -170561, -154606, -408298, -106585, 24900, 157205, -19870, -33374, -128442, -223537, 5836, 49819, -145722, -235649, 125885, 137271, -55068, -142478, -304921, -286199, -34604, -66486, -372846, -214423, 64665, 100954, -488841, -317931, 20027, 91236, -43041, 223164, 279998, -44884, 144140, 78138, -13119, -339851, -180176, 27948, -14270, 380953, 167630, 121991, 178669, -45654, 62596, 90785, -268175, -343820, 163168, 505487, 665526, 405514, -7943, -130483, -2636, -18914, -138531, -360381, -355845, -163553, 65075, -76014, -10137, -39922, -111245, -238880]
7324b38880N601k87571L9528J94173J9232o1949K74314N4128n8459J64749k43112
7313a38246j53998l29871K78851K96519m4444M2516r286M7929P4462m29130p3296
7302d37994L84697m6944j09084j66119L46580P8100l42023J52610O6988J1042
7292f2147l30837R5884N5248j92487J62481l7417p5627j53855O4227K09731J33144
7281a31655Q2924O9935K40380k2409k28460J54578j35170Q0767j54042l32098
7271c75250j22n1478J11873J73821k9931j64743K15266k31406j87197O15782P6542
7260A53157o3306j16680J29093p9031q1648N4967j39660J8568m2425o8371J93836
7249d1500j31453j30240N9001j55077n5607K05669j12932R8714J44951k1324O8510
$$ y = [-238880, -233279, -520850, -481322, -287149, -267917, -329866, -55552, -1424, -59883, 104866, -138246, -292244, -622115, -343264, -46745, -91189, -48673, -57959, -10030, 64432, -364698, -437994, -53297, -100241, -209325, -375444, -28864, 49236, -292787, -140177, -73189, -62147, -392984, -297100, -241852, -434339, -271858, -309275, -384902, -538757, -474530, -264799, -131655, -48731, 21204, 261584, 239175, 10715, 165293, 30123, 110890, -43152, -375250, -375372, -426850, -314977, -141156, -171087, -335830, -120564, -351970, -539167, 76615, 153157, 89851, -26829, 102264, 23233, -58415, -3448, -143108, -124540, -166965, -235336, -41500, -172953, -303193, -244192, -399269, -454876, -249207, -362139, -263425, -118474, -139798, -71288]
7238g1288K18782K62331j11946j48561j91155j09504j53318m83176K28040Q8474
7228d71321N3627K91254r0564J72207k68228r1744J66772M6278L5198j60295M3615
7217b73201j11563l7675K56148j31786K19717j7584m1306p4227p6173k6657L8439
7206b75868l02964L61348L09841k60996O178J03916j43268J83345J75008j44272
7196A2268j58535l1725K1116k9449J13594j10628n5056J48133l8716Q3164k69297
7185c15131K98141j9390P261k22599M6598o1400k9005N2453J35434P071p3963
7174a74530o139l3599m2175n3911K18446n2578J32547P4179K4854k08135n740
7163a26781r0324k36145K26377J74037P3167P3628k33063J73353l1185p7366j3276
$$ y = [-71288, 147494, 409825, 297879, 149318, -41837, -151341, -304659, -787835, -559795, -471321, -417694, -126440, -217004, -44797, -313025, -404769, -237997, -191719, -156521, -316816, -273201, -384764, -422439, -166291, -298077, -78360, -95944, -137250, -211477, -287650, -314307, -275868, -578832, -217484, 92357, -168639, -162461, -58545, -201813, -18468, 156540, 12268, -146267, -177992, -156876, -186325, -72731, -183359, -238415, -90282, -128998, -45834, -315131, -16990, -36380, -29119, -251718, -205120, -266520, -295525, -243072, -107638, -100567, -174530, -180669, -214268, -256443, -310354, -91908, -144486, -11939, 62240, 87094, -121041, -126781, -217105, -453250, -226873, -52836, 20331, 93959, -139104, 34249, 3064, -74302, -87578]
7152h7578o6494J63521K38179L1470k66614j64586K1296O86J31495o8428j89170
7141b56223k62149L76263P9814j10079Q3922M2452k4409j14466Q3469J6306j81589
7130b66689o8022M95899K10559l76389o1472j78202O5904J36509R7828k95419
7120b39494k06831R8312M87217K20251k68968L7261l50980l42198M13463K2461
7110a29506J50458r8305j13618K6451P6376L9379K22263K99625k85669j49012
7100C8442k14906Q6723q4619r1019J5677l288J35944j23495J27960j31083k11856
7089d55520J65445P395J38459p4374J61647O9640K1748O09j4586J21049P8011
7078B19523j02878n2089J18054k16945P397j56742j5334J74706N94p797M6833
$$ y = [-87578, -154072, 9449, 247628, 279098, 12484, -152102, -130806, -130120, 1375, -67053, -256223, -518372, -142109, -62295, -172374, -88452, -46000, -70409, -184875, -101406, -85100, -266689, -334711, 161188, 371747, -4642, -66114, -244316, -178412, -41903, 55925, -239494, -446325, -348013, 139204, 359455, 90487, 127748, -223232, -565430, -151967, -129506, 20952, -77353, -190971, -164520, -88144, -48765, 173498, 473123, 187454, 38442, -176464, -89741, -174360, -265379, -249702, -252990, -117046, -240541, -112581, -243664, -455520, -290075, -282680, -144221, -218595, -56948, 12692, 34440, 35049, 20463, 141512, 219523, 116645, 64556, 182610, -34335, -26938, -183680, -199014, -24308, -23714, -31511, 15322]
7067A5322j83268j01170O0695j00739M4554L74949J9386k69311j29810J41911
7057a27481K18940k4179j42489L16314q043j20639j93165J7457j87867L19394
7047F8242O4070l43755J43823J7674p7720l2121L09462l77158p1961J98659J52646
7036E1861P2067n0797j14070Q2113j15876l66122J69438m4745q613J97845M7228
7025g9671r3991N1115L17612o9998J04487n965j54091k92656j72590L11717L91608
7014C07577k41668k12561k27605q9595J02585L71422L3369l07876L2277L16984
7004H4909k04653J70348j82326j49763K50526O766j88765L16906j82615N6024
6994b2643K87857P503k38100j03599j28449J28524J38757J71771P9307k41424
$$ y = [15322, -167946, -269116, -208421, -309160, -264606, 110343, 129729, -139582, -269392, -127481, 91459, 67280, -75209, 241105, 233062, 112423, -80742, -63285, -251152, 68242, 132312, -211443, -67620, -49946, -127666, -159787, 149675, -227483, -299444, -100785, 51861, 123928, 73131, -40939, 41174, -74702, -440824, -271386, -316131, -324744, -126899, -79671, -173662, -122547, 195065, 125067, 229554, 223589, 69498, -223158, -395748, -84031, 307577, 65909, -146652, -374257, -463852, -361267, 10155, 43524, -264352, -232075, 84909, -119744, 50604, -131722, -281485, -30959, -24193, -212958, 103948, -78667, -22643, 265214, 272717, 34617, -68982, -197431, -68907, 69850, 241621, 320928, 79504]
6984G9504n46997j23916M07175J13175R398K10247J83738m00815M0908j00961
6974a28544K7540k29864K02703j05024L47943k77613j15958M28J75762L82222
6964B79595j00842j98112k04429L19688K76644o8543m19599r2309J24805M5861
6954c7241j90020J02531J74187l7112K93045q4719J68464Q8300n78666k01826
6944c03057L39453K00763q2563M4766O0061J95376K6325m697Q7573J19381M7087
6933G30468J39566j61856k54225l20177P3337J25458n8309k67107K2527J84914
6923B14596j28432j39015j56526J28552j65214K85107L4696k73995q7147P8060
6913b09318K8961K63141n7131p4779k97109K01331j59995J11840j1013K12087
$$ y = [79504, -467493, -591409, -184234, -71059, -61661, 148586, 332324, -68491, -27583, -128544, -101004, -330868, -128165, -233189, 114754, -162859, -278817, -278389, -102627, 279595, 178753, -19359, -223788, 95900, 372544, 304001, -115598, -207907, -83102, -37241, -227261, -124730, 49457, 12345, 305390, 220671, 389135, 477435, -101231, -303057, 36396, 237159, 154596, 199362, 259423, 454799, 481124, 476427, 564000, 683381, 730468, 870034, 708178, 453953, 133776, 207113, 332571, 274262, 7155, 29682, 214596, 86164, -52851, -209377, -80825, -246039, 39068, 73764, -200231, -287378, -209318, -180357, 82784, 25653, -49126, -346235, -144904, -304899, -193059, -204072, 8015]
6903H015J93750j22443J35265L0018l57356p0648J76302l66909J91653K02205
6893A9852p1736k8879K83459j13780o3122k63350o269O9155l7587j31350L15517
6882b8090L56060l48910k2870J45932k53791J58912N9194j87700o8033L0087K92254
6871A33045n7389j09025N8998p4751R9179j88443k09036p2690K09289j21434K1111
6860c11146K7624J04632L97379k54196J0944N3697k49252j23468J96668M37339
6850B90221j65427j36990j41548j87542J31576K93068k55378j14570n1022L56
6840c37256j09646m5305Q4321J97468J23956Q3015J90798m18824P9991p2210J09550
6829a14142J00494P1955p3732k69317l8796o2893K47780J06389J72726J34089
$$ y = [8015, 201765, 79322, 214587, 244605, -112751, -183399, -7097, -374006, -182353, 19852, -51884, -80763, 202696, 88916, 25794, -237556, -243825, -174670, -212257, -343607, -28090, 327970, -20940, -43810, 102122, -151669, 7243, 66437, -121263, -189296, -159209, 133045, 75656, -33369, 25629, -49122, 50057, -138386, -347422, -420112, -210823, -332257, -311146, -283522, -178890, 218489, -35707, -24763, 28934, -220318, -343786, -147118, 290221, 124794, -12196, -153744, -341286, -209710, 83358, -172020, -286590, -337612, -337256, -446902, -492207, -407886, -210418, -86462, -3447, 187351, -231473, -151482, -223692, -114142, -13648, 58307, -15425, -284742, -323538, -386431, -138651, -32262, 140464, 274553]
6819B74553M3243l3448k07866j7428j7868j61153n6198p9697J9931R1316J76149
6808C1534k65345J8528N4794m9329R4341k95883J15097K00203L9972K3540J43063
6797A10515k2210j18752m94220J71456q2555K17960o8914O5983N3727k3068O4684
6786a25394K35061j41542k12690l7579K6718L36757k61983J7177q4904J7997K16956
6775a3426n5664K4041m1188R041q070L83273j71834p00653K03348j56819J01748
6764d26203q5414L02757M2500j13386k62570K36679L23309m10128j9958j78948
6754e91362Q8061R222K13061Q6426J9736k55145N4417J30538j32513R1773j60259
6743d46045L28582k82947j3451R7794J49538J25334q4174J48424l30835J5087
$$ y = [274553, 317796, 284348, 76482, 59054, 41186, -119967, -176165, -255862, -235931, -144615, 31534, -233811, -215283, -160489, -209818, -115477, -411360, -296263, -96060, -56088, -32548, 110515, 88305, -30447, -524667, -353211, -435766, -217806, -286720, -220737, -167010, -190078, -125394, 109667, -31875, -244565, -282144, -255426, 81331, -180652, -163475, -248379, -230382, -13426, -69090, -45049, -86237, -77196, -85266, 298007, 126173, -574480, -371132, -527951, -426203, -511617, -208860, -166360, -279746, -542316, -305637, 17672, -392456, -412414, -591362, -503301, -494079, -281018, -194592, -174856, -430001, -375584, -245046, -377559, -285786, -446045, -117463, -400410, -413861, -316067, -166529, -41195, -125369, 23055, -307780, -292693]
6733b92693O8196r5457Q7083O9637K17248j11848L0292m22282J20970L92795J23278
6722A87219n6395k50608L0837Q1619j81938j86907J99307q7906N9620q5940j1375
6711c02467J82246r7619j47942O9189j43010J55724L71928j30207q5487L2472
6701i5173J28959M6170k86777J39728j06052m4640K3360J08621K30293m316r2194
6690D7979l16396P7520K71734j33185l19676J18154O1288K22854K43729k68659
6680E342n6597P2513k7155P5427N7675j37105l30257M00857j12073m06902J24436
6669c33839J43882L9478n5805m1487j33498R636M44129m6305j84192N1367O8540
6658c8094r215j11890M886R0117O6354o981L9768k35487l0929n092J23651o1706
$$ y = [-292693, -224497, -319954, -232871, -163234, 54014, -57834, -27542, -449824, -328854, 63941, 187219, 130824, -119784, -88947, -7328, -189266, -376173, -176866, -264772, -205152, -291092, -302467, -120221, -217840, -365782, -296593, -439603, -283879, 88049, -42158, -127645, -95173, 33786, 79956, -206821, -67093, -173145, -217785, -194425, -85804, 144489, 140173, 47979, -268417, -190897, 80837, -52348, -372024, -253870, -192582, 30272, 274001, 5342, -51255, 21258, -5897, 69530, 127205, -9900, -340157, 60700, -51373, -458275, -333839, -189957, -150479, -206284, -247771, -381269, -371633, 72496, 26191, -158001, -106634, -38094, -47309, -159199, -154313, -64196, 2158, -4823, 34945, -200542, -231471, -236563, -112912, -174618]
6646a74618K98843j46080M3011J8521j95301M7002J65589k05410q4247j123j82163
6635d15976P4849N1175L40880J35441k48322l5534o2768l32462M56796L34156
6625B98235L1560n408k60429l14177J01627n8299l5863j7443j22501M43375k307
6614E8370k00912Q5720l18056j07116K33326J25325R2246j99133P7850j956k0927
6603a75263r3812j39360K46001j01292j90079J13854K38266K4973k76488J80354
$$ y = [-174618, 124225, -21855, 21156, 39677, -155624, -108622, 56967, -148443, -232690, -233813, -415976, -341127, -289952, 50928, 186369, -61953, -97487, -160255, -492717, -35921, 298235, 329795, 324387, 63958, -250219, -148592, -206891, -242754, -260197, -382698, 60677, 58370, -142542, -56822, -374878, -481994, -248668, -123343, -31097, -230230, -152380, -154336, -175263, -269075, -408435, -162434, -263726, -453805, -339951, -101685, -76712, -353200, -172846]
$$ [...]
##END NTUPLES=NMR SPECTRUM
##END=
