##TITLE=1H_CA-9238-2
 CDCl3
 8 sc, 
 8.2.2024
##JCAMPDX= 6.0         $$ Bruker NMR JCAMP-DX V2.0
##DATA TYPE= NMR SPECTRUM
##DATA CLASS= NTUPLES
##ORIGIN= UXNMR, Bruker Analytische Messtechnik GmbH
##OWNER= root
$$ XWIN-NMR		Version 3.5
$$ Thu Feb  8 13:55:20 2024 Russian Standard Time (UT+4h)  she@DPX200
##.OBSERVE FREQUENCY= 200.1313
##.OBSERVE NUCLEUS= ^1H
##.ACQUISITION MODE= SIMULTANEOUS
##.ACQUISITION SCHEME= undefined
##.AVERAGES= 8
##.DIGITISER RES= 18
##SPECTROMETER/DATA SYSTEM= spect
##.PULSE SEQUENCE= zg30
##.SOLVENT NAME= CDCl3
##.SHIFT REFERENCE= (INTERNAL, CDCl3, 0, 15.5772)
##AUDIT TRAIL= $$ (NUMBER, WHEN, WHO, WHERE, WHAT)
$$ ##TITLE= Audit trail, XWIN-NMR		Version 3.5
$$ ##JCAMPDX= 5.01
$$ ##ORIGIN= Bruker BioSpin GmbH
$$ ##OWNER= she
$$ F:/spectra/data/she/nmr/H-F/1/pdata/1/auditp.txt
$$ ##AUDIT TRAIL=  $$ (NUMBER, WHEN, WHO, WHERE, WHAT)
(   1,<2024-02-08 13:54:17.37 +0400>,<she>,<DPX200>,
      <created by zg, POWCHK disabled, PULCHK disabled
       configuration hash MD5:
       00 E9 B6 7A A2 85 ED C7 34 08 36 98 17 FE 4E 26
       data hash MD5: 16K
       C8 AD 9C 15 54 A1 D1 FB B4 B5 9D 82 F3 F7 54 5F>)
(   2,<2024-02-08 13:54:20.07 +0400>,<she>,<DPX200>,
      <Start of raw data processing
       efp BC_mod = 2 LB = 0.24 FT_mod = 6 PKNL = 1 PHC0 = -24593.38 PHC1 = 11.05268 SI = 16K 
       data hash MD5: 16K
       F6 6E F4 98 51 B7 D8 9E F4 5D 6B BC 39 4E D1 B8>)
$$ ##END=
$$ 
$$ hash MD5
$$ FD 95 29 9F 8A 47 9E 4E AD 39 B9 02 3B F4 10 2C
##$RELAX= 
##$RELAX= 
##$RELAX= 
##$RELAX= 
##$RELAX= 
##$RELAX= 
$$ Bruker specific parameters
$$ --------------------------
##$DU= <F:/spectra>
##$EXPNO= 1
##$NAME= <H-F>
##$PROCNO= 1
##$TYPE= <nmr>
##$USER= <she>
##$AMP= (0..31)
100 100 100 100 100 100 100 100 100 100 100 100 100 100 100 100 100 100 
100 100 100 100 100 100 100 100 100 100 100 100 100 100 
##$AQSEQ= 0
##$AQ_mod= 1
##$AUNM= <au_zg>
##$AUTOPOS= <>
##$BF1= 200.13
##$BF2= 200.13
##$BF3= 200.13
##$BF4= 200.13
##$BF5= 200.13
##$BF6= 200.13
##$BF7= 200.13
##$BF8= 200.13
##$BYTORDA= 1
##$CFDGTYP= 0
##$CFRGTYP= 5
##$CHEMSTR= <none>
##$CNST= (0..31)
1 1 145 1 1 1 1 1 1 1 1 1 1 1 1 1 1 1 1 1 1 1 1 1 1 1 1 1 1 1 1 1 
##$CPDPRG= <>
##$CPDPRG1= <>
##$CPDPRG2= <>
##$CPDPRG3= <>
##$CPDPRG4= <mlev>
##$CPDPRG5= <mlev>
##$CPDPRG6= <mlev>
##$CPDPRG7= <mlev>
##$CPDPRG8= <mlev>
##$CPDPRGB= <>
##$CPDPRGT= <>
##$D= (0..31)
0 1.2 0 0 0 0 0 0 0 0.06 0 0.03 0 0 0 0 0.0002 0 0 0 0 0 0 0 0 0 0 0 0 
0 0 0 
##$DATE= 1707386056
##$DBL= (0..7)
120 120 120 120 120 120 120 120 
##$DBP= (0..7)
150 150 150 150 150 150 150 150 
##$DBP07= 0
##$DBPNAM0= <>
##$DBPNAM1= <>
##$DBPNAM2= <>
##$DBPNAM3= <>
##$DBPNAM4= <>
##$DBPNAM5= <>
##$DBPNAM6= <>
##$DBPNAM7= <>
##$DBPOAL= (0..7)
0.5 0.5 0.5 0.5 0.5 0.5 0.5 0.5 
##$DBPOFFS= (0..7)
0 0 0 0 0 0 0 0 
##$DE= 6
##$DECBNUC= <off>
##$DECIM= 32
##$DECNUC= <off>
##$DECSTAT= 4
##$DIGMOD= 1
##$DIGTYP= 9
##$DL= (0..7)
0 120 120 120 120 120 120 120 
##$DP= (0..7)
150 150 150 150 150 150 150 150 
##$DP07= 0
$$ [...]
##$SUBNAM2= <"">
##$SUBNAM3= <"">
##$SUBNAM4= <"">
##$SUBNAM5= <"">
##$SUBNAM6= <"">
##$SUBNAM7= <"">
##$SUBNAM8= <"">
##$SUBNAM9= <"">
##$SW= 18.0517328524113
##$SWIBOX= (0..15)
0 0 2 0 0 0 0 0 0 0 0 0 0 0 0 0 
##$SW_h= 3612.71676300578
##$TD= 16384
##$TD0= 1
##$TE= 0
##$TE2= 300
##$TE3= 300
##$TEG= 300
##$TL= (0..7)
0 120 120 120 120 120 120 120 
##$TP= (0..7)
150 150 150 150 150 150 150 150 
##$TP07= 0
##$TPNAME0= <>
##$TPNAME1= <>
##$TPNAME2= <>
##$TPNAME3= <>
##$TPNAME4= <>
##$TPNAME5= <>
##$TPNAME6= <>
##$TPNAME7= <>
##$TPOAL= (0..7)
0.5 0.5 0.5 0.5 0.5 0.5 0.5 0.5 
##$TPOFFS= (0..7)
0 0 0 0 0 0 0 0 
##$TUNHIN= 0
##$TUNHOUT= 0
##$TUNXOUT= 0
##$USERA1= <user>
##$USERA2= <user>
##$USERA3= <user>
##$USERA4= <user>
##$USERA5= <user>
##$V9= 5
##$VALIST= <valist>
##$VCLIST= <CCCCCCCCCCCCCCC>
##$VD= 0
##$VDLIST= <DDDDDDDDDDDDDDD>
##$VPLIST= <PPPPPPPPPPPPPPP>
##$VTLIST= <TTTTTTTTTTTTTTT>
##$WBST= 1024
##$WBSW= 4
##$XGAIN= (0..3)
0 0 0 0 
##$XL= 0
##$YL= 0
##$YMAX_a= 49463
##$YMIN_a= -61354
##$ZGOPTNS= <>
##$ZL1= 120
##$ZL2= 120
##$ZL3= 120
##$ZL4= 120
##$ABSF1= 0
##$ABSF2= 0
##$ABSG= 0
##$ABSL= 0
##$ALPHA= 0
##$AQORDER= 0
##$ASSFAC= 0
##$ASSFACI= 0
##$ASSFACX= 0
##$ASSWID= 0
##$AUNMP= <proc_1d>
##$AZFE= 0.1
##$AZFW= 0.1
##$BCFW= 0
##$BC_mod= 2
##$BYTORDP= 0
##$COROFFS= 0
##$CY= -3
##$DATMOD= 1
##$DC= 0
##$DFILT= <>
##$DTYPP= 0
##$F1P= 0
##$F2P= 0
##$FCOR= 1
##$FTSIZE= 16384
##$FT_mod= 6
##$GAMMA= 0
##$GB= 0
##$INTBC= 1
##$INTSCL= 3.70164e-10
##$ISEN= 128
##$LB= 0.24
##$LEV0= 0
##$LPBIN= 0
##$MAXI= 10000
##$MC2= 0
##$MEAN= 0
##$ME_mod= 0
##$MI= 1.114404
##$NCOEF= 0
##$NC_proc= -9
##$NLEV= 6
##$NOISF1= 3.799351
##$NOISF2= 2.8
##$NSP= 0
##$NTH_PI= 0
##$NZP= 0
##$OFFSET= 15.57721
##$PC= 1
##$PHC0= -24593.38
##$PHC1= 11.05268
##$PH_mod= 1
##$PKNL= yes
##$PPARMOD= 0
##$PSCAL= 0
##$PSIGN= 0
##$REVERSE= no
##$SF= 200.129988891804
##$SI= 16384
##$SIGF1= 3
##$SIGF2= 2
##$SINO= 5.538805
##$SIOLD= 16384
##$SREGLST= <1H.CDCl3>
##$SSB= 0
##$STSI= 16384
##$STSR= 0
##$SW_p= 3612.71676300578
##$SYMM= 0
##$S_DEV= 0
##$TDeff= 16384
##$TDoff= 0
##$TI= <>
##$TILT= no
##$TM1= 0
##$TM2= 0
##$TOPLEV= 0
##$USERP1= <user>
##$USERP2= <user>
##$USERP3= <user>
##$USERP4= <user>
##$USERP5= <user>
##$WDW= 1
##$XDIM= 16384
##$YMAX_p= 401153575
##$YMIN_p= -11839938
$$ End of Bruker specific parameters
$$ ---------------------------------
##NTUPLES= NMR SPECTRUM
##VAR_NAME=  FREQUENCY,     SPECTRUM/REAL,   SPECTRUM/IMAG
##SYMBOL=    X,             R,               I
##VAR_TYPE=  INDEPENDENT,   DEPENDENT,       DEPENDENT
##VAR_FORM=  AFFN,          ASDF,            ASDF
##VAR_DIM=   16384,         16384,           16384
##UNITS=     HZ,            ARBITRARY UNITS, ARBITRARY UNITS
##FACTOR=    0.220516191357247, 1,           1
##FIRST=     3117.46694958683, 0,            0
##LAST=      -495.24981341895, 0,            0
##MIN=       -495.24981341895, -11839938,    0
##MAX=       3117.46694958683, 401153575,    0
$$ Real data points
##PAGE= N=1
##DATA TABLE= (X++(R..R)), XYDATA
$$ [...]
$$ plain form
11631 19461215 19020833 19489101 20712386 19918367 20830821 21559355 21648670 21564282 23171048
11622 23171048 24169483 23685504 23251545 24711841 26674073 27332516 26372851 26291835 28194226
11613 28194226 30093830 29445673 28324122 27403047 28617894 31022815 34566845 35370796
11605 35370796 34460574 34443951 36168146 36834820 36020183 38277498 40147668 40733799 41829857
11596 41829857 43317401 41926288 42734210 42309410 41460963 42360785 41747814 39324417 39880841
11587 39880841 41359246 42029036 43019921 41432504 39744655 38304523 37773490 37105620 36018342
11578 36018342 33973543 33224630 31941312 29533647 28942331 28357141 26379289 25928631 26217993
11569 26217993 24352635 22883980 22880614 23212600 22334426 21505296 19827902 18078144 19149619
$$ packed form
11631A9461215m40382M68268J223285p94019R12454P28534Q9315q4388J606766
11622B3171048R98435m83979m33959J460296J962232O58443r59665q1016J902391
11613B8194226J899604o48157j121551r21075J214847K404921L544030Q03951
11605C5370796r10222j6623J724195O66674q14637K257315J870170N86131J096058
11596D1829857J487544j391113Q07922m24800q48447Q99822o12971k423397N56424
11587C9880841J478405O69790R90885j587417j687849j440132n31033o67870j087278
11578C6018342k044799p48913j283318k407665n91316n85190j977852m50658K89362
11569B6217993j865358j468655l366L31986q78174q29130j677394j749758J071475
$$ plain form
11560 19149619 19801861 18766971 17916194 17709659 16212320 14676592 14009962 13365350 11717913
11551 11717913 11482395 12975520 12670239 13777321 14566236 13023261 11512020 10590795 9289621
11542 9289621 10257157 12266812 12660300 10550024 7824991 7556806 8014561 8938161 9012485
11533 9012485 8066696 7931737 8590897 7923597 7485272 7530811 7829367 8383067 9181811 8201589
11523 8201589 7100630 6775911 6678315 7080673 8131112 7483022 6646041 7036995 7949255
11514 7949255 8479997 6638412 5961164 5937520 5088644 6165299 7086873 6239175 6136571
11505 6136571 5756482 5472418 5770340 4763301 4822154 6375195 4636401 3280484 4313268
11496 4313268 6262532 8290759 6724243 3432843 3021007 4603740 4149388 3130922
$$ packed form
11560A9149619O52242j034890q50777k06535j497339j535728o66630o44612j647437
11551A1717913k35518J493125l05281J107082P88915j542975j511241r21225j301174
11542I289621R67536K009655L93488k110276k725033k68185M57755R23600P4324
11533I012485r45789j34959O59160o67300m38325M5539K98556N53700P98744r80222
11523H201589j100959l24719r7596M02358J050439o48090q36981L90954R12260
11514G949255N30742j841585o77248k3644q48876J076655R21574q47698j02604
11505F136571l80089k84064K97922j007039N8853J553041j738794j355917J032784
11496D313268J949264K028227j566516l291400m11836J582733m54352j018466
$$ plain form
11488 3130922 4165491 3265325 1439353 3235649 5272280 5281870 5415961 3515881 1303722
11479 1303722 3651417 4617561 4618250 4608700 4048866 3600919 3437051 3642762 3901955 3701897
11469 3701897 4340054 4000057 2149447 1971158 2951863 3826946 5106865 5488341 3942495
11460 3942495 4188749 4544862 4737015 5923763 6277832 4178296 2454250 3796198 4931353
11451 4931353 4590349 3919383 4108253 3837765 3668812 3981364 3618325 2913727 2829786 3463339
11441 3463339 5009573 4025557 3113084 2634371 4892904 5317716 3903380 3193075 3684939
11432 3684939 4602831 4330693 3525003 2645332 2251418 4149461 5539232 5337885 5035671
11423 5035671 4588922 5099744 4942367 5298806 5399965 4552803 3579446 4269128 3434253
$$ packed form
11488C130922J034569r00166j825972J796296K036631R590J34091j900080k212159
11479A303722K347695R66144O89r550n59834m47947j63868K05711K59193k00058
11469C701897O38157l39997j850610j78289R80705Q75083J279919L81476j545846
11460C942495K46254L56113J92153J186748L54069k099536j724046J341948J135155
11451D931353l41004o70966J88870k70488j68953L12552l63039p04598q3941O33553
11441C463339J546234r84016r12473m78713K258533M24812j414336p10305M91864
11432C684939R17892k72138q05690q79671l93914J898043J389771k01347l02214
11423E035671m46749N10822j57377L56439J01159q47162r73357O89682q34875
$$ plain form
11414 3434253 4335838 6856868 6697209 5124589 4544629 3904967 5438096 5928060 5979573
11405 5979573 4571859 3343942 3527512 5237570 4874688 4692738 4270996 4383824 6270908
11396 6270908 5665544 4210780 4554203 3908712 4131748 6331713 6382990 7054763 8142585
11387 8142585 6332209 5172950 4063613 4129788 6101808 7341782 7261503 5963630 5376274
11378 5376274 6801357 8138906 8321632 7996318 8707957 7969540 8100327 8957445 9359888
11369 9359888 8685572 8901283 8991156 7410694 7525716 7889821 7624184 7337546 8175293
11360 8175293 7151846 6839160 8016120 8559506 9302611 10008090 10199079 10398374 10260262
11351 10260262 8323571 6585050 8296033 10053514 9567854 10642398 11385248 10708978
$$ packed form
11414C434253R01585K521030j59659j572620n79960o39662J533129M89964N1513
11405E979573j407714j227917J83570J710058l62882j81950m21742J12828J887084
11396F270908o05364j454764L43423o45491K23036K199965N1277O71773J087822
11387H142585j810376j159259j109337O6175J972020J239974q0279j297873n87356
11378E376274J425083J337549J82726l25314P11639p38417J30787Q57118M02443
11369I359888o74316K15711Q9873j580462J15022L64105k65637k86638Q37747
11360H175293j023447l12686J176960N43386P43105P05479J90989J99295j38112
11351A0260262j936691j738521J710983J757481m85660J074544P42850o76270
$$ plain form
11343 10708978 11069542 10488800 11295373 11969149 11910624 11580879 11651538 12071159 13323184
11334 13323184 14931328 14301295 11701257 11382205 12057503 13396484 15110334 15329597 14655419
11325 14655419 14907930 16196136 16942804 15406000 14638306 16027642 16742177 17307668 18854739
11316 18854739 19141352 17835216 19456882 19544989 18049038 18574397 20495117 22541447 23573408
11307 23573408 23263501 21472677 21861264 23570805 23969464 23884323 23757799 23205638 23379031
11298 23379031 24324794 27227564 26152436 24764367 25291815 24782423 24669923 26660916 26719266
11289 26719266 25395882 25519641 25061776 26593662 26033916 24624597 23186647 23845178 23913173
11280 23913173 24566413 24269955 23736279 22436820 19894791 19569947 20233118 20917155 21573045
$$ packed form
11343A0708978L60564n80742Q06573O73776n8525l29745P0659M19621J252025
11334A3323184J608144o30033k600038l19052O75298J338981J713850K19263o74178
11325A4655419K52511J288206P46668j536804p67694J389336P14535N65491J547071
11316A8854739K86613j306136J621666Q8107j495951N25359J920720K046330J031961
11307B3573408l09907j790824L88587J709541L98659q5141j26524n52161J73393
11298B3379031R45763K902770j075128j388069N27448n09392j12500J990993N8350
11289B6719266j323384J23759m57865J531886n59746j409319j437950O58531O7995
11280B3913173O53240k96458n33676j299459k542029l24844O63171O84037O55890
$$ plain form
11271 21573045 21312135 20220281 19491846 18169473 18313280 19322897 20335353 19830958 18935937
11262 18935937 16977536 14892243 14823297 16103307 16937168 15733433 14144587 14589242 14956823
11253 14956823 15687729 14167137 12796508 13061512 15110692 15002181 14459816 14409742 13430680
11244 13430680 11718575 12587185 12637759 12347902 11893921 9792914 7913537 8090952 10521977
11235 10521977 11107800 9699412 8934682 7848200 7629818 9205432 8536741 9632855 9800569
11226 9800569 9438634 8873405 8904589 9128468 7917506 7488735 9172437 8550525 6796176
11217 6796176 6339161 4754508 5819053 7827972 5765733 4719282 6577781 6609557 6909896
11208 6909896 6563451 5692389 5556694 7063250 8404654 7303893 5896099 5737229 6378234
$$ packed form
11271B1573045k60910j091854p28435j322373J43807J009617J012456n04395q95021
11262A8935937j958401k085293o8946J280010Q33861j203735j588846M44655L67581
11253A4956823P30906j520592j370629K65004K049180j08511n42365n0074r79062
11244A3430680j712105Q68610N0574k89857m53981k101007j879377J77415K431025
11235A0521977N85823j408388p64730j086482k18382J575614o68691J096114J67714
11226I800569l61935n65229L1184K23879j210962m28771J683702o21912j754349
11217F796176m57015j584653J064545K008919k062239j046451J858499L1776L00339
11208F909896l46445q71062j35695J506556J341404j100761j407794j58870O41005
$$ plain form
11199 6378234 5598061 5191995 5684928 5563966 4928996 4152203 3088680 3607022 3913365
11190 3913365 3279054 3841386 4482350 3860296 3445296 3617233 3368947 3852992 4235344
11181 4235344 4937077 5061323 4430370 4768594 3344381 3793091 4195702 4353113 3617554
11172 3617554 2431160 2238247 3143892 4544936 4114206 3921002 5072616 5260409 4171771
11163 4171771 2984704 3066932 4579255 6755869 5687265 3438180 3235677 3337590 2655451
11154 2655451 2912050 3827892 3670902 2393151 3425883 2429350 856242 2290697 3338437
11145 3338437 2070551 1919441 2882005 2248219 2369728 2504406 1747458 1780594 3197504
11136 3197504 3341128 2141395 2923166 627523 -590134 1725677 3766685 4294526 3547267
$$ packed form
11199F378234p80173m06066M92933j20962o34970p76793j063523N18342L06343
11190C913365o34311N62332O40964o22054m15000J71937k48286M84045L82352
11181D235344P01733J24246o30953L38224j424213M48710M02611J57411p35559
11172C617554j186394j92913R05645J401044m30730j93204J151614J87793j088638
11163D171771j187067Q2228J512323K176614j068604k249085k02503J01913o82139
11154B655451K56599R15842j56990j277751J032732r96533j573108J434455J047740
11145C338437j267886j51110R62564o33786J21509J34678p56948L3136J416910
11136C197504J43624j199733P81771k295643j217657K315811K041008N27841p47259
$$ plain form
11127 3547267 1602531 1758057 1352528 554211 1514194 2761553 4548423 3474634 -262666
11118 -262666 -790823 1815796 2588028 4040442 3012530 1955806 1214187 1787732 625443
11109 625443 418650 2927697 3902446 3366712 2304453 2520469 3796408 3727414 1291044
11100 1291044 743966 2413874 3129782 3289348 3207795 3719137 4493631 4054683 2609024
11091 2609024 2697856 2397660 1979575 1557665 2276095 2162013 1857472 3178807 2516181
11082 2516181 2029241 2609747 2717607 2506272 2934406 3545946 3854018 2569213 1854373
11073 1854373 2223057 2192133 1740772 955037 2030450 2648335 1800522 1593275 1547374 2020527
11063 2020527 2427958 1638575 3093381 4519989 2824325 2294043 1986831 1001287 1740538
$$ packed form
11127C547267j944736J55526m05529p98317R59983J247359J786870j073789l737300
11118b62666n28157K606619P72232J452414j027912j056724p41619N73545j162289
11109F25443k06793K509047R74749n35734j062259K16016J275939o8994k436370
11100A291044n47078J669908P15908J59566q1553N11342P74494m38948j445659
11091B609024Q8832l00196m18085m21910P18430j14082l04541J321335o62626
11082B516181m86940N80506J07860k11335M28134O11540L08072j284805p14840
11073A854373L68684l0924m51361p85735J075413O17885q47813k07247m5901M73153
11063B020527M07431p89383J454806J426608j695664n30282l07212r85544P39251
$$ plain form
11054 1740538 2479460 1884007 2373888 2010117 1270322 958862 -51947 701847 -100451
11045 -100451 342293 1388730 3322850 3466741 3878577 2869018 1226764 2252147 2589930
11036 2589930 1734041 1196797 1242331 1821427 2489009 1015944 1051892 1597754 2286979 2384305
11026 2384305 2606644 1793585 1145144 2535935 1126238 416535 1505843 2506775 2555475
11017 2555475 3517683 2725887 1938224 1177845 198439 850212 2306991 3818798 3028879
11008 3028879 921864 1514807 2608810 2429402 1211537 842791 -168914 -767091 913156
10999 913156 1827256 2485699 3384241 2317459 952758 1387293 946120 1920266 2088431
10990 2088431 2126563 2338080 1513465 707590 412144 -575499 1176057 1254290 -282459
$$ packed form
11054A740538P38922n95453M89881l63771p39795l11460j010809P53794q02298
11045a00451M42744J046437J934120J43891M11836j009559j642254J025383L37783
11036B589930q55889n37244M5534N79096O67582j473065L5948N45862O89225R7326
11026B384305K22339q13059o48441J390791j409697p09703J089308J000932M8700
11017B555475R62208p91796p87663p60379r79406O51773J456779J511807p89919
11008C028879k107015N92943J094003j79408j217865l68746j011705n98177J680247
10999I13156R14100O58443Q98542j066782j364701M34535m41173R74146J68165
10990B088431L8132K11517q24615q05875k95446r87643J751556P8233j536749
$$ plain form
10981 -282459 -6533 658596 1353811 1984148 810224 -58240 1258045 1450228 2026167
10972 2026167 2293381 1667059 1539882 1355036 698118 2022572 1247075 596260 2061210
10963 2061210 1648565 1439781 1387912 1213834 176163 1589 281738 1467197 2944948
10954 2944948 2796034 642175 2083864 2977757 997745 -406978 440492 233555 891677
10945 891677 2259980 2363600 2896435 3076183 2540052 1804334 343636 1817908 2517163
10936 2517163 2774594 2900522 2113053 2141293 3678708 3813144 2505233 2472455 3503417
10927 3503417 2844449 1700512 3593370 3725127 2600040 948812 1800614 1248430 569910
10918 569910 1378446 1600953 800487 509104 684347 -257866 148114 1888294 1414671
$$ packed form
10981b82459K75926O65129O95215O30337j173924q68464J316285J92183N75939
10972B026167K67214o26322j27177j84846o56918J324454p75497o50815J464950
10963B061210m12645k08784n1869j74078j037671j74574K80149J185459J477751
10954B944948j48914k153859J441689Q93893j980012j404723Q47470k06937O58122
10945H91677J368303J03620N32835J79748n36131p35718j460698J474272O99255
10936B517163K57431J25928p87469K8240J537415J34436j307911l2778J030962
10927C503417o58968j143937J892858J31757j125087j651228Q51802n52184o78520
10918E69910Q08536K22507q00466k91383J75243r42213M05980J740180m73623
$$ plain form
10909 1414671 1588247 1823625 96167 688155 1857007 1867770 -54197 -1484366 -789011
10900 -789011 1059758 1921667 1438149 -956037 -1086778 -404870 -702567 941125 1977481
10891 1977481 2031258 2359794 2514931 949677 -1057031 -338252 2531248 3466959 3539571
10882 3539571 3061621 2011061 157398 -611973 726102 1242472 1987787 1679592 -240220
10873 -240220 1417515 1979320 126364 1087410 1962933 754671 1564052 2446913 1917711
10864 1917711 2404171 1924913 738406 699173 1214571 2173543 2693732 2084688 2063280 2059448
10854 2059448 568095 1029514 2685254 1784371 2188028 2162135 692498 1211848 2531134
10845 2531134 4186127 4288424 2960884 904988 337661 647254 965745 767061 304437
$$ packed form
10909A414671J73576K35378j727458N91988J168852J0763j921967j430169O95355
10900g89011J848769Q61909m83518k394186j30741O81908k97697J643692J036356
10891A977481N3777L28536J55137j565254k006708P18779K869500R35711P2612
10882C539571m77950j050560j853663p69371J338075N16370P45315l08195j919812
10873b40220J657735N61805j852956R61046Q75523j208262Q09381Q82861n29202
10864A917711M86460m79258j186507l9233N15398R58972N20189o09044k1408l832
10854B059448j491353M61419J655740r00883M03657k5893j469637N19350J319286
10845B531134J654993J02297j327540k055896n67327L09593L18491j98684m62624
$$ plain form
10836 304437 -576996 -175624 -189844 -232649 1678257 2059754 1034500 519693 507149 516988
10826 516988 1437672 1435776 -154759 627516 1589210 3078774 2633277 2080094 675001
10817 675001 761167 517968 2020004 3329745 1187137 1551518 1288011 1197674 740635
10808 740635 1880451 2580617 1861371 350070 431780 492720 -241105 1591899 1665118 1062334
10798 1062334 -566180 -1011830 1355856 2195274 1038452 921235 21589 -241395 1184219
10789 1184219 1495724 1969527 1572041 -1056387 -2184773 -471240 1113945 2183546 1008408
10780 1008408 -601962 598528 1937758 2172907 1901965 1132090 2224189 2892015 1679738
10771 1679738 965753 2692237 1728808 1148648 2284786 1729254 1694579 2393134 2008174
$$ packed form
10836C04437q81433M01372j4220m2805J910906L81497j025254n14807j2544R839
10826E16988R20684j896j590535P82275R61694J489564m45497n53183j405093
10817F75001Q6166k43199J502036J309741k142608L64381k63507r0337m57039
10808G40635J139816P00166p19246j511301Q1710O0940p33825J833004P3219o02784
10798A062334j628514m45650K367686Q39418j156822j17217q99646k62984J425614
10789A184219L11505M73803l97486k628428j128386J713533J585185J069601j175138
10780A008408j610370J200490J339230K35149k70942p69875J092099O67826j212277
10771A679738p13985J726484r63429n80160J136138n55532l4675O98555l84960
$$ plain form
10762 2008174 1650419 2565230 1972716 1577869 1787807 2004707 2658341 2768826 2022284
10753 2022284 1349337 1832972 1045933 -327244 -771765 305994 2087727 1330068 -180623
10744 -180623 409327 1498336 78839 477928 1411201 1968533 2335979 583847 162772
10735 162772 850903 1391123 1294948 1635111 1847073 1324034 823923 1824195 1795267 3444639
10725 3444639 3520228 3126999 2031768 2071256 3362419 2756658 1946213 1496045 2307843
10716 2307843 1982292 628548 -581214 -353269 324995 -276922 -379420 111293 1132179
10707 1132179 674776 765416 160092 -77783 -74447 741402 2718715 1867680 -639085 -530986
10697 -530986 1139465 1707466 2837819 1208344 -195459 913169 3438004 2763921 1357710
$$ packed form
10762B008174l57755R14811n92514l94847K09938K16900O53634J10485p46542
10753B022284o72947M83635p87039j373177m44521J077759J781733p57659j510691
10744a80623N89950J089009j419497L99089R33273N57332L67446j752132m21075
10735A62772O88131N40220r6175L40163K11962n23039n00111J000272k8928J649372
10725C444639P5589l93229j095231L9488J291163o05761q10445m50168Q11798
10716B307843l25551j353744j209762K27945O78264o01917j02498M90713J020886
10707A132179m57403R0640o05324k37875L336Q15849J977313q51035k506765J08099
10697e30986J670451N68001J130353j629475j403803J108628K524835o74083j406211
$$ plain form
10688 1357710 2464394 2062500 2020242 2799078 2594779 2132885 3147135 2971083 1131678
10679 1131678 1169917 815762 147614 900870 3065750 2200872 1889895 1319652 929452
10670 929452 -1239864 -1005267 1764851 1636819 140953 999496 2814080 2028490 1259340
10661 1259340 174617 1739173 2798250 1719894 -146654 823080 2032677 1121378
10653 1121378 1823465 2848262 2748088 1475353 1411989 913562 -533102 516865 1968983
10644 1968983 4077503 2851934 60323 214711 1796184 1615861 1495195 1980408 3648521
10635 3648521 3127918 1288634 488927 1079380 979864 1674986 2876776 1839678 463667
10626 463667 -283081 -766402 98362 955035 600057 997076 877498 712532 2265034
$$ packed form
10688A357710J106684m01894m2258P78836k04299m61894J014250j76052j839405
10679A131678L8239l54155o68148P53256K164880q64878l10977n70243l90200
10670I29452k169316K34597K770118j28032j495866Q58543J814584p85590p69150
10661A259340j084723J564556J059077j078356j866548R69734J209597r11299
10653A121378P02087J024797j00174j272735o3364m98427j446664J049967J452118
10644A968983K108520j225569k791611J54388J581473j80323j20666M85213J668113
10635C648521n20603j839284p99707N90453r9516O95122J201790j037098j376011
10626D63667p46748m83321Q64764Q56673l54978L97019j19578j64966J552502
$$ plain form
10617 2265034 1697539 46922 -1299304 1383901 4193012 3826995 926098 -603377
10609 -603377 341504 219733 287393 793959 1143632 -567808 -179699 763156 1397917 1570079
10599 1570079 1865455 1558595 3092280 2282836 1356194 -101177 334018 1638644 795046
10590 795046 -38946 633735 221686 725587 1249605 1608627 860390 874431 -25944 -719928
10580 -719928 67975 1351695 425823 375776 1159153 1991029 3636820 4200780 2450007
10571 2450007 1503652 1776933 1399444 1702865 1218366 2673439 3779568 2446253 964553
10562 964553 1690839 2647873 2503736 848683 -1190107 -602049 1317182 1367293 1667801
10553 1667801 2392887 1229981 407194 1459300 567978 -196961 794909 1225135 1753742
$$ packed form
10617B265034n67495j650617j346226K683205K809111l66017k900897j529475
10609f03377R44881j21771O7660N06566L49673j711440L88109R42855O34761J72162
10599A570079K95376l06860J533685q09444r26642j457371M35195J304626q43598
10590G95046q33992O72681m12049N03901N24018L59022p48237J4041r00375o93984
10580g19928P87903J283720r25872n0047P83377Q31876J645791N63960j750773
10571B450007r46355K73281l77489L03421m84499J455073J106129j333315j481700
10562I64553P26286R57034j44137j655053k038790N88058J919231N0111L00508
10553A667801P25086j162906q22787J052106q91322p64939R91870M30226N28607
$$ plain form
10544 1753742 861531 1040582 994592 698896 -451 -317465 831996 1098249 1416936
10535 1416936 1681773 1750036 632705 98307 214038 727339 694439 1318214 251221
10526 251221 -425878 -631728 1216735 1919351 1272266 1472258 -99964 -414948 1086736
10517 1086736 771927 1461528 2173481 1659641 1514143 1719929 1947335 1058018 461977
10508 461977 1267269 327601 208524 178391 292402 618996 2576296 2534700 2131438 1541576
10498 1541576 926655 1187538 185371 496809 984507 631790 837299 1453804 1468758
10489 1468758 1594545 -51964 -101249 458556 215652 1497962 1807852 1959782 2435104
10480 2435104 2708803 3414660 2684943 1570639 1068061 1061474 1143889 1991459 2345714 1752173
$$ packed form
10544A753742q92211J79051m5990k95696o99347l17014J149461K66253L18687
10535A416936K64837O8263j117331n34398J15731N13301l2900O23775j066993
10526B51221o77099k05850J848463P02616o47085J99992j572222l14984J501684
10517A086736l14809O89601P11953n13840j45498K05786K27406q89317n96041
10508D61977Q05292r39668j19077l0133J14011L26594J957300m1596m03262n89862
10498A541576o14921K60883j002167L11438M87698l52717K05509O16505J4954
10489A468758J25787j646509m9285N59805k42904J282310L09890J51930M75322
10480B435104K73699P05857p29717j114304n02578o587Q2415Q47570L54255n93541
$$ plain form
10470 1752173 1141664 610314 -76871 674916 1457212 553302 -1699751 -1058229 80283
10461 80283 -195094 211488 1036977 -307788 -1299147 -799106 -522167 73213 923413 1188158
10451 1188158 753407 1365970 -180837 -967060 -320207 1206254 1644443 946507 367960
10442 367960 2065068 3176424 2791483 2569472 564812 428104 1993423 2685493 2352717
10433 2352717 2231137 2250199 2032878 2087784 1325762 1013774 1653704 1845195 1180370 1725071
10423 1725071 2073849 1420772 387924 10924 473075 87615 -688620 46235 -137590
10414 -137590 874811 797394 572212 1204968 1403555 1167247 1408759 1568146 2723256
10405 2723256 4038657 3941475 3508473 2833063 2359239 2183464 1741122 1469070 2151806
$$ packed form
10470A752173o10509n31350o87185P51787P82296r03910k253053O41522J138512
10461H0283k75377M06582Q25489j344765r91359N00041K76939N95380Q50200K64745
10451A188158m34751O12563j546807p86223O46853J526461M38189o97936n78547
10442C67960J697108J111356l84941k22011k004660j36708J565319O92070l32776
10433B352717j21580J9062k17321N4906p62022l11988O39930J91491o64825N44701
10423A725071L48778o53077j032848l77000M62151l85460p76235P34855j83825
10414a37590J012401p7417k25182O32756J98587k36308K41512J59387J155110
10405B723256J315401r7182m33002o75410m73824j75775m42342k72052O82736
$$ plain form
10396 2151806 1180875 1239708 337850 211897 347382 1675540 2509894 1984923 3003199
10387 3003199 2439685 951066 1209285 1041321 1915256 1547483 -513984 -2005185 -278756
10378 -278756 730800 1162507 955871 1003343 975645 1705743 1852761 1514176 2552691 3319063
10368 3319063 3761096 2430179 1574631 1860948 2044114 1975879 2291478 3148051 2814363
10359 2814363 1901450 1472362 2780293 2720914 3109286 3506785 4214055 3536598 3796461
10350 3796461 2267475 1065637 2805030 959415 -391966 1441514 2077022 955052
10342 955052 1462713 968052 1736523 3568675 4430825 3492411 2685603 2953542 2145422
10333 2145422 2517986 2230890 2030925 3987494 4083690 2198641 1554855 2204770 2590516
$$ packed form
10396B151806r70931N8833r01858j25953J35485J328158Q34354n24971J018276
10387C003199n63514j488619K58219j67964Q73935l67773k061467j491201J726429
10378b78756J009556M31707k06636M7472k7698P30098J47018l38585J038515P66372
10368C319063M42033j330917q55548K86317J83166o8235L15599Q56573l33688
10359B814363r12913m29088J307931n9379L88372L97499P07270o77457K59863
10350C796461j528986j201838J739393j845615j351381J833480O35508j121970
10342I55052N07661m94661P68471J832152Q62150r38414q06808K67939q08120
10333B145422L72564k87096j99965J956569R6196j885049o43786O49915L85746
$$ plain form
10324 2590516 1592929 1624945 2665412 1323797 2783362 3138180 2288349 2136264 2785732
10315 2785732 2506898 1474894 1503461 212143 454660 1581624 2231841 2649115 3366884
10306 3366884 3097964 2216850 1993908 3304817 3454706 1810991 2398408 3005193 3357379
10297 3357379 2656622 2383543 2490151 2604977 3255797 2824101 2289288 2371893 3872474
10288 3872474 5053274 4497845 3498948 2427892 2531119 2856428 2454920 3747223 4970730
10279 4970730 4426909 2812306 2861417 4359079 4338726 4781957 5007626 5426904 5828655
10270 5828655 7986305 7754591 8589623 10105139 8497180 6329891 7271602 7392992 7134021
10261 7134021 8004295 7154836 5804223 5866803 7111834 6067912 5873261 7244062 6335474
$$ packed form
10324B590516r97587L2016J040467j341615J459565L54818q49831j52085O49468
10315B785732k78834j032004K8567j291318K42517J126964O50217M17274P17769
10306C366884k68920q81114k22942J310909J49889j643715N87417O06785L52186
10297C357379p00757k73079J06608J14826O50820m31696n34813Q2605J500581
10288C872474J180800n55429r98897j071056J03227L25309m01508J292303J223507
10279D970730n43821j614603M9111J497662k0353M43231K25669M19278M01751
10270E828655K157650k31714Q35032J515516j607959k167289R41711J21390k58971
10261G134021Q70274q49459j350613O2580J245031j043922j94651J370801r08588
$$ plain form
10252 6335474 5487411 6099904 7468034 6892245 7260002 6329193 2884322 2593844 3462769
10243 3462769 5447279 6685574 5828728 5403466 5561057 3794651 3869090 3563242 4949867
10234 4949867 6245405 6624964 5526003 4292997 3267728 4539910 6820161 7221993
10226 7221993 7133045 6120998 3885003 3270152 3671507 2709193 4166876 5563771 5208313
10217 5208313 4897590 4728945 3795150 3682162 3420336 3048622 2894585 2062950 1949439
10208 1949439 4227245 4776547 5111491 4829164 3572526 3003440 2793170 1441831 2355244
10199 2355244 4131371 5076197 3440122 4890372 5914786 4418895 3624664 3237681 1373276
10190 1373276 1274626 2832097 2180050 2559883 3549323 2938605 1694765 1854697 1759229
$$ packed form
10252F335474q48063O12493J368130n75789L67757r30809l444871k90478Q68925
10243C462769J984510J238295q56846m25262J57591j766406P4439l05848J386625
10234D949867J295538L79559j098961j233006j025269J272182K280251M01832
10226G221993q8948j012047k235995o14851M01355r62314J457683J396895l55458
10217E208313l10723j68645r33795j12988k61826l71714j54037q31635j13511
10208A949439K277806N49302L34944k82327j256638n69086k10270j351339R13413
10199B355244J776127R44826j636075J450250J024414j495891p94231l86983j864405
10190A373276r8650J557471o52047L79833R89440o10718j243840J59932r5468
$$ plain form
10181 1759229 1055234 1924295 2406159 866268 849226 2352956 1051370 -848419 -1173799
10172 -1173799 -1417242 -237830 1305863 773383 311745 2079953 2492594 1420766 802674
10163 802674 1874985 2833575 3465778 4936279 4516354 3083613 3580195 3619526 4816468
10154 4816468 4374923 4008854 2746100 3155495 3620276 3414517 1759074 2051246 2605146
10145 2605146 2939924 2631330 2426296 2190197 2125378 1974013 1054438 1413878 1879829 1553501
10135 1553501 -590816 141507 1985220 2041454 2755517 1886917 1895082 1761342 1445901 852795
10125 852795 1245823 1983296 3278110 4197440 2297173 498569 1660358 3382193 4233501
10116 4233501 3494015 1964096 2524621 2443860 2446756 2970843 2309740 2811768 3447131 2383563
$$ packed form
10181A759229p03995Q69061M81864j539891j7042J503730j301586j899789l25380
10172a173799k43443J179412J543693n32480m61638J768208M12641j071828o18092
10163H02674J072311R58590O32203J470501m19925j432741M96582L9331J196942
10154D816468m41545l66069j262754M09395M64781k05759j655443K92172N53900
10145B605146L34778l08594k05034k36099o4819j51365r19575L59440M65951l26328
10135A553501k144317P32323J843713N6234P14063q68600Q165j33740l15441n93106
10125H52795L93028P37473J294814R19330j900267j798604J161789J721835Q51308
10116D233501p39486j529919N60525q0761K896N24087o61103N02028O35363j063568
$$ plain form
10106 2383563 1620092 1392408 936640 589859 749070 554102 632489 1525579 2497116 3335883
10096 3335883 3007132 2040438 1726322 2618363 1939080 193938 918816 1139371 1753116
10087 1753116 2457643 4034136 2551821 918169 -799563 -1057007 -75367 2020888 3263753
10078 3263753 2066047 1715417 1023897 183489 -264916 1687800 1988494 2369870 1752991
10069 1752991 149321 -316371 57172 1992184 3194320 1789283 620948 666907 817776
10060 817776 1621584 1624825 1389506 1645648 1362618 -205295 439800 88330 -37552 907731
10050 907731 2749792 2475641 1642522 938648 -420391 -1365697 530425 1832992 1157542
10041 1157542 869879 833186 1123591 1947058 1125671 -377871 1052697 2452241 1629852
$$ packed form
10106B383563p63471k27684m55768l46781J59211j94968P8387Q93090R71537Q38767
10096C335883l28751r66694l14116Q92041o79283j745142P24878K20555O13745
10087A753116P04527J576493j482315j633652j717732k57444R81640K096255J242865
10078C263753j197706l50630o91520q40408m48405J952716L00694L81376o16879
10069A752991j603670m65692L73543J935012J202136j405037j168335M5959J50869
10060H17776Q03808L241k35319K56142k83030j567913O45095l51470j25882R45283
10050I07731J842061k74151q33119p03874j359039r45306J896122J302567o75450
10041A157542k87663l6693K90405Q23467q21387j503542J430568J399544q22389
$$ plain form
10032 1629852 1420592 909134 604157 1483338 2201727 2178702 2608140 2821073 2246525 2020570
10022 2020570 2819639 4092535 2943275 2507642 2425169 2321873 3412754 4125397 3601321
10013 3601321 1946958 946609 2104105 2405330 2284136 2486702 2105163 1747951 1666898
10004 1666898 1720016 588134 593691 1139854 178357 482354 1869163 1157088 469101 868905
9994 868905 3023662 3439200 1754181 1336259 865124 1974730 2595270 391517 -741051
9985 -741051 612025 1158471 1701901 848508 21648 1919576 4890428 4912387 2562406
9976 2562406 1661470 1908669 1365706 1018591 2213205 2419582 3151168 4720920 2632797
9967 2632797 628545 1789308 2350562 731905 1009014 1714362 675680 1255763 2608325
$$ packed form
10032A629852k09260n11458l04977Q79181P18389k3025M29438K12933n74548k25955
10022B020570P99069J272896j149260m35633q2473j03296J090881P12643n24076
10013C601321j654363j000349J157496L01225j21194K02566l81539l57212q1053
10004A666898N3118j131882N557N46163r61497L03997J386809p12075o87987L99804
9994H68905K154757M15538j685019m17922m71135J109606O20540k203753j132568
9985g41051J353076N46446N43430q53393q26860J897928K970852K1959k349981
9976B562406r00936K47199n42963l47115J194614K06377P31586J569752k088123
9967B632797k004252J160763N61254j618657K77109P05348j038682N80083J352562
$$ plain form
9958 2608325 2544450 1839803 1413337 -824955 -1014085 1098075 3499199 2648291 2834988
9949 2834988 2079934 1859796 1995061 2492873 2883470 2842556 3717392 1938163 1323111 1227662
9939 1227662 3380637 3072162 2063120 1158378 530048 605723 2381355 3794128 1890031
9930 1890031 2834807 3245590 2714135 3185241 3890983 3142016 2118176 2279536 2590437
9921 2590437 3816631 3012698 2777440 1889157 2334152 1830163 1824624 2719475 3842313 2727032
9911 2727032 2305634 1813820 2469454 4272595 5431763 5921894 3689019 3695439 4137400
9902 4137400 3250259 4569350 5344240 5254783 5576400 5271602 3700431 4598676 5269694
9893 5269694 6274315 6149845 6420949 6895846 5676411 4767070 4769741 3348397 3024728
$$ packed form
9958B608325o3875p04647m26466k238292j89130K112160K401124q50908J86697
9949B834988p55054k20138J35265M97812L90597m0914Q74836j779229o15052r5449
9939A227662K152975l08475j009042r04742o28330P5675J775632J412773j904097
9930A890031R44776M10783n31455M71106P05742p48967j023840J61360L10901
9921B590437J226194q03933k35258q88283M44995n03989n539Q94851J122838j115281
9911B727032m21398m91814O55634J803141J159168M90131k232875O420M41961
9902D137400q87141J319091P74890q9457L21617l04798j571171Q98245O71018
9893E269694J004621j24470K71104M74897j219435r09341K671j421344l23669
$$ plain form
9884 3024728 3154576 1676798 3062521 2853946 3380508 2943594 2380311 3481331 4919050
9875 4919050 4427085 3081584 2808068 3013227 5060721 4753231 3945000 5487935 5393840
9866 5393840 3145546 1668399 1812189 2765699 3188629 3957666 5721429 4386522 4501159
9857 4501159 4528420 4331671 2907140 1882067 1795869 2744093 3869813 4002766 3142967
9848 3142967 2146339 2124912 2517094 4140485 2882688 562177 1539385 3553262 4410361
9839 4410361 4518620 4561698 2654523 3392544 3892963 3442112 4021612 4587024 4612058 4410734
9829 4410734 3901765 3144204 2877046 4045213 5137927 5365878 4670474 3460922 3193466
9820 3193466 3631540 4395535 4448263 4205838 3233527 3391174 4418232 3405791 2995135
$$ packed form
9884C024728J29848j477778J385723k08575N26562m36914n63283J101020J437719
9875D919050m91965j345501k73516K05159K047494l07490q08231J542935r4095
9866E393840k248294j477147J43790R53510M22930P69037J763763j334907J14637
9857D501159K7261j96749j424531j025073q6198R48224J125720J32953q59799
9848C142967r96628k1427L92182J623391j257797k320511R77208K013877Q57099
9839D410361J08259M3078j907175P38021N00419m50851N79500N65412K5034k01324
9829D410734n08969p57561k67158J168167J092714K27951o95404j209552k67456
9820C193466M38074P63995N2728k42425r72311J57647J027058j012441m10656
$$ plain form
9811 2995135 2693297 3216687 5111462 5760353 5068169 4524414 4738955 5057034 4367314
9802 4367314 4741047 5410890 6300582 5343768 3738967 4440170 4595617 5265810 4919024
9793 4919024 4095517 4179863 5305085 5830627 6445721 5886050 5766020 6164412 5817908 5328388
9783 5328388 4561871 5272596 6123815 6553891 6751274 5775522 4529664 4087827 4419373
9774 4419373 4695204 4034239 4304016 6578114 6785287 6731277 5790603 5366373 4867382 5442854
9764 5442854 5889078 5123326 6053467 7354501 7160093 6067156 6153060 5345225 6392185
9755 6392185 6612379 4503003 3550529 5719736 7378165 9106178 6752416 4877598 5384760
9746 5384760 4864116 6209860 6657968 7358786 8931611 9575647 7624933 7095752 7450437
$$ packed form
9811B995135l01838N23390J894775O48891o92184n43755K14541L18079o89720
9802D367314L73733O69843Q89692r56814j604801P01203J55447O70193l46786
9793D919024q23507Q4346J125222N25542O15094n59671j20030L98392l46504m89520
9783E328388p66517P10725Q51219M30076J97383r75752j245858m41837L31546
9774D419373K75831o60965K69777K274098K07173n4010r40674m24230m98991N75472
9764E442854M46224p65752R30141J301034j94408j092937Q5904q07835J046960
9755F392185K20194k109376r52474K169207J658429J728013k353762j874818N07162
9746E384760n20644J345744M48108P00818J572825O44036j950714n29181L54685
$$ plain form
9737 7450437 7315024 8478757 10069171 10380722 9174121 9055517 8744715 9041123 8858825
9728 8858825 9124066 8635379 9283055 10581074 10261813 9895595 8975923 8766007 9327708
9719 9327708 10978176 10471334 10081094 9706310 11072107 10667030 9760299 10397812 11549491
9710 11549491 12745924 13044362 12132578 11687130 12667439 11924786 12459903 13944463 14276704
9701 14276704 14497142 14728617 15420808 15943770 17129637 15973413 14215766 15370953 17526285
9692 17526285 18000937 18087763 18545438 18838711 20197508 20222653 19643977 19654686 19892714 20048036
9682 20048036 20270874 20444870 21737544 23376821 24494287 26303523 25578997 25175158 26957055
9673 26957055 29239182 29437913 30293530 31091385 31769473 34829809 35089346 36540045 38864010
$$ packed form
9737G450437j35413J163733J590414L11551j206601j18604l10802K96408j82298
9728H858825K65241m88687O47676J298019l19261l66218r19672k09916N61701
9719I327708J650468n06842l90240l74784J365797m05077r06731O37513J151679
9710A1549491J196433K98438r11784m45448R80309p42653N35117J484560L32241
9701A4276704K20438K31475O92191N22962J185867j156224j757647J155187K155332
9692A7526285M74652Q6826M57675K93273J358797K5145n78676J0709K38028J55322
9682B0048036K22838J73996J292674J639277J117466J809236p24526m03839J781897
9673B6957055K282127J98731Q55617P97855O78088L060336K59537J450699K323965
$$ plain form
9664 38864010 42105900 44771929 47758377 53758353 61154183 69202088 78738591 90418667
9656 90418667 99288273 104759254 107276166 105942848 98738887 93519672 94083157 98563029
9648 98563029 105125667 108272544 108687072 104519625 94854929 82078237 70218994 63847299
9640 63847299 58252774 54218327 52297429 50985459 48463669 48010173 49227537 49504117
9632 49504117 47261122 45657916 46250526 48996534 50808152 49536452 50142884 51696605
9624 51696605 52591984 52615971 54100159 55541902 57231444 59798175 63409450 65199009 68344267
9615 68344267 74160677 80475268 88909800 98790603 111686173 127396194 144680370 167566477
9607 167566477 191781441 210632262 218585755 217993414 209394966 199060197 192776605 194029203
$$ packed form
9664C8864010L241890K666029K986448N999976P395830Q047905R536503J1680076
9656I0418667Q869606N470981K516912j333318p203961n219215N63485M479872
9648I8563029O562638L146877M14528m167447r664696j2776692j1859243o371695
9640F3847299n594525m034447j920898j311970k521790m53496J217364K76580
9632D9504117k242995j603206N92610K746008J811618j271700O06432J553721
9624E1696605Q95379K3987J484188J441743J689542K566731L611275J789559L145258
9615F8344267N816410O314591Q434532R880803J2895570J5710021J7284176K2886107
9607A67566477K4214964J8850821P953493n92341q598448j0334769o283592J252598
$$ plain form
9599 194029203 202089954 213411339 216203083 208615100 192776825 168727233 142525142
9592 142525142 119894048 104705503 92862063 84151538 77509579 71550980 67593273 64377753
9584 64377753 61009036 58334091 56837441 55434349 52296249 49038415 47691759 47119533
9576 47119533 45550150 43840832 41157449 37392196 36190716 36391644 34495866 33766345
9568 33766345 33554439 34372692 35145967 35120634 33010571 31779402 33191009 35750048 36081181
9559 36081181 36058927 37291038 37503232 37298869 38057249 38472367 39300564 41432309 43572677
9550 43572677 44623553 45893483 47992013 51721300 54702519 54574661 54467265 55295621 55100903
9541 55100903 54045138 53629044 57466850 61444113 61832920 62820393 64772726 66707672 67813881
$$ packed form
9599A94029203Q060751J1321385K791744p587983j5838275k4049592k6202091
9592A42525142k2631094j5188545j1843440q710525o641959n958599l957707l215520
9584F4377753l368717k674945j496650j403092l138100l257834j346656n72226
9576D7119533j569383j709318k683383l765253j201480K00928j895778p29521
9568C3766345k11906Q18253P73275k5333k110063j231169J411607K559039L31133
9559C6081181k2254J232111K12194k04363P58380M15118Q28197K131745K140368
9550D3572677J050876J269930K098530L729287K981219j27858j07396Q28356j94718
9541E5100903j055765m16094L837806L977263L88807R87473J952333J934946J106209
$$ plain form
9532 67813881 68491019 69886647 74029386 78062183 77872793 71763149 66711052 63322365
9524 63322365 59699757 55398135 50747166 44326065 41092602 37614371 33624678 31363296
9516 31363296 31815966 31269193 29453119 28353151 27295124 28206169 28890910 28551840 26859041
9507 26859041 27604845 29795576 29494438 30262437 33323229 35964247 39242800 44612572 48995303
9498 48995303 52580999 56593676 60122762 64168988 67439853 69656490 67764564 64360820
9490 64360820 60075775 56563265 51994263 45589647 39264288 33488398 28538121 25252744
9482 25252744 22864683 21270582 20111002 18185481 17672980 17437815 15777936 14710933
9474 14710933 14690625 15117558 14504534 13407358 12771101 11948656 12334075 12539022 11339577
$$ packed form
9532F7813881O77138J395628M142739M032797j89390o109644n052097l388687
9524F3322365l622608m301622m650969o421101l233463l478231l989693k261382
9516C1363296M52670n46773j816074j099968j058027R11045O84741l39070j692799
9507B6859041P45804K190731l01138P67999L060792K641018L278553N369772M382731
9498D8995303L585696M012677L529086M046226L270865K216637j891926l403744
9490F4360820m285045l512510m569002o404616o325359n775890m950277l285377
9482B5252744k388061j594101j159580j925521n12501k35165j659879j067003
9474A4710933k0308M26933o13024j097176o36257q22445L85419K04947j199445
$$ plain form
9465 11339577 9869707 9897992 11353480 10713678 10239164 7470687 6680442 9250789 8929265
9456 8929265 7351647 8360174 8969845 7652782 7646737 6855750 7613219 7586271 8799886
9447 8799886 9558830 7939375 5911526 5624677 6380036 6954847 7654954 7694207 7741692 7274824
9437 7274824 5086721 6276796 6916615 5179567 4866094 5881695 6142013 6076858 7533832
9428 7533832 7908535 5492098 4076772 3365609 2475399 4231954 4752170 4205847 5646283
9419 5646283 6213054 2974029 3464539 4640373 4993892 6078399 6433103 5407255 3889635
9410 3889635 3023309 3454600 4492270 5728488 6323925 5332234 5280627 5954277 6319746
9401 6319746 8530789 8388395 6046247 3329806 4155010 4121557 4644062 6124175 6626356
$$ packed form
9465A1339577j469870K8285J455488o39802m74514k768477p90245K570347l21524
9456H929265j577618J008527O09671j317063o045p90987P57469k6948J213615
9447H799886P58944j619455k027849k86849P55359N74811P00107L9253M7485m66868
9437G274824k188103J190075O39819j737048l13473J015601K60318o5155J456974
9428G533832L74703k416437j415326p11163q90210J756555N20216n46323J440436
9419E646283N66771l239025M90510J175834L53519J084507L54704j025848j517620
9410C889635q66326M31291J037670J236218N95437r91691n1607O73650L65469
9401F319746K211043j42394k342148k716441Q25204l3453N22505J480113N02181
$$ plain form
9392 6626356 6816856 6753324 4767058 3254386 2815838 4635624 5496913 4933582 6213278
9383 6213278 7297802 7199523 4933828 3352458 2775258 3502941 6103685 7716045 7820516
9374 7820516 7128454 6461714 4592519 5059114 8060732 10080885 11243717 10691386 9086194
9365 9086194 6751541 5764100 6641705 5665697 5530463 5970323 5885884 8251119 7873490
9356 7873490 5449221 4660076 5079802 3960907 4156533 3607419 5075639 6106300 5552525
9347 5552525 4925334 2833184 2470626 4034229 4062428 4845224 5496309 4341903 4697737
9338 4697737 6848434 6914596 6998238 7895022 7686363 8503000 9462731 8443831 9446841
9329 9446841 9383167 9216793 9506406 8786630 8936351 8429850 9182650 9530736 8849606 8817001
$$ packed form
9392F626356J90500o3532j986266j512672m38548J819786Q61289n63331J279696
9383F213278J084524r8279k265695j581370n77200P27683K600744J612360J04471
9374G820516o92062o66740j869195M66595L001618K020153J162832n52331j605192
9365I086194k334653r87441Q77605r76008j35234M39860q4439K365235l77629
9356G873490k424269p89145M19726j118895J95626n49114J468220J030661n53775
9347E552525o27191k092150l62558J563603K8199P82796O51085j154406L55834
9338D697737K150697O6162Q3642Q96784k08659Q16637R59731j018900J003010
9329I446841o3674j66374K89613p19776J49721n06501P52800L48086o81130l2605
$$ plain form
9319 8817001 9221688 7919601 7182212 7267960 6159739 7394813 6769254 6648534 7081190
9310 7081190 7113310 6196914 6266941 6103608 8014065 8191269 7140383 8123698 7862346 7905780
9300 7905780 8081992 7804267 7946877 8070991 7270707 7174560 8276641 7649483 9131273
9291 9131273 9851133 10524982 9816023 9829221 9810547 9999758 9874057 12226410 13799885 13665848
9281 13665848 13590243 12740834 13238973 14308008 15010369 15091966 16569080 17411901 19297870
9272 19297870 21144582 24574202 29416896 33591795 36574533 36117093 30663779 26594746
9264 26594746 28151192 29951391 31906595 33644043 32723292 29858927 23917153 19101693
9256 19101693 16849533 16645962 15591105 13786534 10209185 10388065 11328571 11649553 11046702
$$ packed form
9319H817001M04687j302087p37389Q5748j108221J235074o25559j20720M32656
9310G081190L2120r16396P0027j63333J910457J77204j050886R83315k61352M3434
9300G905780J76212k77725J42610J24114q00284r6147J102081o27158J481790
9291I131273P19860O73849p08959J3198j8674J89211j25701K352353J573475j34037
9281A3665848p5605q49409M98139J069035P02361Q1597J477114Q42821J885969
9272A9297870J846712L429620M842694M174899K982738m57440n453314m069033
9264B6594746J556446J800199J955204J737448r20751k864365n941774m815460
9256A9101693k252160k03571j054857j804571l577349J78880R40506L20982o02851
$$ plain form
9247 11046702 12153295 11451500 10875107 12340754 12458810 10822423 10122322 10983651 11160504
9238 11160504 11294038 10785515 9555404 10615118 10346630 11169428 10339252 10351330 9203475
9229 9203475 8611340 9580054 10421338 9561107 11163482 11324573 11004056 12404883 12782334
9220 12782334 12775600 15615327 18057032 16483750 14921245 15058069 13066424 12172588 14873709
9211 14873709 16229939 15507246 15450463 15491734 13993983 12757781 11871796 9701785 9159617
9202 9159617 10324523 10061469 10256766 9577549 8761545 8327679 10340856 9619692 8620406
9193 8620406 9761414 10900064 10589988 10361880 9580061 8554510 7659020 8525323 9239436
9184 9239436 8370196 8797188 9664414 9444652 8817409 8212538 9100375 9190817 10274368 10535773
$$ packed form
9247A1046702J106593p01795n76393J465647J18056j636387p00101Q61329J76853
9238A1160504J33534n08523j230111J059714k68488Q22798q30176J2078j147855
9229I203475n92135R68714Q41284q60231J602375J61091l20517J400827L77451
9220A2782334o734K839727K441705j573282j562505J36824j991645q93836K701121
9211A4873709J356230p22693n6783M1271j497751j236202q85985k170011n42168
9202I159617J164906k63054J95297o79217q16004m33866K013177p21164r99286
9193H620406J141008J138650l10076k28108p81819j025551q95490Q66303P14113
9184I239436q69240M26992Q67226k19762o27243o04871Q87837R0442J083551K61405
$$ plain form
9174 10535773 10281673 10443731 11333655 9958558 10479864 12261515 13057095 12122766 10421201
9165 10421201 9354853 9656292 11195479 12195650 13024754 13432729 13615088 12437281 11787117
9156 11787117 12412708 11661446 11450906 11285822 11915898 12883406 13096800 11373908 10297088
9147 10297088 10908360 11725769 11227197 12817548 13084667 11733242 12661332 13648785 13880893
9138 13880893 13628764 14897329 14662411 13512706 13193718 14374855 13334466 13009897 14296236
9129 14296236 15420665 16506851 16643369 15793903 17036437 16912395 17644769 20359664 20071975
9120 20071975 19269423 20223856 20477219 20890270 19853242 20988981 22812479 23040621 22578894
9111 22578894 21753040 22206201 22425276 22509844 24443843 25041854 24107808 25381560 26802029
$$ packed form
9174A0535773k54100J62058Q89924j375097N21306J781651P95580r34329j701565
9165A0421201j066348L01439J539187J000171Q29104M07975J82359j177807o50164
9156A1787117O25591p51262k10540j65084O30076R67508K13394j722892j076820
9147A0297088O11272Q17409m98572J590351K67119j351425R28090R87453K32108
9138A3880893k52129J268565k34918j149705l18988J181137j040389l24569J286339
9129A4296236J124429J086186J36518q49466J242534j24042P32374K714895k87689
9120B0071975q02552R54433K53363M13051j037028J135739J823498K28142m61727
9111B2578894q25854M53161K19075Q4568J933999N98011r34046J273752J420469
$$ plain form
9102 26802029 27564700 27896790 27615138 27793785 29464681 31558165 32442820 31970260 31335964
9093 31335964 30760975 31609219 32862189 33739566 33041109 34248013 35154395 35305606 35274600
9084 35274600 36896178 37493988 37656391 38571303 39424192 40051094 41791096 42933226 44207816
9075 44207816 45438939 46134061 46431423 48232175 51667392 54849455 56871552 59152061
9067 59152061 62141931 66204508 72404434 81298896 91111481 102280675 116528590 129129163
9059 129129163 131226584 125084703 117724093 112907881 113145268 117249887 124622706 136807883
9051 136807883 147039095 144156068 133775272 124911237 118398635 117528029 118267580 120587703
9043 120587703 126166994 131165035 128332638 123358726 120358165 119011374 117909845 117647235
$$ packed form
9102B6802029P62671L32090k81652J78647J670896K093484Q84655m72560o34296
9093C1335964n74989Q48244J252970Q77377o98457J206904R06382J51211l1006
9084C5274600J621578N97810J62403R14912Q52889O26902J740002J142130J274590
9075D4207816J231123O95122K97362J800752L435217L182063K022097K280509
9067E9152061K989870M062577O199926Q894462R812585J1169194J4247915J2600573
9059A29129163K097421o141881p360610m816212K37387M104619P372819J2185177
9051A36807883J0231212k883027j0380796q864035o512602q70606P39551K320123
9043A20587703N579291M998041k832397m973912l000561j346791j101529k62610
$$ plain form
9035 117647235 121660998 126029588 129080979 128086789 127291556 127257386 131293898 135550764 139997399
9026 139997399 146260464 155557690 168937548 186967163 209862541 228777577 234389567
9019 234389567 226044836 215224567 210877060 216055281 231921188 253831195 276888379
9012 276888379 290257304 288991873 275294500 260986557 251426155 249989353 250870502 254122879
9004 254122879 255078820 250910751 240553629 224546878 203603699 185622460 172704706
8997 172704706 164704859 161481644 160325147 153476210 140759143 126865605 117387706 110235709
8989 110235709 104415966 99065189 95380895 91927017 91059058 91478181 91191079 91732011 94331510
8980 94331510 99818676 105867438 111311143 113410572 112453769 109984977 108626887 109868029
$$ packed form
9035A17647235M013763M368590L051391r94190p95233l4170M036512M256866M446635
9026A39997399O263065R297226J3379858J8029615K2895378J8915036N611990
9019B34389567q344731j0820269m347507N178221J5865907K1910007K3057184
9012B76888379J3368925j265431j3697373j4307943r560402j436802Q81149L252377
9004B54122879R55941m168069j0357122j6006751k0943179j7981239j2917754
8997A72704706p999847l223215j156497o848937j2717067j3893538r477899p151997
8989A10235709n819743n350777l684294l453878q67959M19123k87102N40932K599499
8980I4331510N487166O048762N443705K099429r56803k468792j358090J241142
$$ plain form
8972 109868029 110808882 105103179 96789766 91110297 86496161 82485947 78585474 77074970
8964 77074970 78004129 78282667 77690788 76985336 78786770 79711562 81290508 79456994 78970088
8955 78970088 81450273 83871866 83955310 86405124 87378364 88337997 92361744 95476201 97754185
8946 97754185 103165057 110121905 116296351 122792024 133196890 145387860 161512994 178502455
8938 178502455 198259521 224987632 263090786 306205012 350585867 384300281 401153575
8931 401153575 398759093 382715917 358696410 339392320 338173886 349413865 333303372
8924 333303372 279305644 226137598 183649607 154425900 135119947 122265780 111806823
8917 111806823 104336255 98345639 91903877 87503812 85410132 83597921 80218314 78052709
$$ packed form
8972A09868029R40853n705703q313413n679469m614136m010214l900473j510504
8964G7074970R29159K78538n91879p05452J801434R24792J578946j833514m86906
8955G8970088K480185K421593Q3444K449814R73240R59633M023747L114457K277984
8946I7754185N410872O956848O174446O495673J0404866J2190970J6125134J6989461
8938A78502455J9757066K6728111L8103154M3114226M4380855L3714414J6853294
8931D01153575k394482j6043176k4019507j9304090j218434J1239979j6110493
8924C33303372n3997728n3168046m2487991k9223707j9305953j2854167j0458957
8917A11806823p470568n990616o441762m400065k093680j812211l379607k165605
$$ plain form
8909 78052709 76514848 76320629 76140053 75235407 76536485 76790006 79605460 84483798 88772166
8900 88772166 93207789 101515596 113003163 128857740 148475271 166944007 182013045
8893 182013045 188037409 181280424 165380750 143288716 119685111 98348768 82742359
8886 82742359 70655588 60617417 54108834 50082183 48519850 49285911 46389637 43132753
8878 43132753 40059326 38014252 37052989 35728583 35355748 34527406 33489544 31124668 29922800
8869 29922800 29860934 29760886 30257533 29354064 27101895 25871800 25496192 24706295 24063414
8860 24063414 22971990 21643339 22118980 23258072 22189803 20834201 20319860 19297898
8852 19297898 19353844 18298510 18282557 18694750 18356230 17514547 18290721 18081353 17782710 18972781
$$ packed form
8909G8052709j537861j94219j80576r04646J301078K53521K815454M878338M288368
8900H8772166M435623Q307807J1487567J5854577J9617531J8468736J5069038
8893A82013045O024364o756985j5899674k2092034k3603605k1336343j5606409
8886H2742359j2086771j0038171o508583m026651j562333P66061k896274l256884
8878D3132753l073427k045074r61263j324406l72835q28342j037862k364876j201868
8869B9922800o1866j00048M96647r03469k252169j230095l75608p89897o42881
8860B4063414j091424j328651M75641J139092j068269j355602n14341j021962
8852A9297898N5946j055334j5953M12193l38520q41683P76174k09368k98643J190071
$$ plain form
8842 18972781 20355266 19960796 18411849 17877368 18927100 18588950 18246589 18924876 20182631
8833 20182631 19942751 20280529 20587498 21580653 24712883 25594390 25246018 26595244 28394964
8824 28394964 32031868 35712186 39348389 43267901 45941087 46686361 43592334 38774490
8816 38774490 37264408 38513387 39851427 42642502 43946023 42192825 40159874 36131099
8808 36131099 31387191 28458711 26405276 24561721 22789942 23287609 22937990 22803506 23461264
8799 23461264 25022008 25718231 27846405 28911740 29391872 33159503 38996940 41340345
8791 41340345 42318385 43116187 43157499 43914422 47849258 51956377 55820217 59474595 58085128
8782 58085128 53426033 48812783 44823877 45428242 46582075 45556383 43771759 40517435
$$ packed form
8842A8972781J382485l94470j548947n34481J049732l38150l42361O78287J257755
8833B0182631k39880L37778L06969R93155L132230Q81507l48372J349226J799720
8824B8394964L636904L680318L636203L919512K673186P45274l094027m817844
8816C8774490j510082J248979J338040K791075J303521j753198k032951m028775
8808C6131099m743908k928480k053435j843555j771779M97667l49619j34484O57758
8799B3461264J560744O96223K128174J065335M80132L767631N837437K343405
8791D1340345R78040P97802M1312P56923L934836M107119L863840L654378j389467
8782E8085128m659095m613250l988906O04365J153833j025692j784624l254324
$$ plain form
8774 40517435 35176884 30607935 25858093 23600623 22020349 21086686 19742390 19855972
8766 19855972 21626420 20483956 18050020 17582795 18238451 19924573 21846769 23176619
8758 23176619 25228455 27092062 30282625 31067473 30296212 28913181 25109650 24230370 25938317
8749 25938317 26947350 28252627 29538974 27023627 23037868 18920680 16867046 13587794
8741 13587794 11443295 12300520 11106644 10270431 10817634 10225208 10160165 8767412 6028299
8732 6028299 5771392 8112514 9721266 8727144 8655807 7975290 7322389 6729887 7015285
8723 7015285 6214182 6243423 7046320 6085211 5244304 6117238 6869713 7448967 6535372 4792370
8713 4792370 5102299 5265135 5708162 6604409 5980647 5246272 4790449 5338811 5790407 7216600
$$ packed form
8774D0517435n340551m568949m749842k257470j580274r33663j344296J13582
8766A9855972J770448j142464k433936m67225O55656J686122J922196J329850
8758B3176619K051836J863607L190563P84848p71261j383031l803531q79280J707947
8749B5938317J009033J305277J286347k515347l985759m117188k053634l279252
8741A3587794k144499Q57225j193876q36213N47203n92426o5043j392753k739113
8732F028299k56907K341122J608752r94122p1337o80517o52901n92502K85398
8723G015285q01103K9241Q02897r61109q40907Q72934P52475N79254r13595j743002
8713D792370L09929J62836M43027Q96247o23762p34375m55823N48362M51596J426193
$$ plain form
8703 7216600 5256504 5290769 5065855 4276496 3137689 4629187 5652000 4717372 4241141
8694 4241141 4832043 5032339 4435083 4483286 5136991 5461414 6300583 5586175 5324890 6321436
8684 6321436 7578527 6874702 5213793 4680759 5457035 6206218 7892876 6800228 4680652
8675 4680652 4244596 5014701 5453987 5284989 5432233 4804952 4603105 3106806 2261027
8666 2261027 2466417 3277970 2526911 2938506 3442345 3461816 4008557 4345746 4534624 3034850
8656 3034850 2718551 2890770 3718522 4638964 3956436 4173807 4235936 3294137 1936237 3153407
8646 3153407 1889357 2870190 2950430 2557594 2941124 4031676 4922796 5010619 3761350
8637 3761350 2237300 2657030 2108663 3201803 2534298 1279875 2519930 2860601 3853114
$$ packed form
8703G216600j960096L4265k24914p89359j138807J491498J022813r34628m76231
8694D241141N90902K00296n97256M8203O53705L24423Q39169p14408k61285R96546
8684F321436J257091p03825j660909n33034P76276P49183J686658j092648k119576
8675D680652m36056P70105M39286j68998J47244o27281k01847j496299q45779
8666B261027K05390Q11553p51059M11595N03839J9471N46741L37189J88878j499774
8656C034850l16299J72219Q27752R20442o82528K17371O2129r41799j357900J217170
8646C153407j264050R80833Q0240l92836L83530J090552Q91120Q7823j249269
8637C761350j524050M19730n48367J093140o67505j254423J240055L40671R92513
$$ plain form
8628 3853114 4638530 4391456 3073751 2796269 3248977 2774150 1571137 2366828 1988961
8619 1988961 1308666 1891827 2318096 3252929 2740343 1592274 939231 2508753 2364854
8610 2364854 2379151 2429501 3540629 4727584 4594185 5005857 3732722 3033124 2462619
8601 2462619 1615067 1212131 2121701 2713021 2680994 1789168 970152 1747607 2955733 3768397
8591 3768397 2828773 2678512 2050501 924582 459831 1103738 2354504 3379780 2755058
8582 2755058 2951719 1556857 -86206 1124870 694151 31493 -458143 1094592 1066762
8573 1066762 875744 2129692 3299244 2241577 1005817 1338842 864477 1644254 2050633
8564 2050633 1899068 2334854 3887784 3863572 2180150 2173171 2618210 1785297 222232 1358148
$$ packed form
8628C853114P85416k47074j317705k77482M52708m74827j203013P95691l77867
8619A988961o80295N83161M26269R34833n12586j148069o53043J569522j43899
8610B364854J4297N0350J111128J186955j33399M11672j273135o99598n70505
8601B462619q47552m02936R09570N91320l2027q91826q19016P77455J208126Q12664
8591C768397r39624j50261o28011j125919m64751O43907J250766J025276o24722
8582B755058J96661j394862j643063J211076m30719o62658m89636J552735k7830
8573A066762j91018J253948J169552j057667j235760L33025m74365P79777M06379
8564B050633j51565M35786J552930k4212j683422o979M45039q32913j563065J135916
$$ plain form
8554 1358148 2186279 2600877 2163810 2338558 627448 -200904 1775996 1702431 2429555
8545 2429555 1577221 215721 550827 1091708 1752204 2000703 2512146 2538820 2670889 2828918
8535 2828918 1990693 277062 -1240067 372535 1693948 1840494 3559079 4215466 3643393
8526 3643393 3239246 2672464 1334028 566872 2163439 3599961 2533309 2721173 2644331
8517 2644331 2283567 2418653 2519375 2479361 2504498 1286743 377781 375518 700065 -681144
8507 -681144 -1205004 -313686 884451 1131788 -93534 -845558 -465363 328445 697939
8498 697939 261900 873569 787256 630794 1983283 2283824 1339225 518754 1409636 -261810
8488 -261810 -563368 903824 1552135 2263860 3202443 2774795 2915349 2043169 2017851 2081823
$$ packed form
8554A358148Q28131M14598m37067J74748j711110q28352J976900p3565P27124
8545B429555q52334j361500L35106N40881O60496K48499N11443K6674J32069J58029
8535B828918q38225j713631j517129J612602J321413J46546J718585O56387n72073
8526C643393m04147n66782j338436p67156J596567J436522j066652J87864p6842
8517B644331l60764J35086J00722m0014K5137j217755r08962k263L24547j381209
8507f81144n23860Q91318J198137K47337j225322p52024L80195P93808L69494
8498F97939m36039O11669q6313j56462J352489L00541r44599q20471Q90882j671446
8488b61810l01558J467192O48311P11725R38583m27648J40554q72180k5318O3972
$$ plain form
8478 2081823 1162639 1511716 3345821 3360013 3979217 1944730 299268 610784 1716508
8469 1716508 2444984 2732694 1105115 693437 425034 674440 844501 827620 874588 -286456
8459 -286456 -940752 -624116 -728293 -1337491 -500389 110462 531508 179440 -679226 973896
8449 973896 2957876 4842867 3786123 2685706 2663090 3108754 1704736 -477113 -16632
8440 -16632 1788512 1705461 -264142 578052 668754 2783095 1789383 -168591 -642397 1326104
8430 1326104 3438149 3100443 1913400 1465515 3018784 1838239 -292001 -1492184 84967
8421 84967 762688 -159859 985625 2265796 3530152 3691876 1644986 167840 329763
8412 329763 1623770 3033139 2193930 1845717 2871883 3181557 2329164 1550959 1554032 1619406
$$ packed form
8478B081823r19184L49077J834105J4192O19204k034487j645462L11516J105724
8469A716508P28476K87710j627579m11678k68403K49406J70061j6881M6968j161044
8459b86456o54296L16636j04177o09198Q37102O10851M21046l52068q58666J653122
8449I73896J983980J884991j056744j100417k2616M45664j404018k181849M60481
8440a6632J805144q3051j969603Q42194R0702K114341r93712j957974m73806J968501
8430A326104K112045l37706j187043m47885J553269j180545k130240j200183J577151
8421H4967O77721r22547J145484J280171J264356J61724k046890j477146J61923
8412C29763J294007J409369q39209l48213J026166L09674q52393p78205L073O5374
$$ plain form
8402 1619406 1265904 -23541 1727823 3561580 2819806 1836898 -116976 -1092471 -320065
8393 -320065 307630 -150600 1053869 916949 1748521 1154841 575263 93831 116015 268278
8383 268278 427857 548328 821659 1956020 2889818 2275773 1514218 -337382 -1544695
8374 -1544695 -1402470 113808 18150 2147552 2424801 796996 628629 1220704 1582196
8365 1582196 2350873 2294938 1271340 2680329 4216690 3550906 1682812 65269 1009610
8356 1009610 1076918 -72509 838347 2201930 3398505 2117920 303300 -1090339 201982
8347 201982 1944562 2127850 1275599 1377357 674169 -136656 1069329 1451391 926563
8338 926563 -50148 -907395 -894819 -595716 1575514 1498301 1728461 138634 -561110 -676965
$$ packed form
8402A619406l53502j289445J751364J833757p41774r82908j953874r75495P72406
8393c20065O27695m58230J204469j36920Q31572n93680n79578m81432K2184J52263
8383B68278J59579J20471K73331J134361R33798o14045p61555j851600j207313
8374a544695J42225J516278r5658K129402K77249j627805j68367N92075L61492
8365A582196P68677n5935j023598J408989J536361o65784j868094j617543R44341
8356A009610O7308j149427R10856J363583J196575j280585j814620j393639J292321
8347B01982J742580J83288q52251J01758p03188q10825J205985L82062n24828
8338I26563r76711q57247J2576K99103K171230p7213K30160j589827o99744j15855
$$ plain form
8328 -676965 -383327 405553 419800 1585343 2811950 1706474 862304 730917 264267
8319 264267 546229 1547714 942099 1852711 2829802 2527551 2490854 1179707 162125
8310 162125 939495 1898427 1872851 114399 -776358 355947 -283121 799395 1233249
8301 1233249 447990 1451649 2128126 592267 -194268 594771 359610 1160549 2552271
8292 2552271 1499054 739497 1069343 2882182 2124023 1610400 3029475 3236730 3859154
8283 3859154 4097088 2914732 1503509 1814799 2987650 3702188 4182866 2656515 1298762
8274 1298762 1812954 2501984 1430905 1835039 2133157 1078597 961015 598542 604471 1043243
8264 1043243 2393188 2323917 1181802 -1478707 -2063326 -1166254 -278362 1038250 1144687
$$ packed form
8328f76965K93638P88880J4247J165543J226607j105476q44170j31387m66650
8319B64267K81962J001485o05615R10612R77091l02251l6697j311147j017582
8310A62125P77370R58932k5576j758452q90757J132305o39068J082516M33854
8301A233249p85259J003659O76477j535859p86535P89039k35161Q00939J391722
8292B552271j053217p59557L29846J812839p58159n13623J419075K07255O22424
8283C859154K37934j182356j411223L11290J172851P14538M80678j526351j357753
8274A298762N14192O89030j071079M04134K98118j054560j17582l62473N929M38772
8264A043243J349945o9271j142115k660509n84619Q97072Q87892J316612J06437
$$ plain form
8255 1144687 1888980 320653 -515505 126365 -963790 119305 1710328 960847 1916154
8246 1916154 964438 -1252735 1735800 2644500 1562224 1497973 1046841 979590 542361
8237 542361 26874 1088741 904166 733479 322280 -191271 -643086 114936 -438121 1049054
8227 1049054 1776786 -313325 -1572053 -489133 1306303 315920 779781 -35462 -926305
8218 -926305 794608 1578667 871527 549607 1933713 1897905 2540422 2753579 4287976
8209 4287976 2860069 2312590 3115487 2644303 1700653 1423288 1910677 3210505 3999510
8200 3999510 2391332 351669 427728 1951445 1571353 -477194 29212 -3766324 -11839938
8191 -11839938 -204195 2070710 -46897 1696025 1232635 1097155 1687595 1981770 1796440
$$ packed form
8255A144687P44293j568327q36158O41870j090155J083095J591023p49481R55307
8246A916154r51716k217173K988535R08700j082276o4251m51132o7251m37229
8237E42361n15487J061867j84575j70687m11199n13551m51815P58022n53057J487175
8227A049054P27732k090111j258728J082920J795436r90383M63861q15243q90843
8218i26305J720913P84059p07140l21920J384106l5808O42517K13157J534397
8209D287976j427907n47479Q02897m71184r43650k77365M87389J299828P89005
8200C999510j608178k039663P6059J523717l80092k048547N06406l795536q073614
8191a1839938J1635743K274905k117607J742922m63390j35480N90440K94175j85330
$$ plain form
8182 1796440 -123107 -782855 956450 2482884 3537399 3188465 500761 -80994 1419502
8173 1419502 2035802 1127099 2283348 935007 -1016661 134282 -560549 -143212 1098663
8164 1098663 2276138 669696 1715198 1048039 -754334 -97036 3326829 3096528 2134642
8155 2134642 2153146 548700 -827224 -1187727 -1032757 -910192 -305242 -658916 -725761 -391686
8145 -391686 795788 601883 260496 2247311 2547822 1969242 358506 -307191 -512594
8136 -512594 1856157 1787914 -2103 -109147 835177 -35663 320995 632349 -205645 1774352
8126 1774352 2667760 1483600 705018 1069389 1025709 371571 -373607 107976 902370 846598
8116 846598 352093 -397273 203008 186313 335452 -18807 482925 809066 575577 1283566
$$ packed form
8182A796440j919547o59748J739305J526434J054515l48934k687704n81755J500496
8173A419502O16300r08703J156249j348341j951668J150943o94831M17337J241875
8164A098663J177475j606442J045502o67159j802373O57298L423865k30301r61886
8155B134642J8504j604446j375924l60503J54970J22565O04950l53674o6845L34075
8145c91686J187474j93905l41387J986815L00511n78580j610736o65697k05403
8136e12594K368751o8243j790017j07044R44324q70840L56658L11354q37994J979997
8126A774352Q93408j184160p78582L64371m3680o54138p45178M81583P94394n5772
8116H46598m94505p49366O00281j6695J49139l54259N01732L26141k33489P07989
$$ plain form
8106 1283566 550044 124282 -371538 -71815 -1516170 -717512 166712 180100 -1323680
8097 -1323680 -1386225 644194 2320651 2272229 1047703 1245184 2778831 3225073 1533476
8088 1533476 1740241 1140079 2278999 2487795 2617512 1760421 -1088 448352 2411913
8079 2411913 3269208 1822967 914639 -246878 -654291 340884 1749570 2471440 2319101
8070 2319101 1303050 -433100 -1046831 -1772876 -1021198 -257620 -537587 -1356144 -1100577
8061 -1100577 -502069 -391773 -1470955 -1966921 232973 375449 917175 38248 1985567
8052 1985567 2501797 1812715 1403577 158935 598569 2784596 2799064 2060700 2320394
8043 2320394 437997 378718 680170 1621148 601868 -293408 454021 1498252 64432
$$ packed form
8106A283566p33522m25762m95820K99723j444355P98658Q84224J3388j503780
8097a323680o2545K030419J676457m8422j224526J97481J533647M46242j691597
8088A533476K06765o00162J138920K08796J29717q57091j761509M49440J963561
8079B411913Q57295j446241r08328j161517m07413R95175J408686P21870j52339
8070B319101j016051j736150o13731p26045P51678P63578k79967q18557K55567
8061a100577N98508J10296j079182m95966K199894J42476N41726q78927J947319
8052A985567N16230o89082m09138j244642M39634K186027J4468p38364K59694
8043B320394j882397n9279L01452R40978j019280q95276P47429J044231j433820
$$ plain form
8034 64432 679601 2820669 759874 -867904 -1282445 -368582 -480286 -277323 672011
8025 672011 1663381 1580784 925011 262040 -297120 494898 1428184 1763275 1637381 1285073
8015 1285073 1266913 3349728 3793037 1812175 -701453 -242829 1424073 1636559 1885333
8006 1885333 1230194 1244542 419053 292351 1683579 3403884 2185683 -396781 -997981
7997 -997981 -847315 289414 1142140 767124 -1022331 -2437888 -2075271 -344307 -71518
7988 -71518 -147929 -1103291 -642723 628478 2273237 1810206 1052646 1550688 847915 1519550
7978 1519550 874364 1025108 21667 1171089 1559764 1004152 1496223 2108819 924328
7969 924328 875538 1440374 835511 484326 836357 1070477 -275746 -34339 -546571 -1949666
$$ packed form
8034F4432O15169K141068k060795j627778m14541R13863j11704K02963R49334
8025F72011R91370q2597o55773o62971n59160P92018R33286L35091j25894l52308
8015A285073j8160K082815M43309j980862k513628M58624J666902K12486K48774
8006A885333o55139J4348q25489j26702J391228J720305j218201k582464o01200
7997i97981J50666J136729Q52726l75016j789455j415557L62617J730964K72789
7988g1518p6411r55362M60568J271201J644759m63031p57560M98042p02773O71635
7978A519550o45186J50744j003441J149422L88675n55612M92071O12596j184491
7969I24328m8790N64836o04863l51185L52031K34120j346223K41407n12232j403095
$$ plain form
7959 -1949666 -1572390 -814136 -1821639 -1686532 -919380 2843 1609644 1959615 -58292
7950 -58292 -443569 935769 1020886 687336 655829 1477944 2209436 608001 -35887 1244272
7940 1244272 3447527 3466696 1759551 -92915 458141 3310685 5892574 4945682 1922914
7931 1922914 2308912 3013121 3301655 3015251 2915812 2874829 3459326 1516243 294897 347700
7921 347700 607131 2213314 2220714 2057647 672311 1412772 3212133 2624016 767979
7912 767979 370378 -726665 -915156 133404 1170775 474512 112568 165051 -605671
7903 -605671 685126 2656750 1752063 764556 1070818 -90265 62807 2266908 1549993
7894 1549993 961678 71284 -64436 369895 1192065 1589120 1192374 1043480 610448 799284
$$ packed form
7959a949666L77276P58254j007503J35107P67152R22223J606801L49971k017907
7950e8292l85277J379338Q5117l33550l1507Q22115P31492j601435o43888J280159
7940A244272K203255J9169j707145j852466N51056K852544K581889r46892l022768
7931A922914L85998P04209K88534k86404r9439m0983N84497j943083j221346N2803
7921C47700K59431J606183P400j63067j385336P40461J799361n88117j856037
7912G67979l97601j097043j88491J048560J037371o96263l61944N2483p70722
7903f05671J290797J971624r04687r87507L06262j161083J53072K204101p16915
7894A549993n88315q90394j35720M34331Q22170L97055l96746j48894m33032J88836
$$ plain form
7884 799284 1423459 3698402 1603209 733999 2062818 2194810 1102056 749856 -703842
7875 -703842 -1141035 -281557 150889 543238 47223 230862 1304937 2046278 1951075 1795800
7865 1795800 2147181 1364849 -486847 -1787708 -1143471 546184 896053 2036012 1492058
7856 1492058 -546861 -700594 -1042592 -81214 2245175 2194231 1924258 1815044 1056161
7847 1056161 1783567 2274422 1666042 2332669 3277243 3553395 2642901 1436369 1156292
7838 1156292 2296106 2779968 3099875 3979464 4686202 3129929 1002475 1810204 1867658
7829 1867658 1332847 1457794 2045837 1503371 1185609 1568898 2103295 3264033 4193593
7820 4193593 2863279 -863747 -835242 874165 734854 1944130 736368 -1211997 653128
$$ packed form
7884G99284O24175K274943k095193q69210J328819J31992j092754l52200j453698
7875g03842m37193Q59478M32446L92349m96015J83639J074075P41341r5203j55275
7865A795800L51381p82332j851696j300861O44237J689655L49869J139959n43954
7856A492058k038919j53733l41998R61378K326389n0944k69973j09214p58883
7847A056161P27406M90855o08380O66627R44574K76152r10494j206532k80077
7838A156292J139814M83862L19907Q79589P06738j556273k127454Q07729N7454
7829A867658n34811J24947N88043n42466l17762L83289N34397J160738R29560
7820D193593j330314l727026K8505J709407j39311J209276j207762j948365J865125
$$ plain form
7811 653128 1670288 -925948 -1523383 -1125173 53341 1297531 1380877 -260441 2226747
7802 2226747 5652721 1368488 1353964 1771397 1399070 1307384 1179182 163858 1255323
7793 1255323 1806869 759400 2870194 2859801 1265344 162995 475529 2041499 2437407
7784 2437407 1181917 975526 -632909 819665 2019079 3094640 2734092 1099889 153929
7775 153929 287208 352117 -396716 289329 1533981 1827435 949968 2517286 2288200 638978
7765 638978 800053 1225193 2374559 1933160 669030 -187511 1315725 1060883 -1173306
7756 -1173306 133596 2928382 4331425 2422418 788018 -654962 366035 713681
7748 713681 1235685 -281966 -695615 778790 655943 -192021 -161607 604307 474067 907583
$$ packed form
7811F53128J017160k596236n97435L98210J178514J244190Q3346j641318K487188
7802B226747L425974m284233j4524M17433l72327r1686j28202j015324J091465
7793A255323N51546j047469K110794j0393j594457j102349L12534J565970L95908
7784B437407j255490k06391j608435J452574J199414J075561l60548j634203r45960
7775A53929J33279O4909p48833O86045J244652K93454q77467J567318k29086j649222
7765F38978J61075M25140J149366m41399j264130q56541J503236k54842k234189
7756a173306J306902K794786J403043j909007j634400j442980J020997L47646
7748G13681N22004j517651m13649J474405j22847q47964L0414P65914j30240M33516
$$ plain form
7738 907583 -498005 -700265 -587928 1913388 1147937 176476 156192 -190804 543958 59007
7728 59007 -203431 -295119 568123 761087 2722216 1802715 1177924 1679761 408413 1582555
7718 1582555 2316654 2470236 3659358 3026896 -452895 -1425569 739376 2555777 566426
7709 566426 261087 1984096 1521605 1032248 -183733 208810 2694903 3595091 285634
7700 285634 106661 721254 662425 881334 762672 2116741 1817448 365582 386239 1362392
7690 1362392 -744125 -990352 700201 1700498 3435776 2475937 712232 1126003 2900529
7681 2900529 2028744 2303190 1551627 740355 1341956 3899024 3659943 2006038 972515
7672 972515 450032 1139062 1239328 2013739 809382 643174 839924 771910 254794 -1323745
$$ packed form
7738I07583j405588k02260J12337K501316p65451r71461k0284l46996P34762m84951
7728E9007k62438r1688Q63242J92964J961129r19501o24791N01837j271348J174142
7718A582555P34099J53582J189122o32462l479791r72674K164945J816401j989351
7709E66426l05339J723009m62491m89357j215981L92543K486093R00188l309457
7700B85634j78973O14593n8829K18909j18662J354069k99293j451866K0657R76153
7690A362392k106517k46227J690553J000297J735278r59839j763705M13771J774526
7681B900529q71785K74446p51563q11272O01601K557068k39081j653905j033523
7672I72515n22483O89030J00266P74411j204357j66208J96750o8014n17116j578539
$$ plain form
7662 -1323745 -2938051 -2158277 537018 399102 -77793 258524 386562 -794638 -1429745
7653 -1429745 -1436958 -1250255 -515575 393020 473538 -120271 1342296 1675828 2079033 1937088
7643 1937088 717328 378521 787769 875848 1440389 1073209 1474044 215808 -723536
7634 -723536 1012229 2345624 -100014 -430876 3493357 4919256 2596773 983142 1475912
7625 1475912 526349 1196708 638195 -599438 127239 418092 61615 -1141006 -1211259
7616 -1211259 -833437 870546 2224778 722231 -937369 246009 3287363 1025896
7608 1025896 -92647 1496990 2453210 2866439 1953943 1622633 456257 1654293 1655594
7599 1655594 1211855 1108810 3038418 1537574 1126372 2662616 1243869 1277342 853661
$$ packed form
7662a323745j614306P79774K695295j37916m76895L36317J28038j181200o35107
7653a429745p213J86703P34680R08595Q0518n93809J462567L33532M03205j41945
7643A937088j219760l38807M09248Q8079N64541l67180M00835j258236r39344
7634g23536J735765J333395k445638l30862L924233J425899k322483j613631M92770
7625A475912r49563O70359n58513j237633P26677K90853l56477j202621p0253
7616a211259L77822J703983J354232j502547j659600J183378L041354k261467
7608A025896j118543J589637R56220M13229r12496l31310j166376J198036J301
7599A655594m43739j03045J929608j500844m11202J536244j418747L3473m23681
$$ plain form
7590 853661 -676462 -378723 337277 -227984 -100360 442625 315407 462343 414404 347049
7580 347049 420620 -309935 -616739 -1087499 -1210112 616123 2649252 1723013 867877 81422
7570 81422 48461 -62055 419582 -131342 -745541 1231158 3432077 2309396 293856
7561 293856 -141853 295254 1256491 2969417 2452120 2323093 3650777 3095430 1272589
7552 1272589 79870 138143 -586398 138394 204681 98709 214278 774974 -897097 -879931
7542 -879931 809257 2543531 3164402 1272424 606382 -803468 445537 1506704 615700
7533 615700 794963 1076827 1295551 353071 235446 196054 739147 1607402 1473518 1484478
7523 1484478 1228555 1064357 785088 696371 1721439 2848021 1732815 1694956 -383526
$$ packed form
7590H53661j530123K97739P16000n65261J27624N42985j27218J46936m7939o7355
7580C47049P3571p30555l06804m70760j22613J826235K033129r26239q55136p86455
7570H1422l2961j10516M81637n50924o14199J976699K200919j122681k015540
7561B93856m35709M37107R61237J712926n17297j29027J327684n55347j822841
7552A272589j192719N8273p24541P24792O6287j05972J15569N60696j672071J7166
7542h79931J689188J734274O20871j891978o66042j409850J249005J061167q91004
7533F15700J79263K81864K18724r42480j17625l9392N43093Q68255j33884J0960
7523A484478k55923j64198k79269q8717J025068J126582j115206l7859k078482
$$ plain form
7514 -383526 -906434 -2218816 -1994564 -945310 555575 2333887 3233722 3238456 1360729
7505 1360729 370117 204413 988805 -2482 -242667 1583727 2987861 1280486 -168853
7496 -168853 -784173 -875861 148800 793268 2248987 3107014 2644547 474924 212695
7487 212695 2833382 4681417 3339108 1409221 1963487 775695 1019916 1438226 -246755
7478 -246755 -618019 994427 780927 891157 836646 1299209 1860277 2196469 1455443 1137497
7468 1137497 2322978 2407619 2021966 589399 510431 1188266 2496786 2148006 -218037
7459 -218037 -693353 -1119810 -1066955 1153040 2367452 2066294 1956084 1687705 1331396 546610
7449 546610 311179 -39577 201494 -879562 -338269 1252652 1992433 1490376 -172864
$$ packed form
7514c83526n22908j312382K24252J049254J500885J778312Q99835M734j877727
7505A360729r90612j65704P84392r91287k40185J826394J404134j707375j449339
7496a68853o15320r1688J024661O44468J455719Q58027m62467k169623k62229
7487B12695K620687J848035j342309j929887N54266j187792K44221M18310j684981
7478b46755l71264J612446k13500J10230n4511M62563N61068L36192p41026l17946
7468A137497J185481Q4641l85653j432567p8968O77835J308520l48780k366043
7459b18037m75316m26457N2855K219995J214412l01158j10210k68379l56309p84786
7449E46610k35431l50756K41071j081056N41293J590921P39781n02057j663240
$$ plain form
7440 -172864 275076 -219102 -221635 444413 1173826 2100783 2081897 1086569 720583 1383698
7430 1383698 3037499 2802439 618427 -703353 -950357 -318428 1681015 1196825 507944
7421 507944 1174768 928077 165249 1250268 944882 971023 1654942 1591029 496874 1367424
7411 1367424 2648937 2956352 2619429 840464 -423955 -500344 1879101 2039557 851778
7402 851778 758830 1241167 1533298 2170762 2444293 1764674 1973815 3027510 1916879 -41624
7392 -41624 2257692 2734518 2304895 2403303 1502894 1115897 1587028 1185916 163866 1498183
7382 1498183 1575335 1562401 1351259 2407897 2268870 1997643 803246 609769 27871 255942
7372 255942 1895233 159850 564239 1443221 970389 70116 1826828 2295122 1488869
$$ packed form
7440a72864M47940m94178k533O66048P29413R26957j8886r95328l65986O63115
7430A383698J653801k35060k184012j321780k47004O31929J999443m84190o88881
7421E07944O66824k46691p62828J085019l05386K6141O83919o3913j094155Q70550
7411A367424J281513L07415l36923j778965j264419p6389K379445J60456j187779
7402H51778r2948M82337K92131O37464K73531o79619K09141J053695j110631j958503
7392d1624K299316M76826m29623R8408r00409l86997M71131m01112j022050J334317
7382A498183P7152j2934k11142J056638j39027k71227j194397j93477n81898K28071
7372B55942J639291j735383M04389Q78982m72832r00273J756712M68294q06253
$$ plain form
7363 1488869 2612539 2741832 1919094 2890462 4258338 2290752 3184369 1961974 1360356
7354 1360356 1173184 2566028 2001187 742237 2155364 2724326 1866401 -434652 -869195
7345 -869195 -222563 2602113 3758475 1848978 449408 1811482 3646172 2407298 863606
7336 863606 -646786 -19752 1660500 1499582 -754688 -451464 1140055 303920 213799
7327 213799 334304 1785869 2169727 1888144 1287440 1029494 512746 1153494 1290296 310845
7317 310845 534326 68430 -33651 916799 2026175 487876 780635 1822184 1221900
7308 1221900 378075 1379622 1367801 731561 1458780 -647830 -494913 1045158 1964646
7299 1964646 2198596 2324394 1178610 -208982 837145 1318830 956788 2750461 3084606
$$ packed form
7363A488869J123670J29293q22738R71368J367876j967586Q93617j222395o01618
7354A360356j87172J392844n64841j258950J413127N68962q57925k301053m34543
7345h69195O46632K824676J156362j909497j399570J362074J834690j238874j543692
7336H63606j510392O27034J680252j60918k254270L03224J591519q36135r0121
7327B13799J20505J451565L83858k81583o00704k57946n16748O40748J36802r79451
7317C10845K23481m65896j02081R50450J109376j538299K92759J041549o00284
7308A221900q43825J001547j1821o36240P27219k106610J52917J540071R19488
7299A964646K33950J25798j145784j387592J046127M81685l62042J793673L34145
$$ plain form
7290 3084606 2176931 1895022 685139 1923938 3180448 2534122 1271124 -223411 1024776
7281 1024776 1345631 857417 2146089 4507595 3307489 2497628 1980891 60537 -479316
7272 -479316 135521 1936097 1742494 1855654 2444940 1448599 1937474 731823 18499
7263 18499 500063 -102685 -1108900 556429 183272 -536287 -50452 314206 201195 -449980
7253 -449980 177333 1090272 1338589 1409784 998693 530462 1572724 2789961 2702357 2897349
7243 2897349 1732860 412550 254377 307836 1331649 1510012 1359004 2711744 2658995
7234 2658995 1522071 1153247 1682529 1564419 740568 1049266 2013160 2472238 1996130
7225 1996130 1212253 -318831 718582 943406 906488 1924644 1390937 203840 1182190
$$ packed form
7290C084606r07675k81909j209883J238799J256510o46326j262998j494535J248187
7281A024776L20855m88214J288672K361506j200106q09861n16737j920354n39853
7272d79316O14837J800576j93603J13160N89286r96341M88875j205651p13324
7263A8499M81564o02748j006215J665329l73157p19559M85835L64658j13011o51175
7253d49980O27313R12939K48317P1195m11091m68231J042262J217237q7604J94992
7243B897349j164489j320310j58173N3459J023813J78363j51008J352740n2749
7234B658995j136924l68824N29282j18110q23851L08698R63894M59078m76108
7225A996130p83877j531084J037413K24824l6918J018156n33707j187097R78350
$$ plain form
7216 1182190 822142 165405 -159166 2981285 3303599 1923204 1311560 813847 1482139
7207 1482139 1696155 582360 -889785 469965 1452078 2773843 2448249 444537 -356079
7198 -356079 934474 890293 75692 771843 618601 2028117 136596 -502760 122632
7189 122632 1510614 1128510 1026108 683993 543592 -264706 -896787 407500 292850
7180 292850 -298420 447782 1715141 984629 928340 -579278 -399752 725738 1363485
7171 1363485 2407322 1884718 783787 -474178 -658959 -1059242 -1213990 -361459 2633064
7162 2633064 4079499 1704328 286133 -919159 -412100 834728 2565032 1093904
7154 1093904 1146178 1614629 1586171 282098 432072 -148958 -25815 -1230600 47813
$$ packed form
7216A182190l60048o56737l24571L140451L22314j380395o11644m97713O68292
7207A482139K14016j113795j472145J359750R82113J321765l25594k003712q00616
7198c56079J290553m4181q14601O96151j53242J409516j891521o39356O25392
7189A22632J387982l82104j02402l42115j40401q08298o32081J304287j14650
7180B92850n91270P46202J267359p30512n6289j507618J79526J125490O37747
7171A363485J043837n22604j100931j257965j84781m00283j54748Q52531K994523
7162B633064J446435k375171j418195j205292N07059J246828J730304j471128
7154A093904N2274M68451k8458j304073J49974n81030J23143j204785J278413
$$ plain form
7145 47813 1921792 2005723 2386251 2692020 3397715 1784219 1707231 1134067 1075292 1344228
7135 1344228 -139450 -183271 580547 726246 1091369 1022780 -970314 -1738545 -1192184 1335260
7125 1335260 2633946 1946293 1827350 -362884 648763 2070554 1419495 -960025 -498497
7116 -498497 -782597 132669 497797 467497 354513 919039 855306 -24028 521173 752539
7106 752539 2321654 1968270 1495008 197824 181191 1317065 778851 605586 1773476
7097 1773476 1593422 1091731 1086883 -26253 739029 1167525 737293 619711 1460407 1049996
7087 1049996 1443626 1197275 36880 39771 1054736 311238 -692780 948685 1182408
7078 1182408 -388388 -688614 485084 2021189 2906374 1729262 434824 1470872 661001
$$ packed form
7145D7813J873979Q3931L80528L05769P05695j613496p6988n73164n8775K68936
7135A344228j483678m3821P63818J45699L65123o8589j993094p68231N46361K527444
7125A335260J298686o87653j18943k190234J011647J421791o51059k379520M61528
7116d98497k84100R15266L65128l0300j12984N64526o3733q79334N45201K31366
7106G52539J569115l53384m73262j297184j6633J135874n38214j73265J167890
7097A773476j80054n01691m848j113136P65282M28496m30232j17582Q40696m10411
7087A049996L93630k46351j160395K891J014965p43498j004018J641465K33723
7078A182408j570796l00226J173698J536105Q85185j177112j294438J036048q09871
$$ plain form
7069 661001 -730989 314837 1143080 505689 -502273 171977 741297 1550305 489136
7060 489136 594077 955583 2085443 1757692 2080749 1510977 -277774 -1319806 -197483
7051 -197483 1959603 729312 1545459 1633683 731354 509762 933184 612704 -442517
7042 -442517 1358632 554117 775147 1358286 1320150 2352607 3650242 2944475 -191297
7033 -191297 -868690 1366597 2079590 1722161 1898167 2112281 2224693 -33454 1816062
7024 1816062 2618924 1622639 837680 811756 1966289 2831418 3175675 2620568 1889087 -155329
7014 -155329 190851 270702 38185 825613 1641749 3224364 3123368 1596326 1444353 1081159
7004 1081159 872362 264034 843926 1124781 1592318 1441253 1317098 348041 -709236
$$ packed form
7069F61001j391990J045826Q28243o37391j007962O74250N69320Q09008j061169
7060D89136J04941L61506J129860l27751L23057n69772j788751j042032J122323
7051a97483K157086j230291Q16147Q8224r02329k21592M23422l20480j055221
7042d42517J801149q04515K21030N83139l8136J032457J297635p05767l135772
7033a91297o77393K235287P12993l57429J76006K14114J12412k258147J849516
7024A816062Q02862r96285p84959k5924J154533Q65129L44257n55107p31481k044416
7014a55329L46180P9851k32517P87428Q16136J582615j00996j527042j51973l63194
7004A081159k08797o08328N79892K80855M67537j51065j24155r69057j057277
$$ plain form
6995 -709236 -1258058 -1377726 65781 1401985 972712 -11183 -140029 -1953124 -564210
6986 -564210 879232 1191950 457403 942339 226092 651547 457882 37221 1122382
6977 1122382 1796253 844242 72402 -486958 661188 560011 466953 1338004 1925139 2405845
6967 2405845 2391459 2608599 1561797 1139434 1180356 2791069 4287488 3917541 3675833
6958 3675833 2688874 2409086 2443238 1537529 2701315 2996940 2946212 3668932 3547686 2369398
6948 2369398 2007017 1868233 2463702 1652926 1182303 1208209 -29234 -342940 2138842
6939 2138842 1860383 1627972 1104792 1021140 1578825 1380081 891369 2282281 2520894 1475422
6929 1475422 1189870 1079065 859038 1565776 2676201 2453301 1703126 1127067 558078
$$ packed form
6995g09236n48822j19668J443507J336204m29273r83895j28846j813095J388914
6986e64210J443442L12718p34547M84936p16247M25455j93665m20661J085161
6977A122382O73871r52011p71840n59360J148146j01177r3058Q71051N87135M80706
6967B405845j4386K17140j046802m22363M0922J610713J496419l69947k41708
6958C675833r86959k79788L4152r05709J163786K95625n0728P22720j21246j178288
6948B369398l62381j38784N95469q10776m70623K5906j237443l13706K481782
6939B138842k78459k32411n23180q3652N57685j98744m88712J390912K38613j045472
6929A475422k85552j10805k20027P06738J110425k22900p50175n76059n68989
$$ plain form
6920 558078 -71565 372907 935165 935884 869350 1395518 1371468 -343953 149147 660860
6910 660860 711319 400090 -1321762 -1242936 -1552510 -893918 141983 612216 860957 1677804
6900 1677804 516943 331390 469833 659232 2208104 3052237 1815479 2845984 2883235
6891 2883235 1764163 1791016 2249018 3019100 2510769 1740024 2620366 2773524 2288993 2004900
6881 2004900 2275322 2750430 3833720 2658704 3817890 3645968 1670109 1157668 1247517
6872 1247517 2196800 2320581 2744098 3082894 1066484 -491109 400030 866071 1538820
6863 1538820 2056011 1918293 819113 984973 209602 603567 2005431 1823444 -187690
6854 -187690 -637557 283658 -101237 -50004 435235 -438123 1374728 1984665 1135247 782140
$$ packed form
6920E58078o29643M44472N62258P19o6534N26168k4050j715421M93100N11713
6910F60860N0459l11229j721852P8826l09574O58592J035901M70233K48741Q16847
6900A677804j160861j85553J38443J89399J548872Q44133j236758J030505L7251
6891B883235j119072K6853M58002P70082n08331p70745Q80342J53158m84531k84093
6881B004900K70422M75108J083290j175016J159186j71922j975859n12441Q9849
6872A247517R49283J23781M23517L38796k016410j557593Q91139M66041O72749
6863A538820N17191j37718j099180J65860p75371L93965J401864j81987k011134
6854a87690m49867R21215l84895N1233M85239q73358J812851O09937q49418l53107
$$ plain form
6844 782140 946502 1869440 2834566 3095466 870872 356725 1676438 1485645 953014
6835 953014 661549 462359 -33158 573363 1527968 892937 -95482 -244220 441681 1723709
6825 1723709 2660476 1737429 958260 923621 353434 -243037 908801 2200494 1615947
6816 1615947 -922620 -1394757 -910402 891915 2080892 2087730 2478132 1835430 1844060 1871406
6806 1871406 2128484 1776988 2140983 2457978 2985183 3003018 2421951 2638879 2737933 1746164
6796 1746164 561496 148814 610602 1887132 3244058 2289221 1175700 1227887 1183687
6787 1183687 1227607 1462058 -53764 -548876 -316488 -26109 -139672 -1017229 143591
6778 143591 1082438 753717 -25237 -1179763 -499833 1693696 2272419 1913127 880968
$$ packed form
6844G82140J64362R22938R65126K60900k224594n14147J319713j90793n32631
6835I53014k91465j99190m95517O06521R54605o35031r88419j48738O85901J282028
6825A723709R36767r23047p79169l4639n70187n96471J151838J291693n84547
6816A615947k538567m72137M84355J802317J188977O838L90402o42702Q630K7346
6806A871406K57078l51496L63995L16995N27205J7835n81067K16928R9054r91769
6796A746164j184668m12682M61788J276530J356926r54837j113521N2187m4200
6787A183687M3920K34451j515822m95112K32388K90379j13563q77557J160820
6778A43591R38847l28721p78954j154526O79930K193529N78723l59292j032159
$$ plain form
6769 880968 314548 19191 1012415 2194321 2900323 2343228 1534820 1934161 1186967 1666995
6759 1666995 2407285 2754162 3500567 3907560 4047165 4012445 2886902 752863 2021070
6750 2021070 1038856 370285 2399650 3399087 4059416 2853988 -490950 -758480 210624
6741 210624 487108 2418200 4034586 2604375 526311 574687 1711156 2656225 1778543
6732 1778543 1851365 1152429 518344 958002 195199 369700 750591 -521034 78160 1281677
6722 1281677 -237721 -248647 564623 660683 518695 -606445 -17452 1369859 1646805
6713 1646805 -76496 760626 545005 -44031 -1294470 -899097 670558 433108 -1486165
6704 -1486165 -1301664 -1103275 -700617 1134291 929508 259667 -551539 -693212 1916770
$$ packed form
6769H80968n66420k95357R93224J181906P06002n57095q08408L99341p47194M80028
6759A666995P40290L46877P46405M06993J39605l4720j125543k134039J268207
6750B021070r82214o68571K029365R99437O60329j205428l344938k67530R69104
6741B10624K76484J931092J616386j430211k078064M8376J136469R45069q77682
6732A778543P2822o98936o34085M39658p62803J74501L80891j271625N99194J203517
6722A281677j519398j0926Q13270R6060j41988j125140N88993J387311K76946
6713A646805j723301Q37122k15621n89036j250439L95373J569655k37450j919273
6704a486165J84501J98389M02658J834908k04783o69841q11206j41673K609982
$$ plain form
6695 1916770 2713077 727851 1165392 896792 1772031 1024220 1455677 2500391 3365435
6686 3365435 1851794 855539 1620693 2442112 3208568 850307 1999293 2628818 1663229
6677 1663229 824657 713550 692218 2816703 4484073 2478070 1741017 1672703 2967253
6668 2967253 2273591 -32954 -689331 1344812 2085519 2000664 1495973 900434 1672239
6659 1672239 2081678 1511422 1001877 754746 1141053 887965 1519867 461613 17038
6650 17038 -177892 847890 314653 651696 1033128 904301 -450156 -626725 459925
6641 459925 -43814 -197765 -1028661 -731055 -921359 290647 -721244 -61759 1052759
6632 1052759 740836 -831613 -730913 -417318 -759692 2636162 4573160 3623977 1366190
$$ packed form
6695A916770P96307j985226M37541k68600Q75239p47811M31457J044714Q65044
6686C365435j513641r96255P65154Q21419P66456k358261J148986O29525r65589
6677A663229q38572j11107k1332K124485J667370k006003p37053o8314J294550
6668B967253o93662k306545o56377K034143P40707q4855n04691n95539P71805
6659A672239M09439n70256n09545k47131L86307k53088O31902j058254m44575
6650A7038j94930J025782n33237L37043L81432j28827j354457j76569J086650
6641D59925n03739j53951q30896K97606j90304J212006j011891O59485J114518
6632A052759l11923j572449J00700L13595l42374L395854J936998r49183k257787
$$ plain form
6623 1366190 380204 399340 1285534 2143859 589328 553488 2165982 2608281 1052470
6614 1052470 1464190 757913 25182 1928062 1057780 360621 1866731 3217464 2381179
6605 2381179 2299062 1230629 177729 -22080 1013902 2000009 1180117 1139411 1077257 355629
6595 355629 574615 1832508 1655807 2347068 1534120 3030550 3009432 1938691 1005381
6586 1005381 -565388 -295820 978175 1578870 1475505 1827483 832120 1332625 1783324
6577 1783324 424747 397325 284951 656177 873990 -601588 -1306498 -120768 322695
6568 322695 1429559 937701 477728 -135798 -2496226 -2268957 -2120156 57050 2253187
6559 2253187 2139942 2018695 1854911 798280 179551 709663 1939524 2630969 3351373
$$ packed form
6623A366190r85986J9136Q86194Q58325j554531l5840J612494M42299j555811
6614A052470M11720p06277p32731J902880q70282o97159J506110J350733q36285
6605B381179q2117j068433j052900j99809J035982R86107q19892m0706o2154p21628
6595C55629K18986J257893j76701O91261q12948J496430k1118j070741r33310
6586A005381j570769K69568J273995O00695j03365L51978r95363N00505M50699
6577A783324j358577k7422j12374L71226K17813j475578p04910J185730M43463
6568C22695J106864m91858m59973o13526k360428K27269J48801K177206K196137
6559B253187j13245j21247j63784j056631o18729N30112J229861O91445P20404
$$ plain form
6550 3351373 3860620 2767608 911367 1278980 2308299 2540278 2496355 1823323 659229
6541 659229 258328 379938 877396 832107 1259932 1373733 2056285 2089262 548640 1555147
6531 1555147 2555201 1216587 438555 637340 95558 625206 -355952 1017172 1572539
6522 1572539 496702 801096 197874 -659370 1058974 1605660 1135271 1757627 -272405
6513 -272405 482446 3239363 2667097 2623630 1823341 754085 1005 309649 1816472
6504 1816472 1564113 1029723 1745942 1605631 546060 -36599 -222940 1205782 1783709
6495 1783709 189027 -608408 311721 1403202 860109 -584670 -1818921 -1207369 -924982
6486 -924982 714650 1705545 3311813 2445773 1275456 953761 -220869 379733 -303890
$$ packed form
6550C351373N09247j093012j856241L67613J029319K31979m3923o73032j164094
6541F59229m00901J21610M97458m5289M27825J13801O82552L2977j540622J006507
6531A555147J000054j338614p78032J98785n41782N29648r81158J373124N55367
6522A572539j075837L04394o03222q57244J718344N46686m70389O22356k030032
6513b72405P54851K756917n72266m3467q00289j069256p53080L08644J506823
6504A816472k52359n34390P16219j40311j059571n82659j86341J428722N77927
6495A783709j594682p97435R20129J091481n43093j444779j234251O11552K82387
6486i24982J639632R90895J606268q66040j170317l21695j174630O00602o83623
$$ plain form
6477 -303890 1235793 1185059 879176 2016334 1878774 1467513 1781102 526809 -416741
6468 -416741 806655 2544471 3877453 4786235 3505333 1978684 1097913 1377093 3779608
6459 3779608 5188395 4124037 2848427 1782215 482466 -1099535 429948 1181845
6451 1181845 882373 62694 264789 1849569 3642768 2246697 477048 538096 -670585
6442 -670585 -1004150 -286122 1178573 2120894 3319281 3052718 1632761 1525466 1685721
6433 1685721 1370563 1093273 543329 -444647 333881 2014261 2306486 2142833 2631459
6424 2631459 1938872 414367 -342449 484969 1623948 1308018 1124529 2406799 2548380
6415 2548380 2982014 2100017 1998279 2843877 1160289 -435066 1243959 1917066 2350188
$$ packed form
6477c03890J539683n0734l05883J137158j37560m11261L13589j254293r43550
6468d16741J223396J737816J332982R08782j280902j526649q80771K79180K402515
6459C779608J408787j064358j275610j066212j299749j582001J529483P51897
6451A181845k99472q19679K02095J584780J793199j396071j769649O1048j208681
6442f70585l33565P18028J464695R42321J198387k66563j419957j07295J60255
6433A685721l15158k77290n49944r87976P78528J680380K92225j63653M88626
6424B631459o92587j524505p56816Q27418J138979l15930j83489J282270J41581
6415B548380M33634q81997j01738Q45598j683588j595355J679025O73107M33122
$$ plain form
6406 2350188 2894118 2800090 2160836 1453946 1391521 2354655 2583014 2248803 1771371 1143504
6396 1143504 1755830 1163599 2058540 3410440 1771483 611909 1024285 1175973 1698939
6387 1698939 1751077 304044 360223 1411974 1338197 771873 76033 511182 616981 414775
6377 414775 531676 -1059257 -894878 582327 -57954 -268304 136709 2205522 3096918
6368 3096918 2700029 1893502 1364669 1613326 2331924 1257257 1057794 2208187 2664832
6359 2664832 2984142 2476533 1245733 556097 -165194 653918 526827 1699734 1908480
6350 1908480 2304399 1018424 727943 748630 2127864 1434586 1133583 1460639 -86891
6341 -86891 740098 1620528 2099184 3033480 2119423 584917 1549895 2298095 2215837 3223160
$$ packed form
6406B350188N43930r4028o39254p06890o2425R63134K28359l34211m77432o27867
6396A143504O12326n92231Q94941J351900j638957j159574M12376J51688N22966
6387A698939N2138j447033N6179J051751p3777n66324o95840M35149J05799k02206
6377D14775J16901j590933J64379J477205o40281k10350M05013K068813Q91396
6368C096918l96889q06527n28833K48657P18598j074667j99463J150393M56645
6359B664832L19310n07609j230800o89636p21291Q19112j27091J172907K08746
6350A908480L95919j285975k90481K0687J379234o93278l01003L27056j547530
6341h6891Q26989Q80430M78656R34296r14057j534506R64978P48200q2258J007323
$$ plain form
6331 3223160 3023476 2146838 1157258 776682 873212 3288022 4289480 3695100 3160949
6322 3160949 2241332 2221790 2535904 3213089 2041544 2160762 2058002 1525474 157621
6313 157621 125134 339222 13535 112539 -357649 549621 2007524 990154 -423984 -596718
6303 -596718 -26635 42797 373371 1166897 934717 -912805 -442897 739122 1923434
6294 1923434 3198786 3245404 1356788 2189527 1692479 1011348 1919874 2940646 3341936
6285 3341936 2797122 753644 -1080256 662552 3238744 3649394 1768412 2255930 2686307
6276 2686307 3235823 3929686 2394710 2226171 1188931 974652 1113640 382350 -190047
6267 -190047 -41895 635580 739172 2213754 2433080 1470328 318217 204638 1956692
$$ packed form
6331C223160j99684q76638r89580l80576R6530K414810J001458n94380n34151
6322C160949r19617j9542L14114O77185j171545J19218j02760n32528j367853
6313A57621l2487K14088l25687R9004m70188R07270J457903j017370j414138j72734
6303e96718N70083O9432L30574P93526k32180j847522M69908J182019J184312
6294A923434J275352M6618j888616Q32739m97048o81131R08526J020772M01290
6285C341936n44814k043478j833900J742808K576192M10650j880982M87518M30377
6276B686307N49516O93863j534976j68539j037240k14279J38988p31290n72397
6267a90047J48152O77475J03592J474582K19326r62752j152111j13579J752054
$$ plain form
6258 1956692 1959916 1878711 3028304 3406781 3165871 3319130 2601712 2521176 1627470 1176025
6248 1176025 1699619 1985217 1263996 134148 960877 2141796 2574770 2421493 680187
6239 680187 -871203 -516578 635590 1382282 1797741 1826585 1010804 2088669 880913
6230 880913 -1297287 643046 1163520 95583 641810 496539 -470292 1350654 1967141
6221 1967141 2427548 1879950 1019209 1112921 294630 -743454 -915115 717970 2410296
6212 2410296 1955608 -884960 453848 808898 773746 1553799 2562107 2906073 2902411 2943713
6202 2943713 2597284 1754910 703944 1254794 1489381 2351597 1575623 812264 3154775
6193 3154775 3222465 1929576 1471428 2586527 2284428 1700524 2774134 4596037 4081800
$$ packed form
6258A956692L224q1205J149593L78477k40910J53259p17418q0536q93706m51445
6248A176025N23594K85598p21221j129848Q26729J180919M32974j53277j741306
6239F80187j551390L54625J152168P46692M15459K8844q15781J077865j207756
6230H80913k178200J940333N20474j067937N46227j45271r66831J820946O16487
6221A967141M60407n47598q60741R3712q18291j038084j71661J633085J692326
6212B410296m54688k840568J338808L55050l5152P80053J008308L43966l662M1302
6202B943713l46429q42374j050966N50850K34587Q62216p75974p63359K342511
6193C154775O7690j292889m58148J115099l02099n83904J073610J821903n14237
$$ plain form
6184 4081800 2916488 2123873 2196055 967560 -473827 229844 1370990 2412434 568115
6175 568115 407559 787807 1151689 848003 1716418 1439561 593211 795590 1824165 2652715
6165 2652715 970281 114692 1006001 901827 1471320 2364290 1561272 955404 97448
6156 97448 337652 1716648 2606349 2633933 2960829 3568230 2320839 89507 1287527
$$ packed form
6184D081800j165312p92615P2182j228495j441387P03671J141146J041444j844319
6175E68115j60556L80248L63882l03686Q68415k76857q46350K02379J028575Q28550
6165B652715j682434q55589Q91309j04174N69493Q92970q03018o05868q57956
6156I7448K40204J378996Q89701K7584L26896O07401j247391k231332J198020
$$ [...]
##END NTUPLES=NMR SPECTRUM
##END=
