##TITLE=1H_CA-9238-1
 D2O
 8 sc, 
 8.2.2024
##JCAMPDX= 6.0         $$ Bruker NMR JCAMP-DX V2.0
##DATA TYPE= NMR SPECTRUM
##DATA CLASS= NTUPLES
##ORIGIN= UXNMR, Bruker Analytische Messtechnik GmbH
##OWNER= root
$$ XWIN-NMR		Version 3.5
$$ Thu Feb  8 13:47:39 2024 Russian Standard Time (UT+4h)  she@DPX200
##.OBSERVE FREQUENCY= 200.1313
##.OBSERVE NUCLEUS= ^1H
##.ACQUISITION MODE= SIMULTANEOUS
##.ACQUISITION SCHEME= undefined
##.AVERAGES= 8
##.DIGITISER RES= 18
##SPECTROMETER/DATA SYSTEM= spect
##.PULSE SEQUENCE= zg30
##.SOLVENT NAME= CDCl3
##.SHIFT REFERENCE= (INTERNAL, CDCl3, 0, 15.6158)
##AUDIT TRAIL= $$ (NUMBER, WHEN, WHO, WHERE, WHAT)
$$ ##TITLE= Audit trail, XWIN-NMR		Version 3.5
$$ ##JCAMPDX= 5.01
$$ ##ORIGIN= Bruker BioSpin GmbH
$$ ##OWNER= she
$$ F:/spectra/data/she/nmr/H-F/1/pdata/1/auditp.txt
$$ ##AUDIT TRAIL=  $$ (NUMBER, WHEN, WHO, WHERE, WHAT)
(   1,<2024-02-08 13:46:29.34 +0400>,<she>,<DPX200>,
      <created by zg, POWCHK disabled, PULCHK disabled
       configuration hash MD5:
       00 E9 B6 7A A2 85 ED C7 34 08 36 98 17 FE 4E 26
       data hash MD5: 16K
       07 23 D6 A1 00 8E 1B EB 5B 75 EE 70 95 46 BF 6B>)
(   2,<2024-02-08 13:46:31.56 +0400>,<she>,<DPX200>,
      <Start of raw data processing
       efp BC_mod = 2 LB = 0.24 FT_mod = 6 PKNL = 1 PHC0 = -24598.35 PHC1 = 9.052685 SI = 16K 
       data hash MD5: 16K
       83 38 E6 74 85 6D 64 4B C5 36 B4 EB D0 30 4B 02>)
(   3,<2024-02-08 13:46:55.70 +0400>,<she>,<DPX200>,
      <pk PHC0 = 5.256904 PHC1 = 2 
       data hash MD5: 16K
       9E 6F 01 09 2C F6 9B 2A 91 02 3C 24 F5 54 7B EC>)
(   4,<2024-02-08 13:46:59.18 +0400>,<she>,<DPX200>,
      <abs ABSG = 5 
       data hash MD5: 16K
       B5 87 20 08 85 72 1A FE C6 9D 82 0C EF 8C 41 07>)
$$ ##END=
$$ 
$$ hash MD5
$$ CC 96 D9 3B FB CE 18 4A D6 DE F3 B2 1E 42 56 58
##$RELAX= 
##$RELAX= 
##$RELAX= 
##$RELAX= 
##$RELAX= 
##$RELAX= 
$$ Bruker specific parameters
$$ --------------------------
##$DU= <F:/spectra>
##$EXPNO= 1
##$NAME= <H-F>
##$PROCNO= 1
##$TYPE= <nmr>
##$USER= <she>
##$AMP= (0..31)
100 100 100 100 100 100 100 100 100 100 100 100 100 100 100 100 100 100 
100 100 100 100 100 100 100 100 100 100 100 100 100 100 
##$AQSEQ= 0
##$AQ_mod= 1
##$AUNM= <au_zg>
##$AUTOPOS= <>
##$BF1= 200.13
##$BF2= 200.13
##$BF3= 200.13
##$BF4= 200.13
##$BF5= 200.13
##$BF6= 200.13
##$BF7= 200.13
##$BF8= 200.13
##$BYTORDA= 1
##$CFDGTYP= 0
##$CFRGTYP= 5
##$CHEMSTR= <none>
##$CNST= (0..31)
1 1 145 1 1 1 1 1 1 1 1 1 1 1 1 1 1 1 1 1 1 1 1 1 1 1 1 1 1 1 1 1 
##$CPDPRG= <>
##$CPDPRG1= <>
##$CPDPRG2= <>
##$CPDPRG3= <>
##$CPDPRG4= <mlev>
##$CPDPRG5= <mlev>
##$CPDPRG6= <mlev>
##$CPDPRG7= <mlev>
##$CPDPRG8= <mlev>
##$CPDPRGB= <>
##$CPDPRGT= <>
##$D= (0..31)
0 1.2 0 0 0 0 0 0 0 0.06 0 0.03 0 0 0 0 0.0002 0 0 0 0 0 0 0 0 0 0 0 0 
0 0 0 
##$DATE= 1707385588
##$DBL= (0..7)
120 120 120 120 120 120 120 120 
##$DBP= (0..7)
150 150 150 150 150 150 150 150 
##$DBP07= 0
##$DBPNAM0= <>
##$DBPNAM1= <>
##$DBPNAM2= <>
##$DBPNAM3= <>
##$DBPNAM4= <>
##$DBPNAM5= <>
$$ [...]
##$SUBNAM3= <"">
##$SUBNAM4= <"">
##$SUBNAM5= <"">
##$SUBNAM6= <"">
##$SUBNAM7= <"">
##$SUBNAM8= <"">
##$SUBNAM9= <"">
##$SW= 18.0517328524113
##$SWIBOX= (0..15)
0 0 2 0 0 0 0 0 0 0 0 0 0 0 0 0 
##$SW_h= 3612.71676300578
##$TD= 16384
##$TD0= 1
##$TE= 0
##$TE2= 300
##$TE3= 300
##$TEG= 300
##$TL= (0..7)
0 120 120 120 120 120 120 120 
##$TP= (0..7)
150 150 150 150 150 150 150 150 
##$TP07= 0
##$TPNAME0= <>
##$TPNAME1= <>
##$TPNAME2= <>
##$TPNAME3= <>
##$TPNAME4= <>
##$TPNAME5= <>
##$TPNAME6= <>
##$TPNAME7= <>
##$TPOAL= (0..7)
0.5 0.5 0.5 0.5 0.5 0.5 0.5 0.5 
##$TPOFFS= (0..7)
0 0 0 0 0 0 0 0 
##$TUNHIN= 0
##$TUNHOUT= 0
##$TUNXOUT= 0
##$USERA1= <user>
##$USERA2= <user>
##$USERA3= <user>
##$USERA4= <user>
##$USERA5= <user>
##$V9= 5
##$VALIST= <valist>
##$VCLIST= <CCCCCCCCCCCCCCC>
##$VD= 0
##$VDLIST= <DDDDDDDDDDDDDDD>
##$VPLIST= <PPPPPPPPPPPPPPP>
##$VTLIST= <TTTTTTTTTTTTTTT>
##$WBST= 1024
##$WBSW= 4
##$XGAIN= (0..3)
0 0 0 0 
##$XL= 0
##$YL= 0
##$YMAX_a= 74348
##$YMIN_a= -106623
##$ZGOPTNS= <>
##$ZL1= 120
##$ZL2= 120
##$ZL3= 120
##$ZL4= 120
##$ABSF1= 15.45491
##$ABSF2= -2.596939
##$ABSG= 5
##$ABSL= 3
##$ALPHA= 0
##$AQORDER= 0
##$ASSFAC= 0
##$ASSFACI= 0
##$ASSFACX= 0
##$ASSWID= 0
##$AUNMP= <proc_1d>
##$AZFE= 0.1
##$AZFW= 0.1
##$BCFW= 0
##$BC_mod= 2
##$BYTORDP= 0
##$COROFFS= 0
##$CY= -3
##$DATMOD= 1
##$DC= 0
##$DFILT= <>
##$DTYPP= 0
##$F1P= 0
##$F2P= 0
##$FCOR= 1
##$FTSIZE= 16384
##$FT_mod= 6
##$GAMMA= 0
##$GB= 0
##$INTBC= 1
##$INTSCL= 3.70164e-10
##$ISEN= 128
##$LB= 0.24
##$LEV0= 0
##$LPBIN= 0
##$MAXI= 10000
##$MC2= 0
##$MEAN= 0
##$ME_mod= 0
##$MI= 1.114404
##$NCOEF= 0
##$NC_proc= -8
##$NLEV= 6
##$NOISF1= 3.799351
##$NOISF2= 2.8
##$NSP= 0
##$NTH_PI= 0
##$NZP= 0
##$OFFSET= 15.61578
##$PC= 1
##$PHC0= -24593.09
##$PHC1= 11.05268
##$PH_mod= 1
##$PKNL= yes
##$PPARMOD= 0
##$PSCAL= 0
##$PSIGN= 0
##$REVERSE= no
##$SF= 200.129981172466
##$SI= 16384
##$SIGF1= 3
##$SIGF2= 2
##$SINO= 5.538805
##$SIOLD= 16384
##$SREGLST= <1H.CDCl3>
##$SSB= 0
##$STSI= 16384
##$STSR= 0
##$SW_p= 3612.71676300578
##$SYMM= 0
##$S_DEV= 0
##$TDeff= 16384
##$TDoff= 0
##$TI= <>
##$TILT= no
##$TM1= 0
##$TM2= 0
##$TOPLEV= 0
##$USERP1= <user>
##$USERP2= <user>
##$USERP3= <user>
##$USERP4= <user>
##$USERP5= <user>
##$WDW= 1
##$XDIM= 16384
##$YMAX_p= 291238865
##$YMIN_p= -1301300
$$ End of Bruker specific parameters
$$ ---------------------------------
##NTUPLES= NMR SPECTRUM
##VAR_NAME=  FREQUENCY,     SPECTRUM/REAL,   SPECTRUM/IMAG
##SYMBOL=    X,             R,               I
##VAR_TYPE=  INDEPENDENT,   DEPENDENT,       DEPENDENT
##VAR_FORM=  AFFN,          ASDF,            ASDF
##VAR_DIM=   16384,         16384,           16384
##UNITS=     HZ,            ARBITRARY UNITS, ARBITRARY UNITS
##FACTOR=    0.220516191357247, 1,           1
##FIRST=     3125.18573271914, 0,            0
##LAST=      -487.531030286638, 0,           0
##MIN=       -487.531030286638, -1301300,    0
##MAX=       3125.18573271914, 291238865,    0
$$ Real data points
##PAGE= N=1
##DATA TABLE= (X++(R..R)), XYDATA
$$ [...]
11841D358248K19175L39131j28898J47152J26198R8180J48489K43855k3222k0134
11831E508174M24906m8795O15013K35216j43798L98811K72897L09458j24429l50103
11821G097350L07447K07772K29827J65987J56801J75448O28931L0756j89734k7767
11811H782818n0219j05027J20840M05549l46638p7949L32207o8941p1966L10061
11801I230735J83181l226N7542k79545J74439J13109J44861K17323n1700l80811
11791I405908l03334K70277M02423K64863M32273j57896q520M10868K53379L56864
11781A1327105j12237M34571O74456L13223J40966L78256l043K04834j16115Q25610
11771A4067626Q48479L886M92660M56364K46201J75351K28376O20614M14906K82256
$$ plain form
11841 4358248 4577423 4916554 4787656 4934808 5061006 5159186 5307675 5551530 5528308 5508174
11831 5508174 5933080 5884285 6499298 6734514 6590716 6989527 7262424 7571882 7447453 7097350
11821 7097350 7404797 7612569 7842396 8008383 8165184 8340632 8969563 9000319 8810585 8782818
11811 8782818 8732599 8627572 8748412 9153961 8807323 8729374 9061581 8992640 8920674 9230735
11801 9230735 9413916 9410690 9468232 9188687 9363126 9476235 9621096 9838419 9786719 9405908
11791 9405908 9102574 9372851 9775274 10040137 10472410 10314514 10305994 10716862 10970241 11327105
11781 11327105 11214868 11649439 12323895 12637118 12778084 13156340 13153297 13358131 13242016 14067626
11771 14067626 14916105 14919991 15412651 15869015 16115216 16290567 16518943 17139557 17554463 17836719
11761A7836719P50635R31910O08130M35007O31989Q56412N40065Q85694P70129
11752B4246690O53071Q19180J169485R13709J143347J141529Q15605R55466J567136
11743C3425218J001138J253378J661078J436462J267987J697303J572965J664090
11735D4979619J371118J514126J824643J671987J394311J308541J150302J054106
11727E6268753R21096K39244O8164J71434l41948n81782q12066j323555j247136
11718E3362204j744260j618009j713767j618119j695294j647308k055924j625269
11710C9644254j585075j585577j722970j564046j328054j125726j098920j509535
11702B8124351j615591j155829r75330j300027j244831j155533q56408m09380
$$ plain form
11761 17836719 18587354 19519264 20127394 20562401 21194390 22050802 22590867 23476561 24246690
11752 24246690 24899761 25718941 26888426 27802135 28945482 30087011 30902616 31858082 33425218
11743 33425218 34426356 35679734 37340812 38777274 40045261 41742564 43315529 44979619
11735 44979619 46350737 47864863 49689506 51361493 52755804 54064345 55214647 56268753
11727 56268753 57189849 57429093 57497257 57668691 57326743 56744961 55932895 54609340 53362204
11718 53362204 51617944 49999935 48286168 46668049 44972755 43325447 41269523 39644254
11710 39644254 38059179 36473602 34750632 33186586 31858532 30732806 29633886 28124351
11702 28124351 26508760 25352931 24377601 23077574 21832743 20677210 19820802 19411422
11694A9411422p64831q09896n44213m21558o87709l19126m16654j024911m36029
11685A3986495m09762n41673m37804l08669j67771o44780j64036L8223m47737
11676A0902486l54029M0571n61167l12978k82118n23500k01191n74721p9147m46995
11666G607211j23390k25279j40471J6250l16902p1725j14880j54447j73266l5967
11656F267134m80170K85831k36454j3530m7317m18509p2464m19583Q5205J10192
11646E060335m56601j68831K63144l77232j57661K24950k76184L7502o6775M43833
11636D526480Q4720j30646n17422k75376k14371J90334J7568M06665n94586J08126
11626C601492l9425J7114R108l56017M77585p889K1915o22199J46312J78589J02863
$$ plain form
11694 19411422 18646591 17836695 17292482 16870924 16183215 15864089 15447435 14422524 13986495
11685 13986495 13576733 13035060 12597256 12288587 12120816 11476036 11312000 11350223 10902486
11676 10902486 10548457 10589028 10027861 9714883 9432765 8909265 8708074 8133353 8054206 7607211
11666 7607211 7483821 7258542 7118071 7134321 6817419 6745694 6630814 6476367 6303101 6267134
11656 6267134 5786964 6072795 5836341 5822811 5775494 5356985 5284521 4864938 4950143 5060335
11646 5060335 4603734 4434903 4698047 4320815 4163154 4388104 4111920 4149422 4082647 4526480
11636 4526480 4611200 4480554 3963132 3687756 3473385 3663719 3681287 4087952 3493366 3601492
11626 3601492 3562067 3579181 3588289 3232272 3709857 3701968 3723883 3101684 3247996 3426585 3529448
11615C529448l98565J69101o7992j25992j62972m67162K69913m1706n20875L51518
11605B534716J85889J37988J14723J19205k72414l0347l04263N5191l10099M1171
11595B271760L83604j80903k5328K01230o63773q682O30847j07991o2064j46755
11585B291945k18662j02972j13707P0044o9714k46473P23650J52067k31059L89476
11575B644595R0837Q2256j18873N1196k6225o9005K16698j95039j37943J92140
11565B730637j89152N1696K6730J33969Q3413l68535l26784K82838J48355L7248
11555B610415M40026k49629R2087r1364l62954L67602K38058k40841n105m7054
11545B751241M6561K09751n7801j16446k45272J35227K43784K09692j20534K01501
$$ plain form
11615 3529448 3130883 3299984 3231992 3106000 2943028 2475866 2745779 2704073 2183198 2534716
11605 2534716 2720605 2858593 2973316 3092521 2820107 2789760 2485497 2540688 2230589 2271760
11595 2271760 2655364 2474461 2449133 2650363 1986590 1977908 2608755 2500764 2438700 2291945
11585 2291945 2073283 1970311 1856604 1926648 1856934 1610461 2334111 2486178 2255119 2644595
11575 2644595 2735432 2817688 2698815 2750011 2723786 2654781 2871479 2676440 2538497 2730637
11565 2730637 2541485 2593181 2619911 2753880 2837293 2468758 2141974 2424812 2573167 2610415
11555 2610415 3050441 2800812 2892899 2801535 2438581 2806183 3044241 2803400 2798295 2751241
11545 2751241 2797802 3007553 2949752 2833306 2588034 2723261 2967045 3176737 3056203 3257704
11535C257704J36612r3905Q0854l6552q9396l050M12675j07023k22738m74289
11525B860892K28136L91848R1940k64630L62482N91344j45842p1907q5481k75217
11515C683565k85979O04436L44172J03372L49403N57627J26596j31848j46475
11506E204869L7501Q3141P1240J08590l1328O02720o1322m3960l6886K44147J0786
11495F189498L63147l41391k8413P18830L40141M2763j97585K61202N10084N17715
11485H375991R3228J49316L55802J64708K14457L55181L95597L37393K12447m0806
11475A0613314M35041P50873M79762M01321Q9679M67850R6367O40585L7848j56652
11465A3855988J11617L15886k78114J31473M99356o46064l52249l94j94962m94044
$$ plain form
11535 3257704 3394316 3300411 3381265 3344713 3255317 3252267 3664942 3557919 3335181 2860892
11525 2860892 3089028 3480876 3572816 3308186 3670668 4262012 4116170 4044263 3958782 3683565
11515 3683565 3397586 4002022 4346194 4449566 4798969 5356596 5483192 5351344 5204869
11506 5204869 5242370 5325511 5396751 5505341 5474013 6076733 6015411 5971451 5934565 6178712 6189498
11495 6189498 6552645 6211254 6182841 6901671 7241812 7284575 7086990 7348192 7858276 8375991
11485 8375991 8469219 8618535 8974337 9139045 9353502 9708683 10104280 10441673 10654120 10613314
11475 10613314 11048355 11799228 12278990 12680311 12769990 13237840 13334207 13974792 14012640 13855988
11465 13855988 13967605 14283491 14005377 14136850 14636206 13990142 13637893 13637499 13442537 12948493
11455A2948493O8647q45221n47170L223k41168n46749n75092k20111l26087k14146
11445I504619J3490k23195k42998n47816p14670m09461k63993m06873l13547L2832
11435F428388j92416j63093k75714m42503k88914N1047q3980R1083l05216p0296
11425D748386n20436l63214J29653P6835m50531j13113k6186m61951L8194J19687
11415C177324j79229k16701Q6195J48435M33730m08551k2426l4555n1538k9109
11405B903575n2379k85660J2825m4414P5285n4402o3258L20443l19224l35016
11395B157775k58512K29122J48774n91021K44802L57033j1141o06366P4856L21460
11385B066782l3720J83925l49851l79774Q4172O8904k66815J67815k32173K05453
$$ plain form
11455 12948493 13017140 12171919 11624749 11627972 11386804 10840055 10264963 10044852 9718765 9504619
11445 9504619 9518109 9294914 9051916 8504100 7789430 7379969 7115976 6709103 6395556 6428388
11435 6428388 6235972 6072879 5797165 5354662 5065748 5116795 5032815 5123898 4818682 4748386
11425 4748386 4227950 3864736 3994389 4071224 3620693 3507580 3481394 3019443 3057637 3177324
11415 3177324 2998095 2781394 2867589 3016024 3449754 3041203 3018777 2984222 2932684 2903575
11405 2903575 2851196 2565536 2578361 2533947 2609232 2554830 2491572 2812015 2492791 2157775
11395 2157775 1899263 2128385 2277159 1686138 1930940 2287973 2276832 1670466 1745322 2066782
11385 2066782 2033062 2216987 1867136 1487362 1571534 1640438 1373623 1541438 1309265 1514718
11375A514718M0978J13724K59979Q7663J65401m28418j46094J14785l19415j97852
11365A205469J90398K53779k02393l00190k51607O83525j28496l43139J08058
11356A215404J59419q8453J79494j21130j13705M4608l6381J71000k42108L58220
11346A526368j23177k20752K50373j50988l23473j97317J89447L75518j42436
11337A183563k4532J82685M85574j24108m43575J56200j77039r3086l1616o7757
11327A046309l32133j42477K85113J05557J34142L38750J48098m85930K62079
11318A359508j38845j11957k49533j2311J81738j51329k66542P8413O7775j60626
11308E96291L92325J7410J26176o0342j4211L27826J99314l1102k00217j45203
$$ plain form
11375 1514718 1555696 1669420 1929399 2017062 2182463 1754045 1607951 1722736 1403321 1205469
11365 1205469 1395867 1649646 1447253 1147063 895456 1578981 1450485 1107346 1215404
11356 1215404 1374823 1286370 1465864 1344734 1231029 1275637 1239256 1410256 1168148 1526368
11346 1526368 1403191 1182439 1432812 1281824 958351 761034 950481 1325999 1183563
11337 1183563 1159031 1341716 1827290 1703182 1259607 1415807 1238768 1145682 1114066 1046309
11327 1046309 714176 571699 856812 962369 1096511 1435261 1583359 1097429 1359508
11318 1359508 1220663 1108706 859173 846862 1028600 877271 610729 689142 756917 596291
11308 596291 988616 1006026 1132202 1071860 1057649 1385475 1584789 1553687 1353470 1208267
11298A208267M58614l08038k29260j00091K62940L34962l61417L24884P9414m1044
11288A629231J11526n1658J23493M9537j76973j68461o7180j34430Pj91211N947
11277A129828J48865P80480j89622l29347K1938j78453K19152L17498M0453n20391
11267A440401K69069j4743K03262M4931m41941J61945J83566N14142j01182l49733
11257A909717R3269p3077J35802K58758P8856k39277l57819K20829O9125P5194
11247B171377K7299o4502K95278K07670j49291J20250k98478n4944N89909l60589
11237B483979k36064L68082K22000J12572J07293j40163N61640j21166J24136
11228C482309j52583J28373J82624K45892j80180K3214K60559l64659J9304L47336
$$ plain form
11298 1208267 1666881 1358843 1129583 1029492 1292432 1627394 1265977 1590861 1670275 1629231
11288 1629231 1740757 1689099 1812592 1862129 1685156 1516695 1449515 1315085 1315092 1123881 1129828
11277 1129828 1278693 2059173 1869551 1540204 1562142 1383689 1602841 1920339 1960792 1440401
11267 1440401 1709470 1694727 1897989 1942920 1500979 1662924 1846490 2360632 2259450 1909717
11257 1909717 2002986 1929909 2065711 2324469 2403325 2164048 1806229 2027058 2096183 2171377
11247 2171377 2198676 2134174 2429452 2637122 2487831 2608081 2309603 2254659 2844568 2483979
11237 2483979 2247915 2615997 2837997 2950569 3057862 2917699 3479339 3358173 3482309
11228 3482309 3329726 3458099 3640723 3886615 3706435 3729649 3990208 3625549 3644853 3992189
11218C992189j18435L77093j6678L48571K82361K01267l62336n9397M84798N46571
11208E676004j17881n6206Q09707k6843R1552M13870L63636k27551j56903j02011
11198F667374O32397J55556K00881K25526L18512J2832J46498M32017J82826J19118
11188I093537N22788L85122M58764L1239J89329J16937Q8805M1141k55922O98507
11178A1370247J65235q8113K2300j2780j52691j63531q7828M8210k57831k45832
11168A0597386j77219p17704m87673J1493M04333n2990m49814p53465m65016k80972
11158G628359l75843J62625p26844l10806J74008m99373K32657J16529r69824
11149E431488k40856l98332m84362M12193l0841j21331l71544k8127l05117L26532
$$ plain form
11218 3992189 3873754 4250847 4234169 4582740 4865101 5066368 4704032 4644635 5129433 5676004
11208 5676004 5558123 5501917 6311624 6284781 6376333 6790203 7153839 6926288 6769385 6667374
11198 6667374 7299771 7455327 7656208 7881734 8200246 8213078 8359576 8791593 8974419 9093537
11188 9093537 9616325 10001447 10460211 10491450 10680779 10797716 10886521 10927662 10671740 11370247
11178 11370247 11535482 11447369 11469669 11456889 11304198 11140667 11052839 11101049 10843218 10597386
11168 10597386 10420167 9702463 9214790 9226283 9630616 9577626 9127812 8374347 7909331 7628359
11158 7628359 7252516 7415141 6688297 6377491 6551499 6052126 6284783 6401312 5431488
11149 5431488 5190632 4792300 4307938 4720131 4689290 4567959 4196415 4168288 3863171 4189703
11139D189703L20072l34089m88540L8450N6754n83069p45204K16030L41888o125
11129C005870k12306R667r9977K01853n56861j59916K23358J50634k46060j31739
11119B184523j48480l71311Q6499J0519J54094J0352J69157k6652k92807L7943
11109A813837J50106J0411k89123j41718J85897J15069O8989j79312L01087l56039
11099A679204j02934l62795J4349K18613J7527Q7218k43505o01898m3909N42294
11089A204164K56997l44385l2593k99395j07028K30334j52732K43691O91698k59596
11079A431155l91778K65340j97002L91438m67940j07707j38430J17950K2667j75474
11069G50219j67658k16850J42229j93638M02350J44115J96356l26691l09546k18944
$$ plain form
11139 4189703 4509775 4175686 3687146 3725596 3782350 3199281 2454077 2670107 3011995 3005870
11129 3005870 2793564 2803231 2703254 2905107 2348246 2188330 2411688 2562322 2316262 2184523
11119 2184523 2036043 1664732 1751231 1761750 1915844 1926196 2095353 2068701 1775894 1813837
11109 1813837 1963943 1974354 1685231 1543513 1729410 1844479 1913468 1734156 2035243 1679204
11099 1679204 1576270 1213475 1227824 1446437 1463964 1551182 1307677 705779 661870 1204164
11089 1204164 1461161 1116776 1084183 784788 677760 908094 755362 999053 1690751 1431155
11079 1431155 1039377 1304717 1107715 1499153 1031213 923506 785076 903026 925693 750219
11069 750219 582561 365711 507940 314302 716652 860767 1057123 730432 420886 201942
11059B01942N52777K11865L6170p60460k66617j7431Q2372M04232N76411k73541
11049G47720m07748M8251J81641L1036l1241L3783J04010L69358k98785k0406
11039G57619L1631l09465Q8480o02301L55541M89181m97041J5943K92613m19454
11029B02747l05062K49723p315M62027j28320J38671j78340j49084j8494j31597
11019A34956K62090m4731j36924j02501J31610J69470k81017J26080Q4538M7471
11009C91042K10635K8559p8400P6737L00131K76583p48628j05774K00409l14616
10999B36678j13529L71824j78035L90466k48729l35999J38011K6644M08529m60342
10989B35518l09543j25090M36748L44235j07456K47574j49407J62408M8625m36123
$$ plain form
11059 201942 754719 966584 1002754 242294 -24323 -41754 40618 444850 1021261 747720
11049 747720 339972 388223 569864 600900 569659 603442 707452 1076810 778025 757619
11039 757619 789250 479785 568265 -34036 321505 810686 313645 329588 622201 202747
11029 202747 -102315 147408 140093 602120 473800 612471 434131 285047 266553 134956
11019 134956 397046 352315 215391 112890 244500 413970 132953 259033 343571 391042
11009 391042 601677 630236 551836 628573 928704 1205287 456659 350885 551294 236678
10999 236678 123149 494973 316938 707404 458675 122676 260687 287331 695860 235518
10989 235518 -74025 -199115 237633 581868 474412 721986 572579 734987 783612 347489
10979C47489j36197J16221n8769m81281M23867L03251N8718J5289o53484M51194
10969C86298L42047M3072l4206L1102m16739m83754n4469N80699J45196P8411
10959F17657n69378j5008n01605L39517N11841j94847K55289m50786J48330K80671
10949D21681J18237o32315L36157J0386M4497r5436J27871k97701r7954K63325
10939A98748J63418k71198J09885L31772J41930r7481k74276J41880j40044n7710
10929B46924J17547J21176k97736k51594J69253J11051L2841l12977M1449K67560
10919B45494l7266J4016j73776p3619M34972J07585m28706K7186K31242k26169
10909A20959J2147K37665Q1817Q31m64488l4105J76227J76595N78056j50299n67733
$$ plain form
10979 347489 211292 327513 268744 -212537 211330 514581 573299 588588 -64896 386298
10969 386298 728345 771417 737211 768313 351574 -132180 -186649 394050 539246 617657
10959 617657 48279 33271 -468334 -128817 383024 188177 443466 -7320 141010 421681
10949 421681 539918 -92397 243760 254146 298643 203207 331078 33377 -64577 198748
10939 198748 362166 90968 200853 532625 674555 577074 302798 444678 304634 246924
10929 246924 364471 485647 187911 -63683 105570 216621 249462 -63515 -22066 245494
10919 245494 208228 222244 48468 -25151 409821 517406 88700 115886 347128 120959
10909 120959 133106 370771 452588 453419 -11069 -45174 131053 307648 885704 735405 167672
10898A67672j19912K03124m802L09741J32658l80121J0219M486k11962K29897
10888C41000K82818j37657n42991N6893K65350j0300k73581O2622J10018O5020
10878B19192J14691J43222J40487j02025P1454l58388N4132j39741J77279j96866
10868A23437J38772K437l98724j37704M5262K54673j54543M50368K23392m5815
10858E01555k47632N6086K48783j60486J96703k54155P8985l5376j67757j33908
10848H2798M9683K12771L81317k71287P0227L18943m26897j49809l22865Q5724
10838C0605J13189K975j40050M97170m58408j08261M8543j67941Q9476p3267J44011
10827b1958L927N01563j58306k19922l30315J20243M66800l56371j58361R5071
$$ plain form
10898 167672 47760 250884 246082 555823 688481 308360 318579 323065 111103 341000
10888 341000 623818 486161 -56830 63 265413 255113 -18468 44154 154172 219192
10878 219192 333883 477105 617592 515567 587021 228633 282765 143024 320303 123437
10868 123437 262209 264646 -134078 -271782 -226520 28153 -126390 323978 547370 501555
10858 501555 253923 310009 558792 398306 595009 340854 419839 384463 216706 82798
10848 82798 132481 345252 726569 455282 525509 844452 417555 267746 -55119 30605
10838 30605 143794 146769 6719 503889 45481 -62780 -14237 -182178 -92702 -165969 -21958
10827 -21958 -18031 483532 325226 105304 -225011 -104768 362032 5661 -152700 -57629
10817e7629R2293O521O6771M49268K6261k19703l99846J46574Q266R404n3777
10806G4403J02110J73350m9728k29098k68540O01985j39807j81292J1648j05381
10796a0350K10098r9889Q1248l53028l8047k333K09188K43893Q959K20896m27048
10785D3587m44715K15809M69807m6507L03303p2508k01684J39590K64931j51330
10775E20283k06571k26688q8632p9141k81186Q383K23970M36305L53064J39710
10765G99497K47074n56430k15088Q8919Q5540l61249J72676m40193n057K50069
10755F5758J51365R2882j59634k19229K88914P9226m56506N49553j52806M4540
10745B84063K48312j9283l71016J41200k48157k71972P0332J78796Q6571o8866
$$ plain form
10817 -57629 34664 41185 107956 557224 583485 363782 -36064 110510 118776 128180 74403
10806 74403 176513 349863 300135 71037 -197503 404482 264675 83383 95031 -10350
10796 -10350 199748 99859 181107 -171921 -209968 -212301 -3113 240780 249739 470635 43587
10785 43587 -401128 -185319 284488 237981 541284 468776 267092 406682 671613 520283
10775 520283 313712 87024 -1608 -80749 -361935 -353552 -129582 306723 659787 799497
10765 799497 1046571 490141 275053 363972 449512 88263 260939 -179254 -184311 65758
10755 65758 217123 310005 150371 -68858 220056 299282 -157224 392329 239523 284063
10745 284063 532375 513092 142076 283276 35119 -236853 -166521 12275 98846 29980
10735B9980m4918J51830J46666l81005K07748k9249l05432K15790l43933o4J716
10724c50871K49470K59593M3508k0422k60193k78438Q1760L77387K71008j73531
10714A99271k63005K10633L20090j59241l92457M9023P0774q586l045j36350M2141
10703g0752M54707j70671n12211K49510L2469j16944J05644M80428l42517q2119
10693B7544J42281J01353K15863k3332L7504J4106m4741n0619p1689n04752J29219
10682b7263L86582n4919l28384j29309K2345K78832k26005l05602N11968k32419
10672a04174L1153J50969j04590k52618K10569J94452J79102K41425k20291j35736
10662A90261K3034J05571k09209L5190M9211J07019L4579P5147N23241l08547
$$ plain form
10735 29980 -14938 136892 283558 -97447 110301 81052 -224380 -8590 -352523 -352587 -350871
10724 -350871 -101401 158192 201700 181278 -78915 -357353 -275593 101794 372802 199271
10714 199271 -63734 146899 466989 307748 -84709 -35686 35088 26502 23457 -112893 -70752
10703 -70752 383955 213284 -298927 -49417 -16948 -133892 -28248 452180 109663 27544
10693 27544 169825 271178 487041 463709 501213 515319 470578 419959 348270 -156482 -27263
10682 -27263 359319 304400 -23984 -153293 -130948 147884 -78121 -383723 128245 -104174
10672 -104174 -73021 77948 -26642 -279260 -68691 125761 304863 546288 325997 190261
10662 190261 213295 318866 109657 144847 194058 301077 335656 410803 934044 625497
10652F25497m75137J01937J29937q6656L07m3647j51266Q4459K70960J14141k78662
10641B91870L36470L0751j59404J09258m44034J74807O5768m7283O6271k02191
10631B22283m1707K38891j5987l07206n4657Q482L72923n07285N70167J50012
10621F35916k94766L5928r0029J64843j37103o0249M1803n37858K42574Q2878
10611H3937L54778k11618j85778Q2061K51444P7103k24357p2683J3339j07507
10601F0719J24888J65772p9150J88815l2809M0383j84086J90358R4307n1462r8871
10590D18864j56130n5311q5198k12717k5366n2475K40723J49554k61685J37828
10580I8087K76907q5235j4370k57743j90638L22713L88186l43926k28265K32116
$$ plain form
10652 625497 150360 252297 382234 295578 295885 252238 100972 185431 456391 570532 291870
10641 291870 628340 659091 499687 608945 164911 339718 405486 358203 424474 222283
10631 222283 180576 419467 403480 96274 41617 50099 423022 -84263 485904 635916
10621 635916 341150 377078 287049 451892 314789 254540 296343 -241515 1059 83937
10611 83937 438715 227097 41319 123380 374824 451927 227570 154887 168226 60719
10601 60719 185607 351379 272229 461044 428235 468618 284532 474890 569197 517735 418864
10590 418864 262734 207423 122225 -90492 -115858 -168333 72390 221944 -39741 98087
10580 98087 374994 289759 275389 17646 -172992 149721 537907 193981 -34284 197832
10570A97832J23708q9873j36295l98266J60524N25603J63307j1288k55476k87638
10560g862N66020j12420Q1072M21571P3075m41286j69356m1785j62978J24183
10550C30234k30489J48910J04995J36991n9357k38817J00064J05157K0889n54592
10540a36015K10961M29608J35372j52691j12484p7478o0544p6863J18770j89808
10530H8828J14423m7426M30124K36682m71989J04294j30567O4295Q936L32635
10520G30235m38650j41065M71365L22528l91425k22654l75022O0783M41143k05668
10510B51570q7859M4647R6365L10906j05385n13856N36431L24463k35044K05029
10500H27267J51026P6940l11425K8904k0266O5610J36318J40515l52632j30974
$$ plain form
10570 197832 321540 231667 95372 -302894 -142370 383233 546540 535252 279776 -7862
10560 -7862 558158 445738 526810 948381 1021456 580170 410814 369029 206051 330234
10550 330234 99745 248655 353650 490641 431284 192467 292531 397688 418577 -136015
10540 -136015 74946 504554 639926 487235 374751 297273 236729 159866 278636 88828
10530 88828 203251 155825 585949 822631 350642 454936 324369 388664 397600 730235
10520 730235 291585 150520 621885 944413 552988 330334 -44688 16095 457238 251570
10510 251570 163711 208358 304723 615629 510244 -3612 532819 857282 622238 827267
10500 827267 978293 1055233 743808 772712 752446 818056 954374 1094889 742257 611283
10490F11283K7440j93419M1945j09996L35990O27592n52923q9101K80449j75856
10480H03404j01522N4158j98641j61098M31912L46634O7514k4319O1945j86892
10470A093095l07375r5889K38441j21858K85685j51369K07485J69866l20302J27573
10460A125352N29620j58565j99475L21054r1065N201M46376j12188j89298n1683
10450A625329n6536N44024L79346k76771K65197M30776q46939J52040K21710L9423
10440B477599m50004l28796N30064M46280Q4988k91995N8075L0896m8052l6896
10430B472159j14335j28702J40133j42865Q9450l00282J40718o6692j28684n43
10420A960357k29182K7614n8899J12728J14873Q1178J82368M6061j47417J6087
$$ plain form
10490 611283 638723 445304 487249 377253 713243 1340835 787912 698811 979260 803404
10480 803404 701882 756040 557399 396301 828213 1174847 1242361 1218042 1279987 1093095
10470 1093095 785720 689831 928272 806414 1092099 940730 1148215 1318081 997779 1125352
10460 1125352 1654972 1496407 1296932 1617986 1526921 1532122 1978498 1866310 1677012 1625329
10450 1625329 1568793 2112817 2492163 2215392 2480589 2911365 2064426 2216466 2438176 2477599
10440 2477599 2027595 1698799 2228863 2675143 2760131 2468136 2526211 2557107 2509055 2472159
10430 2472159 2357824 2229122 2369255 2226390 2315840 2015558 2156276 2089584 1960900 1960357
10420 1960357 1731175 1758789 1699890 1812618 1927491 2008669 2191037 2237098 2089681 2105768
10410B105768k39608O1876L26229k45410k41640J55565M24456m39262J8234N12140
10400B438348N1894M6943J16719L34990l72809K92129N16250O9366j03681j69953
10390C220196K17756L72542j80028k11973M65330J16906l55534O88932K14082
10381D548209J85050N09398j31323m957K32077N86682L17838J03498q5748J24587
10371F385311L83075P19748L87033N38332j3766O23893O3273k18049L1309J3166
10361H913325J11107m42965M20186L63991n21438p59088m2466n59880m29693j24096
10351F928983J70590m82938p54797k43608j6375k44735l92306o53177n6277r5668
10341D159692J92267m12100l17217J46058R7140k48800l46509J22675l94111l28944
$$ plain form
10410 2105768 1866160 1928036 2254265 2008855 1767215 1922780 2347236 1907974 1926208 2438348
10400 2438348 2490242 2537185 2653904 2988894 2616085 2908214 3424464 3493830 3390149 3220196
10390 3220196 3437952 3810494 3630466 3418493 3883823 4000729 3645195 4334127 4548209
10381 4548209 4733259 5242657 5111334 5106377 5338454 5925136 6242974 6346472 6260724 6385311
10371 6385311 6768386 7488134 7875167 8413499 8399733 9023626 9086899 8868850 8900159 8913325
10361 8913325 9024432 8581467 9001653 9365644 8844206 8085118 8042652 7482772 7053079 6928983
10351 6928983 7099573 6616635 5861838 5618230 5601855 5357120 4964814 4311637 4255360 4159692
10341 4159692 4351959 3939859 3622642 3768700 3865840 3617040 3270531 3393206 2999095 2670151
10331B670151l01129k48883N0052O2344J56859L56064k62676l22090j98682k34487
10321A727523J72368J68786j1562m70562J440N24503p2078k48293j04723k60288
10311A427114k8691j35760m3196M2465M1421M70648k73098j78083j21686k41043
10301I60091R8494k1155K20470L1747j41458j48548J90590Q1460Q3229k49815
10291A105105l91043j22723L5800N1354J88452M39029k5047l6458j79454P7405
10281A142420k77852l682K47338L01364m68752l01126k04747l04468K09585N65307
10271I05387j05504j66337L54104M65129o8383n0216k62907k88020M94152J42317
10261A419722o19308K49159k99992j11026J591L25913j14405k12045k14652K13158
$$ plain form
10331 2670151 2369022 2120139 2170191 2232535 2389394 2745458 2482782 2160692 1962010 1727523
10321 1727523 1899891 2068677 2057115 1586553 1587993 2112496 2040418 1792125 1687402 1427114
10311 1427114 1398423 1262663 1219467 1261932 1303353 1774001 1500903 1322820 1201134 960091
10301 960091 1058585 1037430 1257900 1289647 1148189 999641 1190231 1271691 1354920 1105105
10291 1105105 714062 591339 627139 678493 866945 1305974 1280927 1244469 1065015 1142420
10281 1142420 864568 860886 1108224 1409588 940836 639710 434963 130495 340080 905387
10271 905387 799883 633546 987650 1452779 1384396 1334180 1071273 783253 1277405 1419722
10261 1419722 800414 1049573 749581 638555 640146 966059 851654 639609 424957 638115
10251F38115L75660l9118j95988L85755P5459l29624k0080M95782J09694n13174
10241I82481L42683j33392k5922K01042j23581k48069m3682o2017L55466k07655
10231A037354J9804j23862J52879j95469K49940J48309n193q20983j51676K00188
10221E11291r023K28407n6843j20180j22642J11561J92796N4322n531l72924K29179
10210F40413l3342j94046J14936r6408l38057j11976K17533K54354J98609l29166
10200C22850J51395N18145k70741L53433k42242J48360J25289j49479J33943o39521
10190D51432M7821M77014k3037r5147L5719j26498M77122n76373R8792N7120N7593
10179H81558O2223l08107J83468j53512k62229L04826L00145l36255l69063M8702
$$ plain form
10251 638115 1013775 974657 778669 1164424 1239883 910259 890179 1385961 1495655 982481
10241 982481 1325164 1191772 1165850 1366892 1243311 995242 951560 889543 1245009 1037354
10231 1037354 1057158 933296 1086175 890706 1140646 1288955 1283762 462779 311103 511291
10221 511291 502268 730675 673832 553652 431010 542571 735367 789689 784158 411234 640413
10210 640413 607071 413025 527961 431553 93496 -18480 199053 453407 652016 322850
10200 322850 474245 992390 721649 1075082 832840 981200 1106489 957010 1090953 451432
10190 451432 499253 976267 953230 858083 893802 767304 1244426 668053 766845 823965 881558
10179 881558 943781 635674 819142 665630 403401 708227 1008372 672117 303054 351756
10169C51756q2898j10872M49087M22852J35696k19314j06729L71493M9329k05565
10159A054835j55170r6659m16344n7046J53549J66893L06338k43749K97707P5845
10149A086199j04969J52570J61001m606j13013k04861J67993k17680k64903J19127
10139G76858L08013L07392M17595j68734l50373M43417L42260K75765M12461J87270
10129B951924J71442q8072j71574K07146l6764K47155n38929K49605J61099n01675
10119B651357j87415k54591k87062j46405l52827j80905q8121m28148J08403L19254
10109A153540j16345Q4401j60173k74362r7854l2590q1092J77335L74226n2874
10099I74212J36451q8918m70834J42530J10289J40989O886Q9115p4062Q6334l47216
$$ plain form
10169 351756 268858 157986 607073 1029925 1165621 946307 839578 1211071 1260400 1054835
10159 1054835 899665 803006 386662 329616 483165 650058 956396 712647 1010354 1086199
10149 1086199 981230 1133800 1294801 1290195 1177182 972321 1140314 922634 657731 776858
10139 776858 1084871 1392263 1809858 1641124 1290751 1734168 2076428 2352193 2764654 2951924
10129 2951924 3123366 3035294 2863720 3070866 3034102 3281257 2742328 2991933 3153032 2651357
10119 2651357 2463942 2209351 1922289 1775884 1423057 1242152 1154031 725883 834286 1153540
10109 1153540 1037195 1121596 961423 687061 589207 556617 475525 652860 1027086 974212
10099 974212 1110663 1021745 550911 693441 803730 944719 951605 1040720 966658 1052992 705776
10088G05776m41107L14911J70291j94182J34334j06661l48302k1522J08527L40090
10078F62155K96795M7695M4959r9671j63899J23847L07845n18906j40201K90946
10068H51565k05411K29183n9933m30014j03720q336K74320J5410j48419K90046
10058G04691p5694J0378J26512K6161l14541j5243j10641M71415r7590K91366
10048A016814k57459j79209k04778K07353k29138l83741O08811j27054j10408
10039C41191J62451k0380K4054J32566K27563l79391l29147J17708K65930L47411
10029H89956k24504K92861Q7274m84781p1946k22992J58463L18177Q3976m07228
10019D19256n8101Q9011k74101J31680J61193K88639m22680k1905M65727M6867
$$ plain form
10088 705776 264669 579580 749871 555689 690023 583362 235060 213538 322065 662155
10078 662155 958950 1006645 1051604 951933 788034 911881 1219726 700820 560619 851565
10068 851565 646154 875337 815404 385390 281670 273334 547654 563064 414645 704691
10058 704691 628997 639375 765887 792048 477507 462264 351623 823038 725448 1016814
10048 1016814 759355 580146 375368 582721 353583 -30158 578653 451599 341191
10039 341191 503642 483262 507316 639882 867445 488054 158907 276615 542545 889956
10029 889956 665452 958313 1045587 560806 488860 265868 424331 742508 826484 419256
10019 419256 361155 450166 176065 307745 468938 757577 334897 312992 778719 825586
10009H25586J33750n7191p0983q7242k47780L94840j709k93461n9623L14001j38284
9998G11904j10498N9159m14340j14315M27751K62704k44659R5082J55114j76715
9988F51187R1629k63812K19834K28721J0217k95207L87756K17744K949m39560
9978H11458k46054M41052l13577J85294J57521p5029j05036k70724M3117l8756
9968E89266j19804L0130k47185K78592M93241K00382Q5617l01930l35668j00254
9958E72387L14557o38963l23821N58983Q7845J33248k12391L14928L90095J75373
9948A372241J72094o50474j00537J40931L2597J26592j11915n2759k9685M43100
9938A342185J75282K68359r5735j57479k03211J35806K44073N3107j58023J1659
$$ plain form
10009 825586 959336 902145 831162 743920 496140 890980 889271 595810 536187 850188 711904
9998 711904 601406 660565 246225 131910 559661 822365 577706 672788 827902 651187
9988 651187 742816 479004 698838 927559 937776 642569 1030325 1248069 1251018 811458
9978 811458 565404 1006456 692879 878173 1035694 960665 855629 584905 628022 589266
9968 589266 469462 499592 252407 530999 1024240 1224622 1310239 1008309 672641 572387
9958 572387 886944 247981 -75840 483143 570988 704236 491845 806773 1196868 1372241
9948 1372241 1544335 893861 793324 934255 966852 1093444 981529 928770 899085 1342185
9938 1342185 1517467 1785826 1690091 1532612 1329401 1465207 1709280 1762387 1604364 1616023
9928A616023L28740j41157K1178L9567p3897M36561k29689j89244k18280L7330
9918A627132p0902j56879k31065j37521K797o2843P2229j50051N87566k27699
9908A252764l3497q0743k92351j89962K46321K67042R6359J52023K36365j86403
9898A467918m02321j34687N17537L1908k5549N2590l11548l7007j00602m0594
9888A017645k81911j14607N17958l41856J75256O34785j27724K0069l90998j9483
9878A089134K47043O3467O5179L08464k15662j99505J1603m1689j8145J25659
9868A435548N209j34561K43927O8695r2699J52797J47644J19239k74366J61753
9858A833186J05141l1717J96209k14201k54838j73485N81440L96216n37233K71978
$$ plain form
9928 1616023 1944763 1803606 1824784 1864351 1790454 2227015 1997326 1808082 1589802 1627132
9918 1627132 1556230 1399351 1168286 1030765 1033562 970719 1042948 892897 1480463 1252764
9908 1252764 1219267 1138524 846173 656211 902532 1169574 1265933 1417956 1654321 1467918
9898 1467918 1065597 930910 1448447 1480355 1454806 1507396 1195848 1158841 1058239 1017645
9888 1017645 735734 621127 1139085 797229 972485 1607270 1479546 1499615 1108617 1089134
9878 1089134 1336177 1399644 1464823 1773287 1557625 1358120 1369723 1328034 1309889 1435548
9868 1435548 1440757 1306196 1550123 1618818 1526119 1678916 1826560 1945799 1671433 1833186
9858 1833186 1938327 1906610 2102819 1888618 1633780 1460295 2041735 2437951 1900718 2172696
9848B172696Q0931K47393p2176L71419M12703M54334O95463k31418j89298k57994
9838C684053n84345l87026k1605k29500k31356J11790L35081j93351j71479o2267
9828B249995m40560l45972J23350L86076Q7037j53566M143N6478K91426K3436
9818B281843K6609l76469k96068k93785K4980M84852n3447j0316J53701P9526
9808B021426l66324L1330N2775J30384J03548K95733n7455l52383K3462P222o43509
9797A246209K76385O01777n51417K73230N91966N5073l56895k51608o42182K55881
9787A498419N32029O5054Q9218M03487J34041m37483K817l9752J4791L12180k98035
9776B276766m98313J97975K46247j14028n8367K75064J12414j15024L65172O2768
$$ plain form
9848 2172696 2253627 2501020 2428844 2800263 3212966 3667300 4362763 4131345 3942047 3684053
9838 3684053 3099708 2712682 2691077 2461577 2230221 2342011 2677092 2483741 2312262 2249995
9828 2249995 1809435 1463463 1586813 1972889 2059926 1906360 1910503 1966981 2258407 2281843
9818 2281843 2308452 1931983 1635915 1342130 1367110 1851962 1798515 1788199 1941900 2021426
9808 2021426 1655102 1686432 1739207 1869591 1973139 2268872 2211417 1859034 1882496 1889718 1246209
9797 1246209 1522594 2124371 1572954 1846184 2438150 2493223 2136328 1884720 1242538 1498419
9787 1498419 2030448 2095502 2184720 2588207 2722248 2284765 2287582 2247830 2262621 2574801 2276766
9776 2276766 1778453 1976428 2222675 2108647 2050280 2325344 2437758 2322734 2687906 2750674
9766B750674K52199j69994K59018k28452l47470J73119K07544N3750j95720J22248
9756B876916J13563j99974q5707q7612J00275O46345n5016K9296N623l93180J66492
9745C117021j28535m3556J46936p570O2945J2482M230J3122L7229K21567l19396
9734C116475j55268K38911L8723N7137j29136m4832N1413N14623N0099K47660
9724C985805m58882n5825r6839j45276K43515L93937p0502L00968j48076k18947
9714C729878k04221j0525K09188L28757j0216m28635L28296m2463M12952J51507
9704D464518K74227J07261K52767l61088k63440J91964P7805K7871K46652p4818
9694D943719k41930j43677L12844J87205L32094l1977k6824j65494p5045n2370
$$ plain form
9766 2750674 3002873 2832879 3091897 2863445 2515975 2689094 2896638 2950388 2754668 2876916
9756 2876916 2990479 2790505 2704798 2617186 2717461 3363806 3308790 3338086 3343709 2950529 3117021
9745 3117021 2988486 2944930 3091866 3084296 3147241 3159723 3163953 3177075 3214304 3435871 3116475
9734 3116475 2961207 3200118 3238841 3295978 3166842 3122010 3173423 3688046 3738145 3985805
9724 3985805 3526923 3471098 3374259 3228983 3472498 3866435 3795933 4096901 3948825 3729878
9714 3729878 3525657 3515132 3724320 4053077 4042861 3614226 3942522 3900059 4313011 4464518
9704 4464518 4738745 4846006 5098773 4737685 4474245 4666209 4744014 4771885 5018537 4943719
9694 4943719 4701789 4558112 4870956 5058161 5390255 5358278 5331454 5165960 5090915 5038545
9684E038545J15353L96481l80870L87996K55507L45367k67101Q4452K38478K10735
9674F424943M41746N053j44819L77504J75616K29454O2876q5114m0886L04129
9664G750502J2724O5757L03341L24542m5086L06164M25738M11540m1456K18344
9654I732110M60098j90798L14963N88906O58048l96184M5667j65869L26910Q87086
9644A2260937K94068k82920l4297Q95720N84488J53824L43681N31052K20276L39750
9634A5306579M363R40583P64781K74546L12830M37167M3564J60964J031514O45176
9624A9922067O06777P93787P25026N54146R28965P54308Q92874J979554J925541
9615B9083045K346769K984823L223380L530722L056737K833507J538806N97509
$$ plain form
9684 5038545 5153898 5550379 5169509 5557505 5813012 6158379 5891278 5975730 6214208 6424943
9674 6424943 6866689 6871742 6726923 7104427 7280043 7509497 7572373 7487259 7446373 7750502
9664 7750502 7763226 7828983 8132324 8456866 8411780 8717944 9143682 9555222 9513766 9732110
9654 9732110 10192208 10001410 10316373 10905279 11563327 11167143 11212810 11046941 11373851 12260937
9644 12260937 12555005 12272085 12237788 13133508 13717996 13871820 14215501 14746553 14966829 15306579
9634 15306579 15310942 16251525 17016306 17290852 17603682 18040849 18084413 18245377 19276891 19922067
9624 19922067 20528844 21322631 22047657 22601803 23530768 24285076 25177950 27157504 29083045
9615 29083045 31429814 34414637 37638017 41168739 44225476 47058983 48597789 49195298
9607D9195298J11822L8609K86126R39985J173390J241818Q13510Q2473j459154
9598E2423877j954213k187650k214112j775071r82351q05189J02725K13219m9819
9589D2771416L02060M90879M78724L27738M83343P16341Q60570J520741J153355
9580D9105167J300327J751044J588217J574314J739235K239858K711263L411210
9572F5420635M185637M973542N291928O262320P962260J0224847J2569879J5493981
9564A32385029J9417525K2998429K2640097K0107861J5225696P029737N5420l969365
9556B35890429m394171j111489L012802M646206L610863j198218r849014j7042409
9548B13564999k1768708k2782354k0968772j7146896j1799418p861813n800364
$$ plain form
9607 49195298 49307120 49345729 49631855 50571840 51745230 52987048 53800558 53883031 52423877
9598 52423877 50469664 48282014 46067902 44292831 43310480 42505291 42608016 42821235 42771416
9589 42771416 43073476 43564355 44043079 44370817 44854160 45570501 46431071 47951812 49105167
9580 49105167 50405494 52156538 53744755 55319069 57058304 59298162 62009425 65420635
9572 65420635 69606272 74579814 79871742 86134062 94096322 104321169 116891048 132385029
9564 132385029 151802554 174800983 197441080 217548941 232774637 239804374 239859794 235890429
9556 235890429 231496258 230384769 233397571 238043777 241654640 240456422 230607408 213564999
9548 213564999 191796291 169013937 148045165 130898269 119098851 111237038 105436674
9541A05436674l951041k974584k062611k410589k299652k511309k968178l387589
9533H2871121m197711m969074m904646m039817l980456m112118l396792l150038
9525E0120469k585792k639372j755759j293062j262304n47500o83425p74987o61353
9516C7916915O1122O18284K57889M79947J416125J954802K603377K640660K558836
9507E0507957K272681K399174K164310K310790J563202J391817k7654o66487j490050
9498F0425740k726334l894143k576066k569387k875359k001978j458962K26456
9490D2549967O78299R76795J498739J728929J237816J813250J562900J952567
9482E3999262K081199K477891K090295O45765o36945q74298j948684k505575j964929
$$ plain form
9541 105436674 101485633 98511049 96448438 94037849 91738197 89226888 86258710 82871121
9533 82871121 78673410 73704336 68799690 64759873 60779417 56667299 53270507 50120469
9525 50120469 47534677 44895305 43139546 41846484 40584180 40036680 39353255 38578268 37916915
9516 37916915 37978037 38596321 38854210 39334157 40750282 42705084 45308461 47949121 50507957
9507 50507957 52780638 55179812 57344122 59654912 61218114 62609931 62582277 61915790 60425740
9498 60425740 57699406 53805263 51229197 48659810 45784451 43782473 42323511 42549967
9490 42549967 43228266 44205061 45703800 47432729 48670545 50483795 52046695 53999262
9482 53999262 56080461 58558352 60648647 61294412 60657467 59783169 57834485 55328910 53363981
9473E3363981l66120R4990r41197j382428k942330m359419m704119l966477l295880
9464C1501001k059548j667804j303407o38895p60675l62823N8813M34652O73218
9455B5874532Q71747J127936Q37790P63160J032736P62853J21066o56606m08931
9446C0326283p75169j418164k152484j842413j590158j979775j566689j484505
9438A7516926j373625j507994j143599q47061m74254o50008q25856j46545j5948
9429A0532036n04489q5638m86207j90963o38911q61051J8971J03286J05785j98176
9419G794643r66275l44686J80587l71638l34364j93557R6180q3063J06594k74547
9409E609874j76660L49377n29172j18103K50722P3087J9309j19187J37354l39829
$$ plain form
9473 53363981 52997861 53092851 52151654 50769226 47826896 43467477 38763358 34796881 31501001
9464 31501001 29441453 27773649 26470242 25831347 25070672 24707849 24766662 25201314 25874532
9455 25874532 26746279 27874215 28712005 29475165 30507901 31270754 31391820 30735214 30326283
9446 30326283 29551114 28132950 25980466 24138053 22547895 20568120 19001431 17516926
9438 17516926 16143301 14635307 13491708 12644647 12170393 11520385 10694529 10547984 10532036
9429 10532036 10027547 9941909 9455702 9264739 8625828 7764777 7783748 7887034 7992819 7794643
9419 7794643 6828368 6483682 6664269 6292631 5958267 5764710 5860890 5777827 5884421 5609874
9409 5609874 5433214 5782591 5253419 5135316 5386038 5459125 5478434 5359247 5496601 5156772
9399E156772m6831j55792j68706N82631K4890l27135J42656M3762K55306m02156
9389E105397m4200j28344k37358L14123l4721j40083J9219j35409o83j71641p69535
9378C776765L01227M97467l62760j21980J59432O5195l02961k43176n500j04911
9368C658798J54767j10897k0043o6618o1923J52309k42413j58397r1818n3966
9358C159799L89853j2576p9020L68592K21479n68578q5861M29943p5356j86777
9348C561498K57068L1869J82461K08311j94251k1869J48737J92808m53615j69930
9338C743087j30596j92279L40972j21307l86570m2350j4444j28661L17602Q9397
9328C474851j2703n4778j20522K01785O1762M19129l73214k42143M11453k19391
$$ plain form
9399 5156772 5109941 4954149 4785443 5368074 5392964 5065829 5208485 5252247 5507553 5105397
9389 5105397 5061197 4932853 4695495 5009618 4974897 4834814 4854033 4718624 4717941 4546300 3776765
9378 3776765 4077992 4575459 4212699 4090719 4250151 4315346 4012385 3769209 3763709 3658798
9368 3658798 3813565 3702668 3682625 3616007 3554084 3706393 3463980 3305583 3213765 3159799
9358 3159799 3549652 3537076 3458056 3826648 4048127 3479549 3393688 3823631 3748275 3561498
9348 3561498 3818566 3850435 4032896 4241207 4046956 4025087 4173824 4366632 3913017 3743087
9338 3743087 3612491 3420212 3761184 3639877 3253307 3210957 3196513 3067852 3385454 3474851
9328 3474851 3462148 3407370 3286848 3488633 3550395 3969524 3596310 3354167 3765620 3546229
9318C546229o2748K12258J58944p148J8980l88286j48471M77890q8753P4410N95342
9307D388647j1421k79969J51246L85473J65415L13447N26909k35770N54833m6966
9297E911844M54972P88789P57372N23988q39745n18646r20029n88911o0275k46737
9287E262622k14001M05170l56946j97652K40864j39793L44574l5548m3410M46416
9277E712296j4592O0871k35118N28088K88654J6802l89274L26618L6316j11739
9267F218922O13892N44607O67440M13447J39178P7289k39206l69165J05862o7384
9257H104882J04747L37962O546j020370n58950K08777K47478J51535J96482k94714
9247G484375l22563j5097K02722J11923M5107K5424R2250K67460K156J12083N40571
$$ plain form
9318 3546229 3483481 3695739 3854683 3847535 3866515 3478229 3329758 3807648 3718895 3793305 4388647
9307 4388647 4377226 4097257 4248503 4633976 4799391 5112838 5639747 5403977 5958810 5911844
9297 5911844 6366816 7155605 7912977 8436965 7597220 7078574 6158545 5569634 5509359 5262622
9287 5262622 5048621 5453791 5096845 4899193 5140057 5000264 5344838 5309290 5265880 5712296
9277 5712296 5697704 5758575 5523457 6051545 6340199 6357001 5967727 6294345 6330661 6218922
9267 6218922 6832814 7377421 8044861 8458308 8597486 8674775 8435569 8066404 8172266 8104882
9257 8104882 8209629 8547591 8554137 7533767 6974817 7183594 7431072 7582607 7779089 7484375
9247 7484375 7161812 7146715 7349437 7461360 7506467 7531891 7624141 7891601 7893757 8005840 8546411
9236H546411j24563Q9228j30267J62197M72605L24592K70055K93651l2445N42816
9226A0414280L80826N59443N30787L58245M32876N40253Q15094M67513O75029
9217A5174346Q77426P46832J299584J773996K103870K809057M039103N401594
9209C4225808N458784K915581j763994l448997k544643j053199R50667K598737
9201C7338744K710173k63145m414381o033911m881749l322434k137604j398278
9193A7597415j594986j270751k82698m01007q14006m93094l80679m5431m86706
9184A1828057n16594K27659j25640l66007j80786L49959J77329n88271J19657
9175A0925363M35171J73393J91593L00691L58056R36861P87887M28544j90492
$$ plain form
9236 8546411 8421848 8511076 8380809 8543006 9015611 9340203 9610258 9903909 9871464 10414280
9226 10414280 10795106 11354549 11885336 12243581 12676457 13216710 14031804 14499317 15174346
9217 15174346 16051772 16798604 18098188 19872184 21976054 24785111 28824214 34225808
9209 34225808 39684592 42600173 40836179 37387182 34842539 33789340 34740007 37338744
9201 37338744 40048917 39785772 35371391 29337480 24455731 21133297 18995693 17597415
9193 17597415 16002429 14731678 14448980 14047973 13233967 12740873 12360194 12314763 11828057
9184 11828057 11311463 11539122 11413482 11047475 10866689 11216648 11393977 10805706 10925363
9175 10925363 11360534 11533927 11725520 12026211 12384267 13321128 14109015 14537559 14347067
9166A4347067j014933j76029l16464j26737N56211J98362o6977j187508q02774
9157A1410218m61223p96990p54298j75787m30644k18496l48624P3505l7957O6
9147H259770o72401l1023N8125J5114N29548n64954K46544j93773k50082R2299
9137G489167J31521J53768j23229o4678j04927L33346j88991O5409K48935J69018
9127H109339j08030R3398O1405k65477K08013M1874m4688k9209J92251n7408J80400
9116H381868j91720K00974O6715O9089l30078M84491N76547J04584j9032l4840
9106I308598j00128P79015P3439K14259j90135k8884P94153n8108K74528j14619
9096A0952118L65197L77809M79578K05574Q9583L33804J25861j62946n28o8682
$$ plain form
9166 14347067 13332134 13156105 12839641 12712904 13269115 13467477 13400500 12212992 11410218
9157 11410218 10948995 10152005 9397707 9221920 8791276 8572780 8224156 8297661 8259704 8259770
9147 8259770 7587369 7556346 7614471 7629585 8159133 7594179 7840723 7646950 7396868 7489167
9137 7489167 7620688 7774456 7651227 7586549 7481622 7814968 7625977 7691386 7940321 8109339
9127 8109339 8001309 8094707 8156112 7890635 8098648 8140522 8095834 8066625 8258876 8201468 8381868
9116 8381868 8190148 8391122 8457837 8526926 8196848 8681339 9257886 9362470 9343438 9308598
9106 9308598 9208470 9987485 10060924 10275183 10085048 10056164 10850317 10792209 11066737 10952118
9096 10952118 11317315 11695124 12174702 12380276 12469859 12803663 12929524 12766578 12766050 12697368
9086A2697368O99491m5362o3000K74649J86231K41541L61975N3640L28416M85276
9076A5220225j3416P67230K41762R2694J0246M04778P88195N23291M05087o4329
9066A8375763L86684O17422M88973J61505J15692O30714n6308O02298J069117
9057B2391860J07582M23566J110112L77905Q60922M92629J092134O95167J85802
9048B7737679M20810O60857Q51696N08421O88633R90947J135339L44547P90055
9039C4128984J100692M98222N29697J300472O92936P74877Q45621J292396J461778
9030D2625675J202614J810601J861871K024974K469551K180085L187885L690067
9022F1053323M940191N635624O997634R039810J1064968J3693806J2935023Q136826
$$ plain form
9086 12697368 13396859 13351497 13288497 13563146 13749377 13990918 14352893 14406533 14734949 15220225
9076 15220225 15206809 15974039 16215801 16308495 16318741 16723519 17511714 18035005 18440092 18375763
9066 18375763 18762447 19379869 19868842 20030347 20146039 20776753 20720445 21322743 22391860
9057 22391860 22499442 22923008 24033120 24411025 25271947 25764576 26856710 27551877 27737679
9048 27737679 28158489 28819346 29671042 30179463 30868096 31859043 32994382 33338929 34128984
9039 34128984 35229676 35727898 36257595 37558067 38251003 39025880 39871501 41163897 42625675
9030 42625675 43828289 45638890 47500761 49525735 51995286 54175371 57363256 61053323
9022 61053323 65993514 71629138 78626772 87666582 98731550 112425356 125360379 133497205
9014A33497205L4083m618767l781220j073887K338358O656391Q782674P994513
9006A49829350J983971n875222r192037q534504o649678m798545l131285k367656
8998A11264394j980655k648804l460390l029760j763171l98340J129659K298799
8990A01411732L237596K455892J804086J253026J251991K152742L740400O009266
8982A23316731Q256176J1313543J4999860J8627979K3371513K4337916J6032713
8975B40256431K211575n418096l551144J102040O196407J1119175J5956512J4540995
8967B82413895R66951j3915767k0642526k0278541j7086464j4208159j1819078
8960A85430311r560011r172733j1465307j1703296j0376947p567153n512453k646496
$$ plain form
9014 133497205 133531288 128912521 125131301 124057414 126395772 133052163 141834837 149829350
9006 149829350 151813321 145938099 136746062 128211558 121561880 116763335 113632050 111264394
8998 111264394 109283739 106634935 103174545 100144785 98381614 97983274 99112933 101411732
8990 101411732 104649328 107105220 108909306 110162332 111414323 113567065 117307465 123316731
8982 123316731 131572907 142886450 157886310 176514289 199885802 224223718 240256431
8975 240256431 242468006 237049910 233498766 234600806 240797213 251916388 267872900 282413895
8967 282413895 283380846 269465079 248822553 228544012 211457548 197249389 185430311
8960 185430311 175870300 166697567 155232260 143528964 133152017 125584864 120072411 117425915
8952A17425915k98279R91078M29122j031549l069998m543156m956377l743470
8944A01203286j693442j268659j544383l323651k720866j507765j85296P02980
8936H9662204J940494K250376J817642K334838L656264N395761P236769Q881038
8928A23175386J1589397J5424899J1782860m211933j6518523j5974503j2486681
8921A12780902p099402l639926o78807p7178n16262j620847k516388j154148O31531
8912I6109475M85332j722776l321309l718995k691727j519230l92049K11350N44336
8903H3984407J940706K419395L485079M607040N039962P296864Q338286J0271626
8895A27383365J3305326J7448316K0387639K3116331K6373555K8271747K3598163
$$ plain form
8952 117425915 117127636 118118714 118547836 117516287 114446289 109903133 104946756 101203286
8944 101203286 99509844 98241185 96696802 93373151 90652285 89144520 88959224 89662204
8936 89662204 91602698 93853074 95670716 98005554 101661818 107057579 114294348 123175386
8928 123175386 134764783 150189682 161972542 157760609 141242086 125267583 112780902
8921 112780902 105681500 102041574 101362767 101285589 100769327 99148480 96632092 95477944 96109475
8912 96109475 96594807 94872031 91550722 87831727 85140000 83620770 83228721 83440071 83984407
8903 83984407 85925113 88344508 91829587 96436627 101476589 108773453 117111739 127383365
8895 127383365 140688691 158137007 178524646 201640977 228014532 256286279 279884442
8888B79884442J1354423k958788j6696533l0055748l4180556l0347959k3787244
8881A53212037j7320208j3541410j1264062r060174o496799n278919m219947m841293
8873H1189225m403694m454699l268775k368046k452525j897821j478960q11580
8865F0053125l62253l77265R5096P62301O40161J845249K230753L103976M915346
8856G2906489O238989P694318R436875J1445877J3262821J4590109J3237714O516027
8848A55329219j565753q763434j6209872j9317350j7289719j4478757j0452783
8841F7251551p575416o092947n081196l393447l183519l194692k432051j628813
8833C4669470j572302j211006r03654j225495j419639q82446j531458j006129
$$ plain form
8888 279884442 291238865 288280077 271583544 241527796 207347240 176999281 153212037
8881 153212037 135891829 122350419 111086357 102026183 95529384 90250465 86030518 81189225
8873 81189225 76785531 72330832 69062057 66694011 64241486 62343665 60864705 60053125
8865 60053125 59690872 59313607 59408703 60171004 60811165 62656414 64887167 67991143 72906489
8856 72906489 79145478 86839796 96276671 107722548 120985369 135575478 148813192 155329219
8848 155329219 153763466 145000032 128790160 109472810 92183091 77704334 67251551
8841 67251551 59676135 53583188 48501992 45108545 41925026 38730334 36298283 34669470
8833 34669470 33097168 31886162 30982508 29757013 28337374 27454928 25923470 24917341
8825B4917341j86328q13050o24340j125758l99727p44865j299596j90649j69502
8816A9363526o46553p56952j1949K07518l84494o41922n56556L79513J5675j67035
8806A6800771k88273l73339m12771j03568J1856k0762n08706k7329K48676J35856
8796A5462411k90023p8295M66458N45288j52187p1910J2328k08578K74313L82877
8786A6342682J13681L47651M14936N65803L66929R33227J269989J193338J684964
8777B3233200J964724K383063J370532J492044J608413J258527K236377K750313
8769C8297193J359465M07674J14337n46654o66715o01574m65577k131423l527728
8760C2238998l560792k328272j504334r46964j139180j010537l70974K43078K01502
$$ plain form
8825 24917341 24731013 23917963 23293623 22167865 21768138 21023273 19723677 19533028 19363526
8816 19363526 18716973 17960021 17948072 18155590 17771096 17129174 16572618 16952131 16967806 16800771
8806 16800771 16512498 16139159 15726388 15622820 15634676 15613914 15105208 15077879 15326555 15462411
8796 15462411 15172388 15094093 15560551 16105839 15953652 15881742 15894070 15685492 15959805 16342682
8786 16342682 16456363 16804014 17218950 17784753 18151682 19084909 20354898 21548236 23233200
8777 23233200 25197924 27580987 28951519 30443563 32051976 33310503 35546880 38297193
8769 38297193 39656658 40064332 40178669 39632015 38965300 38363726 37898149 35766726 32238998
8760 32238998 28678206 26349934 24845600 23898636 22759456 21748919 21377945 21621023 21822525
8751B1822525N35029J073050R39610J255310J496864J228516J182826J167783
8743C0701513J620544K527060L306066M539585L759563J620509J14093O5145O41371
8734D8895449J640947L85387j174973k163657l068918k620731k387527l117683
8726C6388294m314650l824497k722890k547495j788030j173692q80387j144380
8718A7992273k22740j14761k68615J37385L12134M28897O59303O50891O09574
8709B0184341K66716n7793L31699Q67169J571757J599547J385530L39325j516131
8700B4972160k040693r15755n22701p49367j275633k247526j913655j914064j541367
8691A1851399j102174r19714j076991q54990o22220l7023k4518n77483m00018
$$ plain form
8751 21822525 22357554 23430604 24370214 25625524 27122388 28350904 29533730 30701513
8743 30701513 32322057 34849117 38155183 42694768 46454331 48074840 48188933 48254078 48895449
8734 48895449 50536396 50921783 49746810 47583153 44514235 41893504 39505977 36388294
8726 36388294 32073644 28249147 25526257 22978762 21190732 20017040 19136653 17992273
8718 17992273 17769533 17654772 17386157 17523542 17835676 18264573 18923876 19574767 20184341
8709 20184341 20451057 20393264 20724963 21592132 23163889 24763436 26148966 26488291 24972160
8700 24972160 22931467 22015712 21493011 20743644 19468011 17220485 15306830 13392766 11851399
8691 11851399 10749225 9829511 8752520 7897530 7275310 7238287 7213769 6636286 6236268
8682F236268p2725j6982k76361j94779m35591J29923M26102m93009l95504j46340
8672D761002j32417p2118L5234k96935j55306k03733l08043J42261p3991j46449
8662C549505K541l0406k67926J98941o2656l03737r7836K20638o1070j54398k09493
8651B784103j39932K36199Q8801r7081J13407j03951O2414q7664l37755K33727
8641B752268M45505O32500j99744M0839K20406m25428k6689n665j28549j35163
8631C170280l780j51521l1839J88822l20550J25266k29902j46027o468j75449
8621B418832l38203k40311K17440j68309K84888K97323m32893q1854K47376k71889
8611A932400J20346o9243Q4804l40556J44370J82089L30653J15513j19640N200
$$ plain form
8682 6236268 6163543 6146561 5870200 5675421 5239830 5369753 5795855 5302846 4907342 4761002
8672 4761002 4628585 4556467 4591701 4294766 4139460 3935727 3627684 3769945 3695954 3549505
8662 3549505 3552046 3521640 3253714 3452655 3389999 3086262 2988426 3209064 3147994 2993596 2784103
8651 2784103 2644171 2880370 2969171 2872090 2985497 2881546 2943960 2856296 2518541 2752268
8641 2752268 3197773 3830273 3630529 3671368 3891774 3466346 3439657 3433992 3305443 3170280
8631 3170280 3166500 3014979 2983140 3171962 2851412 2976678 2746776 2600749 2594281 2418832
8621 2418832 2080629 1840318 2057758 1889449 2174337 2471660 2038767 1956913 2204289 1932400
8611 1932400 2052746 1983503 2068307 1727751 1872121 2054210 2384863 2500376 2380736 2385936
8601B385936J37688J26540k13182J31169O2308J41246j37785j07529j53175k56200
8591B117016J4953r3360l23357L50142p2086p99914M23016M84463m39723q15131
8581H46019K04036J38221m52281j4802K54032J57227K48658j30809k45121j39049
8571H66131n2121K59817m34377M5258n439r4150L58831M08004r8647j39102j10929
8560A003276K55721m3426k73152J7152j86380L40892k40369j17390J80842l43931
8550E93235K81050M5614j86752j66101J58735l859m00962L79925M15311l6439
8540A079757M32482l16453o10986L7022k0109J93815K88394l8694j24563k92384
8530F28281K65009M60872l9063k48499l48740p0847J22414O65052M20627j87347
$$ plain form
8601 2385936 2523624 2650164 2436982 2568151 2630459 2771705 2633920 2526391 2373216 2117016
8591 2117016 2131969 2038609 1715252 2065394 1993308 1193394 1616410 2100873 1661150 846019
8581 846019 1050055 1188276 735995 721193 975225 1132452 1381110 1250301 1005180 866131
8571 866131 814010 1073827 639450 684708 679269 585119 943950 1351954 1253307 1114205 1003276
8560 1003276 1258997 1215571 942419 959571 773191 1114083 873714 756324 937166 593235
8550 593235 874285 919899 733147 567046 725781 721922 320960 700885 1116196 1079757
8540 1079757 1512239 1195786 584800 621822 601713 795528 1083922 1045228 920665 628281
8530 628281 893290 1354162 1315099 1066600 717860 647013 769427 1434479 1855106 1667759
8520A667759l22894j78911j3783p1467n1612P8756J82834J7030J24626m67926
8510I64412l19923L21065k3537j32869j70943k64974J29712j19866J5971l3266
8500C65782j41123J79581J02757J88174j26566M3709l19213q0012L30914p0327
8490D73676K79070k89493J77612M04437J03164l19016l60776L86578M4403K16038
8480A115693n1254L27929k00771l62841Q1402l87110l81473K66359O12803O4994
8470A085731j14092j96099n40287k19357M08035l98402K01146N8795n34008L4034
8460b14504l5483J00347M25760K538k57361J45917Q8291L62359j36209k01190
8450B80465j54296j1238j11810P47270J82331r6186m75495J0155M99218j33777
$$ plain form
8520 1667759 1344865 1165954 1152171 1080704 1029092 1107848 1290682 1307712 1432338 964412
8510 964412 644489 965554 942017 809148 638205 373231 502943 383077 399048 365782
8500 365782 224659 404240 506997 695171 568605 612314 293101 213089 544003 473676
8490 473676 752746 463253 640865 1045302 1148466 829450 468674 855252 899655 1115693
8480 1115693 1064439 1392368 1191597 828756 910158 523048 141575 407934 1020737 1085731
8470 1085731 971639 775540 235253 15896 423931 25529 226675 285470 -248538 -214504
8460 -214504 -249987 -149640 276120 278658 21297 167214 255505 617864 481655 280465
8450 280465 126169 114931 3121 750391 932722 836536 361041 371196 870414 736637
8440G36637j64006K3034m38163k64762k75263J9935N40710L10640j38863L0801
8430C80700R6349j96254K77538p8838j01654J9528l7186k88073k36287r4870L54504
8419I5457j39052O2569K7142J41597J04395k96550K22892O8359K1551M00170j20904
8408E87626j17065l92304j39693l4763J66346K17343j75435p8140l6080j24819
8398a26984K07552L26357L38229m60222j34742M42786R2309l83532j87846Q8880
8388B02787J04380k51582J40372K02409J17995m928l98585j68917Q6105K87094
8378C17130n5767K33330O1212k88010k08889Q49L75689J04785l48564M51241K13548
8367H56554l31724p6680j24099l13820K16477K28408l30346k46882Q7157R2844
$$ plain form
8440 736637 572631 595665 157502 -107260 -382523 -362588 178122 488762 349899 380700
8430 380700 477049 280795 558333 479495 377841 397369 360183 72110 -164177 -259047 95457
8419 95457 -43595 18974 46116 187713 292108 -4442 218450 286809 308360 708530 587626
8408 587626 470561 78257 -61436 -96199 70147 287490 112055 33915 -2165 -126984
8398 -126984 80568 406925 745154 284932 150190 592976 685285 301753 113907 202787
8388 202787 307167 55585 195957 398366 516361 511433 112848 -56069 30036 317130
8378 317130 261363 494693 555905 267895 59006 59855 435544 540329 191765 643006 856554
8367 856554 524830 448150 324051 10231 226708 455116 124770 -122112 -34955 57889
8357E7889j67363J64981R8151J0584J30402j32108j17061k9363j10720K87122
8347A92514M43437q9796j73402n98390K57393J33047m00175P0213n848J59970
8337a1037o3668K85436k45882j13825n7600m31108L97931L97798l1005L4357p7573
8326H3824m0718q3388j4917J06386j37090J99578l35327m5761R7456K76336J39474
8315B45853j39979q978K20733l50526l3817L5759j71437L99868k65840k84817
8305c53181P0071j63199M307K82292R7074R9919r8288J24499j77077j11154M20581
8294A95844k01700l1090k49366r5510l08857L11734M71203N1042j63326J45637
8284A25611Q0053J014J49206k60981l9425l95612j11551k17603K66851L4848K89891
$$ plain form
8357 57889 -109474 55507 153658 164242 294644 162536 45475 16112 -94608 192514
8347 192514 635951 546155 372753 -225637 31756 164803 -235372 -165159 -171007 -11037
8337 -11037 -74705 210731 -35151 -148976 -206576 -637684 -239753 158045 127040 161397 83824
8326 83824 43106 -40282 -55199 51187 -85903 113675 -221652 -267413 -169957 106379 245853
8315 245853 105874 96896 317629 -32897 -66714 -30955 -202392 197476 -68364 -353181
8305 -353181 -283110 -446309 -442002 -159710 -62636 37283 -61005 63494 -113583 -224737 195844
8294 195844 -5856 -36946 -286312 -381822 -690679 -378945 92258 143300 -20026 125611
8284 125611 205664 206678 355884 94903 55478 -340134 -451685 -669288 -402437 -367589 -77698
8273g7698K94407l63613j11543N99231K0279l43037N3747J60200Q2435n46696
8263b32288k39383M90067Q7348j28792j5279j389j88524k20951L32506l66707
8253d83392J51902J2794l61666N26203k14384m7194M41476M22094n53335m06075
8243e11577L75038l89424j10114K49008K79781j56126n05958N62075J48662k47114
8233c05749r6781K76811l3878k26388L92372n37461J37888J63978J55630l7967
8223a11545j82774N7055k47741J62313K87644O30118Q6009k19092l55077l49334
8213b42424j9467J92685r7829N2915j74269l34131j46259J19936J73836k9242
8203e04249P4007L53332J2085l81108j84995N23336J0217J18458K7783p24250
$$ plain form
8273 -77698 216709 -146904 -258447 340784 361063 18026 71773 231973 314408 -232288
8263 -232288 -471671 18396 105744 -23048 -38327 -39716 -228240 -449191 -116685 -483392
8253 -483392 -331490 -318696 -680362 -154159 -368543 -415737 25739 447833 -105502 -511577
8243 -511577 -136539 -525963 -636077 -387069 -107288 -263414 -769372 -207297 -58635 -305749
8233 -305749 -402530 -125719 -159597 -385985 6387 -531074 -393186 -229208 -73578 -111545
8223 -111545 -294319 -237264 -485005 -322692 -35048 595070 681079 461987 106910 -242424
8213 -242424 -261891 -69206 -167035 -114120 -288389 -622520 -768779 -648843 -475007 -504249
8203 -504249 -430242 -76910 -64825 -445933 -630928 -107592 -97375 21083 48866 -675384
8193f75384L90739r09120N07440P39423j0431L6119l07716k72581j36479J25324
8183e12666L26849K27101k25968J66403j20099j82025K73667k48036p8171K1522
8173c51423l0934J1708k47688M36637K62931Q169n8185R8686m967L6905m76779
8162c14940K6750K59494j54494k85262N14095k87580l34895k41923l46571L48060
8152h17266J0118K04741p253K56279L89445n5321K38063j10809n02845J02340
8142b92508J50617j61046j54907j10587J53778p3474K43164n8945k54257K11819
8132c46346j75803L42817O5623L66977q7034m59498n1670L28168j5063l28340
8122c60169J08468N359j10691m69360N86827N61822k03955l40524M2830K11020
$$ plain form
8193 -675384 -284645 -1193765 -686325 53098 42667 78786 -228930 -501511 -637990 -512666
8183 -512666 -185817 41284 -184684 -18281 -138380 -320405 -46738 -294774 -372945 -351423
8173 -351423 -382357 -370649 -618337 -181700 81231 89400 31215 129901 124934 161839 -314940
8162 -314940 -288190 -28696 -183190 -468452 45643 -241937 -576832 -818755 -1165326 -817266
8152 -817266 -807148 -602407 -609660 -353381 36064 -19257 218806 107997 -394848 -292508
8142 -292508 -141891 -302937 -457844 -568431 -414653 -488127 -244963 -303908 -558165 -346346
8132 -346346 -522149 -179332 -113709 253268 166234 -293264 -344934 -16766 -31829 -360169
8122 -360169 -251701 -246342 -357033 -826393 -239566 322256 118301 -222223 -179393 31627
8112C1627j38596p0052k39991k79891P5900L44680K07088J34005m06604J96440
8102a45394o5926j61647L72999K13713l40393Q974j6141k63006j42114K87804
8092b51131O2666q4641N7154J9149j15673M8375J93308k24681j52577K8215J72217
8081b47619M24237m70496j94553K09547l16715L34668M51175J09413n09436r6731
8071c06510j1741L99333p3269k5895R4006k31429l61778L93614l1073J47184M25811
8060D18253l36847k98931J17464j21013m09545R3505J18668M15312K13823m20704
8050b10015n99870J77460L21373j34251l1348L00494P1708J96162k54994k87581
8040d50862L38392N9928J52480O451n71462J02191M61472l24859m52091p9019
$$ plain form
8112 31627 -106969 -177021 -417012 -696903 -621003 -276323 -69235 64770 -341834 -145394
8102 -145394 -211320 -372967 32 213745 -126648 -117674 -133815 -396821 -538935 -251131
8092 -251131 -188465 -273106 -215952 -196803 -312476 -264101 -70793 -295474 -448051 -419836 -247619
8081 -247619 176618 -293878 -488431 -278884 -595599 -260931 190244 299657 -209779 -306510
8071 -306510 -318251 81082 7813 -18082 75924 -155505 -517283 -123669 -154742 -7558 418253
8060 418253 81406 -217525 -100061 -221074 -630619 -537114 -418446 -3134 210689 -210015
8050 -210015 -809885 -632425 -311052 -445303 -476651 -176157 -104449 91713 -163281 -450862
8040 -450862 -112470 -52542 99938 106389 -465073 -362882 98590 -226269 -678360 -757379
8030g57379K72285K64305p990L45727P0818k26234k30429j77563j85493K43652
8020c88301J83824K19059K01986K01224p0111k73298k74554j75671j86835M21122
8010a41555q0862m28211L60745J69769l2440l84628M06454J10099j48386j63262
8000c32277j24530J54398L7976p7638j01L05494K2863m03535j6001j94222P9233
7989e48340L83044J00650k62172k34392O9016K33150J78195M9776K13009R503
7979A91439k33556q8170r9284j78899k37213j8537k48353J47201M56244O0597
7969b48531K76768p2667l32574Q3379J75265m03999K76499j93240L28785J94897
7959H4582M8059q5307n27294L78725K95730m73978j30553k84257r7446L9031k0815
$$ plain form
8030 -757379 -485094 -220789 -228779 116948 187766 -38468 -268897 -446460 -631953 -388301
8020 -388301 -204477 14582 216568 417792 347681 74383 -200171 -375842 -562677 -141555
8010 -141555 -222417 -650628 -289883 -120114 -152554 -537182 -130728 -20629 -169015 -332277
8000 -332277 -456807 -302409 -264433 -342071 -342172 -36678 -13815 -417350 -433351 -627573 -548340
7989 -548340 -165296 -64646 -326818 -561210 -492194 -259044 -80849 -31073 181936 191439
7979 191439 -42117 -130287 -229571 -408470 -645683 -664220 -912573 -765372 -309128 -248531
7969 -248531 28237 -44430 -377004 -293625 -118360 -522359 -245860 -439100 -110315 84582
7959 84582 132641 47334 -479960 -101235 194495 -279483 -410036 -694293 -791739 -752708 -773523
7948g73523L24898j21860n2437K15315N9555J04409J00451k38468K20136n9043
7938b20567l71543j69567P24915l000k07728J97501l98875j74761N29044k02090
7928b96671j68103K07818k35497j70549J25120j90864p7499L79130M42230m55912
7918d40797j75957K10078k89183l30107n4669N06891K90798P2515K36270M25441
7908D51280l72454j76725J9561j11854J040j05365L56200j16196j08297L5746
7898a27064K71272l35938j7579n2743K09061M07755K9134m98751k23284M8169
7888b89968J18780j93605j97160L51206J34862m78695k04463N73966K7381K19306
7878F1610L21074k32885j47135m6165k70953J36176R2671j22011J70824K65640
$$ plain form
7948 -773523 -448625 -570485 -622922 -407607 -348052 -243643 -143192 -381660 -161524 -220567
7938 -220567 -592110 -761677 -36762 -39762 -247490 -49989 -448864 -623625 -94581 -296671
7928 -296671 -464774 -256956 -492453 -663002 -537882 -728746 -806245 -427115 15115 -440797
7918 -440797 -616754 -406676 -695859 -1025966 -1080635 -573744 -282946 -210431 25839 451280
7908 451280 78826 -97899 -78338 -190192 -189152 -294517 61683 -54513 -162810 -127064
7898 -127064 144208 -191730 -209309 -262052 -52991 354764 383898 -114853 -338137 -289968
7888 -289968 -171188 -364793 -561953 -210747 -75885 -554580 -759043 -185077 -157696 61610
7878 61610 382684 149799 2664 -43501 -314454 -178278 -85607 -207618 -36794 228846
7868B28846l07332l6377r7141l01437K5504J28615m34598L55388K26778j93924
7858d05678L25093L93617k25655p364k25301J8062J29305k72072r4540P0902o6369
7847c60000N5258P1914Q7588J10216K6441o6145q2541j96229j53191n7562j33688
7836f97939K8169K09298M41389K18167j28135n88740j90272K3378L44651L13260
7826b6774j54966q5808J10196L77188k39187j02188j7362o4756l20592M383q9679
7815f09545L63708L20598j58289J1056j55198K02878O4459l75952K88577N7572
7805I864n00886j33607J55329q32000N34555J375098k92034l40588J29079k31325
7795a26515k04375L85116j2289l77308j31280J43292K24381K57075j81213m02201
$$ plain form
7868 228846 -78486 -114863 -212004 -513441 -487937 -359322 -793920 -438532 -211754 -405678
7858 -405678 -80585 313032 87377 80013 -145288 -127226 2079 -269993 -364533 -293631 -360000
7847 -360000 -304742 -232828 -145240 -35024 -8583 -74728 -157269 -353498 -506689 -564251 -697939
7836 -697939 -669770 -460472 -19083 199084 70949 -517791 -708063 -684685 -340034 -26774
7826 -26774 -181740 -267548 -157352 219836 -19351 -121539 -138901 -203657 -524249 -519866 -609545
7815 -609545 -245837 74761 -83528 -72472 -227670 -24792 39667 -336285 -47708 9864
7805 9864 -491022 -624629 -469300 -1301300 -766745 608353 316319 -24269 104810 -126515
7795 -126515 -330890 54226 41937 -335371 -466651 -323359 -98978 158097 -23116 -425317
7785d25317M2347J82471K2480m6893N3160k05514j05145N76608j46059r4923M22275
7774B75490j69336j9827k57146j83460L04263m26138L1272l45222K38824K76023
7764b75257m37r698J73115k76981Q7573M61181j81518n40793j86107n5881J48739
7753f56064L51258l23112k6051L42292K95461j16216J10189Q1250k18020N4581
7743a04432j22273l0390k89445R0810J99187j15287k7596L82302j96402J32566
7733h0960O30818n49421l54067L4540K39894L6349l50865K00038J06492l34209
7723d21391J29542k4942J22231k16305r2497k99581J45248M63676o12409L52074
7713d54354L62116K98706k12510n1623N0697k55709k6772K4009R6052k82231P2225
$$ plain form
7785 -425317 -382970 -200499 -178019 -224912 -171752 -377266 -482411 94197 -51862 -146785 275490
7774 275490 106154 86327 -170819 -354279 -50016 -476154 -444882 -790104 -551280 -275257
7764 -275257 -275694 -285392 -112277 -389258 -301685 159496 -22022 -562815 -748922 -804803 -656064
7753 -656064 -304806 -627918 -653969 -311677 -16216 -132432 -22243 59007 -159013 -104432
7743 -104432 -226705 -257095 -546540 -455730 -256543 -371830 -399426 -17124 -213526 -80960
7733 -80960 549858 437 -353630 -319090 -79196 -42847 -393712 -193674 -87182 -421391
7723 -421391 -291849 -316791 -194560 -410865 -503362 -802943 -657695 -194019 -806428 -454354
7713 -454354 -92238 206468 -6042 -57665 -6968 -262677 -289449 -265440 -169388 -451619 -379394
7702c79394n7372k14651M86795P2804j02945l9788N9625K6418j62738l05198J7803
7691e98641L44594L8962l77254j88146J07003J99034k28638l4650N90782j80505
7681c27459K45076n168J6684J0026k21227J45953n11521Q3100K22538k52389L32354
7670b62033M26993M9003n1864m87516l9443J12076j4305K48036m0946N3230j2085
7659a8854m6845M80582o7777n22881L35527L5478k62842k07476k27426l04312
7649h06826J89094K68598J38146j49823N21728k09843L15814o6996l28665k32906
7639c61679k52178L88493j55746j05998K24407K4170j70108r9286p7224O44309
7629E9160K76164j81992l79427k35168J06911L23967J22544K9028J7291l24985
$$ plain form
7702 -379394 -436766 -651417 -164622 -91818 -194763 -234551 -174926 -148508 -311246 -616444 -598641
7691 -598641 -254047 -215085 -592339 -780485 -673482 -474448 -703086 -737736 -146954 -327459
7681 -327459 -82383 -87551 -70867 -60841 -282068 -136115 -647636 -564536 -341998 -594387 -262033
7670 -262033 164960 213963 162099 -325417 -364860 -252784 -267089 -19053 -59999 -6769 -18854
7659 -18854 -65699 414883 347106 -175775 159752 195230 -67612 -275088 -502514 -806826
7649 -806826 -617732 -349134 -210988 -360811 160917 -48926 266888 199892 -128773 -361679
7639 -361679 -613857 -225364 -381110 -487108 -262701 -238531 -408639 -507925 -585149 59160
7629 59160 335324 153332 -226095 -461263 -354352 -30385 92159 121187 138478 -186507
7619a86507j16127K95152l04019j6890K72750O1657J37603J23536q5496J28579
7609C10238p3553o01536J19243J0080j0067N8641j72174K62169j13565l88102
7599e98626K71570M0224J41000p7152r1763k19391J09523L61997K99731l07067
7589f9954L61038k1976l91993J81757o4168n53124J81366p2211J77089K18438
7579e3738J17451J23562j01961j41940q6880J6063j77152J14112K0832m58539
7569f28190K05912o9122R8262J05118m39126J61718R4790O6282K13550L8439m98981
7558f51348L97104P04449l402o68127l4887k01093K08076m2319j14541J67640
7548b38448J18889r7143N8786l8758l0158q4800m1255K02225j14259j05689L10357
$$ plain form
7619 -186507 -302634 -7482 -311501 -328391 -55641 6016 143619 267155 181659 310238
7609 310238 236685 -364851 -245608 -235528 -245595 -186954 -359128 -96959 -210524 -598626
7599 -598626 -327056 -286832 -145832 -222984 -314747 -534138 -424615 -62618 237113 -69954
7589 -69954 291084 269108 -122885 58872 -5296 -558420 -377054 -449265 -272176 -53738
7579 -53738 63713 187275 85314 -56626 -143506 -127443 -304595 -190483 -169651 -628190
7569 -628190 -422278 -491400 -393138 -288020 -727146 -565428 -470638 -404356 -190806 -152367 -651348
7558 -651348 -254244 450205 446803 -221324 -256211 -457304 -249228 -291547 -406088 -238448
7548 -238448 -119559 -216702 -157916 -196674 -226832 -311632 -352887 -150662 -264921 -370610 -60253
7537f0253K19555K45866j67725j47084m7052R0116l73242J59143m65598K04711
7527c41563K06534M25539l01207J9423M76289m60425k22025k20765m26592J65181
7517f79611J15784J84521J85021Q9054j44091l17615N18290L66821j52699j20922
7507D4553N9051j07665k28300j41109j4212K44176j47413l9776K35638j48883
7497b43940L50281J80376m18943o1377J4778j59333J55143J19477k3275J49166
7487F2353j52196j57151r1431m8816o6399m54239N51193L87381k57572k06952
7477d33829N40494m05264P3920K14501j76864J78425l62711J53579p7413Q9038
7467b06124J79601l46455Q042J89517o5155n71978K13330J13258K52064p6470
$$ plain form
7537 -60253 159302 405168 237443 90359 43307 133423 -239819 -80676 -546274 -341563
7527 -341563 -135029 290510 -10697 8726 485015 24590 -197435 -418200 -844792 -679611
7517 -679611 -563827 -379306 -194285 -105231 -249322 -566937 -48647 318174 165475 44553
7507 44553 103604 -4061 -232361 -373470 -387682 -143506 -290919 -330695 -95057 -243940
7497 -243940 106341 286717 -132226 -193603 -178825 -338158 -183015 -63538 -86813 62353
7487 62353 -89843 -246994 -338425 -387241 -453640 -907879 -356686 30695 -226877 -433829
7477 -433829 106665 -298599 -224679 -10178 -187042 -8617 -371328 -217749 -295162 -206124
7467 -206124 -26523 -372978 -364936 -175419 -240574 -812552 -599222 -485964 -233900 -310370
7457c10370j75584J41186N2700M58045k08790q3494L1050k04067n3296q5646J46073
7446b92193K6799K79848K15230Q1048m58789O964j29112J00331P4482M7358l83401
7435d31435K22635J4021J08755J06116R7268l52528m2613j99616k03126L21957
7425c58566P7620k31675J69851J11054j17858K20457K81714m21056J2828K9075
7415b26556o6411k2690k22346J93691n9439m2442j53141M68395J59050R900K00496
7404B38507k30363l7541j65899l43101K64897K34444l0666l17817L0985L18313
7394c8241L34104j90859l2490k3000Q6842q7934j58544l86573K33295J60169N54422
7383D51191l81131J35701k25038j60760j08552j12296L17944k09990K41240K73120
$$ plain form
7457 -310370 -485954 -344768 -292068 165977 -42813 -126307 -95257 -299324 -352620 -438266 -292193
7446 -292193 -265394 14454 229684 310732 -148057 -141093 -270205 -169874 -95392 -48034 -431435
7435 -431435 -208800 -194779 -86024 20092 117360 -235168 -277781 -477397 -680523 -358566
7425 -358566 -280946 -512621 -342770 -231716 -349574 -129117 152597 -268459 -255631 -226556
7415 -226556 -292967 -315657 -538003 -344312 -403751 -446193 -599334 -130939 28111 38011 238507
7404 238507 8144 -29397 -195296 -538397 -273500 -39056 -69722 -387539 -356554 -38241
7394 -38241 295863 105004 72514 49514 136356 48422 -110122 -496695 -263400 -103231 451191
7383 451191 70060 205761 -19277 -180037 -288589 -400885 -82941 -292931 -51691 221429
7373B21429j08711l14668j99369J5651l16905q8288N9464O35706L27239o53888
7363d22340J75564k58988J38272K86129l99603j9268L8794J45570q2094J72323
7353b25641J12947J07312K1544J31793k30740k95714j48003k8075J62507K57140
7343a34930j77119m19723J50618K3646K7790P2523J82552m5796J7415J21366r9084
7332b80742M41829j7546j73633n7684m46434L48420j20539n0647j56602L9965
7322d73613Q0413L05735K95209k20212R8847m18601m21696K36524J94263J17821
7312b05310j73029P3831J83511K58030J13403m41914m42168k8305M0358r7729
7302g19322K89835j71994J97157L98433o9215j96872j77031K97827J32500K59691
$$ plain form
7373 221429 112718 -201950 -401319 -385668 -702573 -790861 -731397 -95691 231548 -422340
7363 -422340 -246776 -505764 -367492 -81363 -480966 -500234 -461440 -315870 -397964 -225641
7353 -225641 -112694 -5382 16162 147955 -82785 -378499 -526502 -554577 -392070 -134930
7343 -134930 -312049 -731772 -581154 -557508 -529718 -457195 -274643 -320439 -303024 -181658 -280742
7332 -280742 161087 143541 -30092 -87776 -534210 -185790 -306329 -356976 -513578 -473613
7322 -473613 -393200 -87465 207744 -12468 86379 -332222 -753918 -517394 -323131 -205310
7312 -205310 -378339 -304508 -120997 137033 250436 -191478 -633646 -661951 -621593 -719322
7302 -719322 -429487 -601481 -404324 -5891 -75106 -271978 -449009 -151182 -18682 241009
7292B41009k05080l96579j00853K43288P5709J44051m9087n0120M3366O6885l66623
7281c54034k31725K06657P8695K67230j31887M5680J26228n9583l79340K39032
7271a93047J85614l0243k88678l3138L62834J14389m79726j25461K72507K79128
7261F4179j38964N6577j07135l32383J1857J9865J72000q2154J15976K3034R4745
7250a02403l49968L80351J01042m3946j35123J04119P4932l19660m47585K82568
7240d55673J76047L30321k38311M4375L26366m56338R0207L1162J44422R1997
7230H4575k34082l63366J65644m2679K08858O409K07651k21588K4357L46766k84217
7219a01672o3973k9710R87L30254n1814j42412o733m7646J52879l39104R6391
$$ plain form
7292 241009 35929 -360650 -461503 -218215 -142506 1545 -47542 -97662 -54296 12589 -354034
7281 -354034 -585759 -379102 -300407 -33177 -165064 -119384 6844 -52739 -432079 -193047
7271 -193047 -7433 -37676 -326354 -359492 3342 117731 -361995 -487456 -214949 64179
7261 64179 -74785 -18208 -125343 -457726 -445869 -426004 -254004 -336158 -220182 -197148 -102403
7250 -102403 -452371 -72020 29022 -14924 -150047 -45928 29004 -290656 -738241 -455673
7240 -455673 -279626 50695 -187616 -143241 183125 -273213 -183006 -151844 -7422 84575
7230 84575 -149507 -512873 -347229 -389908 -181050 -174641 33010 -188578 -164221 182545 -101672
7219 -101672 -165645 -195355 -194368 135886 84072 -58340 -65073 -112719 40160 -298944 -202553
7208b02553J4235J63046k19690n77008N29559L18527k16946L95853K21227J35793
7198E62043j04271p22644j93406K28893O1061l58046J71796j37998j1116L97629
7188a06059k30788L8848O1673j69722N61179k9560n15190J02855O0178K3059j14785
7177c18312j20685R0301K7408j60504k26617N23177r8565j31492J33947N1725
7167b29617J56431K03935l70774j02846J3406J72503O9843n62283J59094K36570
7157b53738m8590L21431o7875k15156n1231K12636K71878r7684l3429l44911l8938
7146c45607J51497K86221J26649j45941k99347Q6378n3590J23741K23368l06820
7136a53451L821j13331k746j51332J47030L49417R8477l2608p6136P1663l93826
$$ plain form
7208 -202553 -188318 -25272 -244962 -821970 -292411 26116 -190830 205023 426250 562043
7198 562043 457772 -264872 -458278 -229385 -168324 -526370 -354574 -492572 -503688 -106059
7188 -106059 -336847 -297999 -236326 -406048 155131 125571 -389619 -286764 -226586 -203527 -318312
7177 -318312 -438997 -348696 -321288 -481792 -708409 -185232 -283797 -415289 -281342 -229617
7167 -229617 -73186 130749 -240025 -342871 -329465 -156962 -87119 -649402 -490308 -253738
7157 -253738 -302328 19103 -48772 -263928 -315159 -102523 169355 71671 38242 -306669 -345607
7146 -345607 -194110 92111 218760 72819 -226528 -140150 -193740 -69999 153369 -153451
7136 -153451 -149630 -262961 -265707 -417039 -270009 79408 177885 145277 69141 140804 -253022
7125b53022J6282P0552K13162N1318k55010k28351K26776K56365j3221l98383
7115c13532J01924J00554l48843M16570K59804l02505l27074r9204K09145j63558
7105d66719J45963m686J58545k56059L00429J38561q6886M58252k50687l75560
7095b38847l68622L34687j14402M56587J78211r279J16163r1401m05005k44542
7085c86450J26276L30375J35887l74518j00298J73855J4216j63533j39050K2270
7075c60970K16223J14699k32768M2096P2721q9478L99179J14079L0289P417m13740
7064a00253q2292K99231l93234k3626k01841J66094n6159J82318K47613n8034
7054b0183K08803k35185j34527l31986K23754K13626k07813r5206L22566J70532
$$ plain form
7125 -253022 -236740 -166188 46974 98292 -156718 -385069 -158293 98072 84851 -313532
7115 -313532 -211608 -111054 -459897 -43327 216477 -86028 -413102 -512306 -303161 -466719
7105 -466719 -320756 -325442 -166897 -422956 -122527 16034 -70852 387400 136713 -238847
7095 -238847 -607469 -272782 -387184 69403 247614 238335 354498 263097 -141908 -386450
7085 -386450 -260174 70201 206088 -168430 -268728 -94873 -80657 -244190 -383240 -360970
7075 -360970 -144747 -30048 -262816 -220720 -147999 -237477 161702 275781 306070 313487 -100253
7064 -100253 -182545 116686 -276548 -300174 -502015 -335921 -392080 -209762 37851 -20183
7054 -20183 188620 -46565 -181092 -513078 -289324 -75698 -283511 -378717 -56151 114381
7044A14381k24927k28050M86435P3690m1772P3947l73304j47744K23698L90799
7034C47153m08640j13381K70854q4308k68275l0755L38282K2092M6366l70329
7024b50941R7423l3330j19042K36088O7465M7821K087K39624m21952j66436k3639
7013c24832K4903K95431o7079O5352j0738J11535P1972l62398Q8668L14231q3301
7002A23744p4062r4058m54744r7725M8133j40568M68467K90690J67288j9755m38438
6991b21028j30047Q5892M31770o2802l42010J12400J02749j92585K42476J32532
6981A59347Q4684M2600k88846N4826K8190n07689K7987K7957K68612K73191m65140
6970b94281K62848j38753R4086J05300O3788j80130j55025j88546j04396p3103
$$ plain form
7044 114381 -110546 -338596 147839 221529 179757 253704 -119600 -267344 -43646 347153
7034 347153 -61487 -174868 95986 11678 -256597 -287352 50930 73022 119388 -250941
7024 -250941 -153518 -186848 -305890 -69802 -2337 45484 47571 287195 -134757 -301193 -324832
7013 -324832 -299929 -4498 -71577 -6225 -16963 94572 166544 -195854 -107186 207045 123744
7002 123744 49682 -44376 -499120 -596845 -548712 -689280 -220813 69877 237165 217410 -221028
6991 -221028 -351075 -265183 166587 103785 -238225 -125825 -23076 -215661 26815 159347
6981 159347 244031 286631 -2215 52611 80801 -426888 -398901 -370944 -102332 170859 -294281
6970 -294281 -31433 -170186 -76100 29200 92988 -87142 -242167 -430713 -535109 -608212
6960f08212J38777N76347l1667k25597J28462J43660L03247m26025j98211p305
6950b06524l00579K42266j3812l43423L21019Q4307k67028K95021j51094p7230
6940d17077o529m1635O841M42668R9748n74342N03935J51384k94511J76439k84943
6929b38022j97258O88966O6387j56242p993k02822j90148K39765M14837L26225
6919G43695j21583K97617J23756k21332k01795o8643m27564k66574J75288j11117
6909g8252L23644k259q1490j40137P4451k62973M19794m76056J50136j84393n888
6898b63423j23561J17321J63442k098N07727K81257j63579j40475k37117q1727
6888E7767K76943J14860l20492k69158J21593M20755p9199k56063J8048R594l17387
$$ plain form
6960 -608212 -469435 106912 75245 -150352 -21890 121770 425017 -1008 -199219 -206524
6950 -206524 -507103 -264837 -278649 -622072 -301053 -216746 -483774 -188753 -339847 -417077
6940 -417077 -423606 -465241 -458400 -15732 84016 -490326 13609 164993 -129518 46921 -238022
6929 -238022 -435280 253686 320073 163831 155838 -46984 -237132 2633 417470 743695
6919 743695 622112 919729 1043485 822153 620358 551715 124151 -142423 32865 -78252
6909 -78252 245392 243133 161643 21506 95957 -167016 252778 -223278 -73142 -257535 -263423
6898 -263423 -386984 -269663 -106221 -108319 399408 680665 517086 376611 139494 57767
6888 57767 334710 449570 129078 -140080 -18487 402268 323069 67006 85054 94648 -222739
6877b22739m3691N9624j29510K8521J54540j14050q9954l15373m3395M21530N783
6866b88714L77578J28162K24270m36508k05455K58356l5656J46034J90996j58478
6856B00585j99377K09511R6962l4934J02688k839l31272N0593j86556k85259Q9302
6845b90596J09507J65885o09276L8541p6447J05832L82035K31560o9983Q014P5312
6834G0384n4915K19536O171k42696m904k03541J43058N5770k0470J43481k09441
6823i7567k44895J23737n42661j72565N38938L01424N2653L4251K0378L06936
6813C20629n90778J73825L17320k21988J505l42339j45280J59308K86732l56790
6803c97856j3183M19422o9006o0654m2277n1039R208n4049N6996J76877l97245
$$ plain form
6877 -222739 -266430 -206806 -336316 -307795 -153255 -267305 -357259 -672632 -716027 -294497 -288714
6866 -288714 88864 217026 441296 4788 -200667 57689 22033 168067 359063 200585
6856 200585 1208 210719 307681 272747 375435 372596 41324 91917 -94639 -379898 -290596
6845 -290596 -181089 -15204 -624480 -585939 -662386 -556554 -174519 57041 -12942 -4928 70384
6834 70384 15469 235005 241176 -1520 -6424 -209965 -66907 -11137 -31607 111874 -97567
6823 -97567 -342462 -218725 -761386 -933951 -395013 -93589 -40936 -6685 13693 320629
6813 320629 -270149 -96324 220996 -992 513 -341826 -487106 -327798 -41066 -397856
6803 -397856 -411039 8383 -60623 -121277 -163554 -214593 -205385 -259434 -202438 -25561 -422806
6792d22806l90125M59013J89714j99203R1434m2211O7997j77635J697K74783J00955
6781d6387p1433n15188R0428K11647K35942M03634j75827l24893o5345L7570N4655
6770a65197J62512M5949L14004j14382j58760K44476j74618j58181K06895N6297
6760B58995l28845j89270K86144L18019m42602J1772m3481l68490L79905N6283
6750f1570j58083J80328j9424L1502L6403P84977k36401n20691j10130j51763
6740b24852k34636L2794L54626L82521K84057m08541k58463j72271K22693q1412
6730a03484k6610k61394M6622J67775P924j09676L77913m1346j78784N0070j16160
6719a87150J85160N8188o51372j12251L42927K24169J38947l36953J73841J35108
$$ plain form
6792 -422806 -812931 -353918 -164204 -363407 -271973 -314184 -246187 -423822 -422125 -147342 -46387
6781 -46387 -117820 -633008 -542580 -330933 -94991 308643 132816 -192077 -257422 -219852 -165197
6770 -165197 -2685 43264 357268 242886 84126 328602 153984 -4197 202698 258995
6760 258995 -69850 -259120 27024 345043 -97559 -85787 -129268 -497758 -117853 -61570
6750 -61570 -219653 -39325 -58749 -27247 9156 794133 557732 37041 -73089 -224852
6740 -224852 -459488 -426694 -72068 310453 594510 185969 -72494 -244765 -22072 -103484
6730 -103484 -130094 -391488 -344866 -177091 -169167 -278843 99070 57724 -121060 -70990 -187150
6719 -187150 -1990 56198 -595174 -707425 -364498 -140329 -1382 -338335 -164494 -29386
6709b9386K74255k3642J52448m60134n80792l17408J55604P90857J53418j75282
6699f0062P1142j38444o5501K6398Q9233j5221j12518n00815O53539J11571j60479
6688a01157O3240L8618j72997O12990n35124M5548K64581j40315j10769L8622
6678C237l6479j96143m2491l52747K0332M29121k90256j74021P2240L38455M33239
6667B04487L4936k24198j94642J74534K06611l36848M31902K64682l06354n31149
6657b76039r7583L62262l51187J85558N2099K8661l02801l14339j57769K37312
6647f33826Q7564L77995K50883l10413j93966L35049J18507j42427K07208O9007
6637A65581k03878j61190L4409K32475m39303M75959o9638j53835l71074N24397
$$ plain form
6709 -29386 244869 221227 373675 -86459 -667251 -984659 -829055 -38198 115220 -60062
6699 -60062 11080 -127364 -192865 -166467 -77234 -92455 -204973 -705788 -52249 59322 -101157
6688 -101157 -37917 701 -172296 440694 -94430 -48882 215699 75384 -35385 3237
6678 3237 -33242 -229385 -271876 -624623 -604291 -175170 -465426 -639447 -567207 -228752 204487
6667 204487 239423 15225 -179417 -4883 201728 -135120 296782 561464 255110 -276039
6657 -276039 -373622 -11360 -362547 -176989 -124890 -96229 -399030 -713369 -871138 -633826
6647 -633826 -546262 -168267 82616 -227797 -421763 -86714 31793 -110634 96574 165581
6637 165581 -38297 -199487 -165078 67397 -371906 104053 34415 -119420 -490494 33903
6627C3903K19809j93366j66790j19730p9580k83592r4479M63164k09468J16095
6617c14034j25775K26274j93867k32738K21674N369J74809L91789l4023O8709
6607A88187k07247j51802L2259K5255q8765J50473k7975k15083Q4823j45367J00183
6596b55059J26965J92111J85754J63170j47433n36481J98142l56606k6862J46685
6586c09614m8604k30429K23801N67012n01205n33324J29831N25957K8647j21135
6576b69063M1606K05981k05436R6813j62438o4168j51081K38292l27726N21026
6566g6194J4467j59282L43519P389j05916l4687m32468K63210L8893o6592o3181
6555b70842J6080J50641j4449j5282l54317o5359L60637k7128l00456K13753K17906
$$ plain form
6627 33903 253712 60346 -106444 -226174 -305754 -589346 -683825 -220661 -430129 -314034
6617 -314034 -439809 -213535 -407402 -640140 -418466 -413097 -238288 153501 119478 188187
6607 188187 -19060 -170862 -138603 -113348 -202113 -51640 -79615 -294698 -209875 -355242 -255059
6596 -255059 -128094 64017 249771 412941 265508 -270973 -72831 -429437 -456299 -309614
6586 -309614 -358218 -588647 -364846 202166 -299039 -832363 -702532 -176575 -147928 -269063
6576 -269063 -227457 -21476 -226912 -130099 -292537 -356705 -507786 -269494 -597220 -76194
6566 -76194 -61727 -221009 122510 129899 23983 -10704 -443172 -179962 -141069 -207661 -270842
6555 -270842 -254762 -104121 -118570 -133852 -488169 -553528 -192891 -220019 -520475 -306722 -88816
6544h8816K24707q6448j92126J9377k31935K0209M3323L26283k10863m7129M62158
6533B38740N9015j64084k8874J8529L20090j82381k76683l90024j65166O68939
6523I8101k6937J38697k8167Q3603j32377k5880j12474k56468L6289r7576J63654
6512a59535L82464k95574l16783M2744R570J14792N6307N15205N6515k82365k41724
6501a18384n05712K67165L6843K15712j05920l19580j3477O5269K64073J12497
6491a01514Q7105l22634K63373L57373l7897J23695n68235L868k06511P8127J57305
6480a65945l4573j04203l76988M74651J91805M15280j76947k27064r6229J39024
6470C8811k35667K15684P38k12742j34999O11564L07511m39196l48467K03693
$$ plain form
6544 -88816 135891 49443 -142683 -123306 -355241 -335032 -291709 34574 -176289 -223418 238740
6533 238740 297755 133671 104797 123326 443416 261035 -15648 -405672 -570838 98101
6523 98101 71164 209861 181694 265297 132920 107040 -5434 -261902 -225613 -323189 -159535
6512 -159535 222929 -72645 -389428 -346684 -337114 -222322 -166015 349190 405705 123340 -118384
6501 -118384 -624096 -356931 -320088 -104376 -210296 -529876 -543353 -478084 -214011 -101514
6491 -101514 -14409 -337043 -73670 283703 245806 369501 -198734 -194866 -401377 -323250 -165945
6480 -165945 -200518 -304721 -681709 -207058 -15253 400027 223080 -3984 -100213 38811
6470 38811 -196856 18828 19566 -193176 -328175 283389 590900 151704 -196763 6930
6460F930J03132j03375J66784Q0584k10008Q1570K24202j41683l41228J4200k1596
6449a40488k11212K82378K74760j78654L78370L1559r4894k3742r2208j67200
6439E8669M828J29302j47198k19466k93247K48439j85222N88018P0937k17893
6429C7167k21697k01511l80929l43488M07793o9245j50764P0701K02296J39618
6419e10059M45092K08379l03034J38935j93574J17653j65464J58864L16375L0005
6409B43172l15126K51662L17000j82438m26013l10217Q6710J34516j1795j56647
6399c69176j05115J02790K80421K5107l04261K8396j20198J5793m7422K40856
6389b52809L96805M85884j8708j05209n600j80371m5799P2132k39304k05230l40418
$$ plain form
6460 6930 110062 6687 173471 254055 44047 125617 349819 208136 -133092 -118892 -140488
6449 -140488 -351700 -69322 205438 26784 405154 436713 341819 318077 225869 58669
6439 58669 63497 192799 45601 -173865 -467112 -218673 -403895 184123 255060 37167
6429 37167 -184530 -386041 -766970 -1110458 -702665 -771910 -922674 -851973 -649677 -510059
6419 -510059 -64967 143412 -159622 -20687 -214261 -96608 -262072 -103208 213167 243172
6409 243172 -71954 179708 496708 314270 -111743 -421960 -335250 -200734 -212529 -369176
6399 -369176 -474291 -371501 -91080 -65973 -370234 -341838 -462036 -446243 -493665 -252809
6389 -252809 143996 629880 611172 505963 500363 319992 274193 346325 107021 -98209 -438627
6378d38627J67817j48515K6497L90719k12857j92952J96348K1762o1893P5959
6368a75742o9753M9417N6561j95531M02771o9377k99753j94380K70692J44461
6358h0634m91935l4952J12367n908N509q177N8138J8526L07223P2505j70520M05400
6346A87542J19583j90164l18663O5248j52144K1154J46612k06861J69495L63692
6336B05494j20104K39470m45441r7567N08570l38711l63531L25371k5520k97097
6326d09066Q9770Q8414j60044j89258K12696L8286M36175K01815m79831K00963
6316B9920j33439j27955N59838m33381k82149M8329k21766j30358j75471K66866
6306e99566k44076M52019L74646n7572j21039l7297J07583K87554l89721r960
$$ plain form
6378 -438627 -270810 -419325 -392828 -2109 -214966 -407918 -211570 -189808 -251701 -175742
6368 -175742 -245495 -196078 -139517 -335048 67723 -1654 -301407 -495787 -225095 -80634
6358 -80634 -572569 -607521 -495154 -501062 -495553 -503730 -445592 -427066 -119843 -47338 -217858 187542
6346 187542 307125 116961 -201702 -136454 -288598 -267444 -120832 -327693 -158198 205494
6336 205494 85390 324860 -120581 -218148 290422 -48289 -411820 -86449 -111969 -409066
6326 -409066 -319296 -230882 -390926 -580184 -367488 -329202 106973 308788 -171043 29920
6316 29920 -103519 -231474 328364 -105017 -387166 -338837 -560603 -690961 -866432 -599566
6306 -599566 -843642 -391623 -16977 -74549 -195588 -232885 -125302 162252 -227469 -237429
6296b37429N1197K35311m52298K16565Q0017L0371J60876K57104J85238k95987
6286B30965m0915r4365j75053R7790j10530n8839J42363m27761m62328M51249
6276d47424j04893M20569N33597k07356m23173k52587k45304L13612K3436J29301
6266b60222M0284J55363k04570M186O8046J83221k02817J18022O5460j1178M60717
6255D16512o46000L929j21386J93331k53809N41426k36285p3430K96357j26508
6245e863j85136J08968m45260J18451K61729J77316Q0491R2527l31331j24053
6235b52161p1972K93755K80487n2713m08230K11943K87087J9486k43233o51711
6225e87262l6717L84537J03674M8252l6304k151j15791J98803P5964k38775l26299
$$ plain form
6296 -237429 -186232 49079 -403219 -186654 -106637 -76266 84610 341714 526952 230965
6286 230965 190050 95685 -79368 18422 -92108 -150947 -8584 -436345 -898673 -447424
6276 -447424 -552317 -131748 401849 194493 -228680 -481267 -726571 -412959 -389523 -260222
6266 -260222 -219938 -64575 -269145 -264959 -196913 -13692 -216509 -98487 -33027 -44205 416512
6255 416512 -229488 -225559 -346945 -153614 -407423 134003 -102282 -175712 120645 -5863
6245 -5863 -190999 -82031 -527291 -408840 -147111 30205 110696 203223 -128108 -252161
6235 -252161 -324133 -30378 250109 197396 -210834 1109 288196 307682 64449 -587262
6225 -587262 -623979 -239442 -135768 -87516 -123820 -125971 -241762 -42959 33005 -205770 -532069
6214e32069K06155O9587n08716J36326J28991j3319O45928l7960n81585K32361
6204b54301J58528J53278K38820l27449k47798R269l00525J75446K46179j18326
6194b66879O1076n2849J84673n3044j79505J89254J56284K48273K6507k73876
6184C9914m36857j57639J61911K51481Q1211j63224j52454M65236L59391j57226
6174B91744j54805J25026m58475m76367J68212J27314Q9447j32235L83615L22961
6164B86437o1930M2106k87925J7762n7592L21565r5522j68777p3889M3721P5503
6153D1459j23261l1202J95286P7839m43705L46367J91053j43300L20478J17031
6143E48045m00894l14018J28561J33653K2917K30885j60967p53679j6844N30014
$$ plain form
6214 -532069 -325914 -256327 -765043 -628717 -499726 -513045 132883 94923 -486662 -254301
6204 -254301 -95773 57505 296325 -31124 -278922 -269653 -570178 -394732 -148553 -266879
6194 -266879 -205803 -258652 -73979 -127023 -306528 -117274 39010 287283 313790 39914
6184 39914 -396943 -554582 -392671 -141190 -59979 -223203 -375657 89579 448970 291744
6174 291744 136939 261965 -196510 -672877 -504665 -377351 -287904 -420139 -36524 286437
6164 286437 224507 266613 -21312 -3550 -61142 260423 164901 -3876 -77765 -34044 41459
6153 41459 -81802 -113004 82282 160121 -283584 62783 253836 110536 431014 548045
6143 548045 147151 -166867 -38306 95347 118264 349149 188182 -565497 -582341 -52327
6133e2327r943j11966k54102L78448J23901m21125L863J71585L38859l01631K31308
6122I6870j35772J39186J79663m10356n4132K66445m6874m18321J6269j32223
6112d99245K05007J05065o2750q9667K21423K53451J43461l50433J16188J16554
6102A59054N2350J84757m3922P7516j27101J00654j9723q1688k68696L54897J01740
6091D89838k01994m82043j01567j20256j14461L69020r6671k45187P7310K92359
6081a33652j84525j7756k82030L80081j85706k01391O10357r5940J1995j86334
6071b84901N3320l1349L17595j26296j52188K77775j23329l99708N20553K41340
6061B92812k50790j88629k63854J16015P2789m3235L20621l61860j26203L81258
$$ plain form
6133 -52327 -62270 -174236 -428338 -49890 74011 -347114 -343251 -171666 167193 -134438 96870
6122 96870 -38902 100284 279947 -130409 -184541 81904 35030 -383291 -367022 -499245
6112 -499245 -294238 -189173 -251923 -341590 -120167 133284 276745 -73688 42500 159054
6102 159054 211404 396161 352239 429755 302654 403308 383585 301897 33201 388098 489838
6091 489838 287844 -194199 -295766 -416022 -530483 -161463 -258134 -503321 -426011 -133652
6081 -133652 -318177 -335933 -617963 -237882 -423588 -624979 -14622 -110562 -98567 -284901
6071 -284901 -231581 -262930 54665 -71631 -223819 53956 -69373 -469081 51472 292812
6061 292812 42022 -146607 -410461 -294446 -221657 -264892 55729 -306131 -432334 -51076
6051e1076K1690L6310J52179L17532l22062M3873p9931M0912j8218j20118L3540
6040E4631j91205K72154j43731j00994O3368N2990l2770L28443j8433n2580K68386
6029E00259j23132m72491p7931K48137J84803k43712j42583j6544J70286J85187
6019B12279L5717K23137j193j84455k39299J6783j84466L62274j38442j67946
6009f5611K45450L46889K02253o95166j54113N09011l62696K4401j30711M60873
5999C80580J16721k50765k7976N2774n14808L15232J15023l72567m06731L2612
$$ plain form
6051 -51076 -29386 6924 159103 476635 154573 198446 118515 159427 141209 21091 54631
6040 54631 -136574 135580 -8151 -109145 -45777 7213 -25557 302886 284453 231873 500259
6029 500259 377127 -95364 -173295 74842 259645 15933 -126650 -143194 27092 212279
6019 212279 247996 471133 469940 285485 46186 62969 -121497 240777 102335 -65611
6009 -65611 179839 526728 728981 33815 -120298 388713 26017 50418 -80293 380580
5999 380580 497301 246536 218560 271334 -243474 71758 186781 -185786 -592517 -559905
$$ [...]
##END NTUPLES=NMR SPECTRUM
##END=
