##TITLE=1H_CA-9237-1
 DMSO-d6
 8 sc, 
 6.2.2024
##JCAMPDX= 6.0         $$ Bruker NMR JCAMP-DX V2.0
##DATA TYPE= NMR SPECTRUM
##DATA CLASS= NTUPLES
##ORIGIN= UXNMR, Bruker Analytische Messtechnik GmbH
##OWNER= root
$$ XWIN-NMR		Version 3.5
$$ Tue Feb  6 14:09:56 2024 Russian Standard Time (UT+4h)  she@DPX200
##.OBSERVE FREQUENCY= 200.1313
##.OBSERVE NUCLEUS= ^1H
##.ACQUISITION MODE= SIMULTANEOUS
##.ACQUISITION SCHEME= undefined
##.AVERAGES= 8
##.DIGITISER RES= 18
##SPECTROMETER/DATA SYSTEM= spect
##.PULSE SEQUENCE= zg30
##.SOLVENT NAME= DMSO
##.SHIFT REFERENCE= (INTERNAL, DMSO, 0, 15.5309)
##AUDIT TRAIL= $$ (NUMBER, WHEN, WHO, WHERE, WHAT)
$$ ##TITLE= Audit trail, XWIN-NMR		Version 3.5
$$ ##JCAMPDX= 5.01
$$ ##ORIGIN= Bruker BioSpin GmbH
$$ ##OWNER= she
$$ F:/spectra/data/she/nmr/H-F/1/pdata/1/auditp.txt
$$ ##AUDIT TRAIL=  $$ (NUMBER, WHEN, WHO, WHERE, WHAT)
(   1,<2024-02-06 14:08:25.92 +0400>,<she>,<DPX200>,
      <created by zg, POWCHK disabled, PULCHK disabled
       configuration hash MD5:
       00 E9 B6 7A A2 85 ED C7 34 08 36 98 17 FE 4E 26
       data hash MD5: 16K
       D3 8F FE 57 F2 B6 02 42 2B FD 60 33 6F 5D 88 F0>)
(   2,<2024-02-06 14:08:28.10 +0400>,<she>,<DPX200>,
      <Start of raw data processing
       efp BC_mod = 2 LB = 0.24 FT_mod = 6 PKNL = 1 PHC0 = -24595.73 PHC1 = 7.852679 SI = 16K 
       data hash MD5: 16K
       2B C9 E0 D8 E5 65 9C 72 41 C1 27 0F C0 5B B1 DF>)
(   3,<2024-02-06 14:08:49.71 +0400>,<she>,<DPX200>,
      <pk PHC0 = -0.4112436 PHC1 = 1.2 
       data hash MD5: 16K
       E4 3B 03 65 28 5E 03 83 CC ED 6C 54 73 88 CF D5>)
(   4,<2024-02-06 14:08:53.43 +0400>,<she>,<DPX200>,
      <abs ABSG = 5 
       data hash MD5: 16K
       5D DA 55 2A 1B EE AA AC 94 67 49 3B 70 95 62 84>)
$$ ##END=
$$ 
$$ hash MD5
$$ CC 39 CE D4 EA EF A3 7D 95 9C 9D 55 5B C1 52 97
##$RELAX= 
##$RELAX= 
##$RELAX= 
##$RELAX= 
##$RELAX= 
##$RELAX= 
$$ Bruker specific parameters
$$ --------------------------
##$DU= <F:/spectra>
##$EXPNO= 1
##$NAME= <H-F>
##$PROCNO= 1
##$TYPE= <nmr>
##$USER= <she>
##$AMP= (0..31)
100 100 100 100 100 100 100 100 100 100 100 100 100 100 100 100 100 100 
100 100 100 100 100 100 100 100 100 100 100 100 100 100 
##$AQSEQ= 0
##$AQ_mod= 1
##$AUNM= <au_zg>
##$AUTOPOS= <>
##$BF1= 200.13
##$BF2= 200.13
##$BF3= 200.13
##$BF4= 200.13
##$BF5= 200.13
##$BF6= 200.13
##$BF7= 200.13
##$BF8= 200.13
##$BYTORDA= 1
##$CFDGTYP= 0
##$CFRGTYP= 5
##$CHEMSTR= <none>
##$CNST= (0..31)
1 1 145 1 1 1 1 1 1 1 1 1 1 1 1 1 1 1 1 1 1 1 1 1 1 1 1 1 1 1 1 1 
##$CPDPRG= <>
##$CPDPRG1= <>
##$CPDPRG2= <>
##$CPDPRG3= <>
##$CPDPRG4= <mlev>
##$CPDPRG5= <mlev>
##$CPDPRG6= <mlev>
##$CPDPRG7= <mlev>
##$CPDPRG8= <mlev>
##$CPDPRGB= <>
##$CPDPRGT= <>
##$D= (0..31)
0 1.2 0 0 0 0 0 0 0 0.06 0 0.03 0 0 0 0 0.0002 0 0 0 0 0 0 0 0 0 0 0 0 
0 0 0 
##$DATE= 1707214105
##$DBL= (0..7)
120 120 120 120 120 120 120 120 
##$DBP= (0..7)
150 150 150 150 150 150 150 150 
##$DBP07= 0
##$DBPNAM0= <>
##$DBPNAM1= <>
##$DBPNAM2= <>
##$DBPNAM3= <>
##$DBPNAM4= <>
$$ [...]
##$SUBNAM3= <"">
##$SUBNAM4= <"">
##$SUBNAM5= <"">
##$SUBNAM6= <"">
##$SUBNAM7= <"">
##$SUBNAM8= <"">
##$SUBNAM9= <"">
##$SW= 18.0517328524113
##$SWIBOX= (0..15)
0 0 2 0 0 0 0 0 0 0 0 0 0 0 0 0 
##$SW_h= 3612.71676300578
##$TD= 16384
##$TD0= 1
##$TE= 0
##$TE2= 300
##$TE3= 300
##$TEG= 300
##$TL= (0..7)
0 120 120 120 120 120 120 120 
##$TP= (0..7)
150 150 150 150 150 150 150 150 
##$TP07= 0
##$TPNAME0= <>
##$TPNAME1= <>
##$TPNAME2= <>
##$TPNAME3= <>
##$TPNAME4= <>
##$TPNAME5= <>
##$TPNAME6= <>
##$TPNAME7= <>
##$TPOAL= (0..7)
0.5 0.5 0.5 0.5 0.5 0.5 0.5 0.5 
##$TPOFFS= (0..7)
0 0 0 0 0 0 0 0 
##$TUNHIN= 0
##$TUNHOUT= 0
##$TUNXOUT= 0
##$USERA1= <user>
##$USERA2= <user>
##$USERA3= <user>
##$USERA4= <user>
##$USERA5= <user>
##$V9= 5
##$VALIST= <valist>
##$VCLIST= <CCCCCCCCCCCCCCC>
##$VD= 0
##$VDLIST= <DDDDDDDDDDDDDDD>
##$VPLIST= <PPPPPPPPPPPPPPP>
##$VTLIST= <TTTTTTTTTTTTTTT>
##$WBST= 1024
##$WBSW= 4
##$XGAIN= (0..3)
0 0 0 0 
##$XL= 0
##$YL= 0
##$YMAX_a= 276655
##$YMIN_a= -334879
##$ZGOPTNS= <>
##$ZL1= 120
##$ZL2= 120
##$ZL3= 120
##$ZL4= 120
##$ABSF1= 15.49017
##$ABSF2= -2.56168
##$ABSG= 5
##$ABSL= 3
##$ALPHA= 0
##$AQORDER= 0
##$ASSFAC= 0
##$ASSFACI= 0
##$ASSFACX= 0
##$ASSWID= 0
##$AUNMP= <proc_1d>
##$AZFE= 0.1
##$AZFW= 0.1
##$BCFW= 0
##$BC_mod= 2
##$BYTORDP= 0
##$COROFFS= 0
##$CY= -3
##$DATMOD= 1
##$DC= 0
##$DFILT= <>
##$DTYPP= 0
##$F1P= 0
##$F2P= 0
##$FCOR= 1
##$FTSIZE= 16384
##$FT_mod= 6
##$GAMMA= 0
##$GB= 0
##$INTBC= 1
##$INTSCL= 3.70164e-10
##$ISEN= 128
##$LB= 0.24
##$LEV0= 0
##$LPBIN= 0
##$MAXI= 10000
##$MC2= 0
##$MEAN= 0
##$ME_mod= 0
##$MI= 1.114404
##$NCOEF= 0
##$NC_proc= -6
##$NLEV= 6
##$NOISF1= 3.799351
##$NOISF2= 2.8
##$NSP= 0
##$NTH_PI= 0
##$NZP= 0
##$OFFSET= 15.53094
##$PC= 1
##$PHC0= -24596.14
##$PHC1= 9.052679
##$PH_mod= 1
##$PKNL= yes
##$PPARMOD= 0
##$PSCAL= 0
##$PSIGN= 0
##$REVERSE= no
##$SF= 200.129998152
##$SI= 16384
##$SIGF1= 3
##$SIGF2= 2
##$SINO= 5.538805
##$SIOLD= 16384
##$SREGLST= <1H.CDCl3>
##$SSB= 0
##$STSI= 16384
##$STSR= 0
##$SW_p= 3612.71676300578
##$SYMM= 0
##$S_DEV= 0
##$TDeff= 16384
##$TDoff= 0
##$TI= <>
##$TILT= no
##$TM1= 0
##$TM2= 0
##$TOPLEV= 0
##$USERP1= <user>
##$USERP2= <user>
##$USERP3= <user>
##$USERP4= <user>
##$USERP5= <user>
##$WDW= 1
##$XDIM= 16384
##$YMAX_p= 306820152
##$YMIN_p= -339796
$$ End of Bruker specific parameters
$$ ---------------------------------
##NTUPLES= NMR SPECTRUM
##VAR_NAME=  FREQUENCY,     SPECTRUM/REAL,   SPECTRUM/IMAG
##SYMBOL=    X,             R,               I
##VAR_TYPE=  INDEPENDENT,   DEPENDENT,       DEPENDENT
##VAR_FORM=  AFFN,          ASDF,            ASDF
##VAR_DIM=   16384,         16384,           16384
##UNITS=     HZ,            ARBITRARY UNITS, ARBITRARY UNITS
##FACTOR=    0.220516191357247, 1,           1
##FIRST=     3108.20700467552, 0,            0
##LAST=      -504.509758330264, 0,           0
##MIN=       -504.509758330264, -339796,     0
##MAX=       3108.20700467552, 306820152,    0
$$ Real data points
##PAGE= N=1
##DATA TABLE= (X++(R..R)), XYDATA
$$ [...]
12312E2600k0064Q9189J42020o6008j02713K5383J9078K1136j25222N5096J1363
12301A01858M4657m3122j6421L3134o3218O8248k1753L7594j4363p2843N0393
12290A04164m8002J9571P808l6204O088M1509M5581K0518m1824J1796p0336j05288
12278d4619k1154L7331P6097J31075j8726j9235q227q9787N0787K8692m8064P567
12266H1737n879o1736J0941J076M3126p9703j5965K6847O4043p2242P4429k553
12254F4121N3344l3763j94937o6307J78751N3773R4381m4265j123n2468M044P8667
12242A34218l8585m9032R3639k8558q2462q2708q9130P3462Q2968M0867k3463
12231C1216N7930K4845L3566j9235J29314r0130o5219k3197p7046p8162R705j6757
$$ y = [52600, 32536, 121725, 263745, 197737, 95024, 120407, 139485, 160621, 35399, 90495, 101858, 146515, 103393, 86972, 120106, 56888, 125136, 103383, 140977, 126614, 53771, 104164, 56162, 75733, 83541, 47337, 53425, 94934, 140515, 161033, 119209, 131005, 60669, -44619, -65773, -28442, 47655, 178730, 160004, 140769, 132542, 42755, 93542, 122234, 74170, 81737, 75858, 14122, 25063, 26139, 69265, -10438, -26403, 444, 64487, -7755, 66674, 64121, 117465, 83702, -111235, -177542, 1209, 54982, 149363, 105098, 103975, 51507, 55551, 134218, 95633, 46601, 140240, 111682, 29220, -53488, -142618, -69156, 13812, 54679, 31216, 89146, 113991, 147557, 128322, 257636, 167506, 102287, 79090, 2044, -76118, -66413, -83170]
12219h3170k4477J30438P120N128j3405m5707J0879R3444k4305L1823K0924j38526
12207b9834L4604q278q4254R0875P8460P3142o470l9887L5921j03982j23748O0030
12195b3421J97319m9073k3363r219n0352K8661O209l6836o3033J7283L7046L0985
12183F2206J62917j57877r269l6017o0695q4723J07531O8345J4903p8772L657
12172g794J5684K1687K7419k4844K651M6462j29485j9971M7731q0476J37269q9596
12160e3263K6879m1366j7968R4149k2564o7728M9670R990P6526j165p5597p0303
12148i2740j94J8580K8024N883o9391j1202J40368J13051J3947r0249j24543M8015
12136b0451O700o380Q1950o2481q7187j1741J26223k8278J3355k7860J6788j26892
$$ y = [-83170, -107647, 22791, 29911, 35039, 21634, -24073, -13194, 80250, 55945, 87768, 108692, -29834, 4770, -3508, -87762, 3113, 81573, 154715, 148245, 108358, 144279, 40297, -83451, -23421, 173898, 124825, 101462, 92243, 41891, 70552, 76761, 39925, -23108, -5825, 31221, 62206, 225123, 67246, 57977, 21960, -38735, -123458, -15927, 52418, 67321, -11451, -7794, 7890, 29577, 56996, 32152, 34803, 81265, -48220, -68191, -20460, -100936, 36333, -53263, -26384, -67750, -85718, 8431, -14133, -81861, -32191, -22201, 54325, 53160, -22437, -92740, -92934, -74354, -46330, -40447, -109838, -121040, 19328, 132379, 146326, 56077, -68466, -20451, -13751, -20131, 61819, -662, -87849, -99590, 26633, -1645, 11710, -16150, 638, -126254]
12124a26254M6987N9739L2012l4748L9757q4387P5733P409r579N6070k9285k805
12112C0649l2625J9103J05953l0022j13797k2377l406O4517P6424r4644l2607
12101c2832P2268q8757K4366p1979r643n064K5785R8236k3006k2185M3626K0574
12089C1389N0308M1514m1024j12801j9701j10992L3855J09872L8088q7212K8091
12078c8613n5060J12871p4713R1353k4765o4305j7680k0461q7275k1425K0164
12067a79909N4349K6490j6929J1989J6344M5595o9671j3076P0454K591Q9309p0174
12055c2638K2649L4046J079o315L2283l7978j48849J6934J5018N7395j3582Q6743
12043B6785p1553j1755Q3375J35544r2839K1431p508j19783Q4900n9696N1992
$$ y = [-126254, -79267, -19528, 12484, -22264, 17493, -66894, 8839, 16248, 6669, 62739, 33454, 30649, -1976, 17127, 123080, 93058, -20739, -43116, -46522, 17995, 94419, -225, -32832, 39436, -49321, -24955, -96934, -106577, -111641, -85856, 12380, -10626, -32811, 10815, 31389, 81697, 123211, 82187, -30614, -50315, -161307, -127452, -17580, 20508, -66704, -38613, -93673, 19198, -55515, 35838, 11073, -53232, -70912, -91373, -178648, -200073, -179909, -125560, -99070, -115999, -104010, -87666, -42071, -111742, -124818, -54364, -51773, 37536, -32638, -9989, 24057, 25136, 18821, 51104, 13126, -135723, -118789, -103771, -46376, -59958, 26785, -44768, -56523, 26852, 162396, 69557, 90988, 83480, -36303, 48597, -11099, 40893]
12032D0893k5413J2330O88q5224k6716O8298L96m5981N1175m4695Q7634J21307
12020A54692n6001j08926l6626k7202L8308Q9203J54708j26226K5825o2124J7465
12009F3096n1677k541N3351M1393K3696r3741n2324N8850J0506k6975K9763L2150
11997H5547R343l9121n1680M5736L4344j40780q733L1982N0651k7391m407j6855
11985c1364O2143M6835o6532m0020N4857N2895l3259m163k1406l8611k9917J23810
11973G5268R0247j68088m4208j4909p5321P3505J3257M8899l2850m0318P6753
11962B235J5137j00749M6779N2354o8270q5656J00605J0449r3725Q2177J20273
11951H1609m4778o4994L0094j06067j05735L914J08690J00388J05962K5340j16771
$$ y = [40893, 15480, 27810, 28498, -56726, -83442, -15144, -14748, -60729, -9554, -54249, 33385, 154692, 98691, -10235, -46861, -74063, -35755, 53448, 208156, 81930, 107755, 45631, 63096, 11419, 8878, 62229, 103622, 127318, 33577, -18747, 40103, 50609, 23634, 53397, 85547, 94890, 55769, 4089, 49825, 84169, -56611, -65344, -33362, 17289, -10102, -14509, -31364, 30779, 77614, 11082, -28938, 25919, 78814, 45555, 41392, 19986, -18625, -48542, 75268, 165515, -2573, -46781, -61690, -137011, -63506, -50249, -1350, -34200, -74518, 2235, 17372, -83377, -36598, 15756, -52514, -138170, -37565, -27116, -120841, -38664, 81609, 36831, -28163, 1931, -104136, -209871, -205957, -97267, 3121, 109083, 134423, 17652]
11940A7652Q761L9728R493R098l1122o6830n9763l303J7418n5825l799R1964o7471
11927i3999J0688n4733R2446P7798l9983K1485j7499J6054K6293j1828L4884q6623
11915b5017P4558k4253o8287n969l0418P258n218P9052J8863q3383j7930o058
11903h6802j1668l406j111N4844M557n6327J03274O5046j00131K6335j46495J73152
11891B1268k8130q3464J0202K0707J7074l2258q8356P4716J45689l3196k9783
11880e531L084P2649r7030O5548p0090o1902N2778M6339J9972P0276K1002k8667
11868H8428m7831k814n9594p893J11523K7374o2618J5605r0428M5284M3212n0828
11856I420m1234k4413N9964O3878J9373n2621k3919O053J5485j07128n8812n0065
$$ y = [17652, 26413, 66141, 75634, 84732, 53610, -13220, -72983, -76286, -58868, -114693, -118492, -26528, -93999, -83311, -138044, -45598, 32200, -7783, 13702, -3797, 12257, 38550, 26722, 61606, -25017, 49541, 25288, -42999, -48968, -79386, -72128, -77346, 1706, 20569, -62814, -80744, -86802, -98470, -101876, -102987, -48143, -43586, -99913, 3361, 68407, -31724, -5389, -151884, 21268, -6862, -90326, -80124, -59417, -42343, -74601, -162957, -88241, 57448, 24252, -5531, -2447, 70202, -26828, 38720, -31370, -93272, -40494, 5845, 25817, 96093, 117095, 88428, 40597, 37783, -21811, -29704, 81819, 109193, 46575, 62180, -28248, 17036, 60248, 9420, -31814, -56227, 3737, 67615, 86988, 34367, 10448, 16501, 31986, -75142, -133954, -184019]
11844a84019J17779K3341N2231N7538k2133j2090k9447j0214m3766m5956p5512
11833a72248R7175Q1378J6659K8051j42118j3349N2462R515p6770M2076L7347
11822c9822J0997Q6177m6116J6912j0381n9984q470n7991Q3880P4885r3438Q2579
11810C9228M5289o3500q1492R8397n29p0722n5696n9258p913J21108J4538J9239
11798a311J780L1766l2088L467R616o3868n969k210L8960K4816P8802j15815k0129
11785e2183p4740N2811R4175n4674O0131K1058k0787q3086M111K6137K5133N5329
11773E3415r6204q0581N0861O4971o3194n9k7264M4360J08985j2880j1655N211
11761C5966j916p6334N5200M5628m3042k4308J1588l9987m3771J4951k1445P9078
$$ y = [-184019, -66240, -42899, 9332, 66870, 44737, 32647, 3200, -7014, -50780, -96736, -172248, -75073, 6305, 22964, 51015, -91103, -104452, -51990, -42475, -119245, -77169, -39822, -28825, 57352, 11236, 28148, 17767, -42217, -50687, -108678, -24798, 50087, -43351, 39228, 84517, 21017, -60475, 37922, 37393, -33329, -89025, -148283, -156196, -35088, -20550, -1311, 469, 32235, 147, 3614, 13230, -50638, -56607, -58817, -19857, 4959, 83761, -32054, -52183, -126923, -74112, 20063, -34611, 25520, 46578, 25791, -57295, -53184, -27047, -1914, 53415, -42789, -123370, -72509, -7538, -70732, -70791, -98055, -53695, 55290, 42410, 30755, 35966, 34050, -42284, 12916, 58544, 15502, -8806, 2782, -37205, -80976, -66025, -87470, -8392]
11749h392J5463R1038l8459l2327K6266l7051K0962J2018N9956m3955p4636M1952
11737C2835n1319M6215n5217q9584K7355L948N6471j4840M3814o245m6030P2632
11725B0035p4422J8795k9926l8392P061K6398j8345k6628O7757N5088n4102K0300
11713b6381N7100j44907Q5316Q886J2649l1974m5271K8416J6506j5083J9064L5322
11701c57M6317m5869j25412L717J7601L342L8523Q8735p1556N1191m5177j9141
11689e8086r04N5809N0772j03504l6608m4004J8302J10353N3610o1821k6737r782
11677e2600k4632Q4817l7316m205J24266k0398q5760N794L6690K2230N4643j17066
11665a3537k8065J5085p828K6147q7813l1376m3544O6513P6434m649M2218K9676
$$ y = [-8392, 7071, 98109, 59650, 27323, 53589, 16538, 37500, 49518, 109474, 65519, -9117, 32835, -18484, 27731, -27486, -117070, -89715, -85767, -29296, -44136, -322, -6567, -52597, 20035, -54387, -35592, -65518, -103910, -96849, -70451, -88796, -115424, -47667, 7421, -46681, -26381, 30719, -114188, -28872, -19986, -7337, -39311, -84582, -56166, -39660, -54743, -35679, -357, 45960, 91, -125321, -121604, -104003, -100661, -62138, 26597, -44959, 6232, -38945, -58086, -58990, -3181, 47591, -55913, -92521, -136525, -118223, -7870, 45740, -16081, -42818, -52600, -77232, 7585, -29731, -33936, 90330, 69932, -15828, -10034, 26656, 48886, 103529, -13537, -41602, -26517, -34345, -8198, -96011, -127387, -170931, -104418, -27984, -32633, 9585, 39261]
11653C9261P5616m6110k5090j37161J82O819J11947J7788k4814j8319r4082N6825
11641c7138K5683J12583n381p5677j3731j452N2386L6185p7569j14393P3531K8167
11629C194r3890L2351J8831n4436L6174j57659n1829O2627P7358Q7086o4703j0908
11617a15804N977k0832K8577K4474J4408k9333q0304M7150K3273L6335L9366O044
11605b0669q306L253l4844p9230M7455O3880O2316m242l0129k1242m0N820J9669
11592C691M2888l2953l5676P7497n5204Q640o009O70l7244p4248N8621m7406Q0284
11579a6449N0043l9942r796q6383J7759J50451L8623j19148J5402n754j22680
11568a27874J05919N2507K674q4724M3466j0112o6130J6794n3067n0089R2104
$$ y = [39261, 114877, 68767, 43677, -93484, -93302, -86483, 25464, 43252, 18438, 119, -93963, -37138, -11455, 101128, 95747, 20070, 6339, 4887, 57273, 93458, 15889, -98504, -24973, 3194, -90696, -58345, -39514, -93950, -57776, -215435, -267264, -204637, -127279, -40193, -104896, -115804, -109827, -130659, -102082, -77608, -63200, -92533, -172837, -125687, -102414, -66079, -26713, -20669, -28975, -25722, -60566, -139796, -92341, -28461, 33855, 29613, -516, -21758, -21798, -15978, 3691, 46579, 13626, -22050, 55447, 243, 8883, 2874, 3544, -33700, -107948, -49327, -96733, -16449, 33594, -6348, -16144, -102527, -84768, 65683, 104306, -14842, 560, -5194, -127874, -21955, 30552, 33226, -51498, -8032, -18144, -84274, -67480, -120547, -170636, -78532]
11557g8532K1140l6856R5860Q9358k0765K1949j3932q1907r2984N6398J19126
11546G8855k8885n9736m7846n8529M4925M7673r722M2750m7978q550l30j4493
11534f1866o642R5235r8734j8574J04491o4657K2563l9647l6779l3004R0287N9868
11522A2541L3767j18609n4454P7469k2457L5770o2560J1045k6394P9522P9605
11511D5245n7537m1707o286N9505n8115j3689M9540n2954K4074l6495Q6793Q451
11499F825m857J5332J7497l6048l4950k2529o1312m9735P849J51260p3900N157
11487g9411M4036K6167p4965M6262j258K3052N4833j17200n3672j4750N2288o4760
11475a59378m4770J19345K111J8753O629O3072R949j9052j72787P5634j4156m8074
$$ y = [-78532, -57392, -94248, 1612, 90970, 70205, 92154, 78222, -3685, -96669, -40271, 78855, 49970, -9766, -57612, -116141, -71216, -23543, -33265, 9485, -38493, -47043, -47373, -61866, -68508, 26727, -72007, -90581, 13910, -50747, -28184, -67831, -104610, -137614, -47327, 12541, 46308, -72301, -126755, -49286, -71743, -35973, -98533, -87488, -113882, -34360, 45245, -12292, -53999, -60285, -780, -58895, -72584, -23044, -75998, -51924, -88419, -1626, 6825, 1968, 17300, 34797, -1251, -36201, -58730, -120042, -169777, -161928, -10668, -84568, -79411, -35375, -9208, -84173, -37911, -39169, -16117, 38716, -78484, -132156, -146906, -94618, -159378, -204148, -84803, -82692, -63939, -57310, 5762, 15711, -3341, -176128, -100494, -114650, -162724]
11463a62724Q8448j4798K959j0898J2815m8217k4999P9649L6256O8533L2883l0837
11451B9070m291q4189N3947Q5463k1907j9184J0754N5171j622m2081l9193j44099
11439a22161N56Q8785J09056j27423m5619Q5247k8092r6863J5810L8088P4812
11428g804q8896J0122N6229Q0759n1097j00070O9970O4602P799j8178o6962n6235
11416i9761j402R9412P8603r8503l2024K5595O015J7798J14925j0686j90127k6945
11404a17100R9771M7601q6066N0161P1623j2763n1151P3403j9754j7947n8186
11393b0408n6400M7139n9519L8855R1388J4905O4087j9872j74306K9495Q0296
11382C5660k1570J1869M538k9296P7815L6093m6538j22498m9797L0975l191K2152
$$ y = [-162724, -74276, -89074, -86115, -97013, -84198, -132415, -157414, -77765, -41509, 27024, 59907, 29070, 24779, -59410, -5463, 80000, 58093, 38909, 49663, 104834, 103212, 61131, 21938, -122161, -121605, -32820, 76236, -51187, -96806, -11559, -39651, -136514, -120704, -82616, -7804, -96700, -86578, -30349, 50410, -687, -100757, -30787, 33815, 41614, 23436, -43526, -99761, -101163, -1751, 76852, -21651, -53675, -28080, -22065, -4267, 110658, 99972, -90155, -117100, -17329, 30272, -55794, -5633, 65990, 53227, 2076, 75479, 55725, 37778, -20408, -76808, -29669, -89188, -50333, 41055, 55960, 120047, 100175, -74131, -44636, 35660, 14090, 25959, 30497, 1201, 79016, 115109, 68571, -53927, -103724, -72749, -75940, -53788]
11370e3788K0935j0168J0909K219K7983p2190M6437n9812r4649J15805K8910L1824
11358e585J1418o4476n5497j6158k6589R1941P6225m1783o9299L5597R6142O7563
11346I9499l6153j69540M4483P3160M9786N2903j26270j00701Q4788q5377L6175
11335g7247O8143J0896l2677J04354m5027n5859J1717l6680j0285N4696j5040
11324b3009o3066k5236l6037K1279N5496n1373R6384N4169n8120J292l6246J29938
11312F5471m959q793K4529n4840p1703J9561O3385m7768P2488J29997j19739j36345
11300f8716K5130j1800r3953L0994O7706J2894j2420N2820p8149P8423R8175q76
11288A00228n0570l2343J4851J21984p3647o7099j3731l6380k5162R1921n5493
$$ y = [-53788, -32853, -43021, -32112, -29893, -1910, -74100, -27663, -87475, -182124, -66319, -37409, -5585, 5833, -58643, -114140, -130298, -156887, -64946, 11279, -30504, -99803, -64206, 31936, 99499, 63346, -106194, -61711, 11449, 61235, 114138, -12132, -112833, -28045, -113422, -77247, -9104, 1792, -30885, 73469, 28442, -27417, -15700, -52380, -62665, -7969, -23009, -86075, -111311, -147348, -126069, -70573, -121946, -25562, 28607, -29513, -28221, -64467, 65471, 60512, 51719, 76248, 21408, -50295, -30734, 32651, -15117, 57371, 187368, 67629, -68716, -43586, -55386, -149339, -118345, -50639, -37745, -50165, 2655, -75494, 2929, 101104, 100228, 49658, 17315, 32166, 154150, 80503, 13404, -327, -36707, -61869, 30052, -25441]
11277b5441r4453l4075Q205J02553M0250L6672J6192o0798p5852L9897n7492R8841
11265e501M517j6906j1524R0296J15011L5687j31105j11477K3638M1675n2604
11254a8293m9912r036J13827K5440j5347n890l0103j5648K0866m2027m1994n585
11242g3702K6621J05770m2687j2440M1735j13349l268O3259j3305K3145m7404
11231d5625K4484j22036j03289J13318K0544j3438R1240L2161P3263N0619j07723
11220A3518K6386J68868j11746n2907j08706J9703o6775R366O4668p153N2772
11209G994m0196j7464L4926K6268j04290j9470j2117N555Q1625l3112N8520J3073
11197A312M5491m5464N7608j5134p9686R3854m2803o1805J827J52010n1810J3360
$$ y = [-25441, -119894, -153969, -145764, -43211, -2961, 33711, 49903, -10895, -86747, -46850, -104342, -5501, -984, -17890, -29414, 60882, 175893, 211580, 80475, -31002, -7364, 34311, -18293, -68205, -77241, 36586, 62026, 46679, 40789, 10686, -4962, 15904, -26123, -68117, -73702, -47081, 58689, 16002, 3562, 45297, -68052, -71320, -8061, -21366, 1779, -45625, -21141, -143177, -246466, -133148, -112604, -126042, -34802, -2641, 70622, 121241, 13518, 39904, 208772, 97026, 44119, -64587, -44884, -111659, -102293, -37625, -44778, 7994, -32202, -49666, -14740, 11528, -92762, -112232, -124349, -118794, -37169, -70281, -11761, 1312, 46803, 1339, 58947, 43813, -35873, 57981, 15178, -46627, -44800, 107210, 55400, 68760]
11185F8760n9557m9779K9081P8683k1437L057r7485K2998J41474J2589L8238l3854
11173A32768j09465k3441r0202R6181R0074j20371J5198r1739j6298l0764n5426
11162b03485R1619J02731j0863M3345Q293o571l7337n0772O1528k2814j80655
11151b04981O7321O2608R9484k680O1941L7371r3071p44N0010M3628j23797l8883
11139d1793L4823L709j912N393r7052K40826n2130k9136L6996r9567k43O275p5733
11126f9544J3577L1483P3338l2851p5365N2680O4251O8652m0147r6255q7585M6742
11114e1024Q88m4086l0711O3214j3790K3728n2266R9038P6066m5805n697k2559
11102c004k3588O4574J0713n8351r5919K6252J04040k8361j0200j09213K3861
$$ y = [68760, 9203, -40576, -11495, 67188, 45751, 48808, -48677, -25679, 115795, 128384, 166622, 132768, 23303, -138, -90340, 5841, 95915, -24456, -9258, -100997, -117295, -148059, -203485, -111866, -9135, -19998, 23347, 31640, 25069, -12268, -63040, -1512, -24326, -204981, -137660, -75052, 24432, 21752, 83693, 121064, 27993, 27249, 77259, 120887, -2910, -41793, -6970, -3261, -5173, 220, -96832, 143994, 91864, 62728, 99724, 157, -86, 6189, -69544, -55967, -24484, 48854, 16003, -59362, -6682, 57569, 126221, 86074, -10181, -97766, -51024, -50136, -94222, -124933, -61719, -75509, -51781, -104047, -5009, 71057, 25252, 19555, -3004, -26592, 37982, 48695, -9656, -105575, -79323, 24717, -3644, -13844, -123057, -99196]
11091i9196J50414o514l2369K3913N4456K5526l8032P293q673j02480o8509q2404
11079a76575O5921J54163J53449o7562p1348n7212n476Q2653k5175m8653K269
11068F454m0265O4584j1062p4420L5980q1309j034K1237N1178K2125M5417p2798
11056c3913P7357l0605j2634M7896k82o7565P9304l3980k1288m032p8119P3474
11044d387r1631L0548N7827J6876Q2663M3718O1102o3747q3504k32n7610o4552
11032g2929l7259P7701P8556j625m1479J08618r4737o6802r991J716j19230J44964
11020c2497R3651p3542L1944n9595N8455O4506k3551q5806N3605n2624N1604J23202
11008A49352o3915j01458O3952M4272j12818L7264m8633O8375Q3007m1166j0064
$$ y = [-99196, 51218, 44704, 12335, 36248, 90704, 116230, 78198, 85491, 76818, -25662, -94171, -176575, -110654, 43509, 196958, 129396, 58048, 836, -4640, 78013, 52838, 4185, 6454, -33811, 30773, 19711, -54709, -18729, -100038, -101072, -79835, -28657, -6532, 38885, -33913, 43444, 12839, 205, 48101, 47819, -19746, 59558, 25578, 4290, 258, -77861, -4387, -96018, -65470, -7643, 9233, 91896, 135614, 196716, 132969, 49465, 49233, -8377, -72929, -110188, -32487, 46069, 44444, 2965, 111583, 16846, -49956, -59947, -58231, -177461, -32497, 61154, -12388, 19556, -40039, 18416, 82922, 59371, -26435, 27170, -25454, 26150, 149352, 85437, -16021, 47931, 92203, -20615, 16649, -31984, 36391, 119398, 78232, 68168]
10997F8168J2445n5660l3787O9022k11762P5446K1676M2807J2817J4113r189j3781
10985g685M2206n8537Q3317j9652N9524J04037p3909N4095j37670o6167O796q6611
10973a00256K4046N3304N9976m7142k5856o6631J01200J28162k2342r3203j1793
10962e35j6256n9934k182K2854k8996J17043P1562J5085o761m6087j04181n0334
10950h8722m0543J4251r309M7065R1710m1536j09423j6156O2845J5958P7595r1215
10938h7480Q7917N2346j5025L7125M0887k113n5847p9754L0590N6745o4290M9916
10926E1017o9645m167Q7425R016j7319l2737l607L284M4888M464m2072j5707r2965
10913g8125M1229o170L2707O671L0904N4431o1045j3321M3956p084m7055O4240
$$ y = [68168, 80613, 24953, -8834, 60188, -151574, -76128, -54452, -11645, 1172, 15285, 6096, -7685, 34521, -24016, 59301, 39649, 99173, 203210, 129301, 183396, 45726, -20441, -13645, -100256, -76210, -22906, 37070, -10072, -35928, -102559, -1359, 126803, 104461, 11258, -535, -16791, -76725, -78907, -56053, -85049, 31994, 103556, 118641, 111880, 65793, -38388, -88722, -129265, -115014, -124323, -77258, 14452, -27084, -136507, -152663, -89818, -73860, 3735, -87480, 437, 52783, 37758, 74883, 115770, 113657, 57810, -21944, 8646, 65391, 1101, 51017, -18628, -22795, 64630, 73646, 56327, 23590, 19983, 23267, 68155, 72619, 30547, 14840, -78125, -36896, -43066, -10359, -3688, 27216, 81647, 20602, 7281, 51237, 44153, -2902, 61338]
10901F1338q0133l1270L0733j7589j9136J6711N0119J3144J1336K0004n1535J4758
10889A8480k0312n1447J2256l6156K2746M6627O1897N0046p2704J02999j5029
10878A19403o2565R2084j01505l3870J6567p915r336J782J00025p3727l7674O0121
10866F3390j21205p9586O3125J55605N3096M7567j52569l0870n9944N5026k0149
10855b6514m6058Q9457R0875L6804l5309J8425p6266K010n4549K5429N4227q796
10843F9735p9908k6741L4073l8040rJ20454K9511m1297O232n7257l9168L4170
10831A1755M1173J8514n0659R1052n1361p3697M1231J49668l5976r0098L2176
10820H3778M6142K4744j2834m8226R96O586j39473m0455R3229K9410m73J7626
$$ y = [61338, -18795, -50065, -19332, -36921, -56057, -39346, 10773, 23917, 35253, 55257, 3722, 18480, -1832, -53279, -41023, -77179, -54433, -7806, 54091, 104137, 31433, 134432, 119403, 56838, 148922, 47417, 13547, 30114, 22199, 12863, 14645, 114670, 40943, 3269, 63390, -57815, -137401, -74276, 81329, 134425, 181992, 29423, -1447, -61391, -6365, -26514, -72572, 16885, 107760, 144564, 109255, 127680, 51414, 53424, -1125, 24304, 78531, 69735, -10173, -36914, -2841, -40881, -40890, 79564, 109075, 67778, 74010, 16753, -22415, 11755, 52928, 71442, 20783, 111835, 60474, -13223, 28008, 177676, 141700, 51602, 83778, 129920, 154664, 141830, 93604, 94600, 101186, -38287, -78742, 14487, 43897, 43424, 61050]
10808F1050O540m3401m5620l30j5035n9917J08838j3976O50k129O6402n3309O8143
10795G7906N4554K580j6334m8509Q0255o2996L1416q1756j5667J6577N0520K3014
10783A11560l9402m7021M9178p4900P0434L6618M9597k1496J5736n4981q090J7332
10771A04565M2178k2180k3734j8546L6740P600r0366J82378n2891n9548k3942
10760H2254n0262K295R9191k307j4514l7503o908l5251j994o327j3952J2676L4539
10747F1937k1816n1350L3480P8244k2003M7622J0302n6679K9024n8036K156O2481
10735A15362p1843l0026J21266p7951R3613P2927K3127q4804l0218K4144q6825
10724F8772j16202k5253P5951o1158M1253J39496k1749p3844n6859P7871l0660
$$ y = [61050, 67590, 24189, -21431, -21761, -36796, -96713, 12125, -1851, -1201, -3330, 63072, 9763, 77906, 132460, 135040, 118706, 70197, 150452, 87456, 118872, 37116, 21449, 38026, 88546, 111560, 72158, 25137, 74315, -585, 69849, 106467, 156064, 134568, 150304, 95323, 87233, 104565, 146743, 124563, 100829, 82283, 119023, 126623, 36257, 218635, 165744, 106196, 82254, 31992, 34287, 133478, 131171, 116657, 79154, 72246, 36995, 35001, 28674, 14722, 27398, 61937, 40121, -11229, 22251, 100495, 78492, 126114, 136416, 79737, 108761, 50725, 52881, 115362, 43519, 13493, 134759, 56808, 150421, 223348, 246475, 161671, 131453, 155597, 68772, -47430, -72683, 3268, -57890, -16637, 122859, 101110, 27266, -29593, 48278, 17618]
10713A7618J7736P525o198K2225m0524P692l9606J1099N0882j0503n0166N0226
10701C8006k5501M0585R2547J7399o0645J2768N4987K6302p4031q3213J04751
10690A43955N3784q0264m9492n1761l2424J30490J7391k6185m6499q4253J37703
10679A12445m3999l4239M46m7390J01218l2844l6255O6988k9515j13927R0595
10668C3523J55711m7344L9489k7866m1289r029r7733M2495J1693p687O0896N3446
10656A66305k2055k6422L8363j06306L8212L7507l1300m7955o100j5011M0555
10645F5793k3177N7957k5183R6232l109j67019k2055L6621J6583Q513m4862M3699
10633C9993O7764m9723O9834l9416r241k3678q496l2849L4188q0230l4994M6277
$$ y = [17618, 35354, 42879, 36681, 58906, 18382, 26074, -13532, -2433, 48449, 37946, -12220, 38006, 12505, 53090, 145637, 163036, 102391, 115159, 170146, 196448, 122417, 39204, 143955, 197739, 117475, 67983, 16222, -16202, 114288, 131679, 105494, 58995, -25258, 112445, 68446, 34207, 34653, -12737, 88481, 55637, 19382, 86370, 56855, -57072, 33523, 189234, 141890, 181379, 153513, 112224, 103195, 5462, 47957, 59650, 51963, 112859, 166305, 144250, 117828, 156191, 49885, 88097, 125604, 94304, 46349, 40249, 25238, 65793, 42616, 100573, 75390, 171622, 168513, 1494, -20561, 16060, 32643, 41156, -3706, 39993, 107757, 58034, 127868, 88452, 79211, 55533, 47037, 14188, 48376, -31854, -66848, -20571]
10621b0571K8029R2529j6652M7821o3174q7811O5886j5449N8821J8367M4209k7691
10609A24314K0333Q8779m6388p2194J2977k0895K393r834q6967q060O6195n3981
10597A6672J3538m890k1543N4424J50180l2687k5622j4257n4150P3738M8791l2155
10585A72039l9922n6339n164o0048Q9146J0503j3069L9980j7058j4456J1691N7203
10573A74506J438p1710M5267n2549k3302P3968j15863J1956N3425j4483p5229
10562G424J51450M983m9464J1272k5225M9139J5207p7850R2571J199q318J30745
10550C03133r1991q8267J14263j25463K9176K2427L7083l3714n5820k7917L2233
10539A15143N4829j08348j6980N1602l2083n6672K0105L461L4448O7529l9899
$$ y = [-20571, 7458, 99987, 83335, 131156, 67982, -19829, 46057, 30608, 89429, 107796, 152005, 124314, 144647, 233426, 187038, 114844, 127821, 106926, 109319, 99485, 12518, 4458, 70653, 16672, 30210, 25320, 3777, 58201, 208381, 175694, 150072, 135815, 81665, 155403, 204194, 172039, 132117, 75778, 70614, 10566, 99712, 110215, 97146, 137126, 120068, 105612, 117303, 174506, 175944, 104234, 149501, 96952, 73650, 147618, 31755, 43711, 97136, 82653, 7424, 158874, 163857, 114393, 125665, 100440, 149579, 164786, 86936, 179507, 180706, 172388, 303133, 211142, 122875, 237138, 111675, 140851, 163278, 200361, 166647, 110827, 82910, 115143, 169972, 61624, 44644, 96246, 64163, 7491, 27596, 31057, 65505, 133034, 93135]
10528I3135o7778J22803L8716P9990o5166l7986m285n0523M9214J2517m1372J0480
10516A39745P0468q7174m5954J1609m026l4696Q7332k469j6093l166o3548o4572
10504a2544L5632K43776N3967m2768R435l3820L3464n0358o9435L3575q352Q955
10492B01527k8025r7993M334k737R3459L5090N710p6482r1073L1334O261N4847
10480A36252K6220N5430k0944k5084O305P3284R61l6023O8984q7646l7316Q5705
10468B46128L2224m2377N343J14077o7996o2438L5856o3875L1026K3265j35205
10457A16028J5943p010J12478Q0677J9895J1235q1932n5033J4687J6348j4784
10446B28532N763q7808J651j1940L7356j1835L6388O0066k7621R6318j34984l7897
$$ y = [93135, 25357, 148160, 186876, 266866, 201700, 163714, 159429, 108906, 158120, 170637, 129265, 139745, 210213, 123039, 77085, 88694, 84668, 49972, 137304, 134835, 118742, 115576, 52028, -12544, 23088, 266864, 320831, 278063, 287498, 253678, 287142, 236784, 167349, 200924, 192572, 201527, 173502, 75509, 79843, 77106, 170565, 205655, 211365, 134883, 43810, 75144, 81405, 136252, 162472, 217902, 196958, 171874, 178179, 251463, 252424, 216401, 285385, 197739, 160423, 246128, 278352, 235975, 241318, 355395, 287399, 224961, 260817, 196942, 227968, 251233, 116028, 131971, 124961, 237439, 318116, 338011, 349246, 267314, 212281, 226968, 243316, 228532, 234295, 146487, 148138, 136198, 173554, 161719, 198107, 258173, 230552, 326870, 191886, 153989]
10434A53989J72780N5717o9711p6906N9448j665j24259O8254r296l4331R3024
10423B87044q825q0936Q22J7192N1793p315K3082l6105O261J3301Q2688l3610
10411C15392q3416Q3738M5384l4423N6302m9255n1312J1634k2222P2077j04730
10400B39169r4552R8343O957M6885L4651k1177P2866k9537M8766k2072N1128J6454
10388D47881n6853O2322q1448j7013l2563L1562R4877O14J7M198j5822J3706j50283
10375C01195p0776J26872L40R4923q2681J38104m058k0014k2992J967m15j8387
10363D44078J57127M2271j08667p8044k0335L5576J01601M592o4161N8363M325
10352E76726R749m240J6950m4234O8954n607l1978J1936k7608M8931p3053K0956
$$ y = [153989, 326769, 382486, 312775, 235869, 295317, 293652, 169393, 237647, 228351, 194020, 287044, 278219, 197283, 198105, 215297, 267090, 259775, 282857, 246752, 253013, 266314, 349002, 315392, 231976, 315714, 361098, 326675, 382977, 333722, 282410, 294044, 271822, 343899, 239169, 144617, 242960, 249917, 296802, 331453, 310276, 383142, 353605, 402371, 380299, 431427, 447881, 391028, 453350, 371902, 354889, 322326, 353888, 448765, 449379, 449396, 453594, 437772, 451478, 301195, 230419, 357291, 357631, 452554, 369873, 507977, 503919, 483905, 460913, 462880, 462465, 444078, 601205, 643476, 534809, 456765, 436430, 472006, 573607, 578199, 514038, 572401, 576726, 586475, 582235, 599185, 554951, 623905, 618298, 586320, 598256, 570648, 619579, 546526, 567482]
10340E67482R438J29589q3189r1322J01925N4593J25690k7409k9042J3826J21177
10329H92758J2994j43578J08299J1912j5740K7761P172l9330m4045R8005J23088
10318A039296J09053N1919J1592k6898J2018K6556N9437N1011m367M2016K3849
10307A395482N779P831J315P9019J20222r0379j55208j41363R4977J30150j17104
10296A330721m7746o572r6209p1306j0901J07084k8602j01660n9614M2534n1809
10285A005920K150P7725l2810o1636n2228o866M5176K7616l4290p1083n7128L8533
10273H81079L6813N2184m2974q1984J06581L5648p0649N3526M437k4282J1012
10262I61391j13442j6265n615J8428J5303Q3918j6262j68970N5981O097l01J37754
$$ y = [567482, 576920, 706509, 623320, 531998, 633923, 688516, 814206, 786797, 757755, 771581, 892758, 905752, 762174, 870473, 882385, 866645, 894406, 901578, 862248, 818203, 916208, 1039296, 1148349, 1200268, 1211860, 1184962, 1196980, 1223536, 1282973, 1333984, 1329617, 1371633, 1395482, 1401261, 1409092, 1410407, 1489426, 1609648, 1519269, 1364061, 1222698, 1317675, 1447825, 1330721, 1282975, 1276403, 1180194, 1108888, 1097987, 1205071, 1176469, 1074809, 1015195, 1057729, 1005920, 1008070, 1085795, 1052985, 991349, 939121, 932255, 977431, 1005047, 970757, 899674, 842546, 881079, 917892, 970076, 927102, 845118, 951699, 987347, 916698, 970224, 974661, 950379, 961391, 847949, 831684, 826069, 844497, 859800, 943718, 927456, 758486, 814467, 820564, 820263, 958017]
10250I58017L9158q351Q5972N5459q6972J4604L1717M5167L5908j16776n7418
10239I96485k0756n1167K0178j358p714L6995L8819L2747m1944l5611k5627R3016
10227A034063l3175l5235R4927j7727M0218Q6343q1525M9633N9983q148m9874
10216A139483K1307M4163k4988j8458P0651q807P5546r7398m0158K2837n867p000
10204A171311J49792m0417j55109J74294N2704j7184j63802L4061N1936J620Q2594
10193A341800k7398n8463M3394k1574J9447n5114L2329M3542o299M8773q7371
10182A273066K4047K2620M6217L849k2339M6214L6048J13312l9053j12743J15679
10171A506917L8114r1748k4267M8253k1522J14465m3055m0167Q2531N8250P9111
$$ y = [958017, 997175, 988824, 1074796, 1130255, 1043283, 1057887, 1089604, 1134771, 1170679, 1053903, 996485, 975729, 924562, 944740, 943382, 935668, 972663, 1011482, 1044229, 1002285, 966674, 941047, 1034063, 1000888, 965653, 1060580, 1042853, 1083071, 1169414, 1087889, 1137522, 1197505, 1189357, 1139483, 1160790, 1204953, 1179965, 1161507, 1232158, 1223351, 1298897, 1201499, 1161341, 1184178, 1178311, 1171311, 1321103, 1280686, 1125577, 1299871, 1352575, 1335391, 1171589, 1205650, 1257586, 1259206, 1341800, 1314402, 1255939, 1299333, 1277759, 1297206, 1242092, 1274421, 1317963, 1311664, 1360437, 1273066, 1297113, 1319733, 1365950, 1369799, 1347460, 1393674, 1429722, 1543034, 1503981, 1391238, 1506917, 1545031, 1453283, 1429016, 1477269, 1455747, 1570212, 1527157, 1486990, 1569521, 1627771, 1706882]
10160A706882k3108k3441j8153L0833L2282O0231n1653J8814N8594P5583m1903
10149A824961n1006j3958k5115n4119K2991Q8003L4912k2568J00031L874O2438
10138A970444L8713m6047P7295P6265q111l1728N0608Q7717L2571j7389l1356
10127B198982k6626P4821m2865k1257L5101L1199L1494P8601R2937m2788O0088
10116B469687P0749N7950o4301O951J22452J02620l1200n7769k9395O5584r5041
10105B618287L9127J72258M0904j177O5994L1483P1430m9146K9371M2316J1912
10094C072759K9192N3984N3737q70R2476r659M4727K9596O3684P485J49594Q2593
10082C669298j332r353P8570l9422R9738Q3152M8773L5973P0176k9106J22912
$$ y = [1706882, 1683774, 1660333, 1642180, 1673013, 1705295, 1765526, 1713873, 1732687, 1791281, 1866864, 1824961, 1773955, 1759997, 1734882, 1680763, 1703754, 1791757, 1826669, 1804101, 1904132, 1908006, 1970444, 2009157, 1963110, 2040405, 2116670, 2108559, 2076831, 2127439, 2215156, 2247727, 2230338, 2198982, 2172356, 2247177, 2204312, 2183055, 2218156, 2249355, 2280849, 2359450, 2452387, 2409599, 2469687, 2540436, 2598386, 2534085, 2541036, 2663488, 2766108, 2734908, 2677139, 2647744, 2713328, 2618287, 2657414, 2829672, 2870576, 2869399, 2935393, 2966876, 3038306, 2989160, 3018531, 3060847, 3072759, 3101951, 3155935, 3209672, 3208802, 3301278, 3291619, 3336346, 3365942, 3429626, 3437111, 3586705, 3669298, 3667966, 3658613, 3737183, 3697761, 3797499, 3880651, 3929424, 3965397, 4035573, 4006467, 4129379]
10071D129379Q0235P8096M0249o174J01656J43790n563Q8751J00999P9508L9074
10060D870000K606J05170M5557J25275J99540J48998J5345m626J11574M5857Q2280
10049E747576J49242R8211O6818J97279J32608J05850K3815J40867J56957N3308
10039F872531J37902J47497J86025L6926J18481J69283J64427J97891P7544J56075
10029H264582J72502J94876K26063K55766K58908K09153K26932J16588K14966
10020A0140336K64048L11860J38340K81930K63619K39633K32372J78357L14109
10011A2364604L06169L09864M40885L76894K17379K01469M45881K90761L63691
10002A5317597L55613L83860M32409L39994L76480L96852L80999N28104M77275
$$ y = [4129379, 4209614, 4287710, 4327959, 4321785, 4423441, 4567231, 4561668, 4650419, 4751418, 4830926, 4870000, 4872606, 4977776, 5023333, 5148608, 5348148, 5497146, 5512491, 5507865, 5619439, 5665296, 5747576, 5896818, 5995029, 6061847, 6259126, 6391734, 6497584, 6521399, 6662266, 6819223, 6872531, 7010433, 7157930, 7343955, 7380881, 7499362, 7668645, 7833072, 8030963, 8108507, 8264582, 8437084, 8631960, 8858023, 9113789, 9372697, 9581850, 9808782, 9925370, 10140336, 10404384, 10716244, 10854584, 11136514, 11400133, 11639766, 11872138, 12050495, 12364604, 12670773, 12980637, 13421522, 13798416, 14015795, 14217264, 14663145, 14953906, 15317597, 15673210, 16057070, 16489479, 16829473, 17205953, 17602805, 17983804, 18511908, 18989183]
9993A8989183M66118N49398N62917M79485O60702O06524O14966P77359O58884
9984B4365536Q32976R43944Q61701R47761Q97724Q57844J058623J108985J183522
9975C3058616J230099J294679J163809J282471J479713J503366J640679J554586
9967D4208018J687800J693737J631170J748765J818859J822545J982144J980292
9959E8573330J964341K123513J987607K126273K217046K210816K239268K602646
9951G6044840K561643K723260K990723L200659L365302L819686M157665M764204
9943A03627982N218606N844414O289411O820789P473289P858538Q075898Q182276
9935A59391203Q159290P407707O613293N612223M676900L280386K098359P38568
$$ y = [18989183, 19455301, 20004699, 20567616, 21047101, 21707803, 22314327, 22929293, 23706652, 24365536, 25198512, 26142456, 27004157, 27951918, 28849642, 29707486, 30766109, 31875094, 33058616, 34288715, 35583394, 36747203, 38029674, 39509387, 41012753, 42653432, 44208018, 45895818, 47589555, 49220725, 50969490, 52788349, 54610894, 56593038, 58573330, 60537671, 62661184, 64648791, 66775064, 68992110, 71202926, 73442194, 76044840, 78606483, 81329743, 84320466, 87521125, 90886427, 94706113, 98863778, 103627982, 108846588, 114691002, 120980413, 127801202, 135274491, 143133029, 151208927, 159391203, 167550493, 174958200, 181571493, 187183716, 191860616, 195141002, 197239361, 197977929]
9927A97977929o08240j972336l440390m939114o210241p327738q210255q592473
9919A56677142q888224r102154q721614q404174q030800p478264o879149o377761
9911I2795002n579544n237155m783990m207057l909591l687390l428935l056661
9903E8904679k828496k659790k472214k303304k060302j871545j818467j587297
9895D1303264j525555j403008j462344j295545j082303j030881j112583j036768
9887C1354277q82610p86704j022539p89487o50755p92634p52960q08224q04749
9878B4063615o85983n18841o46874o86343n59630n38556o39570n43917m36028
9869A8807873l95175l81494l94393l49860k14829k06992k89661j53658k88910
$$ y = [197977929, 197369689, 195397353, 191956963, 187017849, 180807608, 173479870, 165269615, 156677142, 147788918, 138686764, 129965150, 121560976, 113530176, 106051912, 99172763, 92795002, 87215458, 81978303, 77194313, 72987256, 69077665, 65390275, 61961340, 58904679, 56076183, 53416393, 50944179, 48640875, 46580573, 44709028, 42890561, 41303264, 39777709, 38374701, 36912357, 35616812, 34534509, 33503628, 32391045, 31354277, 30471667, 29684963, 28662424, 27872937, 27222182, 26429548, 25676588, 24868364, 24063615, 23377632, 22858791, 22211917, 21525574, 20965944, 20427388, 19787818, 19243901, 18807873, 18412698, 18031204, 17636811, 17286951, 17072122, 16865130, 16575469, 16421811, 16132901]
9860A6132901q7707n3820j88200j34433j03746j48916m0959k64043j84420k34344
9850A4692313k17087k28158j93626l85773m13176j28640k11232l65027k98627
9841A2250967l59844l42598k61295j81793j59406j42008k22891k61020l67964
9832I952148k69844j85692l73733j83494l01112l76929l23122j82515k18544k25163
9822G312000j65887o1710j47384k48251n3059r9995k34590j72930r4352q5919
9812E947923j88267j31489k7462o4798k01684j25511O8811p5898r3322l1838j57369
9801D919096k5033j77013j00117p3703M3209r4618j21332K7396M4687l9362n2849
9790D350361j14674j8900j40752j15723J3789L0974m5399L3248m0747p9149j8169
$$ y = [16132901, 16045194, 15991374, 15803174, 15668741, 15564995, 15416079, 15375120, 15111077, 14926657, 14692313, 14475226, 14247068, 14053442, 13667669, 13254493, 13125853, 12914621, 12549594, 12250967, 11891123, 11548525, 11287230, 11105437, 10946031, 10804023, 10581132, 10320112, 9952148, 9682304, 9496612, 9122879, 8939385, 8638273, 8261344, 7938222, 7755707, 7537163, 7312000, 7146113, 7084403, 6937019, 6688768, 6635709, 6535714, 6301124, 6128194, 6033842, 5947923, 5759656, 5628167, 5600705, 5535907, 5334223, 5208712, 5277523, 5201625, 5108303, 5076465, 4919096, 4894063, 4717050, 4616933, 4543230, 4586439, 4491821, 4370489, 4397885, 4442572, 4403210, 4350361, 4235687, 4216787, 4076035, 3960312, 3974101, 4005075, 3959676, 3992924, 3952177, 3873028, 3854859]
9779C854859q3129j12002j02295k6121J15288J6339L6202L4089r7407j33231m3562
9768C459030l6551l9145j1480O6418j9612N5207O3781j46030O1949q2866J37199
9757C507900j09787k1568J80050m2151R7386j5291n6583q5704r0417N8930L2278
9746C455043k5369k0453L9322k6017M0335J6287L5959j1682J09102L7738j5453
9735C634812P2691O2999K6221K9256J04874J15080K3549J42045J59152N2398R0852
9724D513929P3759p10j8821J57658M6537J04751Q3391m5131M187O2244J00080
9713E081874p7141m7020J21057N930R1020O0780M4002O3280J37023L4735N3464
9702E569004Q5095M5526P90k3857J18113O4664N2940J02031n987k50r148q296
$$ y = [3854859, 3771730, 3659728, 3557433, 3531312, 3646600, 3662939, 3699141, 3733230, 3635823, 3502592, 3459030, 3422479, 3383334, 3371854, 3438272, 3418660, 3473867, 3537648, 3391618, 3453567, 3370701, 3507900, 3398113, 3376545, 3556595, 3514444, 3611830, 3596539, 3539956, 3454252, 3363835, 3422765, 3455043, 3429674, 3409221, 3448543, 3422526, 3462861, 3479148, 3515107, 3503425, 3612527, 3650265, 3634812, 3707503, 3770502, 3796723, 3825979, 3930853, 4045933, 4069482, 4211527, 4370679, 4423077, 4513929, 4587688, 4586978, 4568157, 4725815, 4772352, 4877103, 4960494, 4915363, 4919550, 4981794, 5081874, 5004733, 4957713, 5078770, 5084700, 5175720, 5236500, 5280502, 5343782, 5480805, 5515540, 5569004, 5654099, 5699625, 5700415, 5676558, 5794671, 5859335, 5912275, 6014306, 6008319, 6008069, 5998921, 5990625]
9690E990625J07686j6062n5429K2802O2773m9932M6443q3930k9440n0959J8978
9679E963555j44322O083L60K6308J34461L0553O4372K921Q4977P4832N9203J88066
9667F491369R8057j059J03861P9180N639J10351O7216N3772P2708m2145j1143
9656G027806L612q9550N0096j147j11775J46806N4830J16012M9879J36055L5796
9645G418420j883R5972m2159p8359j07241m3971j64148n7481j29219j32548k15477
9634F541906j59519p3150k99758r6903R182r2298r1035k3248q626K4436J2245
9623E743232r99N9547j9989j16132J83114J34224j760K43317J24526p1664Q6097
9612F363513R2424J19814M7948P9413K9257n8103j09316j08554j84930k22186
$$ y = [5990625, 6098311, 6082249, 6026820, 6049622, 6112395, 6062463, 6108906, 6024976, 5995536, 5944577, 5963555, 5819233, 5825316, 5825676, 5851984, 5986445, 6016998, 6081370, 6084291, 6169268, 6244100, 6303303, 6491369, 6589426, 6588367, 6692228, 6771408, 6777047, 6887398, 6954614, 7008386, 7081094, 7038949, 7027806, 7031418, 6941868, 6991964, 6990817, 6879042, 7025848, 7080678, 7196690, 7246569, 7382624, 7418420, 7416537, 7512509, 7470350, 7391991, 7284750, 7240779, 7076631, 7019150, 6889931, 6757383, 6541906, 6382387, 6309237, 6009479, 5912576, 5921758, 5829460, 5738425, 5715177, 5706551, 5730987, 5743232, 5742233, 5801780, 5781791, 5665659, 5848773, 5982997, 5981237, 6224554, 6349080, 6277416, 6363513, 6455937, 6575751, 6623699, 6703112, 6732369, 6674266, 6564950, 6456396, 6271466, 6049280]
9602F049280k72887j25606k84301k69189l14160j84809r4246j06312j29614j93791
9592D074365j54181j10366j66963l528m2794o1706N152j48357o0074r7982o8124
9581C165442r2406j7196n9349N8017l548M3785q8843n2354r2763l0866k7612l3786
9569B768521r571O189n4295N7935Q2354p9345k8873M3052J5943M0056L4775R834
9557B886575M4706J6631M5671P3437J3729N8384M7538l8002n9843r1917J6385
9546C013294K2508j7133o286p8767l7104N1945N7192j0949j43869j01504j09886
9535B639441j6407O5569J9787k1919k8643k48n0867R7193Q1757k2744p3309o4149
9523B625461L0033k7340j33275M2266N0014p987J7961o9376j8530K0521P0461
$$ y = [6049280, 5776393, 5650787, 5366486, 5097297, 4783137, 4598328, 4504082, 4397770, 4268156, 4074365, 3920184, 3809818, 3642855, 3639327, 3596533, 3534827, 3539979, 3391622, 3331548, 3233566, 3165442, 3073036, 3055840, 2996491, 3054508, 3050960, 3094745, 3005902, 2953548, 2860785, 2829919, 2802307, 2768521, 2758950, 2765139, 2710844, 2768779, 2851133, 2771788, 2742915, 2785967, 2801910, 2841966, 2876741, 2886575, 2931281, 2947912, 2993583, 3067020, 3080749, 3139133, 3186671, 3148669, 3088826, 2996909, 3013294, 3035802, 3018669, 3012383, 2933616, 2896512, 2948457, 3005649, 2994700, 2850831, 2749327, 2639441, 2623034, 2688603, 2708390, 2686471, 2657828, 2657580, 2606713, 2703906, 2785663, 2762919, 2689610, 2625461, 2655494, 2628154, 2494879, 2537145, 2587159, 2579172, 2597133, 2527757, 2509227, 2529748, 2600209]
9512B600209j21443j6090M2951j1593o2490M6622J08009j5636k3553M5936o9243
9501B523679j8441Q2361J48545P6510o1051j5829O7150J20958j3774M6863N5708
9490C012679k8676J53573r6351l0912Q9925n1785j0679R9882j4204m6232j2129
9479C065091o8189p0620j0882K05267n2852p8482r9117j49326l2415P5149Q0963
9468B864587j09182m7620J09817l217K8679n703q0654Q2562P9352j31615M6620
9457B833626M9292N9969P5245m6591J0724Q4906J45096o052o1240L0828O735n815
9445C176723K4848k180J0761K0873j8725N4647J9720j59853p0246n844j6259M6006
9433C080471k8198L1975K628L7854L4967j27971O6168K6857M2483q395p4255Q5329
$$ y = [2600209, 2478766, 2462676, 2505627, 2494034, 2431544, 2478166, 2586175, 2570539, 2546986, 2592922, 2523679, 2505238, 2587599, 2736144, 2812654, 2751603, 2735774, 2802924, 2923882, 2910108, 2956971, 3012679, 2984003, 3137576, 3041225, 3010313, 3100238, 3048453, 3037774, 3137656, 3123452, 3077220, 3065091, 2996902, 2926282, 2915400, 3120667, 3067815, 2989333, 2890216, 2740890, 2708475, 2783624, 2864587, 2755405, 2707785, 2817602, 2814385, 2843064, 2837361, 2756707, 2839269, 2918621, 2787006, 2833626, 2882918, 2942887, 3018132, 2971541, 2982265, 3067171, 3212267, 3206215, 3144975, 3175803, 3182538, 3176723, 3201571, 3199391, 3210152, 3231025, 3212300, 3266947, 3286667, 3126814, 3056568, 3050724, 3034465, 3080471, 3052273, 3084248, 3086876, 3124730, 3159697, 3031726, 3097894, 3124751, 3167234, 3158839, 3084584, 3169913]
9421C169913Q5513J9566k2217n719J02669J7866N024J40700L2520R7661J7580
9410C661076J5294J01854J50810k2831p5348K9839q542J8799J73814j3376Q9630
9399D121019J60218N0220J86183L7810O2811R8866J28391Q2033R7007K88033Q5187
9388E397778J17794J20776R1619J48867R0766J13990Q8806J06631l8019J14945
9378F353953K5815J01959R7745K5450q790L5232J51070J8749L5511J80462J28312
9367G145468J56386J34957K38352L10640K58921K49428L65479K67393M13713M45869
9357I986606L38968M14841J87126K09481K63557K32380J65804P3039m0286m9386
9347A1782130r0107j73594l01435l44721l25936l79980l59280k64558m04837k68245
$$ y = [3169913, 3255426, 3274992, 3252775, 3247056, 3349725, 3367591, 3372615, 3513315, 3545835, 3643496, 3661076, 3676370, 3778224, 3929034, 3906203, 3830855, 3860694, 3852152, 3870951, 4044765, 4031389, 4121019, 4281237, 4331457, 4517640, 4555450, 4618261, 4717127, 4845518, 4927551, 5024558, 5312591, 5397778, 5515572, 5636348, 5727967, 5876834, 5967600, 6081590, 6170396, 6277027, 6239008, 6353953, 6379768, 6481727, 6579472, 6604922, 6596132, 6631364, 6782434, 6801183, 6836694, 7017156, 7145468, 7301854, 7436811, 7675163, 7985803, 8244724, 8494152, 8859631, 9127024, 9540737, 9986606, 10325574, 10740415, 10927541, 11137022, 11400579, 11632959, 11798763, 11871802, 11831516, 11782130, 11692023, 11518429, 11216994, 10872273, 10546337, 10166357, 9807077, 9542519, 9137682, 8869437]
9337H869437l50706k67500k43321k59451k46512j49036j22977k11918j68239n2626
9327F797151p3671o1285O903k5235l7640j7462k0775k3050j14500j2259K757r4805
9315F326129P1652k8605K2264j2731j03418j5937j2067M933J33816Q1145k0215
9304F446966p1670j5M2879J04727l8332k1354N7214p3838M0066L5428M3038Q9398
9292F654507K03171M82n4450J16838L1188J20513J4887Q3851M4233K7471M9133
9281G291824J81033J38969R1684N4308J06162N9568R8826K05224M2248Q7729J23827
9270H481402J31392J32485R0785J43595Q7790R5459J14159K15164J37346J66499
9260I796076J29867L4830J95946K47862J80478K02418K59321J69458Q4652J17381
$$ y = [8869437, 8518731, 8251231, 8007910, 7748459, 7501947, 7352911, 7229934, 7018016, 6849777, 6797151, 6723480, 6662195, 6669098, 6643863, 6606223, 6588761, 6567986, 6544936, 6430436, 6418177, 6420934, 6326129, 6397781, 6369176, 6391440, 6378709, 6275291, 6259354, 6247287, 6252220, 6386036, 6467181, 6446966, 6375296, 6375281, 6418160, 6522887, 6484555, 6463201, 6520415, 6446577, 6486643, 6522071, 6565109, 6654507, 6857678, 6858160, 6803710, 6920548, 6951736, 7072249, 7087136, 7170987, 7215220, 7242691, 7291824, 7472857, 7611826, 7703510, 7757818, 7863980, 7923548, 8022374, 8227598, 8269846, 8357575, 8481402, 8612794, 8745279, 8836064, 8979659, 9067449, 9162908, 9277067, 9492231, 9629577, 9796076, 9925943, 9960773, 10156719, 10404581, 10585059, 10787477, 11046798, 11216256, 11300908, 11418289]
9250A1418289J81014J12075L53849L39626M1659K18991L34677K46534J98153K41851
9240A3686718L73270L45769K56061K72338L83026J82284J87323K80631K63471
9231A6230891L81913K17821J73183J55132K80203L49339J26668L40244L38959
9222A8594353L40200K06281M70962M45758L42609L57647L77272L94726N13985
9213B2043793N31146N14649M83973N19117O43717N97404N55963N96049O83102
9204B7168913P65673O84739O67144P69150P52267P38388O84471P25156P03554
9195C3659455P11163Q05540R34105Q19710Q20890Q90000R98384J030069J035133
9186D1704449J212491J358482J350939J376537J551174J618644J721002J885990
$$ y = [11418289, 11599303, 11711378, 12065227, 12404853, 12446512, 12665503, 13000180, 13246714, 13444867, 13686718, 14059988, 14405757, 14661818, 14934156, 15317182, 15499466, 15686789, 15967420, 16230891, 16612804, 16830625, 17003808, 17158940, 17439143, 17788482, 17915150, 18255394, 18594353, 18934553, 19140834, 19611796, 20057554, 20400163, 20757810, 21135082, 21529808, 22043793, 22574939, 23089588, 23573561, 24092678, 24736395, 25333799, 25889762, 26485811, 27168913, 27934586, 28619325, 29286469, 30055619, 30807886, 31546274, 32230745, 32955901, 33659455, 34370618, 35176158, 36110263, 36929973, 37750863, 38640863, 39639247, 40669316, 41704449, 42916940, 44275422, 45626361, 47002898, 48554072, 50172716, 51893718, 53779708]
9178E3779708J993298K097469K093462K248977K429405K406049K493858K731375
9170G2273601K794671K765891K633358K680078K486472K171736J900285J641493
9162I1347585J232732R74142R26229P39158Q13861N73867L86414L66563K82833
9153I7643384L29980M14246P55941P92923R37025J235638J522601J632763J964548
9144A07229049K189622K606685L127861L348500L845310M214027M461604N082675
9136A36105333N533524O157054O601997P215066P996357Q601190R506438J0132398
9128A97849357J0546213J0587698J0346333R728065Q858992P970431P286167O828399
9120B70001655O372238N812640N422385M383203L264271K498929K317266J912614
$$ y = [53779708, 55773006, 57870475, 59963937, 62212914, 64642319, 67048368, 69542226, 72273601, 75068272, 77834163, 80467521, 83147599, 85634071, 87805807, 89706092, 91347585, 92580317, 93554459, 94480688, 95219846, 96033707, 96607574, 96993988, 97360551, 97643384, 97973364, 98387610, 99143551, 99936474, 100873499, 102109137, 103631738, 105264501, 107229049, 109418671, 112025356, 115153217, 118501717, 122347027, 126561054, 131022658, 136105333, 141638857, 147795911, 154397908, 161612974, 169609331, 178210521, 187716959, 197849357, 208395570, 218983268, 229329601, 239057666, 247916658, 255887089, 263173256, 270001655, 276373893, 282186533, 287608918, 291992121, 295256392, 297755321, 300072587, 301985201]
9112C01985201J912971J770023J151957k7517j765821l501896n313665p330248
9104B88881005r257109j0692610j1783214j2581088j2975134j2787843j2459149
9097B06344858j1829270j1226371j0230345r218849q470428p661765p104311o583135
9089A34020384n925761n522108n175324m768689m374232m078070l664781l386561
9081I7124858l024694k627534k483432k093843j724445j454101j095778r34332
9073H1686699n88676n81081n46185n47580p63846j105952j428548j781759k151490
9064G2191582k296753k489213k660173k754606k635980k557608k470071k203762
9056E2123416k140851k115161j793055j628793j503204j552066j280291j296413
$$ y = [301985201, 303898172, 305668195, 306820152, 306792635, 305026814, 301524918, 296211253, 288881005, 279623896, 268931286, 257148072, 244566984, 231591850, 218804007, 206344858, 194515588, 183289217, 173058872, 163840023, 155369595, 147707830, 140603519, 134020384, 128094623, 122572515, 117397191, 112628502, 108254270, 104176200, 100511419, 97124858, 94100164, 91472630, 88989198, 86895355, 85170910, 83716809, 82621031, 81686699, 81098023, 80516942, 79970757, 79423177, 78659331, 77553379, 76124831, 74343072, 72191582, 69894829, 67405616, 64745443, 61990837, 59354857, 56797249, 54327178, 52123416, 49982565, 47867404, 46074349, 44445556, 42942352, 41390286, 40109995, 38813582]
9048C8813582j158959r72292j012297r13388q57970p50297p45301o78422o74501
9039C1050155o45489n56842n00797o22497n85856n14748n58863n44803o02680
9030B5917580o59236n73600n85888o39621o28057o68092n56825n10242n09345
9021B0586674l66216m73361m00010l84846k85566k70917l21852k62737k29407
9012A7591762k38645p3046o7485j05068m9771n2707r424p5632k9932p9572j46524
9001A6663956j58647j89062l13758r5542k67239l94398k82613m16140m53828l89638
8991A3703091k65039l59301l44029k83051l12342l14197l00897l21658j84338
8982A1018239k75710j89811j29289j70509j72044q5593j55816o8183M7032k22579
$$ y = [38813582, 37654623, 36682331, 35670034, 34756646, 33898676, 33148379, 32403078, 31724656, 31050155, 30404666, 29847824, 29347027, 28724530, 28138674, 27623926, 27065063, 26520260, 25917580, 25258344, 24684744, 24098856, 23459235, 22831178, 22163086, 21606261, 21096019, 20586674, 20220458, 19747097, 19347087, 18962241, 18676675, 18405758, 18083906, 17821169, 17591762, 17353117, 17280071, 17212586, 17107518, 17057747, 17005040, 16995616, 16919984, 16890052, 16810480, 16663956, 16505309, 16316247, 16002489, 15906947, 15639708, 15245310, 14962697, 14546557, 14092729, 13703091, 13438052, 13078751, 12734722, 12451671, 12139329, 11825132, 11524235, 11202577, 11018239, 10742529, 10552718, 10423429, 10252920, 10080876, 9995283, 9839467, 9771284, 9818316, 9595737]
8972I595737j23844q5191m5487r0219m7319m4112o5738k00521j26791m8965j49292
8961H568258j15683j91957k27711j21477j86270k82470p7500m1422j90851j73656
8951F959261k55984p2184O3317j18417o8746j67914j63228q9360r9475k1366j00863
8940E865041r2632j13795L0492m5046j41235M57J8229j85416k04845l1498m0508
8929E059244l4889j30894n9242k8674j18581p0332j25019j7049q1036N7435m5291
8918D405672j35699j42857k5107l6949J599J00091j00984j51044m9391j04393
8908C760938q6690R9736j43401O9793j00987J03171P8053j23678l2672j40854
8898C483409j24942q466J6920O8126J3631k3954M4916L804o9971R0326l361j24806
$$ y = [9595737, 9471893, 9386702, 9341215, 9250996, 9203677, 9159565, 9093827, 8893306, 8766515, 8717550, 8568258, 8452575, 8260618, 8032907, 7911430, 7725160, 7442690, 7365190, 7323768, 7132917, 6959261, 6703277, 6631093, 6694410, 6575993, 6507247, 6339333, 6176105, 6086745, 5987270, 5965904, 5865041, 5772409, 5658614, 5689106, 5644060, 5502825, 5503282, 5521511, 5336095, 5131250, 5099752, 5059244, 5024355, 4893461, 4834219, 4805545, 4686964, 4616632, 4491613, 4474564, 4393528, 4450963, 4405672, 4269973, 4127116, 4102009, 4065060, 4066659, 4166750, 4065766, 3914722, 3865331, 3760938, 3674248, 3773984, 3630583, 3700376, 3599389, 3702560, 3780613, 3656935, 3624263, 3483409, 3358467, 3350001, 3366921, 3435047, 3448678, 3424724, 3469640, 3473444, 3403473, 3493799, 3490438, 3365632]
8886C365632N7496j820J563J0914r145m7243M3875J0973M192o4364j3850Q3591
8874C441814o0177k7077J21337m4821J2837M3194k7506P7110q1128O932N5206
8863C517721P060J35588r249o1335J16284L0229O6110j9150J5956J27512n3653
8852C873073J18794J45813P0327P3030J41340J66224R7871J18891R5071R6754
8842D997188M0252L3442J78718K3091j1009J40902R6212L58k4998J24783l6517
8831E562422L9580M0160O9188J40970P3763J34954J51994K16336J18370J39259
8821F686996J50847Q8027J19366J23908J12486M3547J31605o5272n6070k8813
8811G306627N1691L2181J3350J0702L1021M4361l9750J139J06191p421l4620j09205
$$ y = [3365632, 3423128, 3421308, 3422871, 3433785, 3424640, 3377397, 3421272, 3432245, 3436437, 3372073, 3358223, 3441814, 3381637, 3354560, 3475897, 3431076, 3443913, 3487107, 3459601, 3536711, 3455583, 3462515, 3517721, 3524781, 3660369, 3651120, 3589785, 3706069, 3736298, 3802408, 3783258, 3799214, 3926726, 3873073, 3991867, 4137680, 4208007, 4281037, 4422377, 4588601, 4686472, 4805363, 4900434, 4997188, 5037440, 5070882, 5249600, 5272691, 5261682, 5402584, 5498796, 5499154, 5474156, 5598939, 5562422, 5602002, 5642162, 5711350, 5852320, 5926083, 6061037, 6213031, 6429367, 6547737, 6686996, 6837843, 6925870, 7045236, 7169144, 7281630, 7325177, 7456782, 7391510, 7335440, 7306627, 7358318, 7390499, 7403849, 7414551, 7445572, 7489933, 7450183, 7451322, 7557513, 7550092, 7515472, 7406267]
8799G406267j3788J6431P2668R5295Q7759J22099J17482J48215J90075L81897
8789H624400J39724O2794n8137J50606k7480L9239o192j41538k32763j75741j75442
8778H199470j50340j84159j82138j26809j31191j07447k01588l6210j73884j47502
8768F758202n7688k21210N7897j33708j00893P8266M6902q9182K612P8598J33003
8757F552799K3190k3345O0016P8100K0082o3244n7107j06802r1211k12050j67443
8746F012985r2805j23126j46927j62373j62938j45538p4366j09047j94841j75874
8736D625150p4810q7722j45118j02571j51669j8280r2701n7802r0255m9183p4708
8725C680331p8747q4442l3106p3604n9198J7866j4409j81138j23931k8059m6027
$$ y = [7406267, 7392479, 7408910, 7481578, 7576873, 7664632, 7786731, 7904213, 8052428, 8242503, 8624400, 8764124, 8826918, 8768781, 8919387, 8891907, 8931146, 8924954, 8783416, 8550653, 8374912, 8199470, 8049130, 7864971, 7682833, 7556024, 7424833, 7317386, 7115798, 7079588, 6905704, 6758202, 6700514, 6479304, 6537201, 6403493, 6302600, 6380866, 6427768, 6338586, 6341198, 6419796, 6552799, 6575989, 6552644, 6612660, 6690760, 6710842, 6647598, 6590491, 6483689, 6392478, 6180428, 6012985, 5920180, 5797054, 5650127, 5487754, 5324816, 5179278, 5104912, 4995865, 4801024, 4625150, 4550340, 4462618, 4317500, 4214929, 4063260, 4044980, 3952279, 3894477, 3804222, 3755039, 3680331, 3601584, 3517142, 3484036, 3410432, 3351234, 3369100, 3354691, 3173553, 3049622, 3021563, 2975536]
8714B975536j01429M2672j15832j02760l3093m4075k6566m3181j04833j0614k7178
8703B408647L3613j38352j08961K2245M5053n2356j08215j32148J4955o9503q6253
8692A828725L4358p7717q3096j16596p5603j8956R2567p5060j29233p5229K578
8681A306738m1131J4512K257j0455r2632j5017j1503j01575k5569J23750j3445
8670A135930j52644k2046Q935n8294K8467q7806O3740N0792m646l9026j2399j3069
8658H97934j31956J00421L3876p1162J7897q2037q0019R8470N2758l5735j05432
8647F95015q8928K04268k8527n0919n0775J26533J15364j11736p5911j1287o4223
8636F58874R3212J3873j08849n497o4544j5166J6981K6090M6281p873K2758L7731
$$ y = [2975536, 2874107, 2916779, 2800947, 2698187, 2665094, 2621019, 2594453, 2551272, 2446439, 2435825, 2408647, 2442260, 2303908, 2194947, 2217192, 2262245, 2209889, 2101674, 1969526, 1984481, 1914978, 1828725, 1863083, 1785366, 1702270, 1585674, 1510071, 1491115, 1583682, 1508622, 1379389, 1304160, 1306738, 1265607, 1280119, 1282376, 1271921, 1179289, 1164272, 1152769, 1051194, 1025625, 1149375, 1135930, 983286, 961240, 970175, 911881, 940348, 852542, 916282, 967074, 962428, 923402, 911003, 897934, 765978, 866399, 900275, 829113, 847010, 764973, 684954, 783424, 836182, 800447, 695015, 606087, 810355, 781828, 730909, 680134, 806667, 922031, 810295, 734384, 723097, 658874, 752086, 765959, 657110, 651613, 587069, 571903, 588884, 614974, 661255, 653382, 676140, 713871]
8624G13871j80526k454N5006j47k5526K8413J8490j4120l9759L7900Q147k2411
8612E76884P9140j13223J28741k7824j61383k4136m1217P9938r231j4398K617
8601D75908J4602M9418o0484n9385N3327P3734m3303l3465K7830j0200K6339l678
8589E10643N3858M7670L6557j85936j59890L7087N1930m1992p518J26769p7125
8578C92053j45562O4153J11737j3087o5180K8220M5687p6836k8557Q3448n4514
8567C41562K7553m8281l3762M4297Q983m7858l4441N1634n6034P5197P0908j1927
8555C87831q1534L3331L0520k5173l917j64104N2813M82j7492M9782M5767L0980
8543C39286J842j6917q9763L3019p5769N9673P6607o2816l9975r22J06389R0325
$$ y = [713871, 533345, 530891, 585897, 585750, 560224, 588637, 607127, 593007, 553248, 591148, 599295, 576884, 656024, 542801, 671542, 643718, 482335, 458199, 416982, 496920, 487689, 473291, 475908, 490510, 539928, 479444, 420059, 473386, 547120, 503817, 470352, 498182, 487982, 514321, 510643, 564501, 612171, 648728, 462792, 302902, 339989, 391919, 349927, 342409, 469178, 392053, 246491, 310644, 422381, 409294, 344114, 372334, 418021, 341185, 312628, 396076, 341562, 369115, 320834, 287072, 331369, 340352, 292494, 258053, 309687, 253653, 328850, 399758, 387831, 306297, 339628, 370148, 344975, 341058, 176954, 229767, 230249, 212757, 262539, 308306, 339286, 341128, 324211, 234448, 267467, 191698, 251371, 327978, 265162, 225187, 224265, 330654, 420979]
8531D20979n0752j11277l4762o21N1586j7012j138m1703n9714O3997N4839q2553
8519A91869o4591O1726R0371R674k4995k7820R8187q8860N664L1384J3035n7613
8507B38031K8045n3642Q0132j5943j63686P5159N1806o0396O815O8622M3854q9568
8495B09229P5197N680q0499K6576r348K2459Q9128P019j21798k329r9667O4119
8483A85766M1818j3454j2641K122k7215J21507L039k5402r4498j8147O2111O676
8471B31682p2014k4945O6154J3521p7698M8655J37664l1907m0076J7530k04831
8460F3735J0874M438R9715j1058M917L527J49976l3837r2837j08427J2131m1040
8448F2114L7737R8658J0223k3552O2959P8482k28562l4881P0072P5143n8950l3094
$$ y = [420979, 370227, 258950, 224188, 223567, 275153, 258141, 257003, 215300, 155586, 219583, 274422, 191869, 127278, 189004, 279375, 289049, 264054, 236234, 334421, 245561, 251225, 282609, 295644, 238031, 266076, 212434, 292566, 276623, 112937, 188096, 239902, 179506, 186321, 254943, 298797, 209229, 284426, 290106, 209607, 236183, 226835, 249294, 338422, 345441, 223643, 221314, 121647, 185766, 227584, 214130, 201489, 203611, 176396, 297903, 300942, 275540, 181042, 162895, 225006, 231682, 159668, 134723, 200877, 214398, 136700, 185355, 323019, 291112, 251036, 268566, 63735, 74609, 79047, 178762, 167704, 172621, 176148, 326124, 292287, 199450, 91023, 103154, 62114, 99851, 198509, 208732, 185180, 248139, 326621, 98059, 63178, 133250, 208393, 149443, 116349]
8436A16349l3623O74R444j2807O6364k6245R7538M8099l8693P8992j04004k2k3503
8423A78563n3836n3713J7251K8569N9861j4095l4387K8597J38913m6445o688j51730
8411I0860L3779P3232k1860k7192l0266O0627Q6742q0482l38K0028j01953k8851
8399G4326l7847O563Q9165O384l1555P0477p7890r885L8036J6487k1416K5695
8387A48540l2698q7705P2888N935j5798K9884P788K922j2527N9943J4643p2087
8375A21728k5156o9442m2169N3765M3154k4880K6941M3790L0656j11895J3026
8364E9518J3460j5361k2275q7566J07480M0094m0430m3007p5216R0073J00132
8353A26902K7568k4435O8735n2582j00548L9499j0143P485L8726O6106k6318j6546
$$ y = [116349, 82726, 83400, 92844, 80037, 146401, 120156, 217694, 265793, 227100, 306092, 202088, 202066, 178563, 124727, 71014, 88265, 116834, 176695, 162600, 128213, 156810, 295723, 249278, 242590, 90860, 124639, 197871, 176011, 148819, 118553, 179180, 265922, 185440, 185102, 205130, 103177, 74326, 36479, 43042, 132207, 138591, 107036, 177513, 99623, 89738, 127774, 144261, 122845, 148540, 115842, 28137, 101025, 106960, 91162, 121046, 128834, 131756, 119229, 179172, 193815, 121728, 96572, 27130, -15039, 38726, 81880, 57000, 83941, 127731, 158387, 46492, 59518, 72978, 57617, 35342, -52224, 55256, 95350, 54920, 11913, -63303, 26770, 126902, 154470, 130035, 198770, 146188, 45640, 85139, 74996, 82481, 121207, 187313, 160995, 144449]
8341A44449j15071K706P9598N719N7507m5292r6720n0115j6058N4294j2862q8285
8329h0130j6032J02548O8367k9242n6496k3498K4130J3281N6698K0435n9938J3298
8317C3421m4679P5857J63928r9975k0567N0983K5807r916l6947J04067o3222p8738
8305A00019k528P9634j28162p644J66672j56672m1922O9751k4873J17401Q3246
8294B54922n5338j4617L529j00975l4916L7291q454j1396m398n516M5356K3916
8282A29404n7529r3888O2543j2629N4508k864m5276N2393j9718l8442m0735M7648
8270C5415J1149m7251K8982O2380j08677j3772J15254j0409m3618q5499L6741
8259a9305J13180l1712l4796J016K3865J982k0013n2635J8867k0820L0601n8894
$$ y = [144449, 29378, 32084, 111682, 117401, 174908, 129616, 32896, -17219, -33277, 21017, 8155, -80130, -96162, 6386, 74753, 45511, -10985, -34483, -10353, 2928, 59626, 80061, 20123, 33421, -11258, 64599, 228527, 128552, 107985, 158968, 184775, 174859, 137912, 241979, 178757, 100019, 97491, 177125, 48963, 41319, 207991, 51319, 9397, 79148, 54275, 171676, 254922, 199584, 184967, 188496, 87521, 52605, 89896, 81442, 70046, 65648, 60132, 105488, 129404, 71875, -22013, 40530, 27901, 82409, 79545, 34269, 86662, 66944, 28502, -12233, 35415, 46564, -687, 28295, 90675, -18002, -31774, 83480, 73071, 29453, -56046, -19305, 93875, 62163, 27367, 28383, 52248, 54230, 34217, -18418, 449, -20371, 10230, -48664]
8247d8664l4988K9602j3228N4365p8786n2312N2417M4111L4198o2035M2975J24442
8235I2097k1416j5666n36j44769j1190O1693N1089P774O247Q937j19764k6299
8223a11803J87672m4319j10414N5235l8945K9569R871K0732k9850m8245j6817
8212i7314j4061L0420j3614l2609k8959N1287l0967K0103O0916M1585K2534P113
8200A6434n2666j1529J1850l0525N1244j08269m4611k2988P00791j6447l30134
8189A63150n6760j10055N7868j05950J15999K1349J01846r833R178q1782q2245
8178B2765L0860L6113m3803K3601k9136P206J6213k8524O75k5485K3820N3685
8166H7990n9847O593m5696n9847l4791K2357L8991M3258N2555k790k7048o7712
$$ y = [-48664, -83652, -54050, -67278, -12913, -91699, -144011, -91594, -47483, -13285, -75320, -32345, 92097, 70681, 55015, 54479, -90290, -101480, -39787, 11302, 19076, 25323, 34260, -85504, -111803, 75869, 31550, -78864, -23629, -62574, -33005, -23134, -2402, -32252, -80497, -97314, -111375, -80955, -94569, -127178, -156137, -104850, -135817, -115714, -54798, -13213, 9321, 16434, -36232, -47761, -35911, -66436, -15192, -123461, -168072, -191060, 509731, 493284, 163150, 106390, -3665, 54203, -51747, 64252, 85601, 187447, 177614, 186792, 105010, 22765, 53625, 89738, 45935, 69536, 40400, 47606, 63819, 35295, 35970, 10485, 34305, 87990, 28143, 34736, -10960, -70807, -105598, -83241, -44250, -992, 51563, 48773, 21725, -45987]
8154d5987Q2977N4314k7027L537k1072o0733r8265l0744j6817L2755j552L9620
8142h8994L3675p1676N5402Q3322q7813P4247O7806K1611J14737n2707N8934q1851
8130A26693q8697Q877k3684o0273N4825l2373J9743j0251j1734K4220l9568K3562
8118h660N6493m0381L5229O8270j31207J551P4950M8162P641q2355L2002j20208
8106e8513o7103P7095J21470p141j9733J5784o3601k8254o7071o387r723Q6399
8094b6778p8353R7743Q6192m2366k8192o3522L9763K4194m3483K0011L5221j33529
8082a13099p0662N4204j7327O1840Q0925J9162J512l3446o3656p7080J29176O5883
8070C7432Q6361n5407j11287P9519p7523p3441M8848l5898l0380Q6852N8678r3749
$$ y = [-45987, 36990, 91304, 64277, 67814, 46742, -13991, -112256, -143000, -159817, -127062, -128614, -88994, -55319, -126995, -71593, 11729, -76084, -1837, 65969, 87580, 202317, 149610, 208544, 126693, 37996, 46873, 23189, -37084, 17741, -14632, 5111, -5140, -16874, 7346, -32222, -8660, 47833, 7452, 42681, 110951, -20256, -18705, 56245, 104407, 112048, 29693, 61695, -58513, -125616, -48521, 72949, 65808, 46075, 61859, -1742, -29996, -97067, -103454, -113177, -26778, -105131, -7388, 78804, 36438, 8246, -55276, -15513, 8681, -34802, -14791, 20430, -113099, -183761, -129557, -146884, -85044, -4119, 15043, 16555, -16891, -80547, -157627, -28451, 37432, 123793, 68386, -42901, 36618, -40905, -114346, -65498, -101396, -131776, -44924, 13754, -79995]
8058g9995L140L4026k477k7690K1906J02764o1459m3959P9550L6855k9614k8389
8046D658j4725L5079q0482k499n5910r930J12490l3885Q704Q0370j10468j27674
8034a94272R857J07582k967q4694K1376M2861o6909K7121J24095Q961p1597J9157
8022e9429l5752n1003k211R4440O4541q3247J1319L2412P0166n4792o2744m0606
8010a16906l120k2974j7751J14636O099o5032o8998L6947l4389J48877L8568n9870
7998d3913l455k9449M6185k0305O3668m3525o4701n551M8165M3894j8837q6573
7986a14397P4013O3487J1703j56530N7773R6453l2569o5381L2137K4703k6215
7975c4823L7622o9498j7877L4993k8214N3571R771r6812Q2261k1773k777N8031
$$ y = [-79995, -76855, -42829, -45306, -72996, -51090, 51674, -9785, -53744, 25806, 62661, 33047, 4658, -10067, 25012, -55470, -57969, -113879, -123809, -11319, -45204, -36500, 43870, -66598, -194272, -184415, -76833, -79800, -164494, -143118, -100257, -167166, -140045, -15950, -6989, -78586, -59429, -95181, -146184, -148395, -53955, 10586, -72661, -61342, -28930, 41236, -13556, -76300, -116906, -120026, -143000, -160751, -46115, -40016, -105048, -174046, -137099, -171488, -22611, 15957, -43913, -47368, -76817, -30632, -50937, 12731, -30794, -95495, -101046, -52881, -8987, -27824, -114397, -40384, 23103, 34806, -121724, -63951, 32502, -67, -65448, -33311, -8608, -34823, 2799, -66699, -84576, -49583, -77797, -24226, -14455, -111267, -29006, -50779, -53556, 4475]
7963D475n010J32j9361O1399j07595N9696M8676L1666K506q2173O0419o2973k429
7950a0572K1839N7756o3742L3456j4916j16147L055J06391k2419k379L544M2486
7938C8352l2544q7565l3304K6991k186R981j6483l9919J7673M4974J0845K9139
7926c4046K6914k8969J2487n3343P1052k9294N1343J413o2212p3409L1886L8408
7914d7770K1016k8800o8723J98501r3081n6352l7183L2626J00517L1088P118r0184
7902c1227J1648n89N1501r865L1048J9755p4576Q1010j9174k5453k9273m9509
7890d4704k429p097R1095j6107Q782k5711K8735k4689O5N6734r0478k6147K4982
7877b6969n8351P9308m9006O0341L929k9776J0774k2603k0864p6035J15328n7951
$$ y = [4475, -535, -403, -19764, 41635, -65960, -6264, 42412, 74078, 76584, -5589, 54830, -8143, -10572, 11267, 69023, 5281, 38737, 23821, -92326, -89271, 17120, -5299, -7678, -4134, 38352, 5808, -81757, -115061, -88070, -90256, -80275, -96758, -136677, -119004, -74030, -63185, -34046, -7132, -36101, -23614, -76957, -5905, -35199, 16144, 17557, -44655, -118064, -86178, -47770, -26754, -55554, -124277, 74224, -18857, -75209, -112392, -79766, 20751, 51839, 58957, -31227, -19579, -20168, 31333, 21468, 52516, 72271, -2305, 78705, 59531, 34078, 4805, -44704, -47133, -54230, 36865, 20758, 29540, 3829, 32564, 7875, 7940, 64674, -25804, -51951, -26969, -85320, -6012, -55018, 5323, 9252, -20524, -9750, -32353, -53217, -129252, -13924, -71875]
7865g1875j25378J01041P9366k9504N8175Q3989r4419j26940j8801M0595J18622
7854A4871K4917r6342R655n38m2358P8141L0430j08287l0933j2045J11914M7264
7842B6689j25893J05447l8727j3151j9438n7784o3945N0580L7762l0927k4701
7831a54088O9279m0650j3503J45221m1686o203k1921l6486j1754p570J61918n8703
7819a6146l5738L9867M4732K2817J4677m2732p4792O0503k9834J5030q739j1878
7807b2233K549j2083k5530J4431l3665j6760O6271j01036P8334o0943k29131M9916
7795b89880K3658Q4622L6273j3407M6269O566J16920k1523k9556l5578j8032P0079
7783b3589R9818j1551q2002p8259o5139k6414O8918Q3251r8034p4557k3065l1006
$$ y = [-71875, -197253, -96212, -16846, -46350, 11825, 95814, 1395, -125545, -144346, -103751, 14871, 39788, -56554, -46899, -47437, -89795, -11654, 18776, -89511, -120444, -132489, -20575, 26689, -99204, 6243, -32484, -45635, -65073, -122857, -186802, -136222, -98460, -129387, -154088, -84809, -125459, -138962, 6259, -35427, -41630, -63551, -100037, -111791, -119361, 42557, -16146, -51884, -12017, 32715, 55532, 70209, 27477, -47315, 13188, -16646, -1616, -10355, -22233, -19684, -31767, -57297, -42866, -76531, -93291, -27020, -128056, -49722, -110665, -339796, -289880, -266222, -181600, -145327, -158734, -112465, -105899, 11021, -10502, -40058, -75636, -93668, -23589, 76229, 64678, -17324, -95583, -160722, -187136, -118218, -34967, -133001, -207558, -230623, -261629]
7771b61629J03203J32219l9722q2213m6013M8290O2626J26289j27312o6912M9651
7760a01523O8456j8812j7278m6042J36066l8947o6441J6469k0958m420p0693Q1986
7748h2137M9220P9987P876n2080j7366o0797m9836o00P7540l8825j387M2453n3462
7735i9414J985O5026J5205K4018o1876o4857J45635P4511j31864l7905l8255l3328
7723a41119J05476L3918l5476J5573N9123J7335L5503l8063j4547j07820k6012
7712i6109M2003r8403k873J40176R398k8902j146j4280N7674k4824K4463J8969
7700B6146r2309K6483K1970m0553K2035k8329l3682Q6530N0576m3641R565m1727
7688c6936l6970J56q850K7083l1025j6686J07174L7590n0455k7920m3160J44607
$$ y = [-261629, -158426, -26207, -65929, -148142, -194155, -145865, -83239, 43050, -84262, -151174, -101523, -33067, -51879, -69157, -115199, 20867, -18080, -84521, -68052, -89010, -93430, -164123, -82137, -32917, 47070, 54946, 2866, -14500, -75297, -125133, -125733, -48193, -87018, -88405, -45952, -99414, -97429, -32403, -17198, 6820, -55056, -119913, 25722, 100233, -31631, -69536, -107791, -141119, -35643, -1725, -37201, -21628, 37495, 54830, 90333, 52270, 37723, -70097, -96109, -54106, -152509, -155382, -15206, -5808, -34710, -35856, -50136, 7538, -17286, 7177, 26146, -66163, -39680, -17710, -58263, -36228, -64557, -98239, -11709, 38867, -4774, 4791, -36936, -73906, -73750, -82600, -55517, -86542, -103228, 3946, 41536, -8919, -36839, -79999, 64608]
7676F4608M3951r4054j4083J9951l9740j1512j13927K8180M4644J2110O736r003
7664f2139J18984K0676p9759n6555O932K9539O4179k5371q1629L8568M1885K2608
7652C7918P957j04301K819m8537J23511m2129m6133m6266Q797J12714K4665l5143
7640d128m3885O6891R694l7048j0648m2226K1591p173O0726K4561j07804L4576
7628c4873j17049J31929K1219p961K9548k8695p4505j07770r773J57668N3314
7617A3052l0599q353m6949p8314J32128j32861O6116K4285o5127P9373M0608j0927
7605a7568o2726O1049M1948L057n552o2848n7527M67N6048Q6602j02003k4655
7593h3708j16098P8207J02283o0950o9403N5489N6283o2815m8870J14211L556
$$ y = [64608, 108559, 14505, 422, 20373, -19367, -30879, -144806, -116626, -71982, -59872, -53136, -62139, 56845, 77521, -2238, -58793, -51861, -22322, 41857, 16486, -65143, -26575, 15310, 37918, 45875, -58426, -55607, -104144, 19367, -22762, -68895, -115161, -106364, 6350, 31015, -4128, -48013, 18878, 28572, -8476, -19124, -61350, -39759, -46932, 13794, 38355, -69449, -34873, -151922, -19993, 1226, -6735, 22813, -5882, -80387, -188157, -197930, -40262, 13052, -17547, -25900, -72849, -151163, -19035, -151896, -85780, -61495, -126622, -47249, -6641, -17568, -80294, -19245, 22703, 25760, 20208, -42640, -100167, -99700, -43652, 42950, -59053, -83708, -199806, -121599, -19316, -80266, -149669, -94180, -37897, -100712, -149582, -35371, -31815]
7582c1815M9287n1849P383J46046l3571o6401n5810p6731m5062N8698K2515L5913
7570d1397K7418q8729m8783J3239K9743N592M9999k1521L6097k2965N9889k6966
7558b8384j76773o5841J32541J00829J7917K9670m9183L5272j36995N037o5117
7547b01027J284J038r843J53325K8066M7126j5598k8262K0624K5838j41039J9889
7535i8579j288o345L7631l8625N7436N1180k0524L8557m963q5695j9252O2951
7523b7516O7149j9861p789K0382j11864n2371k8549k834K1905N7045K0490O2370
7511a443q956k4275J5083n8970N2704p996K1944p3123L4873k5045J7069m8071
7499a06206m8098R8092Q6587l563n6206p073P696n7048M780m8648m931M6438j3819
$$ y = [-31815, 17472, -34377, -26994, 119052, 85481, 19080, -36730, -113461, -158523, -99825, -77310, -41397, -13979, -102708, -151491, -138252, -108509, -102917, -52918, -74439, -38342, -61307, -1418, -28384, -205157, -270998, -138457, -37628, -19711, 9959, -39224, -3952, -140947, -135910, -201027, -199743, -198705, -208548, -55223, -27157, 19969, 4371, -23891, -3267, 22571, -118468, -98579, -99867, -106212, -68581, -107206, -49770, 1410, -19114, 19443, 14480, -71215, -90467, -27516, 39633, 19772, 11983, 32365, -79499, -131870, -160419, -163253, -141348, -84303, -63813, -1443, -10399, -34674, -19591, -78561, -25857, -33853, -11909, -85032, -50159, -75204, -58135, -106206, -154304, -56212, 30375, 26812, -29394, -36467, -28771, -85819, -81039, -129687, -134618, -88180, -101999]
7486a01999j3123K0803R7519r8656l5872O0249N5621Q1248p6428p7138r4258Q4843
7474i7191N291J9255K9286l8550N8607K7470m9170n0641r934k2265O5289r121
7462g1674N9172K0497O4459j14337k9052L6189k7063q4735J33328M1502o2041
7451c3755k7842J9110k2904J0472J14267k8883N8340p8386p4195J308m0836J18508
7439A5204m0269n793r096j9941N8277J4406q0897p6329Q8801R0646q2569q8095
7427a35655M7542j4783J03174M7507p5984n1964o1431k9177J15406N2653p1834
7416g4546l6248R9035j3813K9939r5060M7902r5665K4879L2700K5413N6240k9001
7404b8225M2771j403p6490l9404O1377j220M306J8591K2356n8246k9477N4179
$$ y = [-101999, -115122, -94319, 3200, -95456, -131328, -71079, -15458, 65790, -10638, -87776, -182034, -97191, -91900, -72645, -43359, -81909, -23302, 4168, -45002, -95643, -105577, -127842, -62553, -71674, -12502, 7995, 72454, -41883, -70935, -34746, -61809, -146544, -13216, 28286, -33755, -61597, -42487, -65391, -54919, 59348, 30465, 88805, 10419, -63776, -62468, -103304, 15204, -25065, -30858, -39954, -59895, -1618, 12788, -68109, -144438, -55637, 35009, -47560, -135655, -88113, -102896, 278, 47785, -28199, -80163, -141594, -170771, -55365, -2712, -74546, -110794, -11759, -25572, 4367, -90693, -42791, -138456, -113577, -80877, -55464, 776, -28225, 14546, 13143, -63347, -102751, -41374, -42594, -38288, -19697, 2659, -55587, -85064, -30885]
7392c0885n0429l4957O900K7235J26548O936q2797k6299M2275N9207k8518M7118
7380F2334k9864O0033n0058j11511q9808O3645K6329k8658P7656R87n3203j00789
7368a72907N0706R415N8869j1825j00694K6905P2290P6855p4232L7264p2324q5808
7356a85486N7552j8781m198P8751O2007L1071N1463P556J9255n0182o0497n5736
7344f7225M3690l5668L7658k1104p7913K5142L0981J1051J8455m4452K952r3016
7332a69449N9788N7439N2437M6751L3585n7431q2172n7231M6342q1966l0855K9804
7320a52958O409k2568R6920k3474P7374K1247o0455q7207N4350K5130K7532J4475
7308b3225n841L6054r7358P5340j13326m8626l2234l8726J61569M5471o511K9242
$$ y = [-30885, -81314, -116271, -109371, -82136, 44412, 51348, -31449, -57748, -15473, 43734, 15216, 62334, 32470, 92503, 42445, -69066, -158874, -95229, -68900, -97558, -19902, -18915, -72118, -172907, -122201, -112786, -53917, -65742, -166436, -139531, -67241, 9614, -64618, -27354, -99678, -185486, -127934, -146715, -150913, -72162, -10155, 20916, 72379, 79935, 99190, 49008, -11489, -67225, -23535, -59203, -21545, -42649, -120562, -95420, -64439, -53388, -34933, -79385, -76433, -169449, -109661, -52222, 215, 46966, 80551, 23120, -59052, -116283, -69941, -151907, -182762, -152958, -146549, -169117, -72197, -95671, -18297, 2950, -57505, -144712, -90362, -65232, -37700, -23225, -29066, 6988, -90370, -15030, -128356, -176982, -209216, -247942, -86373, -40902, -47413, -18171]
7296a8171N5411j654l1658j4730J5958L979o9360O058J0740q744J4066O5653o2041
7283c4493k569l938j04871o1642J35475o925o4098J0369J11286m8947o5946n5180
7271a91479N8918j7252N218k1556M0693J8823l7549J39815j802k4772J0940j25934
7259a45937N9428K4480K1558N5110l641l6722N265r153o5736R4259K253j07998
7247a06834r1744N2386P0643J34651m0537n0998l3290k0563M4438M7232k1642
7236a6258k7239j2370M6918j18193O151L1087N7896p803j14171N9965Q7289j9283
7224b6011l2001j9408M5873J9466l9066J9188q9915M9611q6891R2088m012r095
7212h0173N995J6867j7685L425J8619J7774o863k8090k6999m0139M484O6468K2255
$$ y = [-18171, 37240, 35586, 3928, -10802, 5156, 9135, -60225, -54167, -43427, -52171, -38105, 27548, -34493, -37062, -41000, -145871, -207513, -72038, -78963, -143061, -132692, -21406, -70353, -136299, -191479, -132561, -149813, -144595, -166151, -125458, -106635, -144184, -4369, -6171, -30943, -20003, -145937, -86509, -62029, -40471, 14639, 10998, -25724, -20459, -29612, -95348, -1089, 1164, -106834, -198578, -146192, -75549, 59102, 18565, -32433, -65723, -86286, -41848, 5384, -16258, -43497, -55867, -8949, -127142, -120991, -89904, -32008, -39811, -153982, -94017, -6728, -26011, -58012, -77420, -31547, -12081, -51147, -31959, -121874, -72263, -159154, -67066, -71078, -80173, -74178, -57311, -74996, -71571, -52952, -35178, -42041, -70131, -97130, -137269, -132785, -66317, -44062]
7199d4062L613l8298P2893N5259j8425k9887j35619l8605M8332M0551Q8326O7649
7187G1727m5048n0393k2532m08J8192k3750p2330k356N0052L6654j31611k6598
7175a98401J68451J02021N769j29605q2349L0410m017O3417j8352n8402o7004
7164a88062m4282Q9381M7615j7114J9411J05590N838M8507p8878l6963N6225j19953
7152a12685n4594j3841O3000J3717J16464o776k106l9734N606J18141o4672m7308
7140b4788k6845n5745Q9658K3538l0932m5154J08084p1504P225P0345Q4338n2493
7128G5727l4796K415r7220J5620j9396j00411l3218K2507N1481N8009l3976L7971
7116e5287q0024P8528l9937m9309N5373p3779l8446N225O1478L6657N5049j1839
$$ y = [-44062, -40449, -78747, -5854, 49405, 30980, 1093, -134526, -173131, -124799, -84248, 4078, 71727, 26679, -23714, -46246, -46654, -28462, -52212, -124542, -126898, -76846, -40192, -171803, -198401, -29950, 72071, 77840, -51765, -134114, -103704, -107721, -44304, -62656, -121058, -188062, -232344, -142963, -95348, -112462, -93051, 12539, 18377, 66884, -11994, -48957, 7268, -112685, -167279, -181120, -118120, -104403, 12061, 5285, 3179, -36555, -30949, 87192, 22520, -24788, -51633, -107378, -17720, 5818, -25114, -70268, 37816, -33688, -26463, 43882, 128220, 75727, 40931, 43346, -53874, -38254, -57650, -158061, -191279, -168772, -117291, -59282, -93258, -55287, -135311, -56783, -96720, -146029, -90656, -164435, -202881, -197656, -136178, -99521, -44472, -56311]
7104e6311O781p4752k8677o3032J11470J43684l7815k3821M8541n5725j24947
7093a54604k1422O4745L5327m8683N3481o6113J35801j4547j04138K5672N9930
7082c4551R5433p8986L6991O0246n1243m6680k5631K3134m3439j5931P2888l3115
7070d0884j3434q6250P8966Q1762l8326j6479l0261Q2151q5390m1302j2896Q7661
7058c4682o6502O8144K3750N3645P5394m7352j06846p2946Q4358m7712k037l2261
7046a05047n3971O0090M045M6622K1748k9022Q8594L6336o3626m5613J9905L1448
7034A1509m2004j21204O7689L1313l4616O7500O5958l6740q621k0012k3105L1480
7022a0853o260l798l5036m8442j2677Q4735L5225n2294l0105J01883n3968n5272
$$ y = [-56311, -49530, -124282, -152959, -215991, -104521, 39163, 1348, -22473, 26068, -29657, -154604, -176026, -111281, -75954, -124637, -71156, -137269, -1468, -16015, -120153, -94481, -34551, 60882, -18104, 18887, 79133, 27890, -18790, -44421, -21287, -64726, -80657, -7769, -40884, -54318, -140568, -61602, 20160, -18166, -34645, -64906, 17245, -68145, -109447, -122343, -34682, -101184, -33040, -9290, 44355, 119749, 72397, -34449, -107395, -23037, -70749, -72786, -105047, -159018, -98928, -94883, -48261, -26513, -55535, 33059, 69395, 5769, -39844, -19939, 11509, -30495, -151699, -84010, -52697, -87313, -19813, 46145, 9405, 784, -19228, -42333, -10853, -17113, -20911, -55947, -104389, -117066, -32331, 2894, -49400, -79505, 22378, -31590, -86862]
7010h6862l1651L3152k9315J16303J8415m4773J1507p1540m0471P2363O745N2096
6998E969p8005r6370R7828Q694K334J355M3573o9794Q0889P1845K2503j19168
6986b8347N5906N807j2255j8628k1625q445n061p9214J6917l9266M8748J26621
6974D1158m1243n5136J03728O888n6852O591j05177Q2040J05913j7224r3682k2955
6962d5951j1635O1100J38j01783J7966R0432j0747j05748p8829J24807M9202l2474
6950d3522L8435n4290j6500J3299K0736K1973j3108P94q8631l2902J21192O9770
6938C7246p6208l5502l816j4970j9784J6598M8228K0905N4585k6329n9452L8833
6926a9666q564q5738n7082j2280J4807N6251J01201l187L525J6972L3724o2434
$$ y = [-86862, -118513, -85361, -114676, 1627, 20042, -24731, -13224, -84764, -125235, -52872, -46127, 5969, -72036, -168406, -70578, -61884, -59550, -58195, -14622, -84416, -3527, 68318, 90821, -28347, 27559, 33366, 21111, 2483, -19142, -27587, -32648, -111862, -94945, -134211, -85463, 41158, -85, -55221, 48507, 55395, -1457, 5134, -100043, -18003, 87910, 70686, -22996, -45951, -57586, 3514, 3652, -98131, -80165, 10267, -480, -106228, -185057, -60250, -11048, -43522, -5087, -59377, -75877, -62578, -41842, -19869, -32977, -32183, -120814, -153716, -32524, 37246, -38962, -74464, -78280, -93250, -113034, -96436, -48208, -27303, 27282, 953, -58499, -19666, -28230, -113968, -171050, -183330, -168523, -112272, -11071, -14258, -10733, 6239, 39963, -22471]
6914b2471k5716R621r0172J33185k2512K9520O2841m1720n574q5250J0219J5438
6902c2591l463J6819Q0671j42884l5324M0916p7276N4459O2188L1359P6693M055
6890G5622q3845l082N3242M1441n2048j47668J1249J11718k224m206l2151L5471
6878C519m891P485J8814p5273n2266m3340N3847P6178n6576O1758m9487N4910
6866e322J9103j13257Q7977J1467n583j9786P8809K031j67766M5356N4458Q0381
6854F7868k9284j04680N0103m8443R2114O8687k8323m881j6234l8151j495j5011
6842g730L3526m1666k3066o809R798K2623j00514R3448r0385N3482j7410m0466
6830a15169J81058L2715O3775j20312j47961Q8793l5226j3328k3246k8392k1439
$$ y = [-22471, -48187, -38566, -128738, 4447, -18065, 11455, 74296, 32576, 27002, -58248, -48029, -32591, -36054, -19235, 61436, -81448, -116772, -75856, -153132, -98673, -36485, -5126, 71567, 75622, -8223, -11305, 41937, 83378, 31330, -116338, -105089, 6629, 4405, 199, -31952, 3519, -1372, 6113, 24927, -50346, -102612, -145952, -92105, -15927, -72503, -10745, -60232, -5322, 13781, -99476, -11499, -32, -5615, -25401, 53408, 55439, -112327, -66971, -12513, 67868, 38584, -66096, -15993, -64436, 27678, 96365, 68042, 63161, 46927, 8776, 7281, -7730, 25796, -15870, -38936, -45745, -35947, -13324, -113838, -20390, -110775, -57293, -74703, -115169, 65889, 98604, 162379, 42067, -105894, -17101, -52327, -65655, -88901, -117293, -138732]
6819a38732L5476L9463O2266m1137K5205P39p1081j1286k2758O3182p1271P2111
6807e7823J9673K8717j7929J27752L9820r0254q0900M3763N9648p4999l8419L2903
6795h048O0416r2689M6308O3719q3204J43682P4915m4140k4216k5338q1766p9797
6783e0158L7916K3625J0202j22248J03747R0617r0440n0076J9710N610m5527M4305
6771b2717L5817L9141M3505m6547p3050j00045M6250R2213o8260m5258L3550N9561
6759e840r264O8257J0996j2746j30696l3843J009N9978P6325J8980p0830k3472
6747e1146M5849p2145J5666q4248M6082M9292p4238M6557Q626p582R3919M9087
6735F5719n6780J4213j914J3446m8248q5j5992j0959j4202j1876O8266O8056J6309
$$ y = [-138732, -103256, -63793, -1527, -42664, -17459, -16720, -87801, -99087, -121845, -58663, -129934, -57823, -38150, -9433, -27362, 100390, 140210, 49956, -30944, 12819, 72467, -2532, -40951, -8048, 52368, -40321, 5987, 69706, -13498, 130184, 205099, 160959, 136743, 111405, 29639, -50158, -12242, 11383, 21585, -100663, 3084, 93701, 3261, -46815, -27105, -21495, -67022, -22717, 13100, 52241, 95746, 49199, -23851, -123896, -77646, 14567, -53693, -98951, -65401, -5840, -15104, 53153, 64149, 51403, -79293, -113136, -112127, -52149, 24176, 43156, -27674, -51146, -5297, -77442, -61776, -146024, -99942, -50650, -124888, -78331, -69705, -77287, 16632, 65719, 8939, 23152, 21238, 34684, -13564, -13649, -29641, -40600, -54802, -66678, 1588, 69644, 85953]
6722H5953j3266P3789k7758m6720m0721J5088k6814l7212n6999m6583Q1105M8791
6710H653p4679L006N5299N0206m5070J5936r3485J7934l751j842K308j5042Q9551
6697I024O219K3178L7031j29853N1497J52313j01018j14802n2658N747O5442Q6719
6685C8839P3846m0555o5619J6791J5977n9622O0959J8740j62135P5203L2307k9829
6673b5098j6047o4724j1110K4352J41283j0013l5995j4958Q1518J5465o1235j13758
6661i0320K3339K2322N0940j8424n3881M7922k4886R0095l0218q9341o2938J22219
6649a3171Q43j16700J11622m4730L4735J43252j4238o6748J2831m2134k3846j6527
6637c4811m5099K9073L1404j3312k2098J02937l0146l1423J7431P1240n2291p0165
$$ y = [85953, 72687, 146476, 118718, 71998, 31277, 46365, 19551, -17661, -74660, -121243, -40138, 8653, -66026, -63020, -7721, 42485, -2585, 13351, -80134, -62200, -65951, -67793, -65485, -80527, 9024, 15243, 38421, 75452, -54401, -2904, 149409, 48391, -66411, -119069, -113322, -47880, 38839, 112685, 72130, 6511, 23302, 39279, -20343, 40616, 59356, -102779, -27576, 4731, -25098, -41145, -105869, -116979, -92627, 48656, 38643, 2648, -12310, 69208, 84673, 23438, -90320, -66981, -44659, 6281, -12143, -66024, -18102, -42988, 47107, 16889, -72452, -135390, -13171, -12328, -129028, -17406, -62136, -27401, 115851, 101613, 34865, 47696, 5562, -18284, -34811, -79910, -50837, -19433, -32745, -54843, 48094, 17948, -13475, 3956, 75196, 22905, -47260]
6625d7260J8934L5656r2098L8658Q73L1288N1861m5789k0185Q326K1000Q4892
6613H6156j50860K816K6344k4810O0543J02565r8932j3841p5294p2244K9626M0889
6601h7042K2216j3824J10181p8715o5541R8475O2821R30q4056n0395J23138n6140
6589a7952M9725q126K3847K3920J07664j7471j10575l6274j2888Q6900K1878q6448
6577B4200n1802O3554l6784Q4268K3241j34389o1110N9866Q5836L4550p1774l4371
6565a4715R396N7131J4224r5838j6794O1801N9202k872p1904n4224J4738R6331
6553E6476L1890r346j6560k5843l9423N2042j5669m9241l752M7207O5210K0407
6541A13398m3518j08128j8764l6356O2677J08639R5170p8344m3884K699J0820
$$ y = [-47260, -28326, 7330, -84768, -46110, -45237, -13949, 37912, -7877, -28062, -19736, 1264, 86156, -64704, -61888, -35544, -60354, 189, 102754, 3822, -10019, -85313, -157557, -127931, -87042, -64826, -78650, 31531, -47184, -112725, -14250, 48571, 49501, -34555, -84950, 38188, -17952, 31773, 23647, 47494, 71414, 179078, 161607, 51032, 14758, 1870, 88770, 110648, 24200, -27602, 35952, -832, 83436, 106677, -27712, -88822, -28956, 56880, 91430, 19656, -14715, -5319, 51812, 66036, -29802, -46596, 15205, 74407, 71535, -369, -54593, -39855, 56476, 88366, 79020, 62460, 36617, -2806, 49236, 33567, -15674, -19426, 27781, 92991, 113398, 69880, -38248, -57012, -93368, -30691, 77948, 173118, 94774, 50890, 53589, 64409]
6530F4409K6434l4056p5802J08811l2672l315k6963l1493L2467M5846K5251q1503
6518A7414p2326k8470m0470J05382m116L2923O7462k6819q9051R9479m7047M000
6506A8361o1204O944N4054Q3246N8733r5511l3839j4214N6885m0723O2146j3374
6494H1504m8177j3304N2491n2721N8191P2902r7273M2137K7384j00975O2596O4487
6482A49242n3476l6318M6682O3821P874j68147N0079O9281L5812q0558N073J23203
6470B12568l8157j9961k0895K2105J8992o0047j7969l1637O9131M5135m0515L018
6458A41768N8755O991o1751j6129K2692J2972r1392n9317N3658J7252R5481j6442
6446A64538j00053K2909Q6488L4854k9004M436k5058m8653M6023J04947m2540
$$ y = [64409, 90843, 56787, -19015, 89796, 57124, 53809, 26846, -4647, 27820, 73666, 98917, 17414, -54912, -83382, -123852, -18470, -22586, 10337, 77799, 50980, -38071, 61408, 14361, 18361, -42843, -35899, 18155, 101401, 160134, 64623, 30784, 16570, 73455, 32732, 94878, 81504, 33327, 20023, 72514, 19793, 77984, 150886, 53613, 95750, 123134, 22159, 84755, 149242, 95766, 59448, 106130, 169951, 177825, 9678, 59757, 129038, 164850, 84292, 89365, 212568, 174411, 154450, 133555, 155660, 174652, 114605, 96636, 64999, 134130, 179265, 138750, 141768, 200523, 207514, 145763, 129634, 152326, 165298, 73906, 14589, 68247, 85499, 180980, 164538, 64485, 87394, 173882, 208736, 179732, 184168, 159110, 110457, 156480, 261427, 218887]
6435B18887r5852j7616J36576M1323j24000K6055m7850n4218j1930J02382M8788
6424B22545q1335J216L2351q9714j7793N2858J07984j8070l0970P0845m4869j32568
6412G2480j7808J44689J8006j22958k1122P3781K7858l0097K1836K2276N3822
6401B42763M6707j17283N0311M094j07155n9427Q2525Q8174Q0423l1975K5198
6390C04355m455j00231O3699l1468M2229O7452k9934o9320p7958j0966m0522M5749
6378A58630J04973n6879r8286Q4022n5864N5832J09908k3250r7644J38680M9899
6367C70021o6892R1560m9296p0079N1613M9476p8943k708L8431k7779j9416M1121
6355C27109R0216n012J02243k5734j29318r7256j7753J14709m8776K6486J26603
$$ y = [218887, 123035, 105419, 241995, 283318, 159318, 185373, 137523, 83305, 71375, 173757, 222545, 141210, 142426, 174777, 85063, 67270, 120128, 228112, 210042, 179072, 249917, 205048, 72480, 54672, 199361, 217367, 94409, 73287, 147068, 174926, 144829, 166665, 188941, 242763, 289470, 172187, 222498, 226592, 119437, 60010, 142535, 230709, 311132, 279157, 304355, 299900, 199669, 263368, 231900, 274129, 341581, 311647, 242327, 164369, 153403, 112881, 158630, 263603, 206724, 108438, 192460, 136596, 192428, 302336, 279086, 181442, 320122, 370021, 303129, 394689, 345393, 275314, 326927, 376403, 297460, 294752, 333183, 305404, 285988, 327109, 417325, 412313, 514556, 488822, 359504, 262248, 244495, 359204, 310428, 336914, 463517]
6344D63517l9100l7035n1714K5700P8279p7865M7791j4817M448J3320M5752Q12
6332D59088J8080o9122j20343k4744M8985M7352R0754P218p4158r1435O7390N4419
6320D13484k7018K3572J12590Q906p9747k2638r262L2455n2492K5742k4459K5530
6308D26663Q2855J0943o0868J4504P9825J9755l2974R6451Q1067o698j05569J2823
6296F18777R40J0722j1129n4265l7645J348K9108O9068j477R2594K5212m6419
6284F96834O2471n8435J1858m3676L7717K2941k3833J41880P6047j13445j34423
6273F75936r0885J00124J9099L4980N3654j08431p724N0187K9646p4430m593J60373
6261H37936R9984Q2819n7687j08607M1703R439M5278l4124Q0142K5867r3624k8234
$$ y = [463517, 424417, 387382, 335668, 361368, 439647, 361782, 409573, 394756, 399204, 412524, 458276, 459088, 477168, 408046, 287703, 262959, 311944, 359296, 450050, 457268, 383110, 291675, 359065, 413484, 386466, 410038, 522628, 531534, 451787, 429149, 419887, 452342, 399850, 425592, 401133, 426663, 509518, 520461, 459593, 474097, 553922, 573677, 540703, 637154, 718221, 711523, 605954, 618777, 619717, 630439, 619310, 565045, 527400, 528748, 557856, 626924, 625447, 718041, 743253, 696834, 759305, 700870, 712728, 669052, 706769, 729710, 705877, 847757, 923804, 810359, 675936, 585051, 685175, 704274, 739254, 792908, 684477, 676753, 726940, 756586, 682156, 677563, 837936, 937920, 1020739, 963052, 854445, 896148, 905587, 950865, 916741, 996883, 1022750, 929126, 900892]
6249I00892m2534J9283j4685N1729J7867Q490o0859K8656N013J02722O8902K6405
6237A111881l2703K6766o947l3635m905O102L2937j7334O9091l9912J4112J75693
6225A301146j6332J3479q3133K6208R1735J234R4621j0859L349O6833M2817r1562
6213A439536P8335J13099q1407n9469J00178J0678k5340J1335J88460k9095M7937
6202A794247l8760n8166L6218J37550R0332k0584L637M3609r3341R4992M0531
6191B030265n4651r019K8437J97232M5353N6533K4584n5112P3482M0940J6676
6180B394720O7125M7762K0143P1893J31285Q7882J3615j60841o559J02486N6441
6169B825952M0474R0160J94629O2261r9010Q8007K4333J49289Q9412J13065Q6112
$$ y = [900892, 858358, 877641, 862956, 914685, 932552, 941042, 880183, 908839, 913852, 1016574, 1085476, 1111881, 1079178, 1105944, 1098997, 1065362, 1060457, 1066559, 1099496, 1082162, 1151253, 1111341, 1125453, 1301146, 1284814, 1298293, 1215160, 1241368, 1333103, 1334337, 1428958, 1418099, 1421448, 1488281, 1531098, 1439536, 1517871, 1630970, 1549563, 1490094, 1590272, 1600950, 1575610, 1586945, 1775405, 1746310, 1794247, 1755487, 1697321, 1733539, 1871089, 1961421, 1940837, 1944474, 1988083, 1894742, 1989734, 2030265, 1975614, 1966595, 1995032, 2192264, 2237617, 2294150, 2318734, 2263622, 2337104, 2378044, 2394720, 2461845, 2509607, 2529750, 2601643, 2732928, 2820810, 2834425, 2673584, 2667025, 2769511, 2825952, 2866426, 2956586, 3151215, 3213476, 3114466, 3202473, 3226806, 3376095, 3465507, 3578572, 3664684]
6158C664684J9733O9516J08998J50448K4380R6947M9212Q2739N950Q8903J00506
6147D462016M7009K12626n714R2263J55993O5531R5812J37613J51842J26076J15376
6136E656443J76630J79380J26540P9315P8742R4849J89904J21831J60647K08224
6126G072505O7098K00845K23792J02670K02293K40580K44889Q4254Q3619L10369
6116H832914K58286K44499L73585K53024J83264L24122M11135L27041L26209K85452
6106A1819531L71403L71451L59335L92468L83872M72663M51198M88428O02148
6097A5712497M95897N41886N64188N95369N78001O77304P69648P34627N89610
6088B1259027Q40565R88911Q39893R57184R88912J129433J096761J116860J265142
$$ y = [3664684, 3684417, 3753933, 3862931, 4013379, 4037759, 4134706, 4183918, 4266657, 4272607, 4361510, 4462016, 4509025, 4721651, 4715937, 4808200, 4964193, 5029724, 5125536, 5263149, 5414991, 5541067, 5656443, 5833073, 6012453, 6138993, 6218308, 6297050, 6391899, 6581803, 6703634, 6864281, 7072505, 7139603, 7340448, 7564240, 7666910, 7869203, 8109783, 8354672, 8438926, 8522545, 8832914, 9091200, 9335699, 9709284, 9962308, 10145572, 10469694, 10880829, 11207870, 11534079, 11819531, 12190934, 12562385, 12921720, 13314188, 13698060, 14170723, 14621921, 15110349, 15712497, 16208394, 16750280, 17314468, 17909837, 18487838, 19165142, 19934790, 20669417, 21259027, 22099592, 23088503, 23928396, 24885580, 25874492, 27003925, 28100686, 29217546, 30482688]
6079C0482688J380307J421956J563368J625381J749387J785002J979188K151960
6071D4139237K386358K514403K581164K777758K859201K955217K938836K900177
6063F6052351K858387K669850K137623J787564J095017M28869j60942r17721j395381
6054G4555617k098633k471481k732579l002985l101198l040653l087928k983084
6046E2037076k856903k745777k577451k289797k198175j976059j925815j863774
6038C3603325j718246j532767j428627j365096j321193j168141j154488j079542
6030B2835225j029155q71723r69269p60586p02266q11945o89149p18936p28067
6021A5554129o73258m72757m41212n25367n66139m51778l65281l74027m48095
$$ y = [30482688, 31862995, 33284951, 34848319, 36473700, 38223087, 40008089, 41987277, 44139237, 46525595, 49039998, 51621162, 54398920, 57258121, 60213338, 63152174, 66052351, 68910738, 71580588, 73718211, 75505775, 76600792, 77029661, 76868719, 75950998, 74555617, 72456984, 69985503, 67252924, 64249939, 61148741, 58108088, 55020160, 52037076, 49180173, 46434396, 43856945, 41567148, 39368973, 37392914, 35467099, 33603325, 31885079, 30352312, 28923685, 27558589, 26237396, 25069255, 23914767, 22835225, 21806070, 20934347, 19965078, 19204492, 18502226, 17690281, 17001132, 16282196, 15554129, 14880871, 14408114, 13966902, 13441535, 12875396, 12423618, 12058337, 11684310, 11236215]
6012A1236215m02193k93675k50066l56875l06343k82023k15937k97678k69563
6003H561862k47346k49060k18345k88668k61539j27509j75222j67363j98001k02219
5993F426590k44705j41194j89094j66447p2660j12516k20662j56754j40185j65856
5983D816517j18p3817k12402j16887j670r6201j18505j06153k06266n2314j25491
5972C706693j59888M4714l0038j33544l8482p0121o4675K867j6557j34978l2577
5961C073414m4783j36802m2855p4989j15709L2655R4598l887j9694j22632j29034
5950B510282n3660q1970k2341M7998j43273r0650P8337o3386m4439l9706j05073
5939A992119o9005J7238O5386n5254j24438n15m8413p9730L7794J810l3159n640
$$ y = [11236215, 10834022, 10540347, 10290281, 9933406, 9627063, 9345040, 9129103, 8831425, 8561862, 8314516, 8065456, 7847111, 7558443, 7296904, 7169395, 6994173, 6826810, 6628809, 6426590, 6181885, 6040691, 5851597, 5685150, 5612490, 5499974, 5279312, 5122558, 4982373, 4816517, 4816399, 4742582, 4530180, 4413293, 4411623, 4315422, 4196917, 4090764, 3884498, 3832184, 3706693, 3546805, 3591519, 3561481, 3427937, 3389455, 3319334, 3254659, 3257526, 3240969, 3105991, 3073414, 3028631, 2891829, 2848974, 2773985, 2658276, 2690931, 2785529, 2781642, 2761948, 2639316, 2510282, 2456622, 2374652, 2352311, 2400309, 2257036, 2166386, 2244723, 2181337, 2136898, 2097192, 1992119, 1923114, 1940352, 2005738, 1950484, 1826046, 1825531, 1777118, 1697388, 1735182, 1736992, 1703833, 1698193]
5927A698193n7409k5447L1945l996m8411L1031j5241q4985l5492j3547o1158p1697
5915A343786L3223r2001o9042M7768J9401l5394M46N1905o5125r1591J20276k6925
5903A236727j09833L473N0936l4481o6369J14981l1114p8916P6174J0102p4706
5892A096974p1447j8996R938K8519q5684k4960O6014Q9291r9218o3589K6772j6774
5880I36840J9397M6290j40668O2374J5633j22953l4764j2513M6810J282K5261
5869H42989n1382q1498K5076L9780o6937K0680O3044M2784p670j26739n0273J95
5857F50049Q8045O5549n2183l954j0925j0569m8868J1048p2236j6947l4378J02375
5845F67006n1237l1374L665M687L1888l0496L4003L3011m0669j634q2798K0401
$$ y = [1698193, 1640784, 1615337, 1647282, 1643286, 1594875, 1625906, 1610665, 1525680, 1490188, 1476641, 1415483, 1343786, 1377009, 1285008, 1215966, 1263734, 1283135, 1247741, 1248187, 1300092, 1234967, 1143376, 1263652, 1236727, 1126894, 1130367, 1181303, 1146822, 1080453, 1195434, 1164320, 1085404, 1161578, 1171680, 1096974, 1025527, 1006531, 1016469, 1044988, 959304, 934344, 1000358, 1089649, 990431, 926842, 953614, 936840, 956237, 1002527, 861859, 924233, 939866, 816913, 782149, 769636, 816446, 817728, 842989, 791607, 710109, 735185, 774965, 708028, 728708, 791752, 834536, 826866, 700127, 649854, 650049, 738094, 803643, 751460, 747506, 736581, 726012, 677144, 688192, 615956, 599009, 564631, 667006, 615769, 584395, 588060, 592747, 624635, 594139, 628142, 661153, 620484, 618850, 536052, 556453]
5833E56453O3445K9691N6556q2811o6545L3061j3684P1875J10371l342j18392
$$ y = [556453, 619898, 649589, 706145, 623334, 556789, 589850, 576166, 648041, 758412, 755070, 636678]
$$ [...]
##END NTUPLES=NMR SPECTRUM
##END=
