##TITLE=1H_CA-9236-1
 DMSO-d6
 8 sc, 
 6.2.2024
##JCAMPDX= 6.0         $$ Bruker NMR JCAMP-DX V2.0
##DATA TYPE= NMR SPECTRUM
##DATA CLASS= NTUPLES
##ORIGIN= UXNMR, Bruker Analytische Messtechnik GmbH
##OWNER= root
$$ XWIN-NMR		Version 3.5
$$ Tue Feb  6 14:03:14 2024 Russian Standard Time (UT+4h)  she@DPX200
##.OBSERVE FREQUENCY= 200.1313
##.OBSERVE NUCLEUS= ^1H
##.ACQUISITION MODE= SIMULTANEOUS
##.ACQUISITION SCHEME= undefined
##.AVERAGES= 8
##.DIGITISER RES= 18
##SPECTROMETER/DATA SYSTEM= spect
##.PULSE SEQUENCE= zg30
##.SOLVENT NAME= DMSO
##.SHIFT REFERENCE= (INTERNAL, DMSO, 0, 15.4902)
##AUDIT TRAIL= $$ (NUMBER, WHEN, WHO, WHERE, WHAT)
$$ ##TITLE= Audit trail, XWIN-NMR		Version 3.5
$$ ##JCAMPDX= 5.01
$$ ##ORIGIN= Bruker BioSpin GmbH
$$ ##OWNER= she
$$ F:/spectra/data/she/nmr/H-F/1/pdata/1/auditp.txt
$$ ##AUDIT TRAIL=  $$ (NUMBER, WHEN, WHO, WHERE, WHAT)
(   1,<2024-02-06 14:02:02.14 +0400>,<she>,<DPX200>,
      <created by zg, POWCHK disabled, PULCHK disabled
       configuration hash MD5:
       00 E9 B6 7A A2 85 ED C7 34 08 36 98 17 FE 4E 26
       data hash MD5: 16K
       D7 99 49 E2 A4 95 FC 3A DF 98 D2 B8 84 18 FA 4E>)
(   2,<2024-02-06 14:02:04.54 +0400>,<she>,<DPX200>,
      <Start of raw data processing
       efp BC_mod = 2 LB = 0.24 FT_mod = 6 PKNL = 1 PHC0 = -24591.9 PHC1 = 7.852679 SI = 16K 
       data hash MD5: 16K
       F2 90 D6 E8 A9 CA 13 F4 DB 7F 57 2D 4E B6 1D 76>)
(   3,<2024-02-06 14:02:22.14 +0400>,<she>,<DPX200>,
      <pk PHC0 = -3.832215 PHC1 = 0 
       data hash MD5: 16K
       7F B5 BE F3 C2 B1 9C 39 F0 48 BA 2C 04 A9 5A 0C>)
(   4,<2024-02-06 14:02:25.15 +0400>,<she>,<DPX200>,
      <abs ABSG = 5 
       data hash MD5: 16K
       AF 4D 56 B6 4E 6B A2 CE 5A 9F 76 91 1A D3 FC 52>)
$$ ##END=
$$ 
$$ hash MD5
$$ 32 A9 64 7D 0D BF 31 F5 08 8F A6 7E FA BD A3 66
##$RELAX= 
##$RELAX= 
##$RELAX= 
##$RELAX= 
##$RELAX= 
##$RELAX= 
$$ Bruker specific parameters
$$ --------------------------
##$DU= <F:/spectra>
##$EXPNO= 1
##$NAME= <H-F>
##$PROCNO= 1
##$TYPE= <nmr>
##$USER= <she>
##$AMP= (0..31)
100 100 100 100 100 100 100 100 100 100 100 100 100 100 100 100 100 100 
100 100 100 100 100 100 100 100 100 100 100 100 100 100 
##$AQSEQ= 0
##$AQ_mod= 1
##$AUNM= <au_zg>
##$AUTOPOS= <>
##$BF1= 200.13
##$BF2= 200.13
##$BF3= 200.13
##$BF4= 200.13
##$BF5= 200.13
##$BF6= 200.13
##$BF7= 200.13
##$BF8= 200.13
##$BYTORDA= 1
##$CFDGTYP= 0
##$CFRGTYP= 5
##$CHEMSTR= <none>
##$CNST= (0..31)
1 1 145 1 1 1 1 1 1 1 1 1 1 1 1 1 1 1 1 1 1 1 1 1 1 1 1 1 1 1 1 1 
##$CPDPRG= <>
##$CPDPRG1= <>
##$CPDPRG2= <>
##$CPDPRG3= <>
##$CPDPRG4= <mlev>
##$CPDPRG5= <mlev>
##$CPDPRG6= <mlev>
##$CPDPRG7= <mlev>
##$CPDPRG8= <mlev>
##$CPDPRGB= <>
##$CPDPRGT= <>
##$D= (0..31)
0 1.2 0 0 0 0 0 0 0 0.06 0 0.03 0 0 0 0 0.0002 0 0 0 0 0 0 0 0 0 0 0 0 
0 0 0 
##$DATE= 1707213721
##$DBL= (0..7)
120 120 120 120 120 120 120 120 
##$DBP= (0..7)
150 150 150 150 150 150 150 150 
##$DBP07= 0
##$DBPNAM0= <>
##$DBPNAM1= <>
##$DBPNAM2= <>
##$DBPNAM3= <>
##$DBPNAM4= <>
##$DBPNAM5= <>
$$ [...]
##$SUBNAM3= <"">
##$SUBNAM4= <"">
##$SUBNAM5= <"">
##$SUBNAM6= <"">
##$SUBNAM7= <"">
##$SUBNAM8= <"">
##$SUBNAM9= <"">
##$SW= 18.0517328524113
##$SWIBOX= (0..15)
0 0 2 0 0 0 0 0 0 0 0 0 0 0 0 0 
##$SW_h= 3612.71676300578
##$TD= 16384
##$TD0= 1
##$TE= 0
##$TE2= 300
##$TE3= 300
##$TEG= 300
##$TL= (0..7)
0 120 120 120 120 120 120 120 
##$TP= (0..7)
150 150 150 150 150 150 150 150 
##$TP07= 0
##$TPNAME0= <>
##$TPNAME1= <>
##$TPNAME2= <>
##$TPNAME3= <>
##$TPNAME4= <>
##$TPNAME5= <>
##$TPNAME6= <>
##$TPNAME7= <>
##$TPOAL= (0..7)
0.5 0.5 0.5 0.5 0.5 0.5 0.5 0.5 
##$TPOFFS= (0..7)
0 0 0 0 0 0 0 0 
##$TUNHIN= 0
##$TUNHOUT= 0
##$TUNXOUT= 0
##$USERA1= <user>
##$USERA2= <user>
##$USERA3= <user>
##$USERA4= <user>
##$USERA5= <user>
##$V9= 5
##$VALIST= <valist>
##$VCLIST= <CCCCCCCCCCCCCCC>
##$VD= 0
##$VDLIST= <DDDDDDDDDDDDDDD>
##$VPLIST= <PPPPPPPPPPPPPPP>
##$VTLIST= <TTTTTTTTTTTTTTT>
##$WBST= 1024
##$WBSW= 4
##$XGAIN= (0..3)
0 0 0 0 
##$XL= 0
##$YL= 0
##$YMAX_a= 366604
##$YMIN_a= -456330
##$ZGOPTNS= <>
##$ZL1= 120
##$ZL2= 120
##$ZL3= 120
##$ZL4= 120
##$ABSF1= 15.47254
##$ABSF2= -2.579309
##$ABSG= 5
##$ABSL= 3
##$ALPHA= 0
##$AQORDER= 0
##$ASSFAC= 0
##$ASSFACI= 0
##$ASSFACX= 0
##$ASSWID= 0
##$AUNMP= <proc_1d>
##$AZFE= 0.1
##$AZFW= 0.1
##$BCFW= 0
##$BC_mod= 2
##$BYTORDP= 0
##$COROFFS= 0
##$CY= -3
##$DATMOD= 1
##$DC= 0
##$DFILT= <>
##$DTYPP= 0
##$F1P= 0
##$F2P= 0
##$FCOR= 1
##$FTSIZE= 16384
##$FT_mod= 6
##$GAMMA= 0
##$GB= 0
##$INTBC= 1
##$INTSCL= 3.70164e-10
##$ISEN= 128
##$LB= 0.24
##$LEV0= 0
##$LPBIN= 0
##$MAXI= 10000
##$MC2= 0
##$MEAN= 0
##$ME_mod= 0
##$MI= 1.114404
##$NCOEF= 0
##$NC_proc= -6
##$NLEV= 6
##$NOISF1= 3.799351
##$NOISF2= 2.8
##$NSP= 0
##$NTH_PI= 0
##$NZP= 0
##$OFFSET= 15.49017
##$PC= 1
##$PHC0= -24595.73
##$PHC1= 7.852679
##$PH_mod= 1
##$PKNL= yes
##$PPARMOD= 0
##$PSCAL= 0
##$PSIGN= 0
##$REVERSE= no
##$SF= 200.130006310787
##$SI= 16384
##$SIGF1= 3
##$SIGF2= 2
##$SINO= 5.538805
##$SIOLD= 16384
##$SREGLST= <1H.CDCl3>
##$SSB= 0
##$STSI= 16384
##$STSR= 0
##$SW_p= 3612.71676300578
##$SYMM= 0
##$S_DEV= 0
##$TDeff= 16384
##$TDoff= 0
##$TI= <>
##$TILT= no
##$TM1= 0
##$TM2= 0
##$TOPLEV= 0
##$USERP1= <user>
##$USERP2= <user>
##$USERP3= <user>
##$USERP4= <user>
##$USERP5= <user>
##$WDW= 1
##$XDIM= 16384
##$YMAX_p= 274290724
##$YMIN_p= -372014
$$ End of Bruker specific parameters
$$ ---------------------------------
##NTUPLES= NMR SPECTRUM
##VAR_NAME=  FREQUENCY,     SPECTRUM/REAL,   SPECTRUM/IMAG
##SYMBOL=    X,             R,               I
##VAR_TYPE=  INDEPENDENT,   DEPENDENT,       DEPENDENT
##VAR_FORM=  AFFN,          ASDF,            ASDF
##VAR_DIM=   16384,         16384,           16384
##UNITS=     HZ,            ARBITRARY UNITS, ARBITRARY UNITS
##FACTOR=    0.220516191357247, 1,           1
##FIRST=     3100.04772482273, 0,            0
##LAST=      -512.669038183054, 0,           0
##MIN=       -512.669038183054, -372014,     0
##MAX=       3100.04772482273, 274290724,    0
$$ Real data points
##PAGE= N=1
##DATA TABLE= (X++(R..R)), XYDATA
$$ [...]
12313E75352N4456Q981p3982q4304J23301q3790n511J9309l5524k1267l1600L542
$$ 575352 629808 638789 564807 480503 603804 520014 514503 533812 498288 477021 445421 448963
12301D48963N7840K3761j4408p4610O1451r903j12496N0282k8310p390r4361M4229
$$ 448963 506803 530564 516156 441546 502997 493094 380598 430880 402570 395180 300819 345048
12289C45048O6292j8356K970L5521k0378l3116Q9222o9561L4885j2962R972J7710
$$ 345048 411340 392984 395954 431475 411097 377981 467203 397642 432527 419565 429537 447247
12277D47247n2866j8783J20324q1887m4141O8100l2678J2734Q5492k8367L2813
$$ 447247 394381 375598 495922 414035 369894 437994 405316 418050 503542 475175 507988
12266E07988n6705J0089m9776j32318J14133L7021j03202R57N3426O4758q8028
$$ 507988 451283 461372 411596 279278 393411 430432 327230 328187 381613 446371 358343
12255C58343J8356N4509p8649l8638J28231J6524j37728P9574P7962p9029l868
$$ 358343 376699 431208 352559 313921 442152 458676 320948 400522 478484 399455 395587
12244C95587m7704k7211k7714l370L8000K8905o1950l2708J4427K8340Q595r084
$$ 395587 347883 320672 292958 289588 327588 356493 294543 261835 276262 304602 313197 304113
12232C04113N7659o5072L8642j22264k9313p491P7963P405n5693j29929N9981
$$ 304113 361772 296700 335342 213078 183765 176274 254237 261642 205949 76020 136001
12221A36001J29465L758n503O4704r4827J7779j097K4840p7811N5560R497q1509
$$ 136001 265466 269224 263721 328425 233598 251377 250280 275120 197309 252869 262366 180857
12209A80857j13801O2121K0387m8282k1462N7837o872O7380l4922L1100K9549
$$ 180857 67056 129177 149564 101282 79820 137657 130785 198165 163243 194343 223892
12198B23892l1066M6831r0798N0862J1475J0367k6454r0307K5639n063N8623K8366
$$ 223892 192826 239657 148859 199721 211196 221563 195109 104802 130441 125378 184001 212367
12186B12367N390o7813j16409q000P7645J35301K0307q0468o1586R8254L8146
$$ 212367 217757 149944 33535 25535 103180 238481 258788 178320 116734 214988 253134
12175B53134p4822j02705N9843J0885L3988q7584j05627N4944O7232n4270L6343
$$ 253134 178312 75607 135450 146335 180323 92739 -12888 42056 109288 55018 91361
12164I1361K2347n4248R0176Q7396o4656j230K0704l1954j19159o5362N0860n20
$$ 91361 113708 59460 149636 237032 172376 171146 191850 159896 40737 -24625 26235 25715
12152B5715L5339p485k7874j2058M9117J47127L019n0736j7463O3476q3392p7745
$$ 25715 61054 53569 25695 13637 62754 209881 212900 162164 144701 208177 124785 47040
12140D7040O7773O5961N443l0790m1710n599j2843L9620L6090O9524j10445L689
$$ 47040 114813 180774 186217 155427 113717 108118 95275 134895 170985 240509 130064 133753
12128A33753P4592R14j15074Q3625m1365m8075P3165J2528O19k2319J8J25925
$$ 133753 208345 209259 94185 177810 136445 88370 161535 174063 174682 152363 152381 278306
12116B78306J9600j35497p3257L4642O4069O4239O237p5384K7397l2530p9617
$$ 278306 297906 162409 89152 123794 187863 252102 258339 182955 210352 177822 98205
12105I8205J93J08466M5204q477j31907L9217p1520L6969l7971N5703p5762m6430
$$ 98205 98398 206864 252068 243591 111684 150901 79381 116350 78379 134082 58320 11890
12093A1890P5449N2863o994N7284j10027j21793P2890n8890r647j2320O0127J60146
$$ 11890 87339 140202 133208 190492 80465 -41328 31562 -27328 -36975 -49295 10832 170978
12081A70978L7735k6446q180m7968k6456L5705j7467r2764L0247j9388J16970
$$ 170978 208713 182267 174087 126119 99663 135368 117901 25137 55384 35996 152966
12070A52966l3545p8428n6325r206R07J7376K4614L4465R2270m167p3815q785
$$ 152966 119421 40993 -15332 -24538 -23631 -6255 18359 52824 145094 140927 67112 58327
12058E8327M615l7050n5391Q9200J5470n8659k7414K2129N6055K7j7796j8638
$$ 58327 62942 25892 -29499 59701 75171 16512 -10902 11227 67282 67309 49513 30875
12046C0875n8891K3865J7600N2919P9949L438n8436R9708k6449J3990p9539k3771
$$ 30875 -28016 -4151 13449 66368 146317 149755 91319 191027 164578 178568 99029 75258
12034G5258N0010j9061j22838K528J27631l4703L5090o6401P5391q2495j15748
$$ 75258 125268 106207 -16631 -14103 113528 78825 113915 47514 122905 40410 -75338
12023g5338M6523j8047N3324R3099j06324J4987P1206m3494j9003K2802k2519
$$ -75338 -28815 -46862 6462 99561 -6763 8224 79430 35936 16933 39735 17216
12012A7216l8907K9610J38329Q139o7847k9582J6283K2125j5481j23979K6086
$$ 17216 -21691 7919 146248 154387 86540 56958 73241 95366 79885 -44094 -18008
12001a8008M88l4193j7229O0595j0881P3717P1731j11682o0661K835l0186j5747
$$ -18008 -17520 -51713 -68942 -8347 -19228 54489 126220 14538 -46123 -43288 -73474 -89221
11989h9221m5144N3354J4154N1466N0963K7099m1730j5518J40305q0060r2396
$$ -89221 -134365 -81011 -66857 -15391 35572 62671 20941 5423 145728 65668 -26728
11978b6728N818L4858R3693j3772q0268n7279j4603J09817j7689l5971R0022L9641
$$ -26728 -20910 13948 107641 93869 13601 -43678 -58281 51536 33847 -2124 87898 127539
11966A27539n7268l675o644o9977R5461k4346j38773L2312n136l031N3586L9732
$$ 127539 70271 66596 59952 -10025 85436 61090 -77683 -45371 -50507 -53538 48 39780
11954C9780J7904J8772l7098j16580J30786l8078J5256j7603n9312R68Q4629P7058
$$ 39780 57684 76456 39358 -77222 53564 15486 30742 13139 -46173 -45205 39424 116482
11942A16482l5859k9355n0363p121L4307K4660k9391R2846r1347N9848j54121
$$ 116482 80623 51268 905 -6216 28091 52751 23360 116206 24859 84707 -69414
11931f9414L4125J12580N5229O825j09393m8641k3146N7852l5872J4648l5254
$$ -69414 -35289 77291 132520 139345 29952 -18689 -41835 16017 -19855 -5207 -40461
11920d0461m2659P3437Q7510m6912J480K6421l2133p6555l5183L826M6370Q0320
$$ -40461 -83120 -9683 77827 30915 32395 58816 26683 -49872 -85055 -81229 -34859 45461
11908D5461m4359o0186P3462m2956r6472J06947J0978p769L9823J7754r3318j53858
$$ 45461 1102 -59084 14378 -28578 -125050 -18103 -7125 -14894 24929 42683 -50635 -204493
11896b04493P2180N49J6915J63281k5895n2807n0765R1279J7177P1504q5336J407
$$ -204493 -132313 -131764 -114849 48432 22537 -30270 -81035 10244 27421 98925 13589 14996
11884A4996N1357k3444p2475m9550k8488O0990L6445M0587J5826p0847J11469
$$ 14996 66353 42909 -29566 -79116 -107604 -46614 -10169 30418 46244 -24603 86866
11873H6866r8544l3285J07137l1519q3460j6961M5049j22934O1995O7816m6136
$$ 86866 -11678 -44963 62174 30655 -52805 -69766 -24717 -147651 -85656 -17840 -63976
11862f3976N7909l7794l0033k5591Q2013L6141l9160j03017j1n5892L4855R8228
$$ -63976 -6067 -43861 -73894 -99485 -17472 18669 -20491 -123508 -123519 -179411 -144556 -46328
11850d6328K7138o8348k1490M5148J5505P2113J390k4711M2526m7336M8002L2110
$$ -46328 -19190 -87538 -109028 -63880 -48375 23738 25128 417 42943 -4393 43609 75719
11838G5719K381n4349r2355N1248p3278J5234k6505O4672k5702r2856m162Q5165
$$ 75719 78100 23751 -68604 -17356 -90634 -75400 -101905 -37233 -62935 -155791 -159953 -74788
11826g4788P9170O7941m9550r5761m3137Q1801N4108m0515j3370l4117m0519m1569
$$ -74788 4382 72323 22773 -72988 -116125 -34324 19784 -20731 -34101 -68218 -108737 -150306
11814a50306R326L7444P5152N484J11970r4212o5667N0817K0818l6551J9751N106
$$ -150306 -140980 -103536 -28384 -22900 89070 -5142 -70809 -19992 826 -35725 -15974 -10868
11802a0868p1843P756K3708j3327q001N2076N0909q8698j05933Q3802K1152k9268
$$ -10868 -82711 -74955 -51247 -64574 -72575 -20499 30410 -58288 -164221 -80419 -59267 -88535
11790h8535R4359q981l2068m02Q9676p4686O1939J8778j27789K4339k7848q2391
$$ -88535 5824 -3157 -35225 -35627 54049 -20637 41302 60080 -67709 -43370 -71218 -153609
11778a53609P8177M7265N1161L8654j0145J14n4081k8954j13378K3724k7282l2401
$$ -153609 -75432 -28167 22994 61648 51503 51617 -2464 -31418 -144796 -121072 -148354 -180755
11766a80755Q9320J78427p9473r9328J1392P3761L1525R0001p002j34851P931
$$ -180755 -91435 86992 7519 -91809 -80417 -6656 24869 114870 107868 -26983 -19052
11755a9052N3586n7260m3562m2234r8716J24706k715j4414p2528R4071k4332O1023
$$ -19052 34534 -22726 -66288 -108522 -207238 -82532 -85247 -99661 -172189 -78118 -102450 -41427
11743d1427N9698q6934j114o8086L6940K8113m7957O9265m6780K8867P5087P041
$$ -41427 18271 -68663 -69777 -137863 -100923 -72810 -120767 -51502 -98282 -69415 5672 12713
11731A2713k1897k6034l9021j6068n6561J03559N68r5922o111O081J09379O1430
$$ 12713 -9184 -35218 -74239 -90307 -146868 -43309 -42741 -138663 -144774 -138693 -29314 32116
11719C2116j4410k8603q762j23632M458R1956K1340l5482N5064Q262j624O6374
$$ 32116 17706 -10897 -19659 -143291 -138833 -46877 -25537 -61019 -5955 2307 683 67057
11707F7057m6205r9534P7078k787q7921m8135J46751k3008J5076l706p3233K214
$$ 67057 20852 -78682 -1604 -4391 -92312 -140447 6304 -16704 -1628 -5334 -78567 -76353
11695g6353P1744p906l968O7218N5382n0326q8230o5001P0140J44746K0091o2398
$$ -76353 -4609 -12515 -16483 50735 106117 55791 -32439 -97440 -27300 117446 137537 75139
11683G5139L8551j6238j39832M6071j8843r3728O6050l0726j6796k6376k4008
$$ 75139 113690 97452 -42380 3691 -15152 -108880 -42830 -73556 -90352 -116728 -140736
11672a40736J02345J8801j3856J9560m4423N9972O9278p6484n1262j4410m1512
$$ -140736 -38391 -19590 -33446 -13886 -58309 1663 70941 -5543 -56805 -71215 -112727
11661a12727o4585j4363N9492J50258N679M2527N1224p5889Q6257L1865j08154
$$ -112727 -177312 -191675 -132183 18075 23754 66281 117505 41616 127873 159738 51584
11650E1584l2993n5476j38067p515P4084L2594L2088j5997K0289K3106m2235M3388
$$ 51584 18591 -36885 -174952 -182467 -108383 -75789 -43701 -59698 -39409 -16303 -58538 -15150
11638a5150O3517j422m7568N1113J2902n6074L0032r693j6824m1537K012K653
$$ -15150 48367 46945 -623 50490 63392 7318 37350 27657 10833 -30704 -28692 -26039
11626b6039k9736o1044M5217J09633k1570M6103J24737q9364p4293O7205k1163
$$ -26039 -55775 -116819 -71602 38031 16461 62564 187301 97937 23644 90849 69686
11615F9686j16011q6856J35690J2440n5782J8626p4371O8447M9616l8216o0242
$$ 69686 -46325 -133181 2509 14949 -40833 -22207 -96578 -28131 21485 -16731 -76973
11604g6973l1972k2313J04911k7709n9798P4540J6561o6203M592j8735J05491
$$ -76973 -108945 -131258 -26347 -54056 -113854 -39314 -22753 -88956 -84364 -103099 2392
11593B392R576o4043J05778j1331o463j09526l587j7699J0734O077O5711k8047
$$ 2392 11968 -52075 53703 42372 35909 -73617 -77204 -94903 -84169 -78092 -12381 -40428
11581d0428j0538L2395p5079L2510M6824L6718N7908K2779p6354n9314m1985j0652
$$ -40428 -50966 -18571 -93650 -61140 -14316 22402 80310 103089 26735 -32579 -74564 -85216
11569h5216M9436O785J2792j7594n4526N3906q48j11099k3494J14041j377J07944
$$ -85216 -35780 -28995 -16203 -33797 -88323 -34417 -35265 -146364 -169858 -55817 -57194 50750
11557E0750o1416p3506p7176L2144J40181O9158j37417N4258J6675j0061j49P025
$$ 50750 -10666 -84172 -161348 -129204 10977 80135 -57282 -3024 13651 3590 3441 10466
11545A0466Q8825p7398m3041j7419J2131N9757n4866l7315j5244M9105K9178m4607
$$ 10466 99291 21893 -21148 -38567 -26436 33321 -21545 -58860 -74104 -24999 4179 -40428
11533d0428M4636j5020M4555j4970m8619R0120m4166o8272J8449k0288m9008r17
$$ -40428 4208 -10812 33743 18773 -29846 60274 16108 -52164 -33715 -54003 -103011 -103928
11521a03928O1933L8754m8049O3269N2244j52722O1937J7668j3144p2992Q1872
$$ -103928 -41995 -3241 -51290 11979 64223 -88499 -26562 -8894 -22038 -95030 -13158
11510a3158q183J10659j4143K8236N2804o8415j03443l9442J4905N6302K3576
$$ -13158 -21341 89318 75175 103411 156215 87800 -15643 -55085 -40180 16122 39698
11499C9698j03238R2403M4791N5034j46348K8384J5814l8403p5807N8215J31437
$$ 39698 -63540 28863 73654 128688 -17660 10724 26538 -11865 -87672 -29457 101980
11488A01980k0315q1659n0057Q7760r9131P1931k7680J1788j8416n2878o7194
$$ 101980 81665 6 -50051 37709 -61422 10509 -17171 -5383 -23799 -76677 -143871
11477a43871M1049k8318J13652J7140K5963K0540n7866J3691j05405L1547J10930
$$ -143871 -102822 -131140 -17488 -348 25615 46155 -11711 1980 -103425 -71878 39052
11466C9052l6980r6486P1218L2731p5333q0790L2960L3228J62437q0213j8579
$$ 39052 2072 -94414 -23196 9535 -65798 -146588 -113628 -80400 82037 1824 -16755
11455a6755J0248Q245j1631j4948l6580k989M0925m380J1953J42L7550m706j8364
$$ -16755 -6507 1738 -9893 -24841 -61421 -64410 -23485 -27865 -15912 -15770 21780 17074 -1290
11442a290m2624n1586l5651K4875R593J42963k9526o4408J086O2178m0385o6901
$$ -1290 -43914 -95500 -131151 -106276 -96683 46280 16754 -47654 -46568 15610 -24775 -91676
11430i1676J12443J7703m3164r4918m325O4140j2929q4551N8331P7197Q113m631
$$ -91676 20767 38470 -4694 -99612 -103937 -39797 -52726 -137277 -78946 -1749 6364 1733
11418A733q893q6399l1859M5565K7692j5809M3568J1421p8166N2861o019j35534
$$ 1733 -7160 -93559 -125418 -79853 -52161 -67970 -24402 -12981 -91147 -38286 -44305 -179839
11406a79839n2864L3474Q1869Q2267K8663L9677k1678J9309m0747o056P7555j39315
$$ -179839 -232703 -199229 -117360 -35093 -6430 33247 11569 30878 -9869 -15925 61630 -77685
11394g7685R2323p600l3315j55990M5035R8986o7744L8284L8492K0213m4003O5779
$$ -77685 14638 7038 -26277 -182267 -137232 -38246 -105990 -67706 -29214 -9001 -53004 12775
11382A2775P83R5582j11293o1532O7662J1152L0748k9566k3761Q9629q0821j2485
$$ 12775 13558 109140 -2153 -63685 3977 15129 45877 16311 -7450 82179 1358 -11127
11370a1127k7666j5184L4421j1086m2713N4363O9125j4210m1937k1716M6376j52833
$$ -11127 -38793 -53977 -19556 -30642 -73355 -18992 50133 35923 -6014 -27730 18646 -134187
11358a34187O6035J29129J7211n7555n4702J593k7091j5332N4795R6967j27492
$$ -134187 -68152 60977 78188 20633 -34069 -32476 -59567 -74899 -20104 76863 -50629
11347e0629K7035K6030j26486J04588O3603j29210R004m9763Q876j8266o691R6071
$$ -50629 -23594 2436 -124050 -19462 44141 -85069 -76065 -125828 -116952 -135218 -141909 -45838
11335d5838N4869L9122n6560o7274P659K7077j7504M7611M3022k8115j03911J27992
$$ -45838 9031 48153 -8407 -75681 -68022 -40945 -58449 -10838 32184 4069 -99842 28150
11323B8150O1988k8819n2359n3053K338J04636j24553R061m0581p7057N7418R2442
$$ 28150 90138 61319 8960 -44093 -41755 62881 -61672 -52611 -93192 -170249 -112831 -20389
11311b0389l0455K7515N4641N9744j360K1726j10391n5650L6017m7480J3584L4647
$$ -20389 -50844 -23329 31312 91056 89696 111422 1031 -54619 -18602 -66082 -52498 -17851
11299a7851K5564M0378n1273j13654L6465O0844K6818m1286K2553J3359J127N6548
$$ -17851 7713 48091 -3182 -116836 -80371 -19527 7291 -33995 -11442 1917 3044 59592
11287E9592J8775j02222J1061m1929o7506L3365L3807l5473Q9003K6866L4253
$$ 59592 78367 -23855 -12794 -54723 -122229 -88864 -55057 -90530 -1527 25339 59592
11276E9592k8729j31844l3796P2346n8572J35182P4072o2586o2992K8010k4695
$$ 59592 30863 -100981 -134777 -62431 -121003 14179 88251 25665 -37327 -9317 -34012
11265c4012M3885k6771N5155L4376m6273n9213n309n5897K3003K5754p0009O2102
$$ -34012 9873 -16898 38257 72633 26360 -32853 -38162 -94059 -71056 -45302 -115311 -53209
11253e3209k0088L4590o639p4592l6055R0153p178j8895P8094L8949l6857M9120
$$ -53209 -73297 -38707 -45346 -119938 -155993 -65840 -73018 -91913 -13819 25130 -11727 37393
11241C7393N8444j19204j815q1621r698Q0191K6720k7829j2420J5666K0539K6468
$$ 37393 95837 -23367 -25182 -106803 -116501 -36310 -9590 -37419 -49839 -34173 -13634 12834
11229A2834j17777k3950Q3287K3632N3443n8581p0836k385N497n9870o9658J26430
$$ 12834 -104943 -128893 -45606 -21974 31469 -27112 -97948 -100333 -94836 -154706 -224364 -97934
11217i7934Q2621M5177J0580j04031o7445J12187J9131m5412j6528M4536J292
$$ -97934 -15313 29864 40444 -63587 -131032 -18845 286 -45126 -61654 -17118 -15826
11206a5826r2008m1687l5975J14839J7371j3096P2740m3735k2542J8344L2846
$$ -15826 -107834 -149521 -185496 -70657 -53286 -66382 6358 -37377 -59919 -41575 -8729
11195h729p7035p0072K4310J317p0397m2497P8027N9277P3007P7246r9741n0154
$$ -8729 -85764 -155836 -131526 -130209 -200606 -243103 -165076 -105799 -32792 44454 -55287 -105441
11183a05441J5235Q8145m9806M8069k2744J7521o1862L5686k0185q3051r9J62297
$$ -105441 -90206 -2061 -51867 -3798 -26542 -9021 -70883 -35197 -55382 -138433 -138532 23765
11171B3765o6246j00730n3840J28772K7601r4883P9853K0068j3082o95k1169K1442
$$ 23765 -42481 -143211 -197051 -68279 -40678 -135561 -55708 -35640 -48722 -49417 -70586 -49144
11159d9144J0636J6738L1689k4550R1588p3431j22925M7417J12214j5360k1353
$$ -49144 -38508 -21770 9919 -14631 76957 3526 -119399 -71982 40232 24872 3519
11148C519N4516n6809j04013J39413n2377N131l5942N7457k8646m1269p252O573
$$ 3519 58035 1226 -102787 36626 -15751 -10620 -46562 10895 -17751 -59020 -66272 -59699
11136e9699P5706k4763n3876J422K719m7138K1351q1119K534J0518O1831M5600
$$ -59699 16007 -8756 -62632 -61210 -58491 -105629 -84278 -165397 -162863 -152345 -90514 -44914
11124d4914J3176m3378m3856M1121J50O3365j2350r1831K9309K9182k114J62993
$$ -44914 -31738 -75116 -118972 -77851 -77701 -14336 -26686 -118517 -89208 -60026 -62140 100853
11112A00853j37251o8475Q2109P8954O9000n8587p4738O6710k5759m0216o5279
$$ 100853 -36398 -104873 -22764 56190 125190 66603 -8135 58575 32816 -7400 -72679
11101g2679O845O8783k0476r7869n3694m7942K1583J77825l1026j48019J02658
$$ -72679 -65834 2949 -17527 -115396 -169090 -217032 -195449 -17624 -48650 -196669 -94011
11090i4011J61451K2915r3398q536k4129K7464O7645o932l9860j25l5665o0150
$$ -94011 67440 90355 -3043 -11579 -35708 -8244 59401 52469 12609 12484 -23181 -83331
11078h3331o4123J39665L6117L6179k2441k7461J6915m1466O7693o3825l9629
$$ -83331 -147454 -7789 28328 64507 42066 14605 31520 -9946 57747 -6078 -45707
11067d5707K0268N3029K8855j03303K372Q9533p6034J2254Q4829l0569q4838J28522
$$ -45707 -25439 27590 56445 -46858 -44486 45047 -30987 -18733 66096 35527 -49311 79211
11055G9211k5840k5867j5226L1723k3769n8747j804N4466j110j0714m4033Q6506
$$ 79211 53371 27504 12278 44001 20232 -38515 -40319 14147 13037 2323 -41710 44796
11043D4796j08607K1202J51885o3782p829N6866q7269M1028l0857j12869j7773
$$ 44796 -63811 -42609 109276 45494 37665 94531 7262 48290 17433 -95436 -113209
11032a13209J12186j8241m1549R5599K8900p3251n3734L5289M419j6803N4861
$$ -113209 -1023 -19264 -60813 34786 63686 -9565 -63299 -28010 -23591 -40394 14467
11021A4467R832K185P177p2196l4708O0827m3997o0494K5141J5125o8633J18407
$$ 14467 24299 26484 33661 -38535 -73243 -12416 -56413 -116907 -91766 -76641 -145274 -26867
11009b6867l347Q8364O6921k8356m6815m8477k6068j8537Q5397q893p3562q918
$$ -26867 -30214 58150 125071 96715 49900 1423 -24645 -43182 42215 33322 -40240 -49158
10997d9158K5413j07433K4867l6458R8830K1487P4938j00408J21728n1614j03209
$$ -49158 -23745 -131178 -106311 -142769 -43939 -22452 52486 -47922 73806 22192 -81017
10986h1017R2570k3618q2854J4935m9625J06741L073Q7390K5532J4574k0739j42561
$$ -81017 11553 -12065 -94919 -79984 -129609 -22868 -19795 67595 93127 107701 86962 -55599
10974e5599Q677O4480m1822L9795r4155O634O2829n9574L9974J3328J37305Q8347
$$ -55599 -46922 17558 -24264 15531 -78624 -71990 -9161 -68735 -28761 -15433 121872 210219
10962B10219k9111Q730l1964r4524p079m7050j00854K9778k1405K5674j7097p1513
$$ 210219 181108 189838 157874 63350 56271 9221 -91633 -61855 -83260 -57586 -74683 -146196
10950a46196P2451N6911N620L3653J00973k7970k4945p8200M8833o909l9189L3008
$$ -146196 -73745 -16834 -11214 22439 123412 95442 70497 -7703 41130 34221 -4968 28040
10938B8040J03205j38933n6109P571J329m031J30226n3903o1525L4563M8449j0416
$$ 28040 131245 -7688 -63797 -56226 -54897 -58928 71298 17395 -44130 -9567 38882 28466
10926B8466n9936n2610P4576J1014j902L349K9994L5449q8726q955m7066P4792
$$ 28466 -31470 -84080 -9504 1510 -392 2957 32951 68400 -20326 -29281 -76347 -1555
10914a555L8943j0143J12082L6245n3617j11570n4266O3682p2937K8937O1943
$$ -1555 37388 27245 139327 175572 121955 10385 -43881 19801 -53136 -24199 37744
10903C7744M0149N941m4562J4966l3683M2486l9314r997P9314K445r3620o7100
$$ 37744 77893 83834 39272 54238 20555 63041 23727 13730 93044 95489 1869 -65231
10891f5231M045P7482K7632o5774O083o5026M0434L1932J22114Q014p5625k5822
$$ -65231 -61186 16296 43928 -21846 -15763 -80789 -40355 -8423 113691 121705 46080 20258
10879B0258J23990J6829j02260m6016Q525R258k4156l7992M5067J627j9162J9655
$$ 20258 144248 161077 58817 12801 21326 30584 6428 -31564 13503 15130 -4032 15623
10867A5623j23703L8723j6521J0400N9595p8562O950q418N2271N5240K3729j05655
$$ 15623 -108080 -69357 -85878 -75478 -15883 -94445 -87495 -95913 -43642 11598 35327 -70328
10855g0328p6557J4419N9007L1689j36319J01048N0740J08823j8560L8031j41213
$$ -70328 -146885 -132466 -73459 -41770 -178089 -77041 -26301 82522 63962 101993 -39220
10844c9220P15O3226o9570N1805j2721J37J2779J35990j34932j8055M190k6209
$$ -39220 -38505 24721 -44849 6956 -5765 -5628 7151 143141 8209 -9846 -5656 -31865
10832c1865J5039Q0363L1412k3180r5783K6129N6250K9331N5505j08142m3432
$$ -31865 -16826 63537 94949 71769 -24014 2115 58365 87696 143201 35059 -8373
10821h373k1458m309R7389M0039j7945j6727j01687N4056J31468o8175j67827
$$ -8373 -29831 -34140 63249 103288 85343 68616 -33071 20985 152453 84278 -83549
10810h3549M0644O4055O64j6298N9748K8483j108K7569k5704m7778k8298j26246
$$ -83549 -42905 21150 21814 5516 65264 93747 92639 120208 94504 46726 18428 -107818
10798a07818J4R5089j1222o0711O5961O6339q9863J35177J6078J370j00912K8998
$$ -107818 -107804 -12715 -23937 -84648 -18687 47652 -42211 92966 109044 110414 9502 38500
10786C8500n1351p7644P268n447P0896N32M753j51744N4689R1046r317N376k4372
$$ 38500 -12851 -90495 -83227 -88674 -17778 -17246 -12493 -164237 -109548 -18502 -27819 -22443 -46815
10773d6815P806P1059k4956p6297J14667L7120j30986l4501l0308O7307O6731
$$ -46815 -39009 32050 7094 -69203 45464 82584 -48402 -82903 -113211 -45904 20827
10762B0827k4766L6690M4219J4020O4393l5235j5401q585j19879M4222M5353N2150
$$ 20827 -3939 32751 76970 90990 155383 120148 104747 96162 -23717 20505 65858 118008
10750A18008K4746r7316p1613J097L7944O0718j2313k9581K1267j6576M4621m5970
$$ 118008 142754 45438 -26175 -25078 12866 73584 61271 31690 52957 36381 81002 35032
10738C5032k9333k170M0045m2149r0941j0123J0732J20448K8311n9150M5922P924
$$ 35032 5699 3529 43574 1425 -89516 -99639 -88907 31541 59852 702 46624 54548
10726E4548n4096M8951M675J33M9875m1348K4037k7823q6142K0710J16633Q4661
$$ 54548 452 49403 54078 54211 104086 62738 86775 58952 -27190 -6480 110153 194814
10714A94814o4814j02723J7365k247m7717Q3395n5979L337k2628J1656J10209
$$ 194814 130000 27277 44642 42395 -5322 78073 22094 25431 2803 14459 124668
10703A24668m7153p8251p6760M5748Q7578p214K5233J1425m4213j04804R5689
$$ 124668 77515 -736 -77496 -31748 55830 48616 73849 85274 41061 -63743 31946
10692C1946O5579O882M6828j3084j06390O0352r8253L8404Q3564r5158l8955j03206
$$ 31946 97525 104407 151235 138151 31761 92113 -6140 32264 115828 20670 -18285 -121491
10680a21491M1348R8363L3611N3271K5578K1020L4011j49124n071R2194Q575j03147
$$ -121491 -80143 18220 51831 105102 130680 151700 185711 36587 31516 123710 132285 29138
10668B9138r2284Q2245M6662p7727N3413j1547R400K1542Q881l2244J2481o2373
$$ 29138 -63146 19099 65761 -11966 41447 29900 39300 60842 69723 37479 49960 -12413
10656a2413l0221P5400k2264r2085L6654j2810K0598j199L7674N89L5685n9333
$$ -12413 -42634 32766 10502 -81583 -44929 -57739 -37141 -38340 -666 -77 35608 -23725
10644b3725j16J6886m1126M9730K4394n9262P7026P8747r9717R597o4820n7700
$$ -23725 -23841 -6955 -48081 1649 26043 -33219 43807 122554 22837 32434 -32386 -90086
10632i0086K2880J11604J2357Q171j1496l282j9394P0545m0107n8484M5150L6883
$$ -90086 -67206 44398 56755 64926 53430 50148 30754 101299 61192 2708 47858 84741
10620H4741j22439K2066r8247l493k8610k2411M4059J40339R0554m6338M4544
$$ 84741 -37698 -15632 -113879 -117372 -145982 -168393 -124334 16005 106559 60221 104765
10609A04765L1195m282r0002k9785M913l7143o9731K9453O7493L483L0758J15620
$$ 104765 135960 131678 41676 11891 16804 -20339 -90070 -60617 6876 10359 41117 156737
10597A56737n3943k2104L3179K4046j60655q8389n3540j5598L5580J00583L2064
$$ 156737 102794 80690 113869 137915 -22740 -111129 -164669 -180267 -144687 -44104 -12040
10586a2040q963N9620o2376Q6095N7037N4181m881k6515p4724J139l628j3587
$$ -12040 -21003 38617 -23759 62336 119373 173554 168673 142158 67434 68573 64945 51358
10574E1358N1764p212k2239p2775p531k7796J48432n1633K07K5187N126N6242
$$ 51358 103122 95910 73671 896 -6635 -34431 114001 62368 62575 87762 92888 149130
10562A49130K9179K9794O440j6636J2715n7998k9681j2571p8279J03466L3083
$$ 149130 178309 208103 214543 197907 210622 152624 122943 110372 32093 135559 168642
10551A68642j7108J8043r232O8703l9397n5354p5n5502M9530K9192m3289M3093
$$ 168642 151534 169577 160345 229048 189651 134297 134222 78720 128250 157442 114153 157246
10539A57246l0333M2121q1170L8656p8422p2382J62001M0873J08733p5163j4317
$$ 157246 126913 169034 87864 126520 48098 -24284 137717 178590 287323 212160 197843
10528A97843o3080M0209j6353m0454J12091p9199J1856P1986O0986r0243j11303
$$ 197843 134763 174972 158619 118165 230256 151057 162913 234899 295885 205642 94339
10517I4339J5224Q700R4527K0377l373k2770l4373n5496K5411K6880L3448l7629
$$ 94339 109563 118263 212790 233167 229794 207024 172651 117155 142566 169446 202894 165265
10505A65265J623J2528j2434k1778N056k9108Q216J3612K0478j18439k9228J01548
$$ 165265 166888 179416 166982 145204 150260 121152 129368 142980 163458 45019 15791 117339
10493A17339p195j09906Q963K9040l0246Q0168M2651J4691J7344k3147n2581n1691
$$ 117339 110144 238 9201 38241 7995 88163 130814 145505 162849 139702 87121 35430
10481C5430m222N3045l5704N3985R063K7543P067m3566O6664j8522R4451O119
$$ 35430 31208 84253 48549 102534 111597 139140 146207 102641 169305 150783 245234 251353
10469B51353j2411L3563o3031l1489L6720l6527o0406q98R9045N0540M009j26831
$$ 251353 238942 272505 209474 177985 214705 178178 117772 116874 215919 266459 270468 143637
10457A43637m8388L7213o710N3384M2585N3333J0239p1777k587R4199J8036j5107
$$ 143637 95249 132462 125752 179136 221721 275054 285293 213516 210929 305128 323164 308057
10445C08057n6981J8592j12839R0539J04450n4908R3098R42l0641q155j6431k0786
$$ 308057 251076 269668 156829 247368 351818 296910 390008 390950 360309 352154 335723 314937
10433C14937J6855J20556j06662J425M3609M0459M1346k7111R012p739K7016N184
$$ 314937 331792 452348 345686 347111 390720 431179 472525 445414 454426 446687 473703 478887
10421D78887l192J4254k2675m4982n236k370J9395J43428p2449n456M9493j0073
$$ 478887 475695 489949 467274 422292 417056 414686 434081 577509 505060 499604 549097 539024
10409E39024O1382K9804n1869p6m712O3595N314j62690l3763r415K7198n3111
$$ 539024 600406 630210 578341 578265 573553 637148 642462 479772 446009 436594 463792 410681
10397D10681P159P117O1298J50387k7713p0820o1137L5553J1595P6676n4629N6106
$$ 410681 417840 424957 486255 636642 608929 538109 476972 512525 524120 600796 546167 602273
10385F02273M9695k1181K729j8846M5542j4967m4943l8419J00946L5788Q1549
$$ 602273 651968 630787 633516 614670 660212 645245 600302 561883 662829 698617 780166
10374G80166J10443n2222K0563K6589P556O8925O0084k2811J5547o6385P1851
$$ 780166 890609 838387 858950 885539 893095 962020 1022104 999293 1014840 948455 1020306
10363A020306J71120j25935j8530J69038J10778J1317K2173J09099J47367j3926
$$ 1020306 1191426 1065491 1046961 1215999 1326777 1338094 1360267 1469366 1616733 1602807
10353A602807Q6381L2012J74949K09963R3344N5742J07296J84157L52021L79845
$$ 1602807 1689188 1721200 1896149 2106112 2199456 2255198 2362494 2546651 2898672 3278517
10343C278517L28400K93172L27637K78724J38973J01900P9730O6109j24160K4405
$$ 3278517 3606917 3900089 4227726 4506450 4645423 4747323 4827053 4893162 4769002 4793407
10333D793407P4488K2792o5409j84725j52250k53529k84317l30749k85883k93935
$$ 4793407 4867895 4890687 4825278 4640553 4488303 4234774 3950457 3619708 3333825 3039890
10323C039890l87869j29509j67809k70625j64072o377o4036k04618q4530j2202
$$ 3039890 2652021 2522512 2354703 2084078 1920006 1913629 1849593 1644975 1560445 1548243
10313A548243o1387P2799J4697p3812p7204j35720M3797m0416m4647M5873M1505
$$ 1548243 1486856 1559655 1574352 1500540 1423336 1287616 1331413 1290997 1246350 1292223 1333728
10302A333728n0917j65632p1562m1363m2699J9402k2668J4923m8017P4628J8885
$$ 1333728 1282811 1117179 1045617 1004254 961555 980957 958289 973212 925195 999823 1018708
10291A018708m3227k0884j21010j03344J4193J0945q806q197J2728r133r2780
$$ 1018708 975481 954597 833587 730243 744436 755381 746575 738378 751106 741973 649193
10280F49193j5492L445O6901J1128o1702O22r324j6610j0613M5312L5180L0666
$$ 649193 633701 637146 704047 715175 653473 654095 644771 628161 617548 662860 698040 728706
10268G28706j11989M0601l8151k7082L8423K1438n725O1388j5171n1026j1408
$$ 728706 616717 657318 619167 592085 630508 651946 646221 707609 692438 641412 630004
10257F30004j8575j4256m8040q7908n056J793o3622O7875N3935n7794n5504N756
$$ 630004 611429 597173 549133 461225 456169 457962 394340 462215 516150 458356 402852 408608
10245D08608k6157M0551n7617m946j10793L7927Q2840l0154j7297L8137L3857
$$ 408608 382451 423002 365385 360439 249646 287573 370413 340259 322962 361099 394956
10234C94956J01615O671m6093n2672O8920j54471L3916M8471n8702n3249K1098
$$ 394956 496571 503242 457149 404477 473397 318926 352842 401313 342611 289362 310460
10223C10460L8137j7892L2006O3080r7559q8679M2877J20921R304j57259N9237
$$ 310460 348597 330705 362711 425791 328232 239553 282430 403351 412655 255396 314633
10212C14633j7599O0256o710k969m9536j1108m5711N8875J6230M598N8073N1821
$$ 314633 297034 357290 350580 347611 298075 286967 241256 300131 316361 320959 379032 430853
10200D30853m1770J0953L4943l6013M3103l4378j2608J0064J14769J9132j34160
$$ 430853 389083 400036 434979 398966 442069 407691 395083 405147 519916 539048 404888
10189D04888L8028J27295q3883n6506J0328N9163M1567m0063o4687q399P874p2885
$$ 404888 442916 570211 486328 429822 440150 499313 540880 500817 436130 427731 435605 362720
10177C62720M7970J10110j9102o3453p1954r800k0170J5186j6139m7279M6008
$$ 362720 410690 520800 501698 438245 366291 356491 336321 351507 335368 288089 334097
10166C34097O7790L6490o0266N8414J20529j03539p4050j17914N6418Q7289M9378
$$ 334097 401887 438377 378111 436525 557054 453515 379465 261551 317969 405258 454636
10155D54636j01951J147M870N9992J39538l8283j00967n4318L7609j12M0493j20392
$$ 454636 352685 353832 358702 418694 558232 519949 418982 364664 402273 402161 442654 322262
10143C22262N5720L1955m9635J16787P8078l1999k0251J08127l1149o8502L2139
$$ 322262 377982 409937 360302 477089 555167 523168 502917 611044 579895 511393 543532
10132E43532j1258n2611j7502N0158j434N0621P8541O307j37576P3967l9280M5962
$$ 543532 532274 479663 462161 512319 510885 561506 640047 646354 508778 582745 543465 589427
10120E89427O4832j0041k5269J8816k8220O5830j4297N723P0651m0638M994N0607
$$ 589427 654259 644218 618949 637765 609545 675375 661078 666801 737452 696814 701808 752415
10108G52415m3318J24350N378p3141J26713J5153K495p5682J3911n2437J20298
$$ 752415 709097 833447 838825 765684 892397 907550 910045 834363 848274 795837 916135
10097I16135L9839r0599m5625K3875J0172j152J44968J1246M6512J58360q2214
$$ 916135 955974 865375 819750 843625 853797 852645 997613 1008859 1055371 1213731 1131517
10086A131517p0407Q0058J01043O5004r131J409J71133J30885J9503J06270Q7715
$$ 1131517 1061110 1141168 1242211 1307215 1298084 1299493 1470626 1601511 1621014 1727284 1814999
10075A814999K16893L3044k8966L9126N1558N6730J10620N7505J81424M9990q3725
$$ 1814999 2031892 2064936 2035970 2075096 2126654 2183384 2294004 2351509 2532933 2582923 2499198
10064B499198M0504M4292J24675P7222o464l422N2283J33696J72289K41758J79501
$$ 2499198 2539702 2583994 2708669 2785891 2779427 2776005 2828288 2961984 3134273 3376031 3555532
10053C555532K36827K72032J67192J67110J30613L0702K7666n1645l03561l29499
$$ 3555532 3792359 4064391 4231583 4398693 4529306 4560008 4587674 4536029 4232468 3902969
10043C902969k34468j47778j94005k56787l21484k07490j91534k3379j49624q7245
$$ 3902969 3668501 3520723 3326718 3069931 2748447 2540957 2349423 2326044 2176420 2089175
10033B089175m4662n5573r9110q8254l4408M1455m2937R9347L1519r4326r1095
$$ 2089175 2044513 1988940 1889830 1801576 1767168 1808623 1765686 1865033 1896552 1802226 1711131
10022A711131M7343N3076N7177J38937O7049r0251p4863L6502k362K9747l9430
$$ 1711131 1758474 1811550 1868727 2007664 2074713 1984462 1909599 1946101 1943739 1973486 1934056
10011A934056p267j3002l0159j78278m5571j06342n5541k05360p7754j4061N1467
$$ 1934056 1926789 1913787 1883628 1705350 1659779 1553437 1497896 1292536 1214782 1200721 1252188
10000A252188O6345p2454p1988p7139P8856k7895j15646M3527J01321R7290p7667
$$ 1252188 1318533 1246079 1174091 1096952 1175808 1147913 1032267 1075794 1177115 1274405 1196738
9989A196738j36168J02030N7813m4914q4643r02O3876j5020K8551N4280N983L6069
$$ 1196738 1060570 1162600 1220413 1175499 1090856 1089954 1153830 1138810 1167361 1221641 1227624 1263693
9977A263693k6674o6228j09723O2233k7902j377M3183m2988J754l161j2049N124
$$ 1263693 1237019 1170791 1061068 1123301 1095399 1094022 1137205 1094217 1095971 1092810 1080761 1085885
9965A085885J36165J4015M0869P227m5021J7369q6722p0959O3535R2257N3144
$$ 1085885 1222050 1236065 1276934 1284161 1239140 1256509 1169787 1098828 1162363 1254620 1307764
9954A307764l2465n3706O6437J50950Q7363n3993n1064J4269R5735J9300l1642
$$ 1307764 1275299 1221593 1288030 1438980 1526343 1472350 1421286 1435555 1531290 1550590 1518948
9943A518948n6110m2225O2702J5589K7083n5597o547L3347K9074r0073o0660N9655
$$ 1518948 1462838 1420613 1483315 1498904 1525987 1470390 1463843 1497190 1526264 1436191 1375531 1435186
9931A435186k4257L3383j8761k9004J29367J17003j38363p8808K4387p0040J59838
$$ 1435186 1410929 1444312 1425551 1396547 1525914 1642917 1504554 1425746 1450133 1380093 1539931
9920A539931O0284j3568J2868K1785P9619K0920j578R807k5426n3458J02303L1379
$$ 1539931 1600215 1586647 1599515 1621300 1700919 1721839 1720261 1730068 1704642 1651184 1753487 1784866
9908A784866L1485N865M0759Q3061J1235p1852N6035K8482R0499j3624Q4557J37304
$$ 1784866 1816351 1822216 1862975 1946036 1957271 1885419 1941454 1969936 2060435 2046811 2131368 2268672
9896B268672j0871L2895N9916P433J29232Q2583L7865Q7485J37734J34847J67031
$$ 2268672 2257801 2290696 2350612 2358045 2487277 2569860 2607725 2695210 2832944 2967791 3134822
9885C134822K25525J92837K45096P9565O0851P3518M1874k3877k89522j93143
$$ 3134822 3360347 3553184 3798280 3877845 3938696 4012214 4054088 4030211 3740689 3547546
9875C547546Q1424q8726M9175M4474n2533K07116J56299N458K26158J42311K10686
$$ 3547546 3628970 3540244 3589419 3633893 3581360 3788476 3944775 3950233 4176391 4318702 4529388
9864D529388K18701J75426J73711K17465K53472K30706J62306L2274l1372M3482
$$ 4529388 4748089 4923515 5097226 5314691 5568163 5798869 5961175 5993449 5962077 6005559
9854F005559j47368l0511o5571n5875j20197k30227j47865j53991j31274j74530
$$ 6005559 5858191 5827680 5762109 5706234 5586037 5355810 5207945 5053954 4922680 4748150
9844D748150j47987k6680k1448L6600M9725k3894L7091J00604n1704j6486L9064
$$ 4748150 4600163 4573483 4552035 4588635 4638360 4614466 4651557 4752161 4700457 4683971 4723035
9833D723035J4350j9970o3301J06561J47167p1260j36266j7295o792k8124k8570
$$ 4723035 4737385 4717415 4654114 4760675 4907842 4836582 4700316 4683021 4676229 4648105 4619535
9822D619535Q8418M3198q522j2971P4766l2734J5026J52572M0319q3868M4820
$$ 4619535 4707953 4751151 4742629 4729658 4804424 4771690 4786716 4939288 4979607 4895739 4940559
9811D940559J12571J25339J74194K03883J65562K28506J27279J16298J95688L60159
$$ 4940559 5053130 5178469 5352663 5556546 5722108 5950614 6077893 6194191 6389879 6750038
9801F750038J87103J50705J84134K29082K52356J38901L11547K96665J44436L36903
$$ 6750038 6937141 7087846 7271980 7501062 7753418 7892319 8203866 8500531 8644967 8981870
9791H981870K65772L18005K42828J50724R8210J7465J08186P7145M6528J0735
$$ 8981870 9247642 9565647 9808475 9959199 10057409 10074874 10183060 10260205 10306733 10317468
9781A0317468o4014j6450m3618p7796J5686l2366P3774k815J19838R49J43722
$$ 10317468 10253454 10237004 10193386 10115590 10131276 10098910 10172684 10169869 10289707 10290656 10434378
9770A0434378J93140K45816J73140J90065K98662L76324K44235J89675L08403
$$ 10434378 10627518 10873334 11046474 11236539 11535201 11911525 12155760 12345435 12653838
9761A2653838K96179L70168L52218L85469M50559N04150M01235N10744M72898
$$ 12653838 12950017 13320185 13672403 14057872 14508431 15012581 15413816 15924560 16397458
9752A6397458L31687M41589L31961K48288K57319J60961J45579K17506K63691
$$ 16397458 16729145 17170734 17502695 17750983 18008302 18169263 18314842 18532348 18796039
9743A8796039K19049K90453J91097L56350M00127N05812L76667N35275N56207
$$ 18796039 19015088 19305541 19496638 19852988 20253115 20758927 21135594 21670869 22227076
9734B2227076N69925O92504O51329P95498P39155P74282P67343Q41399Q32478
$$ 22227076 22797001 23489505 24140834 24936332 25675487 26449769 27217112 28058511 28890989
9725B8890989R25901R79482R67255J013255R76135J140752J258945J195519J321347
$$ 28890989 29816890 30796372 31763627 32776882 33753017 34893769 36152714 37348233 38669580
9716C8669580J367174J529524J732185J824291J911060K134820K285746K550060
$$ 38669580 40036754 41566278 43298463 45122754 47033814 49168634 51454380 54004440
9708E4004440K920842L269665L817144M359320N004848N843588O792392Q058830
$$ 54004440 56925282 60194947 64012091 68371411 73376259 79219847 86012239 94071069
9700I4071069R517944J0793084J1968749J2758835J2873330J2269350J0734225
$$ 94071069 103589013 114382097 126350846 139109681 151983011 164252361 174986586
9693A74986586Q689775O024379K897412k78656l305742o070557q571977j0374152
$$ 174986586 183676361 189700740 192598152 192319496 189013754 182943197 174371220 163997068
9685A63997068j1558306j1828370j1399918j0289724q694457p161581n549568
$$ 163997068 152438762 140610392 129210474 118920750 110226293 103064712 97515144
9678I7515144m168784l158429k126119j288244p31862m2882P27708J338185K127497
$$ 97515144 93346360 90187931 88061812 86773568 86041706 85998824 86726532 88064717 90192214
9669I0192214K997466L881515N026773O481173Q214049R744979J1078267J2129333
$$ 90192214 93189680 97071195 102097968 108579141 116793190 126538169 137616436 149745769
9661A49745769J2554164J2012195J0694521Q474848N665605K443478r23251m272064
$$ 149745769 162299933 174312128 185006649 193481497 199147102 201590580 200667329 196395265
9653A96395265p611665j0106569j2353190j3682167j4211863j4160212j3143780
$$ 196395265 188783600 178677031 166323841 152641674 138429811 124269599 111125819
9646A11125819j1807339j0072537q498045p164616n848329m967708m345940l767557
$$ 111125819 99318480 89245943 80747898 73583282 67734953 62767245 58421305 54653748
9638E4653748l184345k866696k514393k330926k186253k074973j945778j786602
$$ 54653748 51469403 48602707 46088314 43757388 41571135 39496162 37550384 35763782
9630C5763782j563971j533412j354833j198486j227980j043406j020388r29980
$$ 35763782 34199811 32666399 31311566 30113080 28885100 27841694 26821306 25891326
9622B5891326q87647p65563p85319p53617p96034p15365p26089p02696o27238
$$ 25891326 25003679 24238116 23452797 22699180 21903146 21187781 20461692 19758996 19131758
9613A9131758n90132n42855m77475l97698l85692m19619l01786k24450m24461
$$ 19131758 18541626 17998771 17521296 17123598 16737906 16318287 16016501 15792051 15367590
9604A5367590l89656l60049m74188l70215n49296l97739l24037m94629l77574
$$ 15367590 14977934 14617885 14143697 13773482 13224186 12826447 12502410 12007781 11630207
9595A1630207k53230k07232m01835k98795j77822k33701l32432k45405k99255
$$ 11630207 11376977 11169745 10767910 10469115 10291293 10057592 9725160 9479755 9180500
9586I180500k58835j19028j09805j36501l50456j95652j28239k13230k50745n8811
$$ 9180500 8921665 8802637 8692832 8556331 8205875 8010223 7881984 7668754 7418009 7359198
9576G359198j16653j21540q4587j91975k34931j80558o1148j25728k05104q9194
$$ 7359198 7242545 7121005 7036418 6844443 6609512 6428954 6367806 6242078 6036974 5947780
9566E947780j04314p4743r1444p7525j47340p5848j59736j9444R719o8419m7968
$$ 5947780 5843466 5768723 5677279 5599754 5452414 5376566 5216830 5197386 5207105 5138686 5090718
9555E090718j19414j76037r8115L3124J1462j9170o6146J3224q8374n6790Q0766
$$ 5090718 4971304 4795267 4697152 4730276 4741738 4722568 4656422 4669646 4581272 4524482 4605248
9544D605248J27511P9243N5591q5867j4720M3207J36248N7011J43985O1663l0964
$$ 4605248 4732759 4812002 4867593 4781726 4767006 4810213 4946461 5003472 5147457 5209120 5178156
9533E178156k0747j1764J54242o030K2465n3954n637j3211j7165j02860k44095
$$ 5178156 5157409 5145645 5299887 5293857 5316322 5262368 5256731 5243520 5226355 5123495 4879400
9522D879400q8524m5127j59302j11247q4055l7401p2612m4726k3424n3291Q6791
$$ 4879400 4790876 4745749 4586447 4475200 4391145 4353744 4281132 4236406 4212982 4159691 4246482
9511D246482M3005J38631J375R4567J67148R2918J38666K23725R0428Q6299J11313
$$ 4246482 4289487 4428118 4429493 4524060 4691208 4784126 4922792 5146517 5236945 5323244 5434557
9500E434557J54121J43163K31296O6640R9857Q9992J89589J99205K12918J35805
$$ 5434557 5588678 5731841 5963137 6029777 6129634 6219626 6409215 6608420 6821338 6957143
9490F957143J14806J34111Q8217n3989M5279o138j13059j80962j48839j52443
$$ 6957143 7071949 7206060 7294277 7240288 7285567 7279429 7166370 6985408 6836569 6684126
9480F684126j26108j53809q4367j08349j45802j13686N6248l0210J005M8497P731
$$ 6684126 6558018 6404209 6319842 6211493 6065691 5952005 6008253 5978043 5979048 6027545 6035276
9469F035276L59R243O7616p0217R9268Q4835q3502Q9664K17562P9010L2568L2591
$$ 6035276 6035635 6044878 6112494 6042277 6141545 6226380 6142878 6232542 6450104 6529114 6561682 6594273
9457F594273O90J15014M6206O0831K70017K30937L67778K45997L11060L18587
$$ 6594273 6594963 6709977 6756183 6817014 7087031 7317968 7685746 7931743 8242803 8561390
9447H561390K35660J10469J01634o5131j99095l73164k41811k31362k20000k15709
$$ 8561390 8797050 8907519 9009153 8944022 8744927 8371763 8129952 7898590 7678590 7462881
9437G462881r4443j19368n9304j99445q365m5162n8779m8795j08168p9420l6176
$$ 7462881 7368438 7249070 7189766 6990321 6981956 6936794 6878015 6829220 6721052 6641632 6605456
9426F605456j04476j72567j35253n7961j09816k6645m5731m3901J01226O9398
$$ 6605456 6500980 6328413 6193160 6135199 6025383 5998738 5953007 5909106 6010332 6079730
9416F079730J26032J77991J84788J16982J60769J05522J18808J10536J49814L5936
$$ 6079730 6205762 6383753 6568541 6685523 6846292 6951814 7070622 7181158 7330972 7366908
9406G366908N5019R5552N3436k7581j30589Q9325J12464M7012j3818j22406j51193
$$ 7366908 7421927 7517479 7570915 7543334 7412745 7502070 7614534 7661546 7647728 7525322 7374129
9395G374129j87413k01150k36252j52248j02435j88952j74551k36083j50838n8807
$$ 7374129 7186716 6985566 6749314 6597066 6494631 6305679 6131128 5895045 5744207 5685400
9385E685400j09010j33577n0581k4693j06841j00490l711J0434J3227j9308O841
$$ 5685400 5576390 5442813 5392232 5367539 5260698 5160208 5156497 5166931 5180158 5160850 5167691
9374E167691K3590R6025m914N3798Q2772O0599k0017J7753J62484O0561R6540
$$ 5167691 5191281 5287306 5282392 5336190 5418962 5479561 5459544 5477297 5639781 5700342 5796882
9363E796882L1580l7318J11245N0380J55928M7088r6644j61817j39745j07101
$$ 5796882 5828462 5791144 5902389 5952769 6108697 6155785 6059141 5897324 5757579 5650478
9353E650478o1272m0333j38868k0037j22451p2729j47430k2182J01301p1836j01765
$$ 5650478 5589206 5548873 5410005 5389968 5267517 5194788 5047358 5025176 5126477 5054641 4952876
9342D952876J5807m5969j09987O384N5668j0148O7116p1822K3329O4592J22204
$$ 4952876 4968683 4922714 4812727 4819111 4874779 4864631 4931747 4859925 4883254 4947846 5070050
9331E070050L8026P3845Q6283J30381J00317M6647l2461k3499J33N7954M1418
$$ 5070050 5108076 5181921 5268204 5398585 5498902 5545549 5513088 5489589 5489722 5547676 5589094
9320E589094J12871L5198P4377k982J34956M6850P910J67293J4007k8924m2600
$$ 5589094 5701965 5737163 5811540 5808558 5943514 5990364 5998274 6165567 6179574 6150650 6108050
9309F108050P8013J48711J7800k4061Q3897P6656J48548J45353P2647K28076J92256
$$ 6108050 6186063 6334774 6352574 6328513 6412410 6489066 6637614 6782967 6855614 7083690 7275946
9298G275946J54776J29826K10541J98954K87138J44311J15985P7539J40251N1380
$$ 7275946 7430722 7560548 7771089 7970043 8257181 8401492 8517477 8595016 8735267 8786647
9288H786647K4561J18624N3006K7117j32360p638o1937m412l7150O6237R7899
$$ 8786647 8811208 8929832 8982838 9009955 8877595 8869957 8808020 8803608 8766458 8832695 8930594
9277H930594p1384m0192J81138J33858q671J12324J40125J08807K05287K23289
$$ 8930594 8859210 8819018 9000156 9134014 9125343 9237667 9377792 9486599 9691886 9915175
9267I915175J79045K21235L12436K60123J69394K26506L36180J77916L25836K91618
$$ 9915175 10094220 10315455 10627891 10888014 11057408 11283914 11620094 11798010 12123846 12415464
9257A2415464L07447M49168L25867L25438L06412K15161J05597J46507J17683
$$ 12415464 12722911 13172079 13497946 13823384 14129796 14344957 14450554 14597061 14714744
9248A4714744j1635j255k31535k03138n0701J7810n790q0939J8678R2477K976
$$ 14714744 14703109 14701854 14470319 14267181 14216480 14234290 14228500 14147561 14166239 14258716 14261692
9237A4261692J75935J14843K41868J72433J25900N6565J78209L18084K63547L74988
$$ 14261692 14437627 14552470 14794338 14966771 15092671 15149236 15327445 15645529 15909076 16284064
9227A6284064L06480K79025L60371L66070M45917L32498M13912N69702M30751
$$ 16284064 16590544 16869569 17229940 17596010 18041927 18374425 18788337 19358039 19788790
9218A9788790L51186M97495N98527M25330N71563M18967N29731N17534N45013
$$ 19788790 20139976 20637471 21235998 21661328 22232891 22651858 23181589 23699123 24244136
9209B4244136O07026P46180P49066O54478P09798Q14300R27154P35086O67929
$$ 24244136 24851162 25597342 26346408 27000886 27710684 28524984 29452138 30187224 30855153
9200C0855153R32665R97383Q77402R15459J043543J151847J164830J341437J275587
$$ 30855153 31787818 32785201 33662603 34578062 35621605 36773452 37938282 39279719 40555306
9191D0555306J431097J487191J593969J746773J857907J990139K216126K371368
$$ 40555306 41986403 43473594 45067563 46814336 48672243 50662382 52878508 55249876
9183E5249876K573984K846436L295264L708966M373572N055559O127379P201561
$$ 55249876 57823860 60670296 63965560 67674526 72048098 77103657 83231036 90432597
9175I0432597Q499642R682318J0533886J0862024J0331631R297067P763048N598644
$$ 90432597 98932239 108614557 119148443 130010467 140342098 149639165 157402213 163000857
9167A63000857K777895j33279l067120n577451p410452q590175r202988q897908
$$ 163000857 165778752 165645473 162578353 157000902 149590450 141000275 131797287 122899379
9159A22899379q149239o651553n193135l970818k678307j690115j014755l62538
$$ 122899379 114750140 108098587 102905452 98934634 96256327 94566212 93551457 93188919
9151I3188919K10159P84481J368602J996665K557469L249941L925871M747421
$$ 93188919 93399078 94183559 95552161 97548826 100106295 103356236 107282107 112029528
9143A12029528N745706O791986Q394858J0384947J2674254J5066709J7350994
$$ 112029528 117775234 124567220 132962078 143347025 156021279 171087988 188438982
9136A88438982J8776793J8652616J7041811J4449810J0742982N804155L83575
$$ 188438982 207215775 225868391 242910202 257360012 268102994 273907149 274290724
9129B74290724n115829j0201733j4297147j7204040j9016707j9406983j8843046
$$ 274290724 269174895 258973162 244676015 227471975 208455268 189048285 170205239
9122A70205239j7243615j4701813j2238792j0108297q059927o806746n828288
$$ 170205239 152961624 138259811 126021019 115912722 107852795 101046049 95217761
9115I5217761n080860m458658m020440l587363l392979l090265k593634k189590
$$ 95217761 90136901 85678243 81657803 78070440 74677461 71587196 68993562 66803972
9107F6803972j877151j638387j360769j151571r52333p07817o55873p35021n93255
$$ 66803972 64926821 63288434 61927665 60776094 59823761 59115944 58460071 57725050 57131795
9098E7131795n86081o13237l69614k86416k40444l6916L9717J5171K04550M55504
$$ 57131795 56545714 55932477 55562863 55276447 55036003 54999087 55038804 55053975 55258525 55714029
9088E5714029N34040O65645Q27737J016015J232573J452353J681603K029055K297280
$$ 55714029 56248069 56913714 57741451 58757466 59990039 61442392 63123995 65153050 67450330
9079F7450330K945261L466024M191196N050900N878396P092987Q341534R228434
$$ 67450330 70395591 73861615 78052811 83103711 88982107 96075094 104416628 113645062
9071A13645062R508491Q884536O923841M488111K213025M72136o46894k259572
$$ 113645062 123153553 132038089 138961930 143450041 145663066 146135202 145488308 143228736
9063A43228736m600762o885113q352746q954499q082635o695742n096933l677840
$$ 143228736 138627974 131742861 123390115 114435616 106352981 99657239 94560306 90882466
9055I0882466k797063j811185r85348k52326L47498R29005J422800K213064K987088
$$ 90882466 88085403 86274218 85288870 85036544 85384042 86313047 87735847 89948911 92935999
9046I2935999L835382M968935O166188P622402R338093J0870523J2321734J2831835
$$ 92935999 96771381 101740316 107906504 115528906 124866999 135737522 148059256 160891091
9038A60891091J1878787R675705O857783M487068K559554M70023k535847n884427
$$ 160891091 172769878 182445583 189303366 193790434 196349988 196820011 194284164 188399737
9030A88399737r206446j1451403j2258700j1972002j1389772j0779037j0074450
$$ 188399737 179193291 167741888 155483188 143511186 132121414 121342377 111267927
9023A11267927r106798p766021o491648n127592m189856l458351k670013k020378
$$ 111267927 102161129 94395108 87903460 82775868 78586012 75127661 72457648 70437270
9015G0437270j678273j135085o82351m36275p5926O34436J130061J582524K355753
$$ 70437270 68758997 67623912 66941561 66505286 66429360 67063796 68193857 69776381 72132134
9006G2132134L203684M156267N111657N683056N624875M540577K760689Q87143
$$ 72132134 75335818 79492085 84603742 90286798 95911673 100452250 103212939 104100082
8998A04100082p50703j737595k688740l905978n266772o702284p641899p642976
$$ 104100082 103349379 101611784 98923044 95017066 89750294 83048010 75406111 67763135
8990F7763135o814432n727718m545163l572630l171172k501513k092070j759397
$$ 67763135 60948703 55220985 50675822 47103192 43932020 41430507 39338437 37579040
8982C7579040j619858j284859j295657j101209j003458r87969q89869q69872q49932
$$ 37579040 35959182 34674323 33378666 32277457 31273999 30286030 29396161 28526289 27676357
8973B7676357p54508o91619n65396m52388n51515n65886m84701o52053o38576
$$ 27676357 26921849 26230230 25664834 25212446 24660931 24095045 23610344 22958291 22319715
8964B2319715m76981n88875m94956m45891k69655m37164l30276l02022l09653
$$ 22319715 21842734 21253859 20758903 20313012 20043357 19606193 19275917 18973895 18664242
8955A8664242k77885j93572n1885l01583j15358o5743j30041l8546n6939o0686
$$ 18664242 18386357 18192785 18140900 17839317 17723959 17658216 17528175 17489629 17432690 17372004
8945A7372004p7998K4486p3982q0219J0225l3721j15097P307r2467j11995j10633
$$ 17372004 17294006 17318492 17244510 17164291 17174516 17140795 17025698 17033005 16940538 16828543 16717910
8934A6717910o9612j65347j08618m1743l3989j01467j4925O7952J07865J59106
$$ 16717910 16648298 16482951 16374333 16332590 16298601 16197134 16182209 16250161 16358026 16517132
8924A6517132J28995L6663N5853K76734K05432J17083J42210L23621K75284K62771
$$ 16517132 16646127 16682790 16738643 17015377 17220809 17337892 17480102 17803723 18079007 18341778
8914A8341778K70156L62756L14747K83056K92736L48631L16048K29795K15120
$$ 18341778 18611934 18974690 19289437 19572493 19865229 20213860 20529908 20759703 20974823
8905B0974823L95090J80400K17492K01112K27839J35042J43112K44486L84737
$$ 20974823 21369913 21550313 21767805 21968917 22196756 22331798 22474910 22719396 23104133
8896B3104133L19442K97432M64040L99638N32006M78679N80752O04706O16664
$$ 23104133 23423575 23721007 24185047 24584685 25116691 25595370 26176122 26780828 27397492
8887B7397492O57792O81935O62976P97817Q52743Q74161Q87042J044594J130231
$$ 27397492 28055284 28737219 29400195 30198012 31050755 31924916 32811958 33856552 34986783
8878C4986783J251618J327086J350799J350976J343525J523754J931647J931014
$$ 34986783 36238401 37565487 38916286 40267262 41610787 43134541 45066188 46997202
8870D6997202K196907K529208K823677L138756L785720M482532N370543O429369
$$ 46997202 49194109 51723317 54546994 57685750 61471470 65954002 71324545 77753914
8862G7753914P539401Q886431R884220J0276846R503859P472169M939863K643192
$$ 77753914 85293315 94179746 104063966 114340812 123844671 131316840 136256703 138899895
8854A38899895P01012r72130l063328n630887p683350q878129q954337p819361
$$ 138899895 139600907 138628777 135565449 129934562 122251212 113373083 104418746 96599385
8846I6599385o220872m569401l268608k288163j558109q02404l5040M45023Q15305
$$ 96599385 90378513 85809112 82540504 80252341 78694232 77891828 77856788 78301811 79117116
8837G9117116J330697J823816K530092L389780M252000N422489O515502Q065403
$$ 79117116 80447813 82271629 84801721 88191501 92443501 97865990 104381492 112446895
8829A12446895R837564J1394387J2611910J2851105J2279187J0958524Q790178
$$ 112446895 122284459 133678846 146290756 159141861 171421048 182379572 191169750
8822A91169750N798167K253559j360810m906571p841627j0528481j2518418j3505793
$$ 191169750 196967917 199221476 197860666 192954095 185112468 174583987 162065569 148559776
8814A48559776j3974809j3303942j1759872r537449p717939o154762m913289l926632
$$ 148559776 134584967 121281025 109521153 99983704 92265765 86111003 81197714 77271082
8806G7271082l009358k481290j810060j472616r73195n18307j91499K37988Q35028
$$ 77271082 74261724 71780434 69970374 68497758 67524563 67006256 66814757 67052745 67887773
8797F7887773J511177K331872L233417M087922M915117N454170N133673L730173
$$ 67887773 69398950 71730822 74964239 79052161 83967278 89421448 94555121 98285294
8789I8285294J944255L33050j163584k415424l952357n554542o792755p613023
$$ 98285294 100229549 100562599 99399015 96983591 93031234 87476692 80683937 73070914
8781G3070914p653885o908774n837550m761717l823954l274185k691133k186312
$$ 73070914 65417029 58508255 52670705 47908988 44085034 40810849 38119716 35933404
8773C5933404j959574j675081j526323j440366j260922j185101r53704j067171
$$ 35933404 33973830 32298749 30772426 29332060 28071138 26886037 25932333 24865162
8765B4865162r38033r47682r18540q81881q00191q24029o65967o75555o47355
$$ 24865162 23927129 22979447 22060907 21179026 20378835 19554806 18888839 18213284 17565929
8756A7565929o10988o66423o65069m80918m03568n72890m39636n10135m62815
$$ 17565929 16954941 16288518 15623449 15142531 14738963 14166073 13726437 13216302 12753487
8747A2753487l34571l64099l68471l22990k89098l52294l32138k35438k33708
$$ 12753487 12418916 12054817 11686346 11363356 11074258 10721964 10389826 10154388 9920680
8738I920680k27067k51336l02082k66094j78682k68536k06319j92386j90161j92789
$$ 9920680 9693613 9442277 9140195 8874101 8695419 8426883 8220564 8028178 7838017 7645228
8728G645228k44661m9520j48632j11862k73309k22176Q5156j26405j37185j16347
$$ 7645228 7400567 7351047 7202415 7090553 6817244 6595068 6680224 6553819 6416634 6300287
8718F300287j20015j84154p9319k8593j31847k8529k8845N7463j55911m0872n9552
$$ 6300287 6180272 5996118 5916799 5888206 5756359 5727830 5698985 5756448 5600537 5559665 5500113
8707E500113o3955j39614q2402j5078O535l1740k07910j08051j70267o4727k04219
$$ 5500113 5436158 5296544 5214142 5199064 5205599 5173859 4965949 4857898 4687631 4622904 4418685
8696D418685j3686o2516j04641j57288j44349q2610p2942k3207K430J5593j5494
$$ 4418685 4404999 4342483 4237842 4080554 3936205 3853595 3780653 3757446 3759876 3775469 3759975
8685C759975o5253n9351M0520j00064r2084N2856M3697P943m5805M8567o534m9448
$$ 3759975 3694722 3635371 3675891 3575827 3483743 3536599 3580296 3588239 3542434 3591001 3584467 3535019
8673C535019R8586P9681J00196o2338j41364l524j747o1246r2312J9227p5002
$$ 3535019 3633605 3713286 3813482 3751144 3609780 3606256 3604509 3543263 3450951 3470178 3395176
8662C395176o9522p0463j04772j62385l2237O9424j6812o4496j46655m6642j40100
$$ 3395176 3325654 3255191 3150419 2988034 2955797 3025221 3008409 2943913 2797258 2750616 2610516
8651B610516q1633n3301j3621p1537j01154Q0020m9195k444n9296r614L0192k7789
$$ 2610516 2528883 2475582 2461961 2390424 2289270 2369290 2320095 2317651 2258355 2248741 2278933 2251144
8639B251144N059K9819K6133J7164p3855k6130k8110J01440J30563j17083k00181
$$ 2251144 2256203 2286022 2312155 2329319 2255464 2229334 2201224 2302664 2433227 2316144 2115963
8628B115963k0102n8125r3677J04642m6571K4712L9786q3873o1466k983n5051
$$ 2115963 2095861 2037736 1944059 2048701 2002130 2026842 2066628 1982755 1921289 1918306 1863255
8617A863255j27126M9321n4206j33454N2501N664l8512J60417j06669j17260n3168
$$ 1863255 1736129 1785450 1731244 1597790 1650291 1655955 1617443 1777860 1671191 1553931 1500763
8606A500763j12145M7249j5216j0761M9855P8844j9661l4978l0150n8807j9500
$$ 1500763 1388618 1435867 1420651 1409890 1459745 1538589 1518928 1483950 1453800 1394993 1375493
8595A375493j12492L7304M6376K5818j6784J779M4145o2171O6223r8674O638M606
$$ 1375493 1263001 1300305 1346681 1372499 1355715 1357494 1401639 1339468 1405691 1307017 1313655 1318261
8583A318261m8030J2952r6853p6468J724O6456L5631n9927j0150L8694M3945o3425
$$ 1318261 1270231 1283183 1186330 1109862 1111586 1178042 1213673 1153746 1143596 1182290 1226235 1162810
8571A162810Q285o8213j43829P5473l2312M2723o4666n8749J9525N02P0752l8979
$$ 1162810 1171095 1102882 959053 1034526 1002214 1044937 980271 921522 941047 941549 1012301 973322
8559I73322o5248R6590k9103o3368J20959L1012M345k0048q843N9740l9962p1560
$$ 973322 908074 1004664 975561 912193 1033152 1064164 1068509 1048461 1039618 1099358 1059396 987836
8547I87836J7931m5820M7241r7224M8563Q8784m2959m187M512O8880R6925K947
$$ 987836 1005767 959947 1007188 909964 958527 1047311 1004352 1000165 1004677 1073557 1170482 1173429
8535A173429p7009j180l5243q7754R8856R048j45954l4842N6895p883p6362l3794
$$ 1173429 1096420 1095240 1059997 972243 1071099 1080147 934193 899351 956246 948363 872001 838207
8523H38207j0708j2921M175k6770M01J16929L0425j24283P7143O2204k5965K7826
$$ 838207 827499 814578 818753 791983 792384 909313 939738 815455 892598 954802 928837 956663
8511I56663q3705j4420J02133j30967n679p090O470L5301q4209M6048J18731J7755
$$ 956663 872958 858538 960671 829704 824025 816935 823405 858706 774497 820545 939276 957031
8499I57031K7509q2454L3853J28048Q3463J2117P212q1113M3986l0229j35825
$$ 957031 984540 902086 935939 1063987 1147450 1159567 1166779 1085666 1129652 1099423 963598
8488I63598k675o1198n6243J0988K9438j11311p037Q4459l7299j02700K6168N1065
$$ 963598 960923 899725 843482 854470 883908 772597 765560 850019 812720 710020 736188 787253
8476G87253O0557M962k9738q4600L3225K1162J00214K4737m9831R0036K2378O2887
$$ 787253 847810 852772 823034 738434 771659 792821 893035 917772 867941 957977 980355 1043242
8464A043242J52552J2291Q3645Q0651m1854l9560L9411p5023k4176L2152j12805
$$ 1043242 1195794 1208085 1291730 1372381 1330527 1290967 1330378 1255355 1231179 1263331 1150526
8453A150526r2942j24863p6243K7180o6944J5359n9557j3026o3608j8637L3864
$$ 1150526 1057584 932721 856478 883658 816714 832073 772516 759490 695882 677245 711109
8442G11109N6627k1134j32247m8988K641K6178L894J6818O602j6799J5598O4349
$$ 711109 767736 746602 614355 565367 568008 594186 598080 614898 621500 604701 620299 684648
8430F84648M7036p1275q7564J28041P0862p2976J2723q324K8102k84l5406m6339
$$ 684648 731684 660409 572845 700886 771748 698772 711495 703171 731273 730989 695583 649244
8418F49244o7888j12585q5522Q5751J06459m9580o883r6456o139r455n383J9945
$$ 649244 581356 468771 383249 469000 575459 525879 518996 422540 416401 406946 401563 421508
8406D21508r6934k3420J00273P2246l0420N7313m8235j17239n6067Q6175J1192
$$ 421508 324574 301154 401427 473673 443253 500566 452331 335092 279025 365200 376392
8395C76392r518m2844J3274j26857O3050j8833n8870J02928j54491Q5068L7282
$$ 376392 366874 324030 337304 210447 273497 254664 195794 298722 144231 229299 266581
8384B66581K3106r579o2084o1894J5400P8701J00687J1467j18820k6274p8782
$$ 266581 289687 280108 218024 156130 171530 250231 350918 362385 243565 217291 138509
8373A38509J3363L1966j4876J12709l1662r6766J30144M3186J5805p7083j79687
$$ 138509 151872 183838 168962 281671 250009 153243 283387 326573 342378 265295 85608
8362H5608P387M9321J00469m1650r2221l920J4392J3487M0700r554J1000l1079
$$ 85608 92995 142316 242785 201135 108914 104994 119386 132873 173573 164019 175019 143940
8350A43940j00756O3364k0412J0877K4159J00447o2833m8905J1858O6841M9155
$$ 143940 43184 106548 86136 97013 121172 221619 158786 109881 121739 188580 237735
8339B37735K6358p6510M7332o8956q0373P281J28649P4487r0966M4893m8281r1275
$$ 237735 264093 187583 234915 165959 85586 92867 221516 296003 205037 249930 201649 110374
8327A10374M8610j8606o4110l0719k7827l0896K7406K7243M6823Q949P652L6233
$$ 110374 158984 140378 76268 45549 17722 -13174 14232 41475 88298 97247 104899 141132
8315A41132K0099P3399n6037k1687L3279r0686N948P4449K4568n3203j00634J23542
$$ 141132 161231 234630 178593 156906 190185 99499 105447 179896 204464 151261 50627 174169
8303A74169l4340L5514J6942q4926n4326k1616L3975J0351j62321L1161J42940
$$ 174169 139829 175343 192285 107359 53033 31417 65392 75743 -86578 -55417 87523
8292H7523K1622m0914K297l4402n6616r588K2793J17457J953J8467l3995j2220
$$ 87523 109145 68231 70528 36126 -20490 -30078 -7285 110172 112125 130592 96597 84377
8280H4377M2217m9624q7205n2104M9699L086K9090M9970K0936J6457j6055o6691
$$ 84377 126594 76970 -10235 -62339 -12640 -9554 19536 69506 90442 106899 90844 24153
8268B4153R2845m5283j22648K8796j7442l3824Q4730J6946o5166O2525O3587M559
$$ 24153 116998 71715 -50933 -22137 -39579 -73403 11327 28273 -36893 25632 89219 93778
8256I3778j61211k4598P4337L1628l6303n4507J9013J76918n9982L171m6011r8329
$$ 93778 -67433 -92031 -17694 13934 -22369 -76876 -57863 119055 59073 62244 16233 -82096
8244h2096O811K5347P2751l5579J549L6338j9925l9919O4747M7821m127r9086
$$ -82096 -75285 -49938 22813 -12766 -11217 25121 5196 -34723 30024 77845 73718 -25368
8232b5368j35718O7631J14778j06266J07238M143r5197N115j7687L4912M4357
$$ -25368 -161086 -93455 21323 -84943 22295 26438 -68759 -63644 -81331 -46419 -2062
8221b062j6939Q7025j2377q1075l4416j2546L5434j573Q962q968J4813m7604J08736
$$ -2062 -19001 68024 55647 -25428 -59844 -72390 -36956 -38529 -29567 -38535 -23722 -71326 37410
8208C7410R3330j04494p5159M53l5183k3589o7298P1159R322n3016J11280p4834
$$ 37410 130740 26246 -48913 -48460 -83643 -107232 -174530 -103371 -94049 -147065 -35785 -110619
8196a10619r7905j9479K37250j70873N48085J44539l28560K5215n9332Q6004j48943
$$ -110619 -208524 -228003 9247 -161626 386459 530998 202438 227653 168321 254325 105382
8185A05382P0444q1031M8607r0254n4985J1880o5958N4294J32122J8548L4427
$$ 105382 175826 94795 143402 53148 -1837 10043 -55915 -1621 130501 149049 183476
8174A83476l4924j26331N5243k6620j12426P1084M8883l9212N1883l1010j0388
$$ 183476 148552 22221 77464 50844 -61582 9502 58385 19173 71056 40046 29658
8163B9658J06586l6552l8752m4585l5936n263k7925J16181M6371l7748n148O027
$$ 29658 136244 99692 60940 16355 -19581 -24844 -52769 63412 109783 72035 66887 72914
8151G2914j0305L4376l650j09425m6609N7717N1337p9457R9608J6480o2870k6805
$$ 72914 62609 96985 93335 -16090 -62699 -4982 46355 -33102 66506 82986 20116 -6689
8139f689O6070o8699o5410Q1485L6404j4481r5364j2508O828m3559J7285J22152
$$ -6689 59381 -9318 -74728 6757 43161 28680 -66684 -79192 -72364 -115923 -98638 23514
8127B3514K3008o55q9840O0647m8280p4039O2820l4472K8625J1412r5539R773
$$ 23514 46522 45867 -43973 16674 -31606 -105645 -42825 -77297 -48672 -37260 -132799 -123026
8115a23026L4064N4519M0284O1060m7144J9830L4485q4807J9594J1189n2294K5690
$$ -123026 -88962 -34443 5841 66901 19757 39587 74072 -10735 8859 20048 -32246 -6556
8103f556o0633O4698l3353q0039O0154M9332r0600R0919m5943r5961J2622o858
$$ -6556 -67189 -2491 -35844 -115883 -55729 -6397 -96997 -6078 -52021 -147982 -135360 -142218
8091a42218n818j7418O8780m8340J04599q279R0529q8104m850j2769M4768r726
$$ -142218 -148036 -165454 -96674 -145014 -40415 -48694 41835 -46269 -51119 -63888 -19120 -28846
8079b8846O0370Q0052r4843P3252J7491m2515r4312o4294M1709p543K5677p6566
$$ -28846 31524 111576 16733 89985 107476 64961 -29351 -93645 -51936 -59479 -33802 -110368
8067a10368M792K6482m9597J36318L6563n4201M3928l7406n5417N9530Q696p0798
$$ -110368 -105576 -79094 -128691 7627 44190 -10011 33917 -3489 -58906 624 9320 -61478
8055f1478m8794k3599M2978J747q711l7847J09384J2129P811l5253k4021k5647
$$ -61478 -110272 -133871 -90893 -89146 -97857 -135704 -26320 -14191 -6380 -41633 -65654 -91301
8043i1301o0926K5368J18653O0133l8227q1509K066M8420k8157L8051n1680N8897
$$ -91301 -152227 -126859 -8206 51927 13700 -67809 -65743 -17323 -45480 -7429 -59109 -212
8031b12j6214J7871k4699n1601J0147m5016j9483J25875j06510L7383J8068O1084
$$ -212 -16426 1445 -23254 -74855 -64708 -109724 -129207 -3332 -109842 -72459 -54391 6693
8019F693M9668n7803R0994k775R769o2155m8076n9907N6817M7595q0641p738o2918
$$ 6693 56361 -1442 89552 86777 96546 34391 -13685 -73592 -16775 30820 -49821 -57559 -120477
8006a20477m4215N8663J698M9101M0594j00422R7589j4492n1455N353K3048j7051
$$ -120477 -164692 -106029 -104331 -55230 -14636 -115058 -17469 -31961 -83416 -78063 -55015 -72066
7994g2066Q156m8972O8311O0398r4554n6961K955J00571j0974o5031J69405K438
$$ -72066 -63910 -112882 -44571 15827 -78727 -135688 -132733 -32162 -43136 -108167 61238 63676
7982F3676l7276j6378m6631o5951L4306R2225j69642M9160P4374L1113l2927N4490
$$ 63676 26400 10022 -36609 -102560 -68254 23971 -145671 -96511 -22137 8976 -23951 30539
7970C0539K4535n8647r9721J8939P1025k03291J12425J19334n7119j5921q0082
$$ 30539 55074 -3573 -103294 -84355 -13330 -216621 -104196 15138 -41981 -57902 -137984
7959a37984N5080l3844l9269O4426P3567P8396J8782j79607M1950O5730o7768
$$ -137984 -82904 -116748 -156017 -91591 -18024 60372 79154 -100453 -58503 7227 -60541
7948f0541M8888l7937P3041R6597j63407k1967Q5352o4279K7468n708n5494m0766
$$ -60541 -11653 -49590 23451 120048 -43359 -65326 20026 -44253 -16785 -22493 -77987 -118753
7936a18753j1259R4344r3637j6043K6673q2608q287N0277N049J57645j9786m6445
$$ -118753 -130012 -35668 -129305 -145348 -118675 -201283 -209570 -159293 -154244 3401 -16385 -62830
7924f2830p6646n1746J14539P2580j1787l7275k7608j1456m3671J6515L5418J19703
$$ -62830 -139476 -191222 -76683 -4103 -15890 -53165 -80773 -92229 -135900 -119385 -83967 35736
7912C5736n4526j06909R2250o1275O5892N8344L957q0669K9846l5553L0300J3757
$$ 35736 -18790 -125699 -33449 -94724 -28832 29512 33469 -47200 -17354 -52907 -22607 -8850
7900h850p6849K911j013J5438J1347j2968l8735j4636n6375J18471L1816j04419
$$ -8850 -85699 -82788 -83801 -68363 -57016 -69984 -108719 -123355 -179730 -61259 -29443 -133862
7888a33862P8086K6031q8089n3570N2749M1138K9741r1069N1584n36J75390k2399
$$ -133862 -55776 -29745 -117834 -171404 -118655 -77517 -47776 -138845 -87261 -87797 87593 65194
7876F5194j41712L6900j18572r2989P3002J01832l4159J5882J3307N3819k9337
$$ 65194 -76518 -39618 -158190 -251179 -178177 -76345 -110504 -94622 -81315 -27496 -56833
7865e6833J7756R5643o1610k0331m6328n1715N8948N3209L8052K2154j53496j24378
$$ -56833 -39077 56566 -5044 -25375 -71703 -123418 -64470 -11261 26791 48945 -104551 -228929
7853b28929M1661O8988k0771p3865J29428J17650j0155k1238l6394j8980J8629
$$ -228929 -187268 -118280 -139051 -212916 -83488 34162 24007 2769 -33625 -52605 -33976
7842c3976n8146J4958K0523m654p8391P6192Q1925j45577M824L4921j4834J08841
$$ -33976 -92122 -77164 -56641 -61295 -139686 -63494 18431 -127146 -122322 -87401 -102235 6606
7830F606J9158o2661l8620m0877n8887R1183M5024k3531O3619J9354o6902l699
$$ 6606 25764 -36897 -75517 -116394 -175281 -84098 -39074 -62605 1014 20368 -46534 -50233
7818e0233J2239n0514r582J32567J6782j15311O6305m8148L8623j4487n1979k8849
$$ -50233 -37994 -88508 -98090 34477 51259 -64052 2253 -45895 -7272 -21759 -73738 -102587
7806a02587l4267J14590l8106L0306k1037J1896P8765P9441k85834k05181K68166
$$ -102587 -136854 -22264 -60370 -30064 -51101 -39205 39560 119001 -166833 -372014 -103848
7795a03848R676Q3255r1018M7910P9634m5439P704k2177J1630O8862r3099K7006
$$ -103848 -94172 -10917 -101935 -54025 25609 -19830 -12126 -34303 -22673 46189 -46910 -19904
7783a9904K4428M5855M5815o1425q9200O420j5888p6711J03564R913J45768q0821
$$ -19904 4524 50379 96194 34769 -54431 -48011 -63899 -140610 -37046 -27133 118635 37814
7771C7814n2080j1479m7670K604q531Q882N3147K9575Q2240j3898k3076m6599
$$ 37814 -14266 -25745 -73415 -70811 -79342 -70460 -17313 12262 94502 80604 57528 10929
7759A0929j1941o7639q913O9478n3216j29775L2022O9802P8529K30J01496k5869
$$ 10929 -1012 -68651 -77564 -8086 -61302 -191077 -159055 -89253 -10724 -10494 91002 65133
7747F5133k3674N988o7854q1799n4906P6149j9145j6576j6302J1324L34K7573
$$ 65133 41459 47447 -20407 -102206 -157112 -80963 -100108 -116684 -132986 -121662 -121328 -93755
7735i3755j3953k5247P4271N1223o7650j6018P1265M9217O1466l26j10915j51459
$$ -93755 -107708 -132955 -58684 -7461 -75111 -91129 -19864 29353 90819 90493 -20422 -171881
7723a71881M2598J44008K8525K2363J222n2127Q112N1073r0323k2539j924j9463
$$ -171881 -129283 14725 43250 65613 66835 14708 22820 73893 -16430 -38969 -40893 -60356
7711f0356r8924J2596J15300J7971M9990L7007j21401p2571K0101M5977k5310
$$ -60356 -159280 -146684 -31384 -13413 36577 73584 -47817 -120388 -100287 -54310 -79620
7700g9620J31113J9212j44790n6464M9350J41882M5010j26217j8314P8790j909
$$ -79620 51493 70705 -74085 -130549 -81199 60683 105693 -20524 -38838 39952 38043
7689C8043j21482M9869R491n4841N4755P1428j16210n5600J9954o3003N5088J59025
$$ 38043 -83439 -33570 -24079 -78920 -24165 47263 -68947 -124547 -104593 -167596 -112508 46517
7677D6517j7880q3624P1231j12333m5697J59236j11111R5574J8832l0009r7509
$$ 46517 28637 -54987 16244 -96089 -141786 17450 -93661 1913 20745 -9264 -106773
7666a06773k0807J01704k0634m4781J3344N6854l730o995K8776n7455j5350M3917
$$ -106773 -127580 -25876 -46510 -91291 -77947 -21093 -24823 -31818 -3042 -60497 -75847 -31930
7654c1930k0621j3721j3195M4729k1291N8004N502L8324J1559o2520N7883p5705
$$ -31930 -52551 -66272 -79467 -34738 -56029 1975 7477 45801 57360 -5160 52723 -22982
7642b2982j20803K5990N2845R9750n7503q553k7984p2973n8595r674J09649l5223
$$ -22982 -143785 -117795 -64950 34800 -22703 -31256 -59240 -132213 -190808 -200482 -90833 -126056
7630a26056O6332p596j04450O2770K8561j3623L9324L9006M2732J26257j04645
$$ -126056 -59724 -67320 -171770 -109000 -80439 -94062 -54738 -15732 27000 153257 48612
7619D8612l5301o0869O8856j09619K3595K6203j2755j03678P3939L1850P0936
$$ 48612 13311 -47558 21298 -88321 -64726 -38523 -51278 -154956 -81017 -49167 21769
7608B1769j2966q1116L3722J4202R2126K8808m791o3487p2731J8616M748n4052
$$ 21769 8803 -72313 -38591 -24389 67737 96545 91754 28267 -44464 -25848 -21100 -75152
7596g5152N1738J598J7646O6833M6414K4842M6408j7347j42373L9526J6867q7011
$$ -75152 -23414 -21816 -4170 62663 109077 133919 180327 162980 20607 60133 77000 -10011
7584a0011J07870J5156j00161P9071O5205J7567K6093q0129m3495P2723J65270
$$ -10011 97859 113015 12854 91925 157130 174697 200790 120661 77166 149889 315159
7573C15159j09446N548N170p0980n0132L4885l223P563J7308N4742p1708n953
$$ 315159 205713 211261 216431 145451 95319 130204 126981 134544 151852 206594 134886 128933
7561A28933O7776R2835p5626l2099N114K1716M6594o1632N6140O2712K7226J06686
$$ 128933 196709 289544 213918 181819 186933 208649 255243 193611 249751 312463 339689 446375
7549D46375L3509N5675Q1208J7561Q3177O6003J56232J13811J22049K22860L08451
$$ 446375 479884 535559 616767 634328 717505 783508 939740 1053551 1175600 1398460 1706911
7538A706911K41457K72731M02879Q8430k47771k20719l51500l47261k00016j46909
$$ 1706911 1948368 2221099 2623978 2712408 2464637 2243918 1892418 1545157 1345141 1198232
7528A198232k15455j83069o7848q5865p4119p3303j53069O1895L6170o3472k2082
$$ 1198232 982777 799708 731860 645995 571876 498573 345504 407399 443569 380097 358015
7517C58015j48103L5589J17899p6917K5220n9260k7840j44036q2969P9373j2066
$$ 358015 209912 245501 363400 286483 311703 252443 224603 80567 -2402 76971 64905
7506F4905k3153N6906J01564K6129P686j60805K312L3709r0354M3864n9399k9376
$$ 64905 41752 98658 200222 226351 234037 73232 75544 109253 18899 62763 3364 -26012
7494b6012O74K9824O3310m0466k7409L266K7333R2545J0112p0279n509k6230L3062
$$ -26012 -25338 4486 67796 27330 -79 3187 30520 123065 133177 62898 57389 31159 64221
7481F4221m0327l24r4431J36318l4649m3946J06993p7525o2861N0285J07500l876
$$ 64221 23894 23570 -70861 65457 30808 -13138 93855 16330 -46531 3754 111254 107378
7469A07378j57562J7429N1373l5463n5429N9494n9891j1929N5444o3809M4745
$$ 107378 -50184 -32755 18618 -16845 -72274 -12780 -72671 -84600 -29156 -92965 -48220
7458d8220M2201o9179o8942J40545O9999l7310l5403k4174K880l7864K9678P6145
$$ -48220 -6019 -75198 -144140 -3595 66404 29094 -6309 -30483 -27603 -65467 -35789 40356
7446D0356j99927N2684M2520j4492P0469j2569P218m7070K2237j08426L4214J07037
$$ 40356 -159571 -106887 -64367 -78859 -8390 -20959 -13741 -60811 -38574 -147000 -112786 -5749
7434e749q8374K4558J39501Q457k1279j7075m8512p9443l7595L4532j7705P3095
$$ -5749 -94123 -69565 69936 78393 57114 40039 -8473 -87916 -125511 -90979 -108684 -35589
7422c5589P547P5336r4017J26080K4596j26257m738l9110K948j1628P4271M00
$$ -35589 -28042 47294 -46723 79357 103953 -22304 -27042 -66152 -63204 -74832 -561 -161
7410a61q1310j9683Q9347R9494m7144j52989J84916p210q0035L7366m6619p2264
$$ -161 -81471 -101154 -11807 87687 40543 -112446 72470 65260 -14775 22591 -24028 -96292
7398i6292n294K1720P6196l0544n6514R2649M5828J3865p7309m2399N9868M3716
$$ -96292 -101586 -79866 -3670 -34214 -90728 1921 47749 61614 -15695 -58094 1774 45490
7386D5490m0571M778q5067L9893k5941j00878M9748q192r882J21620L1226L2402
$$ 45490 4919 9697 -75370 -35477 -61418 -162296 -112548 -120740 -130622 -9002 22224 54626
7374E4626K082j30068L9918J37706j10983O0810m0822q8939j14234J4403N4183
$$ 54626 56708 -73360 -33442 104264 -6719 54091 13269 -75670 -189904 -175501 -121318
7363a21318J13553K6788m0893J1048j18886k0384Q316J70889n8958k7797r428
$$ -121318 -7765 19023 -21870 -10822 -129708 -150092 -141776 29113 -29845 -57642 -67070
7352f7070R418L2747J2702j07387l0288Q2261m1568P999j1036N9520M5261L7338
$$ -67070 -57652 -24905 -12203 -119590 -149878 -67617 -109185 -101186 -112222 -52702 -7441 29897
7340B9897J2454q6052k1654m7412m0115O2135O4003o7790N5497N7251j229r6R7173
$$ 29897 42351 -43701 -65355 -112767 -152882 -90747 -26744 -94534 -39037 18214 16985 16889 114062
7327A14062o3410o7671j0012p6141q666k9060k6670M8516l7381k1629P9711K2449
$$ 114062 50652 -17019 -27031 -103172 -111838 -140898 -167568 -119052 -156433 -178062 -98351 -75902
7315g5902k4448N3653L5563j6385P1085l6710n0633J7283n1761J742J732n2980
$$ -75902 -100350 -46697 -11134 -27519 43566 6856 -43777 -26494 -78255 -76513 -74781 -127761
7303a27761J62794k2337n9607n1467n5880L8129k7201J29868j3626N0647L0196
$$ -127761 35033 12696 -46911 -98378 -154258 -116129 -143330 -13462 -27088 23559 53755
7292E3755q7348L0734M8022o6383L8766l9458k9931M720M0332k7398r2559J19164
$$ 53755 -33593 -2859 45163 -21220 17546 -21912 -51843 -47123 -6791 -34189 -126748 -7584
7280g584k4431Q3855J2201N92k0902k6929r8754J2605j393J1726k7291l4324N8206
$$ -7584 -32015 51840 64041 64633 43731 16802 -81952 -69347 -70740 -59014 -86305 -120629 -62423
7267f2423O4213J2252l7837K8172m9125P807J01076n4372n3230O46P809j67399
$$ -62423 1790 14042 -23795 4377 -44748 -36941 64135 9763 -43467 -42821 -35012 -202411
7255b02411L3915Q4480k0524m6305j0127M9382N5415K2988k6454N3621P635l8202
$$ -202411 -168496 -84016 -104540 -150845 -160972 -111590 -56175 -33187 -59641 -6020 1615 -36587
7243c6587p0247P2297P0153q852j9146o1620k9939j1416J08892j14782k7407R8657
$$ -36587 -106834 -34537 35616 26764 7618 -54002 -83941 -95357 13535 -101247 -128654 -29997
7231b9997p0570Q4193k1372Q205r848j3453n2770p47m1419j445P5642N5808j09674
$$ -29997 -100567 -16374 -37746 -29541 -39389 -52842 -105612 -106359 -147778 -149223 -73581 -17773 -127447
7218a27447J28298o0138m8632Q7384J2773p6855N5574K3457n6222o1047k5303
$$ -127447 851 -59287 -107919 -20535 -7762 -84617 -29043 -5586 -61808 -122855 -148158
7207a48158j6362k475n1549J02558M8340m7893J07680P7713n9434l9335n3195
$$ -148158 -164520 -166995 -218544 -115986 -67646 -115539 -7859 69854 10420 -28915 -82110
7196h2110j1927J4754k1502J10951N3067q4416r8393p0800K4083O9575k2701K3123
$$ -82110 -94037 -79283 -100785 10166 63233 -21183 -119576 -190376 -166293 -96718 -119419 -96296
7184i6296J16937L0809q2134J0031j17388O5374J03294j8223q3224j2100m8518
$$ -96296 20641 51450 -30684 -20653 -138041 -72667 30627 12404 -70820 -82920 -131438
7173a31438M0512N2285n492l3825q7497M7132M8172K020r2276q5276J38311K0103
$$ -131438 -90926 -38641 -44133 -77958 -165455 -118323 -70151 -68131 -160407 -245683 -107372 -87269
7161h7269n034n0237P9292k8457O4792Q1158r2740M8360k7940j2287l4416P0674
$$ -87269 -92303 -142540 -63248 -91705 -26913 54245 -38495 9865 -18075 -30362 -64778 5896
7149E896j04474n4279L9573j5594O6871o6374o6656Q4169J0151l1358O0448K5780
$$ 5896 -98578 -152857 -113284 -128878 -62007 -128381 -195037 -110868 -100717 -132075 -71627 -45847
7137d5847Q3929n7682p3372R9102l0298m6168Q2610n6588J02176r4242n6966m2175
$$ -45847 38082 -19600 -92972 6130 -24168 -70336 12274 -44314 57862 -36380 -93346 -135521
7125a35521K9922J59799P17l6776M1185Q040j85886n170P5294L748P9357k4722
$$ -135521 -105599 54200 54917 18141 59326 67366 -118520 -123690 -48396 -44648 34709 9987
7113I987N773n1415m4256J2100J31141m8609M6352j1210l2242m526n2201J04834
$$ 9987 15760 -35655 -79911 -67811 63330 14721 61073 49863 17621 13095 -39106 65728
7101F5728j32022K7808q5887L5148j3551l5049P9173q4850j5557M257l45O5319
$$ 65728 -66294 -38486 -124373 -89225 -102776 -137825 -58652 -143502 -159059 -154802 -155147 -89828
7089h9828j3345l665M0219p2918J8638L61N6520n4888n5685P0782L9060p2861
$$ -89828 -103173 -106838 -66619 -139537 -120899 -120538 -64018 -118906 -174591 -103809 -64749 -137610
7077a37610o0994J31481p0600J15369Q2276j7012m5366O189k8762p9002K8565
$$ -137610 -198604 -67123 -137723 -22354 59922 42910 -2456 3733 -25029 -104031 -75466
7066g5466j00506M7061J00708q969l1114R3730p2464o2079J07009O4208O260m6867
$$ -75466 -175972 -128911 -28203 -37172 -68286 25444 -47020 -109099 -2090 62118 68378 21511
7054B1511Q926r197p3621L9419N3919j55414j00068j08380J01854R7165L1262
$$ 21511 30437 21240 -52381 -12962 40957 -114457 -214525 -322905 -221051 -123886 -92624
7043i2624R2159L9307Q995p3415o1620L8176n5383q274Q045N3312m0989p7858
$$ -92624 -465 38842 47837 -25578 -87198 -49022 -104405 -112679 -104634 -51322 -92311 -170169
7031a70169L5902l1072K1264n196K788N8348O431M9546j88942J02566N1727n1039
$$ -170169 -134267 -165339 -144075 -149271 -146483 -88135 -81704 -32158 -221100 -118534 -66807 -117846
7019a17846l2988N3361l1490l5102K4243M0647r64o9345J08219l5928j0150L7367
$$ -117846 -150834 -97473 -128963 -164065 -139822 -99175 -100139 -169484 -61265 -97193 -107343 -69976
7007f9976P2985L332l4389M1340j3369n7932L8601n097j09196m2735P6630L9912
$$ -69976 3009 6341 -28048 13292 -77 -58009 -19408 -24505 -133701 -176436 -99806 -59894
6995e9894L8379J5191m1325J4793J3980q3346l6969L5135J4305j3332N7415L0515
$$ -59894 -21515 -6324 -47649 -32856 -18876 -102222 -139191 -104056 -89751 -103083 -45668 -15153
6983a5153j5754j8561j87n2306O124J22915Q5254n7143l6361K422K131n6174m9069
$$ -15153 -30907 -49468 -49655 -101961 -95837 27078 112332 55189 18828 21250 23381 -32793 -81862
6970h1862R255M2216N0012k5855k9951R3759K2850j6112m4159p13O583j26327
$$ -81862 -72607 -30391 19621 -6234 -36185 57574 80424 64312 20153 19440 26023 -100304
6958a00304N953Q8673m2271r320K6234J9844m2300k7858n498O444N4120Q331O486
$$ -100304 -94351 -5678 -47949 -57269 -31035 -11191 -53491 -81349 -86847 -80403 -26283 -17952 -11466
6945a1466r7785J15336k4997n4040l4773k7605M3725k5290J24277K588O6001P2755
$$ -11466 -109251 6085 -18912 -72952 -107725 -135330 -91605 -116895 7382 9970 75971 148726
6933A48726p990j28376r0286N6918P5151o4015k917p0333j4809o7905p543J83
$$ 148726 140736 12360 -77926 -21008 54143 -9872 -12789 -83122 -97931 -165836 -173379 -173196
6921a73196J7428L5688N4828j8090L4962L5911n1340l7195L8504l710j3920m4175
$$ -173196 -155768 -120080 -65252 -83342 -48380 -12469 -63809 -101004 -62500 -66210 -80130 -124305
6909a24305p737n8202l9729J30519o5944o762J45438P7032q3136K9131p5154k790
$$ -124305 -132042 -190244 -229973 -99454 -165398 -172160 -26722 50310 -32826 -3695 -78849 -81639
6897h1639K8664o895K6977q8358Q0041j0362m1745m1456J6955J30654L3490q6326
$$ -81639 -52975 -59870 -32893 -121251 -41210 -51572 -93317 -134773 -117818 12836 46326 -40000
6885d0000o5949N1214j1802P5375L9128n100Q742l0322j59511p0823J5496L8209
$$ -40000 -105949 -54735 -66537 8838 47966 42866 51608 21286 -138225 -209048 -193552 -155343
6873a55343K9364o802M1479J36456j8581k9905j4636K742j9741l5947p186K6844
$$ -155343 -125979 -132781 -91302 45154 26573 -3332 -17968 -15226 -34967 -70914 -78100 -51256
6861e1256k0853L792J3766N5196j04927n4806N6576N0704L4529K3797P979K5731
$$ -51256 -72109 -68317 -54551 645 -104282 -159088 -102512 -51808 -17279 6518 14497 40228
6849D0228j03668q3304K1575P5191P6685R152P3861o1426p0489K2594l6619K4505
$$ 40228 -63440 -146744 -125169 -49978 26707 35859 109720 48294 -22195 399 -36220 -11715
6837a1715L9365j40373Q9618k3818j16245J0705L7939J9352J3048K5161O1277
$$ -11715 27650 -112723 -23105 -46923 -163168 -152463 -114524 -95172 -82124 -56963 4314
6826D314l0379J5911k1897p5084j4127J21162K2381j22387L9360O5424j7206o8670
$$ 4314 -26065 -10154 -32051 -107135 -121262 -100 22281 -100106 -60746 4678 -12528 -81198
6814h1198L6932k3036K9414j941o5861k4943L5816M8731O0622j08816J6366J74881
$$ -81198 -44266 -67302 -37888 -39829 -105690 -130633 -94817 -46086 14536 -94280 -77914 96967
6802I6967j8093j12911p8417J3656k1485l8608N7911M3693J1145P5377j206m6249
$$ 96967 78874 -34037 -112454 -98798 -120283 -158891 -100980 -57287 -46142 29235 28029 -18220
6790a8220M0557m7708J6851Q6975j20373K8191O8741o940p564r9734J9328P1114
$$ -18220 22337 -25371 -8520 78455 -41918 -13727 55014 48074 40510 -59224 -39896 31218
6778C1218j07080l0823J23662L1082n8050K3677r0493N6429M3389n7334m1191
$$ 31218 -75862 -106685 16977 48059 -9991 13686 -76807 -20378 23011 -34323 -75514
6767g5514M4778M6142O4340r0045j5912O5899j87407K6172J105P2713o5795j4238
$$ -75514 -30736 15406 79746 -10299 -26211 39688 -147719 -121547 -120442 -47729 -113524 -127762
6755a27762R2831L659o8945k8004n3664K4541L4342K1943M6613M2305L116L1439
$$ -127762 -34931 -31272 -100217 -128221 -181885 -157344 -123002 -101059 -54446 -12141 -9025 22414
6743B2414K5515n9269j10122k334Q1188J2483K3810j46008j8052M1527J0060P4493
$$ 22414 47929 -11340 -121462 -123796 -42608 -30125 -6315 -152323 -170375 -128848 -118788 -44295
6731d4295Q1576K2516M1695j13012O9856r9872K0461O4132n4644o7011r7543J46234
$$ -44295 37281 59797 101492 -11520 58336 -41536 -21075 43057 -11587 -78598 -176141 -29907
6719b9907p1072k854P5449M0205m7883k1209J43565K1927j42286q0974L245J1447
$$ -29907 -100979 -103833 -28384 11821 -36062 -57271 86294 108221 -34065 -115039 -111794 -100347
6707a00347J05393m2077n2168K4783Q3588Q98j7440m6013K961l6623j1645L3534
$$ -100347 5046 -37031 -89199 -64416 19172 20070 2630 -43383 -40422 -77045 -88690 -55156
6695e5156p1445K4232R3994m1128l7692J9490L8565J48518p0866N3769l3622l7759
$$ -55156 -126601 -102369 -8375 -49503 -87195 -67705 -29140 119378 48512 102281 68659 30900
6683C0900O9283j16243K9173M3051j01473J2370L9346l519o1790K2234j8971J0260
$$ 30900 100183 -16060 13113 56164 -45309 -32939 6407 2888 -58902 -36668 -55639 -45379
6671d5379o0246R7822m2275k1517J24151j24629l8827L9979O8750M3277j8694
$$ -45379 -105625 -7803 -50078 -71595 52556 -72073 -110900 -70921 -2171 41106 22412
6660B2412n1059j4309r93o3531p4354L5417K9034O6888n4865J6267Q4412k1053
$$ 22412 -28647 -42956 -43949 -107480 -181834 -146417 -117383 -50495 -105360 -89093 -4681 -25734
6648b5734J4408o8301m3373j09477j5515J21129M6792K2325k7139O3333K0057
$$ -25734 -11326 -79627 -123000 -232477 -247992 -126863 -80071 -57746 -84885 -21552 -1495
6637a495k4599k907j0330N8826o5495p327J9538N1915l6998l7851L838q6229J00984
$$ -1495 -26094 -29001 -39331 19495 -46000 -53327 -33789 18126 -18872 -56723 -52885 -139114 -38130
6624c8130K4037J8878m1656m265k0076J18897q1294K9872L3535l4185J7215q758
$$ -38130 -14093 4785 -36871 -41136 -61212 57685 -23609 6263 39798 5613 22828 14070
6612A4070k6181r705O0300q4976J5871J08878k3406r3669Q491J9345m2870J4037
$$ 14070 -12111 -21816 38484 -46492 -30621 78257 54851 -38818 -30327 -10982 -53852 -39815
6600c9815P275o0392J7994J3641m3634N3485J8506M1544k4987L4039J6429j47419
$$ -39815 -32540 -92932 -74938 -61297 -104931 -51446 -32940 8604 -16383 17656 34085 -113334
6588a13334P8054J68698M727j14098l4355N7888K4456q5352l1911L1651l1820
$$ -113334 -35280 133418 138145 24047 -10308 47580 72036 -13316 -45227 -13576 -45396
6577d5396p9256Q1005n9303N8705j69J3837N9673J7220j392q2574p8695N8921
$$ -45396 -124652 -43647 -102950 -44245 -44414 -30577 29096 46316 44924 -37650 -116345 -57424
6565e7424M9142N5092k7403J9882Q6911j16755n7112J8475P2360R489o904j15791
$$ -57424 -8282 46810 19407 39289 126200 9445 -47667 -29192 43168 52657 45753 -70038
6553g0038P9896l8721j36247J12394l886M0370j32199Q6507L5860N676q2259L599
$$ -70038 9858 -28863 -165110 -52716 -56602 -16232 -148431 -61924 -26064 -20388 -102647 -99048
6541i9048J10443m5464k8852q5248o3234J03365K7091N7747K4666n3146l6116
$$ -99048 11395 -34069 -62921 -148169 -211403 -108038 -80947 -23200 1466 -51680 -87796
6530h7796K7359L7753j08057J03365j2430M3822J2962j00370J15676m6759N8349
$$ -87796 -60437 -22684 -130741 -27376 -39806 4016 16978 -83392 32284 -14475 43874
6519D3874N9464o7529k84k5356r4702J6624Q565M964j7842L3793k6699k8935m771
$$ 43874 103338 35809 35525 10169 -84533 -67909 -59344 -54380 -72222 -38429 -65128 -94063 -98834
6506i8834o7340n073N2681Q9244m404L6539L0218P700j05638J309n6955M0045
$$ -98834 -166174 -171247 -118566 -29322 -33726 2813 33031 40731 -64907 -63598 -120553 -80508
6494h0508J26136k1474m3727J4531o1422l0473J0364Q5635o0082q838m3468L3021
$$ -80508 45628 24154 -19573 -5042 -66464 -96937 -86573 -938 -61020 -69858 -113326 -80305
6482h0305O3663K2093p7361J31816O7080j26571j4160j0048n7021N3768k059L4214
$$ -80305 -16642 5451 -71910 59906 126986 415 -13745 -23793 -80814 -27046 -29105 5109
6470E109J3821o6679N135k1805k0811K5056N2567J1415p7012L8548J2076k476
$$ 5109 18930 -47749 -42614 -64419 -85230 -60174 -7607 3808 -73204 -34656 -22580 -25056
6458b5056m0764l4057r937K6197r667N1529P631Q2130p1448j2909R2335m5674
$$ -25056 -65820 -99877 -109814 -83617 -93284 -41755 -34124 48006 -23442 -36351 55984 10310
6446A0310k483M080P1124o643M2070o246j7895p1962p0153l6228j126M5903J21238
$$ 10310 7827 11907 83031 76388 118458 112212 94317 22355 -47798 -84026 -85152 -39249 81989
6433H1989j17229o8674P8165N7487J4835Q0299n3855r013K44m6122p5780n9039
$$ 81989 -35240 -103914 -25749 31738 46573 126872 73017 64004 64248 18126 -57654 -116693
6421a16693r23J22330Q2902j17963r1560k2968M9030Q0774J5133J8412j3828k4031
$$ -116693 -117616 4714 87616 -30347 -121907 -144875 -95845 -15071 62 18474 4646 -19385
6409a9385L9902j5710n0355Q3419n9958n11L0637K8592k2006p415l512R525j4979
$$ -19385 20517 4807 -45548 37871 -22087 -22598 8039 36631 14625 7210 3698 13223 -1756
6396a756l1557J2004l3720P2289n7048R1320q643j01636J09221l9804K4951O9550
$$ -1756 -33313 -21309 -55029 17260 -39788 51532 42889 -58747 50474 10670 35621 105171
6384A05171j4091k8938L4196l0417j8586P4510j5410j00877l7150K3101K3246
$$ 105171 91080 62142 96338 65921 47335 121845 106435 5558 -31592 -8491 14755
6373A4755n0976K3114M232j3521M0085J7004l1708m8488L156J52731L3586j24710
$$ 14755 -36221 -13107 -8875 -22396 17689 34693 2985 -45503 -42347 110384 143970 19260
6361A9260j540j05521p2569N7336P604p7731L5412Q3552Q7608J06263j7627n0713
$$ 19260 17720 -87801 -160370 -103034 -95430 -173161 -137749 -54197 33411 139674 122047 71334
6349G1334m4504j5789k2824l8617O9059k458M0392o1119j11977K3538J9475J707
$$ 71334 26830 11041 -11783 -50400 18659 16201 56593 -4526 -116503 -92965 -73490 -71783
6337g1783L0579J00127J8268J8830k1949k1659l4207k5521J8350p8351M0949O3387
$$ -71783 -41204 58923 77191 96021 74072 52413 18206 -7315 11035 -67316 -26367 37020
6325C7020k1090q359J5923o3867n1404Q1097l3085m0197R2879l7328j9340K9653
$$ 37020 15930 7571 23494 -40373 -91777 -10680 -43765 -83962 8917 -28411 -47751 -18098
6313a8098J03090r658l6313O3967p452P3638J51762k3147r3161j01598J3593l3892
$$ -18098 84992 75334 39021 102988 95536 169174 320936 297789 204628 103030 116623 82731
6301H2731j42024M3196K1394j51097j729J36505j4161j8974L3333k7534O4503
$$ 82731 -59293 -16097 5297 -145800 -147529 -11024 -25185 -44159 -10826 -38360 26143
6290B6143k0684m7655Q4246l6635L2090Q3950q0871j20555Q9363Q4006q0256r4407
$$ 26143 5459 -42196 42050 5415 37505 121455 40584 -79971 9392 93398 13142 -81265
6278h1265P1333r044j3453J57450o39r9063L2450m160Q59K7878n6697m4614m1358
$$ -81265 -9932 -18976 -32429 125021 124382 25319 57769 53609 54468 82346 25649 -18965 -60323
6265f0323p2437J16375R6977m7729N2337o3771Q5207L6417k2619J6928L4002j37192
$$ -60323 -132760 -16385 80592 32863 85200 21429 106636 143053 120434 137362 171364 34172
6253C4172j11013Q5028n8627k9103J38844j0110m380M7645N6011o3712p2571J01066
$$ 34172 -76841 8187 -50440 -79543 59301 49191 44811 92456 148467 84755 12184 113250
6241A13250o2996k4165O747n6077M6191M10J4242K802q3639k3802J03965R9303
$$ 113250 50254 26089 32836 -23241 22950 23360 37602 40404 -43235 -67037 36928 136231
6229A36231j11540R2231K8788P927Q570q1430j1657j1554l9865r7998O1052P2034
$$ 136231 24691 116922 145710 153637 162207 80777 69120 57566 17701 -80297 -19245 52789
6217E2789M9781M2005K6293j55658j7332O7259J07387n8053o6735N7504r331n6008
$$ 52789 102570 144575 170868 15210 -2122 65137 172524 114471 47736 105240 95909 39901
6205C9901k4310o317L7182N2018j14164N584R832J10721O3481q3239o5059M8201
$$ 39901 15591 9274 46456 98474 -15690 -10106 -274 110447 173928 90689 25630 73831
6193G3831J8813o6638k9117N3681j43121N2752P9327K4499j5662P2755L7046j45075
$$ 73831 92644 26006 -3111 50570 -92551 -39799 39528 64027 48365 121120 158166 13091
6181A3091L0992J04913n5479m3845j3282K683Q6367N5714j31874r6074K2782n2500
$$ 13091 44083 148996 93517 49672 36390 39073 125440 181154 49280 -46794 -24012 -76512
6169g6512J1729J34465l508m8394J00285l015j51169Q030J56567O1858k6760l9429
$$ -76512 -64783 69682 66174 17780 118065 115050 -36119 -28089 128478 190336 163576 124147
6157A24147l4159k9209J4842Q438N7045N275j12m2476l785n4294n8335J9692l6000
$$ 124147 89988 60779 75621 84059 141104 146379 146267 103791 100006 45712 -12623 7069 -28931
6144b8931P7873l995m2921K6600J53320j04583J0905L7355l9464N1131L024M6541
$$ -28931 48942 44947 2026 28626 181946 77363 88268 125623 86159 137290 140314 186855
6132A86855J3453m9934k1563n3207J06154n5625m938l2889p7642m8847K5770J54113
$$ 186855 200308 150374 128811 75604 181758 126133 121195 88306 10664 -38183 -12413 141700
6120A41700K9707J8883p7018j5608q7048Q8135P8647L1023l7073N4139l7225L8255
$$ 141700 171407 190290 113272 97664 10616 98751 177398 208421 171348 225487 188262 226517
6108B26517n6361n5627P0705j6266j03553Q023J12621L4189j6793L1621p7325
$$ 226517 170156 114529 185234 168968 65415 73438 186059 220248 203455 235076 157751
6097A57751m6097j28923j7889r291J9466P9504j2798m8011K4644Q708M3598n1383
$$ 157751 111654 -17269 -35158 -44449 -24983 54521 41723 -6288 18356 27064 70662 19279
6085A9279K9310J5437O4160n766M0578n1902J3089j07676o899Q4137Q5205j4300
$$ 19279 48589 64026 128186 122420 162998 111096 124185 16509 9610 93747 178952 164652
6073A64652m1321J06208m2683P9046k6879n7943q8699K2145j6105Q9391n7949
$$ 164652 123331 229539 186856 265902 239023 181080 92381 114526 98421 187812 129863
6062A29863k3222k1761R6926p1011m8100m290N078Q9518j4276m1934J8997M6778
$$ 129863 106641 84880 181806 110795 62695 58405 63483 153001 138725 96791 115788 162566
6050A62566j0977p6152J2495L4174l7882k4963L9131M1522N6423P0082m6225o0978
$$ 162566 151589 75437 87932 122106 84224 59261 98392 139914 196337 266419 220194 159216
6038A59216K1448o2781M1217N1766M4139N4600q9350o8222N5725q3643N6541Q038
$$ 159216 180664 117883 159100 210866 255005 309605 220255 152033 207758 124115 180656 188694
6026A88694j8770K3316J7542m7702J4431N1544j12439l2446O2153R7219O7472
$$ 188694 169924 193240 210782 163080 177511 229055 116616 84170 146323 243542 311014
6015C11014j50152j3875R7344K0192R90j0786p1532J42432N8228j70810N573L8838
$$ 311014 160862 146987 244331 264523 265513 254727 183195 325627 383855 213045 218618 257456
6003B57456r4897M2979P6647k6957J22832l481o5796k8574o8791m9110J16329
$$ 257456 162559 205538 282185 255228 378060 374579 308783 280209 211418 162308 278637
5992B78637n9994p8214r584Q1965n1785q8044M6439Q0492L8801L8386j08588Q0202
$$ 278637 218643 140429 130845 212810 161025 72981 119420 199912 238713 277099 168511 248713
5980B48713L1654L0781L0626N8209n8936l3139L1112m4594l1736j01150m0680
$$ 248713 280367 311148 341774 399983 341047 307908 339020 294426 262690 161540 120860
5969A20860m497J26387P4906r6835j15954O3396Q3044Q4246M620k2769J2381N2103
$$ 120860 116363 242750 317656 220821 104867 168263 251307 335553 340173 317404 329785 381888
5957C81888j32964J7289Q6018j4583k3363n0589J1097Q9570l6572q6247M4509
$$ 381888 248924 266213 352231 337648 314285 263696 274793 364363 327791 241544 286053
5946B86053j0389m0930k0979L3415K3231J06792J1749l0898J1628k0822n3282
$$ 286053 275664 234734 213755 247170 270401 377193 388942 358044 369672 348850 295568
5935B95568R5213J24557j02240K1211O7668p6575o5448p2542P1010K2677r1488
$$ 295568 390781 515338 413098 434309 501977 425402 359954 287412 358422 381099 289611
5924B89611J1457L8336O7258q9187l048K8451J2957P828L4464L509N6187J06323
$$ 289611 301068 339404 406662 317475 314427 342878 355835 363663 398127 401636 457823 564146
5912E64146L7950j4788o2747m3307n2873J23274j36060k9807J12057k7793J7205
$$ 564146 602096 587308 524561 481254 428381 551655 415595 385788 497845 470052 487257
5901D87257n382J33051p7873n3484Q1996k7424j7159l163K0018N081n8605r8574
$$ 487257 481875 614926 537053 483569 565565 538141 520982 517819 537837 542918 484313 385739
5889C85739J15618j478K6106J6995J16814L419m2296J27691k5786n2798J7568
$$ 385739 501357 499879 525985 542980 659794 663213 620917 748608 722822 670024 687592
5878F87592J77432p8602m5101k725L640P0302K913k8502K8664P1349j610q2621
$$ 687592 865024 786422 741321 738596 742236 812538 815451 786949 815613 886962 885352 802731
5866H02731P3620P4439L1957N1273N3144P3664N3708N7820J00248Q3968M7649
$$ 802731 876351 950790 982747 1034020 1087164 1160828 1214536 1272356 1372604 1456572 1504221
$$ [...]
##END NTUPLES=NMR SPECTRUM
##END=
