##TITLE=1H_CA-9235-1
 CDCl3
 8 sc, 
 5.2.2024
##JCAMPDX= 6.0         $$ Bruker NMR JCAMP-DX V2.0
##DATA TYPE= NMR SPECTRUM
##DATA CLASS= NTUPLES
##ORIGIN= UXNMR, Bruker Analytische Messtechnik GmbH
##OWNER= root
$$ XWIN-NMR		Version 3.5
$$ Mon Feb  5 13:55:44 2024 Russian Standard Time (UT+4h)  she@DPX200
##.OBSERVE FREQUENCY= 200.1313
##.OBSERVE NUCLEUS= ^1H
##.ACQUISITION MODE= SIMULTANEOUS
##.ACQUISITION SCHEME= undefined
##.AVERAGES= 8
##.DIGITISER RES= 18
##SPECTROMETER/DATA SYSTEM= spect
##.PULSE SEQUENCE= zg30
##.SOLVENT NAME= D2O
##.SHIFT REFERENCE= (INTERNAL, D2O, 0, 15.6026)
##AUDIT TRAIL= $$ (NUMBER, WHEN, WHO, WHERE, WHAT)
$$ ##TITLE= Audit trail, XWIN-NMR		Version 3.5
$$ ##JCAMPDX= 5.01
$$ ##ORIGIN= Bruker BioSpin GmbH
$$ ##OWNER= she
$$ F:/spectra/data/she/nmr/H-F/1/pdata/1/auditp.txt
$$ ##AUDIT TRAIL=  $$ (NUMBER, WHEN, WHO, WHERE, WHAT)
(   1,<2024-02-05 13:53:47.26 +0400>,<she>,<DPX200>,
      <created by zg, POWCHK disabled, PULCHK disabled
       configuration hash MD5:
       00 E9 B6 7A A2 85 ED C7 34 08 36 98 17 FE 4E 26
       data hash MD5: 16K
       9D D7 D4 A7 78 85 2A 50 56 53 DA 75 64 6B 5D 7F>)
(   2,<2024-02-05 13:53:49.42 +0400>,<she>,<DPX200>,
      <Start of raw data processing
       efp BC_mod = 2 LB = 0.24 FT_mod = 6 PKNL = 1 PHC0 = -24737.44 PHC1 = 12.05268 SI = 16K 
       data hash MD5: 16K
       9B 49 9F 62 D3 94 29 17 18 F1 A5 E3 0B 38 02 99>)
(   3,<2024-02-05 13:54:05.59 +0400>,<she>,<DPX200>,
      <pk PHC0 = 145.7047 PHC1 = -4.4 
       data hash MD5: 16K
       19 B1 FC CD F4 D0 CB 7E 36 14 14 75 8F A3 06 0A>)
(   4,<2024-02-05 13:54:11.20 +0400>,<she>,<DPX200>,
      <abs ABSG = 5 
       data hash MD5: 16K
       99 89 19 FC BF 88 C4 4C 06 71 3E 93 5C 5F 99 64>)
$$ ##END=
$$ 
$$ hash MD5
$$ 14 B7 46 C8 D2 25 13 FE 5D FD C6 9B BB 10 1F E8
##$RELAX= 
##$RELAX= 
##$RELAX= 
##$RELAX= 
##$RELAX= 
##$RELAX= 
$$ Bruker specific parameters
$$ --------------------------
##$DU= <F:/spectra>
##$EXPNO= 1
##$NAME= <H-F>
##$PROCNO= 1
##$TYPE= <nmr>
##$USER= <she>
##$AMP= (0..31)
100 100 100 100 100 100 100 100 100 100 100 100 100 100 100 100 100 100 
100 100 100 100 100 100 100 100 100 100 100 100 100 100 
##$AQSEQ= 0
##$AQ_mod= 1
##$AUNM= <au_zg>
##$AUTOPOS= <>
##$BF1= 200.13
##$BF2= 200.13
##$BF3= 200.13
##$BF4= 200.13
##$BF5= 200.13
##$BF6= 200.13
##$BF7= 200.13
##$BF8= 200.13
##$BYTORDA= 1
##$CFDGTYP= 0
##$CFRGTYP= 5
##$CHEMSTR= <none>
##$CNST= (0..31)
1 1 145 1 1 1 1 1 1 1 1 1 1 1 1 1 1 1 1 1 1 1 1 1 1 1 1 1 1 1 1 1 
##$CPDPRG= <>
##$CPDPRG1= <>
##$CPDPRG2= <>
##$CPDPRG3= <>
##$CPDPRG4= <mlev>
##$CPDPRG5= <mlev>
##$CPDPRG6= <mlev>
##$CPDPRG7= <mlev>
##$CPDPRG8= <mlev>
##$CPDPRGB= <>
##$CPDPRGT= <>
##$D= (0..31)
0 1.2 0 0 0 0 0 0 0 0.06 0 0.03 0 0 0 0 0.0002 0 0 0 0 0 0 0 0 0 0 0 0 
0 0 0 
##$DATE= 1707126826
##$DBL= (0..7)
120 120 120 120 120 120 120 120 
##$DBP= (0..7)
150 150 150 150 150 150 150 150 
##$DBP07= 0
##$DBPNAM0= <>
##$DBPNAM1= <>
##$DBPNAM2= <>
##$DBPNAM3= <>
##$DBPNAM4= <>
##$DBPNAM5= <>
$$ [...]
##$SUBNAM3= <"">
##$SUBNAM4= <"">
##$SUBNAM5= <"">
##$SUBNAM6= <"">
##$SUBNAM7= <"">
##$SUBNAM8= <"">
##$SUBNAM9= <"">
##$SW= 18.0517328524113
##$SWIBOX= (0..15)
0 0 2 0 0 0 0 0 0 0 0 0 0 0 0 0 
##$SW_h= 3612.71676300578
##$TD= 16384
##$TD0= 1
##$TE= 0
##$TE2= 300
##$TE3= 300
##$TEG= 300
##$TL= (0..7)
0 120 120 120 120 120 120 120 
##$TP= (0..7)
150 150 150 150 150 150 150 150 
##$TP07= 0
##$TPNAME0= <>
##$TPNAME1= <>
##$TPNAME2= <>
##$TPNAME3= <>
##$TPNAME4= <>
##$TPNAME5= <>
##$TPNAME6= <>
##$TPNAME7= <>
##$TPOAL= (0..7)
0.5 0.5 0.5 0.5 0.5 0.5 0.5 0.5 
##$TPOFFS= (0..7)
0 0 0 0 0 0 0 0 
##$TUNHIN= 0
##$TUNHOUT= 0
##$TUNXOUT= 0
##$USERA1= <user>
##$USERA2= <user>
##$USERA3= <user>
##$USERA4= <user>
##$USERA5= <user>
##$V9= 5
##$VALIST= <valist>
##$VCLIST= <CCCCCCCCCCCCCCC>
##$VD= 0
##$VDLIST= <DDDDDDDDDDDDDDD>
##$VPLIST= <PPPPPPPPPPPPPPP>
##$VTLIST= <TTTTTTTTTTTTTTT>
##$WBST= 1024
##$WBSW= 4
##$XGAIN= (0..3)
0 0 0 0 
##$XL= 0
##$YL= 0
##$YMAX_a= 67850
##$YMIN_a= -90857
##$ZGOPTNS= <>
##$ZL1= 120
##$ZL2= 120
##$ZL3= 120
##$ZL4= 120
##$ABSF1= 15.48576
##$ABSF2= -2.56609
##$ABSG= 5
##$ABSL= 3
##$ALPHA= 0
##$AQORDER= 0
##$ASSFAC= 0
##$ASSFACI= 0
##$ASSFACX= 0
##$ASSWID= 0
##$AUNMP= <proc_1d>
##$AZFE= 0.1
##$AZFW= 0.1
##$BCFW= 0
##$BC_mod= 2
##$BYTORDP= 0
##$COROFFS= 0
##$CY= -3
##$DATMOD= 1
##$DC= 0
##$DFILT= <>
##$DTYPP= 0
##$F1P= 0
##$F2P= 0
##$FCOR= 1
##$FTSIZE= 16384
##$FT_mod= 6
##$GAMMA= 0
##$GB= 0
##$INTBC= 1
##$INTSCL= 3.70164e-10
##$ISEN= 128
##$LB= 0.24
##$LEV0= 0
##$LPBIN= 0
##$MAXI= 10000
##$MC2= 0
##$MEAN= 0
##$ME_mod= 0
##$MI= 1.114404
##$NCOEF= 0
##$NC_proc= -9
##$NLEV= 6
##$NOISF1= 3.799351
##$NOISF2= 2.8
##$NSP= 0
##$NTH_PI= 0
##$NZP= 0
##$OFFSET= 15.60256
##$PC= 1
##$PHC0= -24591.73
##$PHC1= 7.65268
##$PH_mod= 1
##$PKNL= yes
##$PPARMOD= 0
##$PSCAL= 0
##$PSIGN= 0
##$REVERSE= no
##$SF= 200.129983818255
##$SI= 16384
##$SIGF1= 3
##$SIGF2= 2
##$SINO= 5.538805
##$SIOLD= 16384
##$SREGLST= <1H.CDCl3>
##$SSB= 0
##$STSI= 16384
##$STSR= 0
##$SW_p= 3612.71676300578
##$SYMM= 0
##$S_DEV= 0
##$TDeff= 16384
##$TDoff= 0
##$TI= <>
##$TILT= no
##$TM1= 0
##$TM2= 0
##$TOPLEV= 0
##$USERP1= <user>
##$USERP2= <user>
##$USERP3= <user>
##$USERP4= <user>
##$USERP5= <user>
##$WDW= 1
##$XDIM= 16384
##$YMAX_p= 484854169
##$YMIN_p= -2459784
$$ End of Bruker specific parameters
$$ ---------------------------------
##NTUPLES= NMR SPECTRUM
##VAR_NAME=  FREQUENCY,     SPECTRUM/REAL,   SPECTRUM/IMAG
##SYMBOL=    X,             R,               I
##VAR_TYPE=  INDEPENDENT,   DEPENDENT,       DEPENDENT
##VAR_FORM=  AFFN,          ASDF,            ASDF
##VAR_DIM=   16384,         16384,           16384
##UNITS=     HZ,            ARBITRARY UNITS, ARBITRARY UNITS
##FACTOR=    0.220516191357247, 1,           1
##FIRST=     3122.54008899598, 0,            0
##LAST=      -490.176674009802, 0,           0
##MIN=       -490.176674009802, -2459784,    0
##MAX=       3122.54008899598, 484854169,    0
$$ Real data points
##PAGE= N=1
##DATA TABLE= (X++(R..R)), XYDATA
$$ [...]
13900 161746 -370283 -657882 -106757 1524 257767 -30216 572179 815512 255842 60876
13890 60876 -759360 -563985 -735154 -100920 224309 -757974 -1324975 -557620 -22936 3442
13880 3442 -569635 127110 513977 661600 928371 158265 -326986 -483847 219093 362618
13870 362618 -337560 49055 708940 1015660 243343 -373483 -25514 -40346 -585740 -989501
13860 -989501 -1495411 -1066627 -915247 -181256 -352342 -399933 11369 399726 620644 -255662
13850 -255662 -825769 -167104 21974 -565042 -67099 174008 -588514 -738411 253787 -106233
13840 -106233 -20536 526537 514350 -44296 -1048921 -269261 -449285 -267703 415377 28985
13830 28985 -412444 -96044 130941 321181 -459548 -370190 -70966 -94429 -195042 -328716
13820 -328716 140551 -580604 -484483 -573319 615086 226892 -141424 -120185 388769 628895
13810 628895 -133228 -5001 31044 -351393 -483326 -314788 1651643 769078 -126940 349802
13800 349802 735500 -159071 -279072 -335764 -294494 390765 895941 602228 273791 222897
13790 222897 -93238 -273673 -693028 -972465 -312608 -157359 418092 -207064 -612022 -158159
13780 -158159 122090 312975 84517 306193 266634 157383 268920 670149 -356769 172148
13770 172148 -119491 -160679 643067 818953 356977 -361922 -628518 223165 601675 -194346
13760 -194346 -465521 371168 553282 185658 102747 495908 565481 106422 296163 -132186
13750 -132186 -456153 -470593 -301811 -78713 903 -264030 -938812 -676735 -247920 -43993
13740 -43993 49172 -429056 55430 1307437 132898 41819 -178736 -430056 110210 281710
13730 281710 264960 1128951 735671 266721 332539 -192306 101750 -555955 -989867 -1208878
13720 -1208878 -364334 -312662 -827707 -249766 340657 941329 -230680 -1229558 14350
13711 14350 -351287 -438707 -120766 -827391 -43971 -82024 44812 353955 1086483 366597
13701 366597 448144 539389 905160 -64973 -328649 152034 73801 606785 138249 80837
13691 80837 34723 -724559 91655 327644 -12237 -79651 -189946 -412893 150211 -256467
13681 -256467 -539717 -622949 -663138 -596013 -1084301 -1009061 -887605 -394220 -449247 -294796
13671 -294796 -107211 294401 1016283 1095757 -357896 -872381 -1453769 -513843 548011
13662 548011 -252637 -1891524 -1366770 -1214844 -1024449 -656976 152081 -38371 145542
13653 145542 -168975 323977 533860 -809353 -852632 23744 841118 629818 -239862 -822979
13643 -822979 -1273428 -502168 -141447 572802 473995 -538677 -696724 -241133 -397161 -731954
13633 -731954 -487900 189110 -43124 -186923 -249861 -746378 -166894 -98719 161856 -333857
13623 -333857 65390 412309 -238313 112422 13568 812604 311381 -231143 547181 -372474
13613 -372474 23820 -910053 -829397 -855865 -196910 829387 -278992 40762 685942 423364
13603 423364 154918 -74148 -217351 -597591 -373136 -871211 -1305386 -719342 -443220 -1047964
13593 -1047964 -1006015 77750 328552 654808 -407096 -1077448 -969918 -241621 159563
13584 159563 168791 521151 -295609 -329517 481086 -34481 -51699 -879085 587478 512957
13574 512957 -534914 -57591 -601679 -783784 -1127352 -684853 -1327704 -623040 118401
13565 118401 -779562 -758719 76218 481908 1072078 1093627 1224078 394726 185259 -821314
13555 -821314 -1197328 -989846 -259651 8661 -696943 -249421 348569 100892 824200 1040558
13545 1040558 909098 1163227 620064 -161413 -233361 511887 187612 912899 310619 271455
13535 271455 1241490 413196 398852 382188 125086 187539 -363410 -654830 -1629402 -1158248
13525 -1158248 72638 -20427 -592261 -510010 -801333 -992223 -685712 -77473 -1250216
13516 -1250216 -1566342 -979711 -232982 -141354 -564095 -58964 -574083 -254044 -338399 633378
13506 633378 886783 354539 -113444 262943 176978 -16661 -403463 -250482 -464378 -467653
13496 -467653 235615 -580335 -561320 69159 -713151 -1169985 -1042238 -146606 -610711 -592460
13486 -592460 -818092 -631426 -226928 -274601 -608580 -696232 -210582 -673023 -1058726 -1355580
13476 -1355580 -1390309 -1996162 -652249 -616525 -409316 111889 45271 -693376 -668997 -89655
13466 -89655 -484442 120021 391229 51547 -285924 -1096513 -637620 -416919 -287213 -196214
13456 -196214 460982 300222 -349960 -535032 137176 22531 -177210 1035776 227280
13447 227280 -462724 1975 448941 191016 -415498 -473743 -818655 -109529 308349 -639933
13437 -639933 -1095245 -717235 180188 204864 -324465 -97984 -199831 421444 501713 314020
13427 314020 860628 872272 344859 -258689 59509 -221648 114822 -303897 465037 -76142
13417 -76142 -224634 401706 945620 1158861 274136 -41321 -371039 76096 833758 669920
13407 669920 -258316 678721 -20087 -336339 -976317 -985632 -743082 -493209 148170 835366
13397 835366 936341 471946 -235484 -698665 -499401 -228296 -451167 -905662 -1170042 -1565830
13387 -1565830 -355173 -494871 -339031 523428 165017 -511594 -373448 -547616 -394731
13378 -394731 -172137 -317679 297529 337680 -189959 -403769 -163287 -80288 -29893 -275692
13368 -275692 571418 138672 308067 -31931 -1110112 -793468 -23199 -14811 411961 461988
13358 461988 358669 -126697 483641 906705 -462896 -608814 -1049077 -135639 -607944
13349 -607944 -890894 -206131 513110 582204 121181 -277109 -34456 -252774 -432587 -509109
13339 -509109 -562722 -42858 -257615 -314954 -385300 -50047 300602 -553184 -778273 -383472
13329 -383472 -804953 260347 949605 213013 -9945 -425722 -97488 -827159 -369741
13320 -369741 -161583 -887863 -592834 -937904 -466671 200267 -702324 -520262 -990806 26694
13310 26694 585411 -676837 -513391 -94634 124700 175514 -63075 1247374 597764 -414054
13300 -414054 -308096 -702810 51107 83722 293536 437998 993965 1037906 421903 461142
13290 461142 91473 -28931 -32332 359623 169803 348158 477061 469958 -268440 -732784
13280 -732784 -180384 -391259 -754316 -50674 509529 -600124 -431482 785918 378060
13271 378060 -173028 -517421 -385931 214929 176723 83953 -674443 -933952 -713467 -458030
13261 -458030 -189650 110169 53632 -606173 18331 684736 307543 405811 314586 1129912
13251 1129912 225918 278309 268724 -19614 -679647 -972441 -566070 -337210 -516975 -478985
13241 -478985 -801012 -883848 -528594 -103943 -657891 -753228 -32954 127668 -148532 -925307
13231 -925307 -1171972 -712185 403344 -52177 56282 9150 -398828 -786331 -648127 -161414
13221 -161414 -1601919 -1775699 -537757 -459696 -518818 -942781 -936522 -414866 991764 697614
13211 697614 -684188 -753113 -112863 299336 -160027 -505213 -1001813 -1336512 -810101 -652229
13201 -652229 -62196 1288909 365034 -291099 -1390610 -1040014 -342890 -358166 199831
13192 199831 50941 -411128 114990 -499119 -418122 -260596 236784 -20592 45335 995482
13182 995482 951516 587139 -242060 -541610 -951326 -1187491 -466079 -438801 -580196 -13510
13172 -13510 136047 532320 -271908 -412781 229286 -116415 -726522 -162900 -634630 -354186
13162 -354186 -72031 -647791 79078 -316682 -511039 610818 576752 603447 689758 340937
13152 340937 62614 -111199 -595017 -161498 216733 -295502 -933760 -558383 -784987 -1084020
13142 -1084020 -671617 -790476 -836784 -731899 -924852 -1198378 -685839 -340042 -626329 295224
13132 295224 215940 -442662 -1316752 -1105855 -1091433 -125153 230663 -988873 -964318 79232
13122 79232 816738 453204 215756 770224 29134 -1171006 -1104988 139482 119307 -364796
13112 -364796 -452146 -365119 107306 150551 -983128 -368206 1192371 395869 436942 719588
13102 719588 597966 -206699 -257732 -717500 -1057012 -706082 -1150463 -275777 4670 -723030
13092 -723030 -453744 -449198 -470113 -262091 -653549 -370642 -625817 -758132 -960897 -1156596
13082 -1156596 -612389 -332668 -561035 -641746 -683464 -510563 -551761 -926781 -882923 -458130
13072 -458130 -60479 -526476 -312228 -389915 -744620 -1533082 -1046489 -661582 -451778 -459837
13062 -459837 -13282 234024 -291329 -950510 -353082 -844197 -224468 202073 -358572 -61556
13052 -61556 281643 13212 -713006 -295540 180750 294636 150658 721751 463759 145714
13042 145714 655804 496806 -82566 -630196 -62224 534314 292693 -66824 27417 851694
13032 851694 238186 -57329 825177 70680 280587 15147 -816667 -1099042 -787543 -742619
13022 -742619 -1531450 -720320 -415029 -89980 122709 -550309 -463988 -258974 -230458 -333465
13012 -333465 -10789 -459323 -1090426 -1203201 -199054 295005 -492877 -694219 -168719
13003 -168719 -61904 -517109 -826202 -587491 -603496 -476272 -113404 104731 265517 -30536
12993 -30536 -295819 -294454 -371493 -757179 -321071 -525786 -526492 -152759 209921 584627 555538
12982 555538 329617 200706 -348248 -495993 86835 444590 -227522 242942 236947 16324
12972 16324 -63857 -61434 -310695 -101708 233408 55579 -62029 -104663 -651030 -377313
12962 -377313 64959 22053 -203042 -870224 -343281 10473 -914927 -332938 -17262 92852
12952 92852 263864 -360487 -299433 199313 612058 -810551 -338557 -224544 -694616 -7955
12942 -7955 -122741 260768 294652 -206992 -235900 -152291 -256874 742545 554375 -774623
12932 -774623 -844042 -1802378 -972631 -77664 644804 116126 5690 482135 -374704 -1003398
12922 -1003398 -1328883 -1602368 -944816 -618237 -173512 458865 -782111 237099 997215
12913 997215 65651 5709 -527860 -1382002 -306803 106011 381086 -588660 -577022 -345126
12903 -345126 -297736 -492319 -498567 -63129 547928 356951 309044 697800 -62258 -111886
12893 -111886 542989 450663 872768 1215583 1253925 1597810 1061527 302802 -621945 -985690
12883 -985690 -52268 218004 -154967 310126 -614936 -832161 -929607 -441190 411121 -69082
12873 -69082 -141851 -636104 -725404 -103904 -1268456 -436851 -295357 -827523 -476560 -198326
12863 -198326 -248560 300685 -163889 7688 305026 -80173 463348 -185396 -598148 -534127
12853 -534127 -835562 -326591 -115846 -263950 -771377 -1005171 -318800 -466807 -730324 -419758
12843 -419758 -809068 559214 1042608 124247 -451972 -232180 346917 117365 -196378
12834 -196378 -81207 -98686 -80457 -337528 -1150657 -724193 270782 146065 -501716 -934356
12824 -934356 -714989 -583769 -353901 -227744 -1147298 -1283022 -708034 -740402 -1201660 -871685
12814 -871685 -549084 -334865 -356583 -430887 327788 965937 187828 -870199 -1854799 -739164
12804 -739164 -833831 136317 259418 66531 -307222 -551425 -625234 140509 16527 -597005
12794 -597005 -614425 -480567 -149470 -151163 235966 -85514 -327211 -842371 -189783 -19785
12784 -19785 -96910 419756 227414 70016 -226102 -152328 -30047 -380971 -731412 -478481
12774 -478481 -491584 382038 856788 292763 -70746 -279365 -855793 -669766 -273008 -137745
12764 -137745 -622273 -919812 -328210 253741 1002854 306239 596267 340022 349056 327665
12754 327665 381531 -285623 72848 -113900 -547722 -587425 -839447 -1279720 -1186512 -268693
12744 -268693 361079 592248 -389380 -1373898 -1199219 -250016 -39651 -456903 -187375 -561417
12734 -561417 -998908 -453026 -264400 -802695 37908 209213 469362 82591 -11192 -255756
12724 -255756 -96621 1244061 261696 -757433 -1012366 -1434595 -766636 -770743 -322670 -437593
12714 -437593 -317676 33146 123756 425251 558046 111882 -111061 -60930 -786244 -875709
12704 -875709 -691047 -642770 -65241 214589 -508159 9782 26146 330135 -911787 -532338
12694 -532338 -475174 -498245 -256450 -766390 -422515 35210 -842966 -671847 489689 352770
12684 352770 -184757 -344141 -771623 -184546 -75371 331849 140205 195883 520366 689496
12674 689496 109205 -412285 -707370 -304500 784302 306648 274601 548263 224164 266208
12664 266208 514083 -399199 -158376 102650 508824 -244718 -837286 -57608 578008 382585
12654 382585 -60239 42219 72046 -69302 245962 244512 97848 75229 76538 488727 225410
12643 225410 -447194 -468271 -1213727 -509294 -304883 76285 -93711 -709290 -330169 -469553
12633 -469553 -685823 248618 1069622 449425 -825461 -522048 533069 -755881 -910204
12624 -910204 -734357 -286137 144417 482559 -422760 -1325756 -1684063 -974816 -485492 -103500
12614 -103500 738500 910466 729683 -139617 -590999 -631260 -612010 -219252 -392770 -707321
12604 -707321 -754096 -809575 -1255276 -380939 -872220 -1538006 -470491 -660020 -980727 -655199
12594 -655199 -576792 -785275 -24592 147173 101002 -392910 -176163 -405223 -834393 -867322
12584 -867322 -492596 30866 903287 471332 -141336 -696314 -306479 519862 598365 -348201
12574 -348201 -1222654 -839864 -652350 -652225 -355807 -291522 -305806 249152 258772 209814 -634516
12563 -634516 -781342 -339869 -459268 -731633 -890269 -158015 -364500 549457 479687 132558
12553 132558 -295261 -221950 129146 165589 -119171 -1047250 -452116 -708221 -993413 -238962
12543 -238962 100231 -95485 -265312 286323 333518 -165076 -468047 -215988 -86689 123547
12533 123547 232561 200442 201060 19821 386276 -311684 -299583 -706551 -370087 -322254 -637370
12522 -637370 -580593 -732004 -89881 733554 396603 53160 -58577 -129535 -969047 -226099
12512 -226099 625082 357566 -113476 494274 340268 -145305 -461940 -168646 -593743 -257265
12502 -257265 470865 181837 218098 -154340 33114 -856355 -389839 -22527 -563283 -566379
12492 -566379 -497259 -81130 -231949 -1102502 -451746 -238031 -882783 -701119 -585915 -440621
12482 -440621 -61142 -589275 -1066683 -33348 -289243 -589110 -1256241 -1200490 -327395 -493910
12472 -493910 -851530 -899243 -235321 -82769 -200445 -131363 -319037 -340352 100765 -488028
12462 -488028 -21308 -395118 -1030184 -748317 -396738 -122741 -51268 -123865 152468 470987
12452 470987 354785 -290551 -594351 -519754 -355078 -702183 -1308456 -957360 -221792 192211
12442 192211 24354 -714485 -1157166 -725125 -57662 1312847 1809647 700736 313441
12433 313441 469834 -1699 -103845 206318 894047 412285 -676359 -409538 -1106695
12424 -1106695 -850674 -1153778 -1023404 -1166218 -1167193 834962 1338682 284638 -5022 546115
12414 546115 -779054 -936288 -482329 -4015 -475868 -70390 258443 -136192 -233184 354939
12404 354939 845236 -33069 -6559 192298 209333 68482 -1201704 -684279 514443 -58869
12394 -58869 77222 -40484 -172354 -516244 -624764 -786053 -391506 -745188 -815237 -224429
12384 -224429 207889 -119265 776089 1107857 505544 -412922 -1003870 -112607 -236519 -781907
12374 -781907 -1271567 -1435731 -710495 -331907 398924 602815 473602 -123892 230117 232028
12364 232028 -1258552 -1421083 -337675 184344 -1022044 -1166082 -995558 -122226 -433395
12355 -433395 -185569 80275 -349126 -676135 -76851 -265564 -417923 -157440 105870 800058
12345 800058 568714 -354940 -805178 -364674 -967344 -467498 -239085 79692 388031 385877
12335 385877 858782 862490 -59849 -937195 -479277 -530649 -421086 -484059 -215403 229193
12325 229193 474016 600472 -556260 -437270 50365 -641868 -438192 -485603 -95452 720169
12315 720169 184311 -122424 -359779 -88760 -6377 -6954 412305 -274514 193536 219391
12305 219391 257050 21051 194666 -344222 -278383 -296258 -653604 -191869 51616 -405260
12295 -405260 -1473677 -346557 312826 35820 -896289 -993802 -400023 -110097 -156884 637907
12285 637907 991598 -138414 393274 236717 -67658 330670 944416 1285829 1072600
12276 1072600 462869 439223 234469 646643 67405 -190277 392422 928709 147709 203362
12266 203362 457347 570617 83881 -600580 -160550 -81065 17184 31174 -461528 -888017
12256 -888017 26119 194906 -68701 216665 709657 721342 937797 923285 1366090 539138
12246 539138 923024 1016811 699318 582948 834239 443204 400205 103242 717632 80537
12236 80537 -54489 -7975 -380503 -147913 -330474 -514800 -374493 -411460 -44949 -755313
12226 -755313 -808647 -204267 -232413 96790 -861808 -683754 -304549 -233533 368262 -757116
12216 -757116 -597207 -357441 -185043 166188 -216969 -371865 -393417 -411069 -473759 1242
12206 1242 -187947 -410422 -102393 -251535 -667101 -225703 541420 797073 671290 721726
12196 721726 217728 -105005 610237 1338210 137839 489636 -669526 -1824110 -962936
12187 -962936 -615852 388904 583486 -60974 -207841 263336 304558 939436 488296 288308
12177 288308 747692 902497 1029275 155238 357687 248522 229209 599854 477748 857925
12167 857925 807113 642535 896499 1306414 805586 536913 497463 763790 914948 635689
12157 635689 57764 -96959 -536799 -782740 -208332 81130 289573 -450157 -375789 -157793
12147 -157793 248202 -90952 -159124 -709965 -250007 -742110 -148297 -133710 -216479 -492223
12137 -492223 -179978 -89208 258326 803797 352727 207982 424025 599339 1154095 -20720
12127 -20720 -444557 33807 -238069 -45399 289426 105421 -34089 168784 -148100 -250892
12117 -250892 471169 -115303 14880 1036625 368618 716998 523705 840405 71303
12108 71303 -284328 648153 161635 -178888 163701 362459 335782 492512 534222 19874
12098 19874 859423 629653 251788 110537 -284471 322961 -361985 -551885 -143007 -441
12088 -441 710727 -719873 -388596 -239624 -357128 27805 264758 -486416 -15279 417883
12078 417883 -108308 16048 -335617 271690 419829 791330 460309 880800 875742 681928
12068 681928 352598 66839 626038 747630 1029146 884792 1371311 697813 522504 -123128
12058 -123128 -662225 -417807 -115899 400301 696681 871042 1401445 797831 299456 626058
12048 626058 1712329 1376659 662859 377456 812195 -361033 -337491 651765 872262
12039 872262 52345 -149485 -591936 144884 684522 594791 607547 -118606 -537003 -798813
12029 -798813 220858 538504 388254 57799 988493 465952 370506 -159032 94780 603206
12019 603206 312853 -159177 -77787 924015 827002 346108 911934 1178814 716223 719313
12009 719313 1386544 1055005 226944 69823 779200 802510 1179300 1559703 1628110 680271
11999 680271 -599640 -411687 763132 1525496 985880 1010470 1115971 822026 1128681
11990 1128681 1395113 1684450 503107 70547 266885 204540 922152 982732 754029 1175084
11980 1175084 744540 800333 615616 826921 965262 1187716 1222313 589432 1344417 1717290
11970 1717290 1337924 1142611 555773 522527 985304 1339062 1239369 1051572 1663036 1660052
11960 1660052 1154200 802146 762059 1151224 1113404 134092 521155 652992 679705 425230
11950 425230 339571 995619 242406 696577 1836924 1770596 294927 -238409 503234 1996018
11940 1996018 1625236 1129694 1356377 1098683 1755249 1347579 1204621 1209669 697984 613608
11930 613608 996073 1395748 1676714 1657518 1116490 1244823 1017849 735525 1329822 1601497
11920 1601497 1698184 1858886 2628820 2330805 2244561 3036437 1711534 1266450 2379882
11911 2379882 2444117 1480124 808089 1665784 1829729 2075840 2417513 2516068 2691804 2919118
11901 2919118 2991411 2715766 2322100 3211770 2878313 2102233 1849831 1626027 2174322 2759846
11891 2759846 2134175 1521793 2079620 2296475 2154085 2490592 2740595 3372934 3277245 3119615
11881 3119615 2687452 1996838 1992658 2610638 2960200 2348025 3107172 3743345 3233892 2882568
11871 2882568 2979041 3586009 3586312 3584030 3187799 3241087 2539641 2649157 3164640 3243039 3308020
11860 3308020 3054334 3412419 3485112 3550391 3128888 3273349 4045044 4105050 4419252 4328193
11850 4328193 3860597 4118204 4438119 5319117 5474172 5204486 5096932 5207982 4601580
11841 4601580 4921002 5390685 4911574 5429771 5615816 5313362 5077128 5974450 5747572
11832 5747572 5769153 5897288 5833349 5660304 5485549 5946429 5627894 6107571 6251746 6725451
11822 6725451 6953130 7042264 6770705 6815976 7175676 7431987 7408274 8202127 8805605 8768962
11812 8768962 8423160 8505771 8592820 9194337 9395576 10326838 10015509 10395640 10907857 11062338
11802 11062338 10646624 10569900 10928532 11586921 11528880 11808504 12524843 13442838 13350697 13619349
11792 13619349 14349959 13661331 13959288 14752663 15024749 15974670 17400253 17769096 17615171
11783 17615171 18125060 18932295 19037612 19514065 20397019 22149901 22132659 23024746 23439835
11774 23439835 23467091 24469850 24653266 25249128 25539011 25539825 26215400 26229036 25981621 25520275
11764 25520275 25756131 25799956 25220299 24708966 25155095 24495270 24628821 24885806 24629157
11755 24629157 24583033 23607213 22975995 23778100 24041137 23909763 23106536 24238484 24995345
11746 24995345 24416289 23817317 24678969 25365121 25026615 25283464 25610111 25834910 25799549
11737 25799549 26130565 27598298 27461666 28374528 28810475 28932944 29401764 30117930 30754861
11728 30754861 32058438 33201729 33766651 35937331 36615554 36810585 37473951 38896424 40751710
11719 40751710 41631527 43218041 45684792 46886468 47650030 50203946 52270299 53879088
11711 53879088 56115412 57545746 59105356 60064295 62865649 65272890 67374523 70151294
11703 70151294 72867674 76241677 78415701 80721205 82821355 85552867 89043883 90677881
11695 90677881 93188230 95755366 97584866 99456228 100600536 100403023 100160728 99187081
11687 99187081 97939540 96386903 95316613 94008247 90929086 88477554 86782840 82948505
11679 82948505 79795212 77095248 73692060 70329602 67742750 64757741 62799333 60037637
11671 60037637 57426632 54569263 52352778 49795693 47127614 44781440 43173123 41116450
11663 41116450 38819470 37885118 36822760 34601153 33015334 31416357 30031954 29995085
11655 29995085 28870792 27488298 26948657 26671154 25284583 23789179 23511482 21948358
11647 21948358 21823248 21820993 21206390 20509961 19028105 19142236 18085573 16975649 16088256
11638 16088256 15120400 15752310 15521692 15187406 14775874 14337832 14431310 13922652 13429531
11629 13429531 13232656 12368867 11393245 11917456 11764459 11291648 10157459 10236449 11213276
11620 11213276 11322104 10531435 9655828 8884550 9621834 8990981 8364098 8337423 8777510
11611 8777510 8352326 8188173 8357460 7807382 7279786 7866105 7652860 7077778 7292337
11602 7292337 6827195 6382099 6862693 6910996 6676097 6591180 6652896 6290819 6195338 5210423
11592 5210423 4991664 6805626 6129432 5874466 5741141 5405317 5022873 5142815 5393619
11583 5393619 5033341 4642005 4992763 4959037 4681301 4735039 4579321 5151083 4786419 5289169
11573 5289169 4376105 3874773 3718867 3536226 4503279 4710482 4556457 4544543 4759447 4014780
11563 4014780 3676532 3494890 3420455 3803871 3215366 2924187 2950610 4041745 3765236 3451773
11553 3451773 3345774 3332827 3079863 2577732 2787517 3061408 2274101 2100424 2650746 2945459
11543 2945459 3138856 3201103 3216203 3042330 2584129 2788141 3076876 2964172 3270543 2699974
11533 2699974 2643098 1715430 2579307 3171356 2913424 2329241 2415871 2225666 2640849 1942333
11523 1942333 2102540 2167314 2778392 2773066 2766497 2606614 3126508 2916089 2140681 1979271
11513 1979271 2149491 3152196 2686055 1925131 1135978 2253623 1751694 1841204 1946394
11504 1946394 2541727 2295580 2309088 2178385 2089557 1966492 2832281 2495141 2545105 1713367
11494 1713367 1050100 1943833 1953315 1867328 1616719 1847561 1897840 2556895 1541392 2043008
11484 2043008 2628222 3064391 3093942 3075475 3001798 2768117 2591706 2579980 2708301 1567227
11474 1567227 1841125 3028594 2911399 3077125 3446315 3403827 3644185 3441864 3382249 3528437
11464 3528437 3195233 2660483 2568242 2008727 2488066 3567821 3233775 2750035 2514910
11455 2514910 2517102 3184959 2990484 2627037 2590458 2535678 2427094 2134379 3642653 3138437
11445 3138437 2860917 3244194 2770809 2398874 2241308 2459493 2388876 2512367 2540467 2456086
11435 2456086 3476106 3555204 2974986 2827562 3477012 3177053 3513163 2871307 2525907
11426 2525907 2191463 2084637 1930840 2672046 3157369 3552858 4071425 3422080 3481733 2995959
11416 2995959 3268910 3161111 3090386 3963393 4217591 4041113 4338252 4269470 4274767 4551820
11406 4551820 3990114 2466745 3257589 3652202 3066223 3174969 2902725 3159675 2851564
11397 2851564 3202570 2794514 2012821 2119804 1904255 1769576 1734182 2035492 1847963 2015977
11387 2015977 2127651 2303122 2234127 2515495 2706082 2241335 1910755 2575836 2216435 2257978
11377 2257978 2105326 1765095 1512188 1612435 1530247 1489238 1012807 873565 1464179 1301458
11367 1301458 1291057 1619842 1914957 1208867 1271033 1895451 1500496 1152306 1420472 1847193
11357 1847193 1388963 1187350 1876135 2324754 1053837 1031065 900944 925333 1129603 1458164
11347 1458164 1765499 1458808 115204 580081 640694 781375 1635301 1612152 879886 1546730
11337 1546730 1912468 1552271 1146469 1852758 2347209 1612120 1107952 1753233 1750800 834575
11327 834575 1076122 823680 562731 1009935 793336 396897 -178173 1002075 1204366
11318 1204366 791105 1077356 763474 911707 476509 1200440 1700545 969725 225040
11309 225040 1507890 1122043 725941 247550 1286085 1407121 1323524 1170510 1308787
11300 1308787 1507023 1522697 796799 795506 944982 928273 578907 1057251 1696744 1518943
11290 1518943 1394789 1516168 770544 362844 198142 733388 1477501 1714253 1413004
11281 1413004 1601249 1559544 1706817 2107915 1681056 1486268 1269328 952872 774598 696045
11271 696045 1162877 586890 1587664 2281355 2253987 2598281 2629683 1954247 2615261 2730356
11261 2730356 2231043 2445028 2444731 2728503 2465294 2700285 2737307 2317411 1210046 1711582
11251 1711582 1195791 956854 1080104 2135361 2303877 2666222 2009252 1884234 2062981
11242 2062981 1367924 1493136 1984646 2030220 2266743 2341153 2399526 2640899 2100515 2011708
11232 2011708 2522534 2630821 2385826 2341820 2691849 2690709 2590585 3038961 3159562 3524083
11222 3524083 3153949 3077004 3660757 3811227 3735294 3668334 2727001 3146680 3443489 2789077
11212 2789077 2911167 3383938 3973550 3615564 4175414 3874443 3492509 3923770 4478094
11203 4478094 3916741 4005147 4433951 3821634 4149433 4364978 4348685 4593118 5027784 5168671
11193 5168671 5401461 5387067 5139931 5491196 5198575 5036081 5661465 6923103 6887764 6526554
11183 6526554 5725687 5131663 6471653 6175728 5918542 6760215 7493383 7830329 7045138
11174 7045138 7333363 9084477 8835383 8312436 8893911 8789711 9141672 9099916 9407384
11165 9407384 9536072 10141680 10188691 10731935 10117985 10217870 11468401 11360581 12096088 12728059
11155 12728059 13028402 13372941 14033248 14010017 14964463 15880809 15387497 14894949 15378857
11146 15378857 15616674 17211832 17775250 17586456 17639019 18584826 19774441 20761616 20643047
11137 20643047 20915631 22104553 21698295 22925531 24355396 24739816 25408543 25781845 26802563
11128 26802563 27181370 27350783 26827477 27631233 28431711 28068820 28369784 27972673 27838588
11119 27838588 28128183 27697847 27056603 27241143 27208199 27273840 25829769 25604312 25035026
11110 25035026 23753183 23457044 23206841 21652947 20830044 20712153 20790084 20171173 18998788
11101 18998788 18298076 17563267 16715334 15743019 15465753 15197074 14734018 13898469 13517372
11092 13517372 14196352 13829558 13002116 12311308 11535908 11184443 10379559 10472267 10041070
11083 10041070 9422543 9431811 9289000 8385727 7918502 8615769 8536270 7776382 7708390 7032293
11073 7032293 7091505 7135281 6399423 5743968 5820472 5693608 5279481 5036332 5698587 6171955
11063 6171955 6246769 5722298 4991442 4868098 4726191 4324190 3696793 3524928 2870281 3197235
11053 3197235 4206059 4204626 3305255 3843974 4288658 4010211 4122174 3924144 3968265 3835731
11043 3835731 3229741 3651862 3358636 3417724 3747453 4020144 3768358 4189887 4100852 4034643
11033 4034643 3211812 2051354 2724077 3016296 2860655 2586834 2671762 1701998 2151516
11024 2151516 2918118 3097149 2939284 1728158 1646978 1898661 2123423 2254800 873663
11015 873663 1072904 1518359 1908432 1487195 1630762 1285111 1657495 1624699 1374234 1778785
11005 1778785 1653031 888578 592795 1039765 1694297 1842888 1115211 423147 796349
10996 796349 1368662 956274 1431054 1630541 3301976 1950973 1566878 1393791 440549
10987 440549 152011 588190 451013 589654 1076550 1610348 1872148 1351211 1902997 988352
10977 988352 426926 496902 554473 841763 54504 429141 1176389 880447 1180958 1248210
10967 1248210 729498 493616 1328943 1808936 2040777 1614513 1696029 1147149 346092 156051
10957 156051 851469 885327 1231715 1395972 1398014 1504895 121710 -492645 392972 668711
10947 668711 456955 802550 1300429 1503785 1072089 856391 672722 318627 176520 -409055
10937 -409055 -226528 453114 1276137 2066578 805295 548194 557966 944754 178885 94354
10927 94354 1118174 1319084 1469036 741572 532177 651350 1841059 998322 1343077
10918 1343077 1321771 676120 1174795 1579743 1077038 721676 378489 -252477 672241 493126
10908 493126 398850 490145 84540 -339698 -119531 296937 415536 395466 544354 1244059
10898 1244059 1075064 838876 599255 121225 432062 -107240 763037 234433 -522945
10889 -522945 -205543 -5187 365924 -207537 58919 102611 203746 528476 359569 -51168
10879 -51168 -37243 -172849 -528541 16924 -22707 910432 757668 634229 1175924 162537
10869 162537 115276 274189 969032 1350107 362876 68159 252913 293478 -29481 447920
10859 447920 760344 588797 -151419 582008 404067 498485 12690 -191433 -472455 -9218
10849 -9218 659413 -110144 355155 329334 581467 804384 -155183 -1034391 395931 686482
10839 686482 624957 -138307 -399393 211931 195370 406475 -431057 -52503 -197594 -97600
10829 -97600 -63894 -288390 -13989 710620 410990 97966 -211199 -296821 -261380 -376136
10819 -376136 -310868 -186593 23489 -43623 321529 -260137 323033 857050 406783 -80727
10809 -80727 -604600 -1277213 -874462 -310124 398674 234381 -229717 -247823 165929 -201606
10799 -201606 81263 -177051 -331960 102332 450958 1057064 1270345 610619 286993 -278013
10789 -278013 -273912 -108352 -14462 -45743 479345 663023 722048 -43728 267440 100733
10779 100733 330603 329410 -14726 236960 -91753 289718 150476 -263489 561162 630295
10769 630295 -369622 914628 837348 511350 557862 834415 1568641 1213121 319588 -469612
10759 -469612 -951413 -277371 -661779 -1110330 147680 211371 440899 394396 406917 340360
10749 340360 414332 592535 462880 1077247 478189 -120936 -442015 110271 249487 462296
10739 462296 194270 378200 -264005 -804305 -451238 69327 357638 -17673 413399 -174797
10729 -174797 -793712 -294930 698916 -584786 -78358 670030 -87827 303956 117474
10720 117474 80934 722038 -349194 -354567 -513430 -1142749 -1609947 -495912 52073 -198360
10710 -198360 152478 302610 310401 826703 819200 -247112 722966 247636 17941 -268249
10700 -268249 -280599 -883427 99614 -700497 -668109 302645 360676 762250 601334 329456
10690 329456 -569413 -632000 -117867 385052 94012 -70882 1022117 292630 28790 -237020
10680 -237020 12747 -72525 -408755 214934 362454 386583 320305 392716 347141 434374 943591
10669 943591 803751 1131025 792333 351349 -451734 -496524 -393893 -471279 -184696 -147740
10659 -147740 -423604 106608 549906 -155996 7777 -814762 -996028 -529701 -732822 -589882
10649 -589882 -257614 -367984 216716 523459 708628 245939 -544214 -418741 665250
10640 665250 373993 -191149 -209404 398780 465558 444132 -74129 -92266 32837 265279
10630 265279 245481 107474 787491 1396050 1289538 733755 702664 687904 -178951 -712462
10620 -712462 -489093 -735251 -773788 251873 299271 242576 384724 97729 -237999 -601610
10610 -601610 -419187 -1329804 -1641367 -745343 872959 522151 -335191 253110 1007507
10601 1007507 584448 468541 839706 869454 284629 -181523 -210390 -350699 -224481 398072
10591 398072 58933 -292817 -19103 219851 -100747 -554105 -469672 -620812 450647 431668
10581 431668 1171714 1226378 -37653 -449352 -582293 64639 298352 -823447 -1000212
10572 -1000212 -1283092 102116 306429 -30682 450170 673817 1199330 1044490 546258
10563 546258 166968 396560 538618 344739 122340 -459493 -1126823 -897097 -284536 -239423
10553 -239423 -328337 -182810 -221411 -15489 265136 -122032 -560961 -819991 -184554 -95147
10543 -95147 -738886 -138880 980866 111511 -269893 -820517 -657142 -1241264 -489464 419341
10533 419341 510373 1368577 907809 195402 914265 909884 318025 1708879 1563815 846538
10523 846538 -340568 -156536 491530 365313 458379 257928 -60931 -318869 -517307 -457354
10513 -457354 -553729 117274 212937 -450079 -397974 -254007 -22548 531065 811070 1239888
10503 1239888 679842 -38458 -87270 171862 717705 771296 480052 56454 73503 901198
10493 901198 -364527 -532376 531587 1291709 556536 -30701 217021 513241 -73957
10484 -73957 -35968 555831 146255 -575172 -216426 120016 458497 890678 397210 429317
10474 429317 154038 -159747 353145 254407 -415688 550147 1094097 1370892 410214 -629706
10464 -629706 -102377 570170 249533 122958 1229512 405533 779487 537141 657031
10455 657031 769705 1019268 494110 172182 893828 1144987 359386 -187765 778739 692978
10445 692978 527981 608392 651562 245179 860201 1507194 1194586 1174397 2022628 1994322
10435 1994322 1898804 2350782 1789267 1870603 2572896 2403372 1918409 1868231 2450553 2337186
10425 2337186 1719865 1772389 1687239 690876 820754 1800598 2407901 1960046 2001988 1892937
10415 1892937 1770516 1709432 2090860 2675267 1769294 1582754 2163297 1131439 1641391
10406 1641391 2133933 1408330 1807719 2562885 2781248 2900914 2243331 1369311 2333247
10397 2333247 3387690 2344018 1797937 1709233 965157 1159431 1955774 1846997 1556306
10388 1556306 2692027 2379011 1500901 3133225 3445500 2302972 2282005 2649143 2535893
10379 2535893 2686547 3304700 3302225 3106959 3325585 2805342 2966490 3897217 3996184 4698433
10369 4698433 4591618 3842068 3527580 3173199 4079551 4917115 5144190 5667004 6044996
10360 6044996 6178297 6484204 7147275 6925052 6311478 6689566 6382459 6208044 6768409
10351 6768409 7875842 7520103 7247542 8358911 8960956 8696035 8823798 8733564 9620109
10342 9620109 10011820 8671543 9167987 8799107 9121683 8891051 7852223 8264168 7229119
10333 7229119 6946175 6654272 6208326 6546919 6504164 5879602 5655196 6703232 6061459
10324 6061459 5658777 5064318 4420231 4640302 3940465 4028547 4161217 3124166 2829822
10315 2829822 2650540 3245385 3220693 3032919 2778150 2195325 2209317 2689639 2669718 2330330
10305 2330330 2536003 2188441 2633033 2755114 2612323 2024227 1508003 1306313 1539363
10296 1539363 1128175 1803984 1448061 2256578 2289744 1796521 1344309 947119 1733973 2222541
10286 2222541 1571336 1058739 1643542 1822831 1313185 958662 1367651 767274 1724630
10277 1724630 1440880 1403327 1315226 1052574 618204 1199401 1179416 990839 1158829 1323641
10267 1323641 575710 237045 519340 840045 1059658 495449 379896 814419 663754
10258 663754 385272 441378 1390951 1423680 952197 922211 217724 776799 1601045 372490
10248 372490 -114181 280587 696788 511241 1163750 1166305 627313 1482411 868023 58961
10238 58961 152315 1050317 1323491 816172 499105 1128716 999465 628804 1011671 339361
10228 339361 678675 2016312 1981545 1171534 614117 928375 571590 942876 1353218 857199
10218 857199 657867 751934 128504 292088 1179727 1046674 1145802 1168172 738405 1036674
10208 1036674 433109 927155 1356308 1508729 1525344 1463649 1524634 683315 878103 520807
10198 520807 480995 503898 783651 574157 605334 629418 1010821 963628 1220136 1375802
10188 1375802 1190676 1526789 1489806 1146170 1593980 1486820 1913653 1876907 1719084 837467
10178 837467 416765 1416850 1012806 1565095 2162137 1750649 1672259 1938723 1432596 1406423
10168 1406423 1020181 1071564 1657119 2163285 2749411 4104376 3720087 2706242 2686130
10159 2686130 1912478 1838931 1954937 2132789 2266399 2499857 2431110 2322913 2643842 1888702
10149 1888702 2708443 1707731 578027 571046 865447 1442493 1373780 855730 1344915 194376
10139 194376 -201044 927019 1564987 2122940 1645909 1163448 1400403 1105085 1861324
10130 1861324 1564048 2055404 1898010 1203615 522696 770074 475201 1130721 1982884
10121 1982884 1988979 1957407 1591334 1448689 1532044 1910032 1478967 1521443 1843560 1572544
10111 1572544 856056 1298632 1123702 1634687 1849150 2106133 1472872 1589557 1559872 1363392
10101 1363392 600775 606383 995083 1475801 938961 1496436 847275 200466 938797 927567
10091 927567 2267775 1913888 1206318 2339359 1543592 539265 662915 913334 1227455
10082 1227455 1502376 1867858 1981393 1135493 480677 353200 996958 1684765 2015158
10073 2015158 1135176 1527105 1810811 1986074 1993162 1395265 583895 -125345 702599 1006139
10063 1006139 962241 84778 -127355 65416 494799 1090294 975399 1258630 1534032 1193287
10053 1193287 1240310 845566 1124140 861493 654891 704248 657219 990190 578401 926440
10043 926440 1141216 1009963 936162 573142 -23509 162662 608277 2219013 1906621 266440
10033 266440 523104 936732 113522 250784 324734 839320 1102883 953673 1408488 517587
10023 517587 466622 493554 292517 314093 802858 302079 715988 1034925 712364 676641
10013 676641 783689 704631 1522260 1239330 753515 628774 1186406 1044046 594971 467236
10003 467236 62324 978891 1497870 1449197 1082589 840628 1350717 1222639 1429707 1467625
9993 1467625 1358324 1370925 1494468 1148228 1040082 571850 545887 394196 518044 984496
9983 984496 801841 1270217 905819 1204052 805213 591507 1106860 2111842 1589141 1313813
9973 1313813 798219 327909 365439 1305506 1671664 1950145 2666963 2273577 3156778 2296906
9963 2296906 1701883 919313 1452619 2305609 2305997 2460270 2454178 3592242 2804786 2220371
9953 2220371 2059157 3084380 2926539 3157960 3429094 3895270 4101426 3409330 2533696
9944 2533696 2218997 3415889 3063230 3316119 3088012 2954109 3350332 2867569 2069005
9935 2069005 1688648 2036681 2209426 2465467 2055981 3250138 2552060 1114688 1405085
9926 1405085 1881734 2337445 1657982 2071524 1398899 2404060 2108245 1646995 1570697 1473419
9916 1473419 2038334 2586001 1972966 1825456 2090323 2554397 3063331 2648510 2390131 1718980
9906 1718980 2111936 2001239 1307140 1292173 1173776 1901012 2141216 1868985 1767716 2396707
9896 2396707 2633579 1993063 1775496 2320410 2234441 2520364 1948076 2235186 2174179 2436704
9886 2436704 2729977 1643553 2645212 2730756 3259490 3154182 2580456 2223216 3197185
9877 3197185 2791189 3496363 4437062 3397705 2771893 2512731 3628664 3841172 3246193
9868 3246193 3655523 3077991 4093493 3431917 3462165 4810756 5253614 5196674 5652558 6227944
9858 6227944 5955031 5884585 5344490 5202336 4751185 4444325 4287614 2996753 3062782 3801453
9848 3801453 4043166 4251024 3588647 3234490 3003615 1760837 1710323 1590684 1514067 2372023
9838 2372023 2891170 2031672 1347494 2134222 2058483 2539975 3147645 3141646 1993886 1881679
9828 1881679 1810724 1560299 1700735 2382763 2790369 3186304 3126788 1964524 2154625 2584956
9818 2584956 2484033 2081332 1057726 1167996 1713831 1807340 1084153 1978992 2592339 2551302
9808 2551302 2513250 3117045 3346618 3383419 3387738 3410204 4166565 4158653 3609385 3010541 2818657
9797 2818657 2961159 3477888 3663360 3549044 3335984 3075615 2938943 3253444 3091368 3323648
9787 3323648 3147065 3060834 2976855 3552276 3971090 3626134 3633478 3692973 4129284 4121734 3815943
9776 3815943 3116228 3503844 3355613 3015869 3363282 3277463 3499730 3461774 3134837 3123832
9766 3123832 3154118 4052779 4792915 4344175 3647793 4278499 4195625 4501207 4640529 4042191
9756 4042191 4259514 4340010 3992947 3812897 3961014 4162354 4949821 5188515 4033771 3478245
9746 3478245 3960448 4287342 4943924 5171804 4816504 4880923 5262389 4669718 5252584 4587712
9736 4587712 4181591 4350029 4224873 5041610 5438079 5565892 5285888 4654099 5032232 4562301
9726 4562301 5055600 5715524 6360920 5755754 5485873 5026119 4751234 5456709 6496874
9717 6496874 5812932 5674500 6655954 6806718 6650341 6601514 6826474 6567613 6647797 7205765
9707 7205765 7896774 7964481 7503183 7580890 8417813 7865372 8359067 8651978 7406261 7461657
9697 7461657 7634455 7494867 7213227 6862441 7439834 7717535 7977507 8941659 9333997 8126407
9687 8126407 7945009 7981887 8541590 8581472 9297299 10095445 9944559 10021405 10549485 10689081
9677 10689081 10957564 10916588 10202695 10361688 11506051 11362840 11617695 12019289 12119263 11581172
9667 11581172 12643640 13058376 13068305 13680255 14207789 14376447 14280909 14813979 15024983 15231955
9657 15231955 15794892 16243233 17014801 17887945 18210198 18248421 19070051 20068688 20449902 21210848
9647 21210848 21538051 21555947 21290112 22312495 23047341 24029293 24104481 24015053 24840683 25274561
9637 25274561 26244494 26776344 27216997 28371921 28452067 29737502 30849830 32101253 33248301
9628 33248301 34599420 36734665 38081672 40477136 40837748 41409612 42453738 43767123
9620 43767123 45427616 45752566 47636907 49127941 49470661 50824857 51605978 51384348 53377035
9611 53377035 55014918 56390801 57009993 57787139 60642769 63071099 64292433 66888419
9603 66888419 69128967 71210159 74159606 77774781 80388594 81795096 84907822 88113501
9595 88113501 91527693 95114842 98510156 102345898 107382321 113086909 118593042 125162310
9587 125162310 133696416 142455488 153189919 167192215 184554855 204680292 229482961
9580 229482961 261608604 299081575 338142933 375109928 404495887 422846017 428555835
9573 428555835 424825120 417868544 411710700 412958348 418807233 425373477 427307804 417788362
9565 417788362 394469987 359975980 321659067 284835853 253926418 230250275 216144530
9558 216144530 207405283 204187118 203098083 203011408 203323255 201722580 199170228 194513954
9550 194513954 189465888 182527040 174102730 165060680 155530809 145451013 133996431 123374212
9542 123374212 112825924 104451678 97102707 92134799 89008528 85914308 83077619 82352957
9534 82352957 81451577 80429178 81998426 83163287 86213995 89476736 94272665 99391191
9526 99391191 104314674 108289970 113367234 118720864 125228187 131735534 139533512 145680830
9518 145680830 148422183 150058280 147588436 142734370 136010533 127493177 119214555 111461930
9510 111461930 103663917 96312455 90191161 86089179 83530388 82476588 82451725 81694466
9502 81694466 80800196 78994646 76537337 73775457 72229130 72022195 69634022 67346440
9494 67346440 64207842 59479443 54048366 48021172 43536021 40112331 37965961 35485113
9486 35485113 32992890 30829888 29207055 28204930 27738760 26286581 25537564 24562714 24579796
9477 24579796 24345864 23314217 23531000 23653509 22481682 21330457 21113060 20829796 20829774 20001898
9467 20001898 20222315 20194647 19777907 19797764 19407903 19433039 19125601 18906518 18408397 18132349
9457 18132349 17744632 16774485 16238618 15078672 14536986 14129851 13372430 12802264 12089581
9448 12089581 11869820 12191212 12622004 12252877 11658638 11583176 11054297 10265959 9254934
9439 9254934 9427869 8878522 8587838 8689180 8306651 7963345 8031638 7644650 7188831 7336545
9429 7336545 7931966 7896681 8680614 8672919 8815744 8484708 7893051 8034225 8036203 8125311 8536420
9418 8536420 8168024 7281131 6430450 7134174 7322307 7250094 7371036 7980708 7434270 7744748
9408 7744748 8041994 8327093 7900312 7870409 8642212 9621173 9179270 8713826 8803529 8053897
9398 8053897 7395239 6851978 6709038 7229923 7143091 6477091 7505155 7653250 6487608
9389 6487608 6951471 6684623 5250736 5437332 5943827 5959123 5983857 6438374 6255717 6313420
9379 6313420 6299484 6645271 6004762 5943917 6515216 7292307 7439787 7250102 7110751 7062812
9369 7062812 6384712 6150308 5990657 7604657 7507608 7249023 7654485 7976659 7725414 7471121
9359 7471121 7444721 7685321 7514354 7482521 7483196 7822298 7333289 6563379 6179259 6324180
9349 6324180 6528321 6996432 6675890 6838768 6736212 6686073 7475700 7447491 7511130 6393033
9339 6393033 6042299 6409125 6211479 6412063 6717856 6508743 6189082 6458541 6821352 7010139
9329 7010139 7518336 6754933 5956000 6599848 7426014 7654094 8285352 8549990 8989629 9344279
9319 9344279 9193201 8803273 7667902 7559858 8065225 8319763 7275314 7336501 6738463
9310 6738463 6434764 6617526 7565215 7967605 7404261 7200043 8529469 9310622 8810150
9301 8810150 8515255 8042751 8533002 7954076 8426533 9210208 9295061 9018619 8715971 8478732
9291 8478732 8690723 8817722 9345739 9773917 10250946 10154583 9705176 9256399 10064801 10230364
9281 10230364 9995293 10253805 9827782 10565259 11254661 11548649 11068278 10907513 10714926
9272 10714926 10860841 11284253 11932742 12144230 11693818 11912304 11760865 12147180 12029425
9263 12029425 12970676 13622367 13494162 12704348 12856111 12720733 12570143 12559631 12904420 12364993
9253 12364993 11785380 12063954 13136221 13725841 13998451 14463399 15270395 15841847 16479307
9244 16479307 16901048 17303360 17918212 19020825 19796374 20096369 21893894 22429772 24582922
9235 24582922 26606882 27556899 30218262 33968733 38934462 43782736 47523941 47790887
9227 47790887 45954107 42688922 41338615 41307077 43434131 44840524 45237717 43060635 37803593
9218 37803593 32691953 28453133 25164882 22919000 21903235 21361970 21482761 20493812 18988260
9209 18988260 19076843 18597610 18475835 18934573 18466939 18070467 18037855 19341329 19888967 19033037
9199 19033037 19711900 20046159 19736919 21028327 21640431 22420066 22840927 24096388 25068921
9190 25068921 26640727 28104162 30992535 35158380 39302304 42651936 43284600 41849654
9182 41849654 39832300 37314388 36874688 38216108 39550685 40046490 38758854 34337071
9174 34337071 29406593 25346242 22805986 20892703 18843029 18050510 18014907 16201684 16670569
9165 16670569 16783356 16461349 15992769 15547534 15022724 15034328 14657999 14415671 14631098 14109370
9155 14109370 14715285 14874737 14247953 14429088 14019128 14007201 14129026 14210029 14067800 14329695
9145 14329695 14070994 14421251 15157394 14805288 14891969 14671958 13997265 14203850 13805618 14055413
9135 14055413 13545798 13373275 14465539 14162363 13787481 13736928 14628291 15101118 15586253
9126 15586253 15606601 16159217 15626710 16021872 15986480 16023730 15470331 15468525 16250850 16890759
9116 16890759 16773393 17791662 18083521 18031257 18545540 19566766 19680963 19516359 19686520
9107 19686520 20151664 20638705 20462608 20813179 21668583 21846588 21897362 22148774 22217074 22427710
9097 22427710 22800493 22633202 22894321 24086605 24826686 25651545 25914253 26234394 26749750
9088 26749750 27320495 27131120 26690632 28053155 29412295 30290807 30254105 30703392 31726889
9079 31726889 32582199 33458133 34539328 35069895 36971711 38737471 39527994 41020046 42102111
9070 42102111 43953831 45685508 47516840 48114122 49935661 50751908 50800984 51076501 52336090
9061 52336090 54263573 56194305 57683754 58971547 59818914 60338596 61812959 62803297 63976791
9052 63976791 65373048 66721896 68695925 71096909 71978817 74198311 76875445 79395423
9044 79395423 81953160 85616291 88490196 92280715 97752318 102402122 109395599 117971292
9036 117971292 127300433 138110358 152760844 171350776 193947637 218688160 238979042
9029 238979042 247440700 243002720 235240158 228772952 228384252 235512561 249665011 265745332
9021 265745332 275220235 271489512 257183297 238680437 222541832 211927576 202479267
9014 202479267 194590077 189471393 186040842 181600429 177262721 173619780 172477698 174046619
9006 174046619 177623058 183195874 189638644 195002860 198424481 202720462 206945530 211041752
8998 211041752 216907836 226344625 241870711 262227482 288643012 322420515 361168480
8991 361168480 393985889 406712564 398961033 385576836 379870476 386865541 404420705
8984 404420705 428792993 453276727 466481451 453974846 419839243 380169824 341797764
8977 341797764 310545067 286182266 265091651 243862113 223212748 206277833 192868020
8970 192868020 181070964 172012758 167238400 163621323 164036754 166109570 169760435 174154748
8962 174154748 176506742 175818181 171305988 166236417 163027888 161716013 158010584 151390394
8954 151390394 142536864 134010517 127088000 122507207 121405846 120237840 118782928 117066007
8946 117066007 116526553 117346917 118612395 120082837 121736865 123669483 126279673 130951720
8938 130951720 136291052 142977806 152176557 162150762 175674363 192639868 211868571 230859483
8930 230859483 248218327 267228030 293311456 325811221 350795859 344727472 310139483
8923 310139483 269193301 234206744 210225601 195383789 185346323 178557425 173947590
8916 173947590 171027917 171136490 174013176 178502644 185206712 195430351 209926482 228958260
8908 228958260 255156108 288085323 327858864 376143884 426243839 466946189 484854169
8901 484854169 478089492 446253219 394223446 337638033 288578411 252292341 226056059
8894 226056059 205300032 189270675 175453352 164539004 156308329 149996247 142707468
8887 142707468 135159401 127437924 120416243 114277748 109982488 106816369 103918545 102243356
8879 102243356 100250436 100226908 101073376 100910271 102769347 104289419 107216886 112206418 118904513
8870 118904513 128590374 141059961 156416897 176642634 201480785 228182166 249881786
8863 249881786 259101611 255438211 237591037 207615963 174893553 145395486 123512571
8856 123512571 106518304 94063216 84125377 76778940 71418293 65701672 62645263 59827642
8848 59827642 56105000 53047664 51972812 50403730 48571885 47470170 46142093 44945912
8840 44945912 42163327 40615188 40343569 38541319 37870370 36113389 35063819 33866614
8832 33866614 32623254 31637596 30294340 29545041 29456268 30115141 29008651 27709706 26388709
8823 26388709 25845986 26286394 26582360 26524607 25569652 25646021 25976499 26272917 26186035 26317106
8813 26317106 26299784 26878323 26651105 26386029 26854119 27137514 27510448 27295791 26999017 27992715
8803 27992715 27867332 27696405 28107850 28574242 28748921 29235704 30035385 30382021 31108070
8794 31108070 33000789 34735061 36961226 38721509 42004564 45712008 49147584 54791552
8786 54791552 60936738 66648798 71288832 73147840 72524858 69690115 68732037 69414494 70571367
8777 70571367 69799114 65838819 58865090 52003460 47348747 43123422 41409992 39355684
8769 39355684 38957250 38243618 36917133 36925006 36843347 37014275 38982685 39734351 41916579
8760 41916579 43748753 45982389 49310533 53535544 59332542 64915542 71578757 77157393
8752 77157393 82298727 85145102 89357578 94521789 97284718 95869565 91459986 86087911
8744 86087911 81942274 79353514 75309181 67476024 58718996 51264665 44930722 40414155
8736 40414155 37623022 34611534 31944568 31567619 31386697 30138611 29889377 28885895 28382800
8727 28382800 28618436 27620673 28300036 29787133 32071091 33569806 35964771 39191158 43274506
8718 43274506 46070301 47349208 45982609 44339618 42540793 42532088 43352041 41326830 37854708
8709 37854708 32352841 27449452 23209613 20964297 19532411 16764682 15683497 15666763
8701 15666763 15114876 14055733 13579480 12607268 12119704 11399750 10824264 11047276 10716234
8692 10716234 11194336 10994236 10230897 9509644 8938724 8390620 7846655 7941705 8303880 7696401
8682 7696401 6669633 6672041 5994009 6635874 6906308 7098188 6320033 4971098 5666421 5237893
8672 5237893 4735381 5618906 4517662 4217616 5078092 4906803 4922802 5234130 5641825 6483153
8662 6483153 6571516 6578170 6744950 6250486 6218528 5186155 5560268 6136798 6677268 6607042
8652 6607042 6059835 6411332 6432810 6398459 6164835 6611986 6256527 5810668 5415085 5539123
8642 5539123 5410267 5169269 5499029 5027166 4529829 4521781 4858298 4074242 4281581 4118790
8632 4118790 3892178 3242965 3449917 4107171 4384146 3432805 2197906 2490398 3625299
8623 3625299 4176517 4470813 4009581 3395903 3643256 3320986 2860913 2976227 3481535 3473023
8613 3473023 3269278 3167800 3765851 3914025 4634827 4053335 3540355 4088591 4203457 4276047
8603 4276047 4030310 3342369 2995139 4151078 3940328 2929755 3322581 2936197 2814648
8594 2814648 2189710 1678898 1942755 1536602 2346853 1760846 1134144 1937687 1305222 1593856
8584 1593856 2907146 2351207 2344234 2288723 1974546 956263 927453 840142 727996 1153809
8574 1153809 1116851 1332962 1982115 2023190 1733467 2540221 2734995 2179169 2372204 2082204
8564 2082204 2287012 2824177 2730925 2443188 2141154 1759550 2645200 2961574 1607971 1313159
8554 1313159 698788 626451 1155464 1616778 1173173 1540000 1638697 1060266 1444795 1355039
8544 1355039 1499635 1408128 1776893 1236471 1095047 1420127 2186025 2363725 3603910 3410916
8534 3410916 2720134 2391555 2317761 3466406 3180579 2273661 1952851 1794021 1812188 1462073
8524 1462073 1143562 2093744 1762192 1228093 1201296 1140456 1271529 1281969 802268 1932956
8514 1932956 2158250 1580829 1548334 1234240 618469 1354579 1255603 1863671 1586710 1704382
8504 1704382 1784237 824081 1042224 2051815 1683058 1514121 1664121 1334061 1981899 1471301
8494 1471301 1752893 2294797 1522847 1217068 1068212 1228042 1710808 1097378 1091760 1133109
8484 1133109 64385 791139 1218374 1440220 1135339 487436 404353 958289 565746 637874
8474 637874 713367 1002263 594183 627469 118747 -617905 -1021669 -375752 59868 3396
8464 3396 -142572 365338 -52843 -459521 765113 451880 231659 176146 907664 626997
8454 626997 1336517 1737156 1543413 1893095 847737 297476 1389283 1579370 1544812 1294366
8444 1294366 1002956 1420349 1676649 1209647 1222326 408028 3315 568005 1103232 641588
8434 641588 1237557 1300584 1100201 2045734 1960751 1099704 907752 778523 371861 -249100
8424 -249100 -504379 552978 1424793 337092 442982 1268333 858029 59943 72005 91330
8414 91330 1510 -381132 -52319 350438 392183 551082 -390015 -52791 762620 409590
8404 409590 786216 419726 60516 -32173 90435 459482 650094 474515 529968 193029
8394 193029 -188788 93739 281350 1030056 866441 503065 650616 422204 -52106 -533019
8384 -533019 -285719 -450729 81441 475234 24766 44333 340454 249740 635958 738777
8374 738777 318276 -788253 -343490 171039 14134 -764057 -1128012 83884 493194
8365 493194 -44904 5297 31593 350764 -141859 -107439 1418147 1151696 733965 -583790
8355 -583790 72482 -292554 -22993 556604 -18467 -795238 -714696 -243950 -191248 -783224
8345 -783224 -804166 -484185 -198398 -196664 75139 -555190 -642817 -322104 -501701 15433
8335 15433 74637 -151442 -419471 -181590 -360590 -794796 83390 -54170 -453023 -457333
8325 -457333 -696329 -1042850 156003 549443 593696 150980 -368434 46733 -682643 -570916
8315 -570916 -434672 15505 279833 -614171 -814094 -354308 -1290747 -1149626 -802451 -724514
8305 -724514 -347064 98021 293401 -266437 -1509690 -1242606 -621845 238413 -226251 -696443
8295 -696443 -593860 -778349 -879971 -1207034 -1016683 -645844 -31395 596672 -207731 -1127004
8285 -1127004 -886729 -1065195 -521532 -306508 -78368 237123 -255945 -190597 -663218 -377244
8275 -377244 -440188 -947730 -25655 513800 741845 -609090 -440729 418479 -24229 -72130
8265 -72130 -19035 -745081 -512288 -232645 132796 352010 527492 814411 360597 592802
8255 592802 947765 308323 369126 15254 251601 245238 897744 618991 -414478 -889094
8245 -889094 -947800 -377076 -425911 226046 -174494 -588262 -588705 211317 373996 -727639
8235 -727639 -1034982 -355865 -478248 -468973 -825988 -290922 -120075 -637305 347480 -169745
8225 -169745 -551746 174736 698900 1306708 355003 -369570 -1067976 -1322137 -579323 -367914
8215 -367914 -188281 34827 -722139 -763080 -628732 -516988 -1043805 -754583 -711129 -1141742
8205 -1141742 -835399 -658517 -573888 -585984 -1382512 -1057783 -1068027 -1431777 -1210147 -929779
8195 -929779 -853081 -673954 -506307 2311749 3227858 375376 -108827 -515704 -1070044 -435100
8185 -435100 106979 -616593 -680883 -843418 -546486 199208 410273 321339 105733 137752
8175 137752 413323 -81655 281069 384113 213338 -420880 -1216131 -1271860 -1811730 -1500226
8165 -1500226 -1533501 -1566714 -122051 -1224296 -1058198 -328290 -536589 -143178 289729 27017
8155 27017 -551092 -475599 -354354 482970 542930 -73866 -492560 -645201 -1047528 -765723
8145 -765723 -542168 -302966 -376643 -477214 -306602 -473693 -174548 973510 607685 385869
8135 385869 228527 -531847 -543702 -157012 -392790 -14159 72973 -827663 -297776 -700861
8125 -700861 410868 938396 658739 354808 -45225 -872778 -428005 -685694 -867729 449056
8115 449056 390440 495039 -15773 -279066 -176991 -28328 -705347 -1621617 -1681601 -1590075
8105 -1590075 -1793525 -1512181 -2014411 -1147890 -629046 -893079 -1989629 -2459784 -2292681
8096 -2292681 -874182 -216367 -952028 -671731 -247147 121732 -392108 -498604 -309969
8087 -309969 -313406 -583882 -678168 -738404 353284 -293098 -382301 -577780 -1119195 -1267145
8077 -1267145 -456487 -415196 -930019 -1123274 -611414 -291315 68673 -584252 -417576 446323
8067 446323 345938 148918 39566 407207 -118222 -3362 320230 31332 -764363 -274228
8057 -274228 331400 58781 -1018911 -1356104 -1057287 -522914 -482678 -531085 -1065751 -1293368
8047 -1293368 -253154 -949319 -1723093 -917836 -1551721 -1141107 -572298 -420845 -816786
8038 -816786 415978 956984 39382 624090 410324 17561 -128914 -257625 -4981 -871154
8028 -871154 -264857 873650 365322 -167218 131007 83908 -750153 -267184 262422 279592
8018 279592 -54343 -92358 -773644 -904254 -698890 -907170 -1005850 -507128 100390 -213967
8008 -213967 -822341 -1170987 -1081497 -220375 -378648 -637164 -1505762 -1886705 -1588403 -1843611
7998 -1843611 -839939 -709210 -1515681 -1089490 -549884 -682475 -197409 -758072 -661656 278881
7988 278881 -552080 -629326 -290028 -487607 -513834 -438524 -478201 -495871 -273728 170388 -1424697
7977 -1424697 -1645816 -1330325 -763596 -202908 -494649 -299418 -342143 -781242 -1236723 -1041355
7967 -1041355 -1067595 -335328 -301296 255417 -706386 -1531009 -1195785 -681820 -862989 -403322
7957 -403322 -1321297 -1140656 -564900 329532 699758 664167 69313 -485776 140881 -610286
7947 -610286 -799239 -855932 -1051826 -1466610 -1112973 -1177970 -1113012 -722830 -1130117 -445927
7937 -445927 -457585 267816 325757 -1093311 -1477007 -1191025 -1199721 -1220621 -1266460 -1050389 -1037219
7926 -1037219 -1333411 -368335 509255 288013 1430 -122811 -578205 -870307 -2019519
7917 -2019519 -1096686 -390038 -102138 -559286 -866835 -1100305 -494258 -707965 -17101 -776664
7907 -776664 -808227 -687537 -894414 -792138 -588146 -984967 165320 215029 -251795 -657475
7897 -657475 -446464 -522839 -311659 -445250 -642550 -1312796 -1565496 -749853 -990950 -908975
7887 -908975 -832010 -604557 -674956 -735540 -481264 -225640 -1130764 -821237 -669376 -1346736
7877 -1346736 -1966111 -754356 -682253 491937 -95179 -354765 -365259 -774836 -745772 -383492
7867 -383492 -1232009 -655321 -623249 -391308 -767494 -1797146 -1565251 -1530595 -1463020 -677547
7857 -677547 -634038 -782824 -272348 214833 29114 290724 486395 -371479 -154382 -448422
7847 -448422 -864333 -385694 -443798 -832590 -1198191 -525373 -575568 -728261 -376393 114155
7837 114155 215938 -829586 -836064 -479895 -154135 -298883 -775555 -694584 -776692 -1019233
7827 -1019233 -966259 -892095 -1519483 -1274708 -1140651 -647595 -367436 -206591 157831 -189858
7817 -189858 -454619 -352658 -555441 -1091636 -1221480 -1422747 -1006192 -1484947 -1191605 -533280
7807 -533280 -1213726 -684855 49836 -841744 -1504094 -934159 -808223 -712083 -221392 -339778
7797 -339778 -707003 -901397 532386 -878645 -566260 -694118 -679159 -1121378 -881269 -853575
7787 -853575 -1268868 -519386 -656445 -399794 -886752 -1191072 -1326598 -615151 -645728 -1079034
7777 -1079034 -1225510 -1415095 -643794 -796544 -1074511 -317416 -294154 -565308 -753910 -944549
7767 -944549 -887883 -752293 -93474 657512 -365398 -464126 -718321 -550056 618454 42153
7757 42153 -224267 242373 -168716 -1038858 -526807 -856372 -718246 -161864 -321899 -583336
7747 -583336 -603388 -1188540 -995557 -934960 -686269 -804152 -628138 -334709 -567519 -392783
7737 -392783 -314185 -521190 221360 -307588 -642522 114197 -31472 -735909 -669646 345183
7727 345183 522448 357087 -825675 -424620 -648503 -732381 -1269070 -972447 -976785 -752295
7717 -752295 -505756 -823413 -501193 -53054 -22792 348791 141445 -40889 -672027 -284097
7707 -284097 -1107110 -1674642 -953716 -1263168 -751210 -426381 -22387 -371472 -415669 -563850
7697 -563850 -416808 -20675 -410897 -185951 163045 446622 -211207 -68737 -309044 -574018
7687 -574018 -93695 350951 174940 -452079 -951495 -1094459 -858589 -19010 203250 -369493
7677 -369493 -27320 57876 307443 -278264 -608970 -308347 229419 -204072 -891690 -226147
7667 -226147 725327 -301572 -1520564 -589933 -324771 -1122359 -1166424 -791330 -417418 275861
7657 275861 -506561 -757008 -816388 -1194711 -1145944 -1022241 -1080597 -800875 -364096 -1914937
7647 -1914937 -1533771 -697136 -652804 -984359 -624268 -976748 -391620 -357029 -880081 -1138684
7637 -1138684 -1328909 -373162 -678137 -993351 -346873 -865380 -998790 -703126 -556905 -421081
7627 -421081 -703009 -247643 -731567 -388076 -233182 -23733 -710870 -404444 -223503 -205027
7617 -205027 -541926 -490529 -516741 -1222723 -1121461 -753560 192344 -289804 -609514 -288429
7607 -288429 -760382 -822741 -337656 -1380555 -209886 -60068 -692817 -539399 -501847 -705076
7597 -705076 -531688 61331 -309107 -656785 -1488386 -1095950 -498252 -54107 567871 74734
7587 74734 -785542 -281259 -855070 -1333132 -820381 -784554 -1093109 -1155069 -870460 -544786
7577 -544786 -184823 -138879 258178 -526329 136142 -281617 154353 308167 -185168 -209727
7567 -209727 -346148 -195587 -255696 -864662 -905537 -1003701 -971765 -1221120 -480713 -276650
7557 -276650 -551005 -931723 -977514 -1321656 -1218168 13185 -251751 194822 -486752 -856277
7547 -856277 -922661 -1003000 -1366993 -721732 -213225 -512555 -699359 -927253 -1973454 -919153
7537 -919153 -1059828 -1424760 -1933413 -1461619 -745743 -1078832 -317993 264309 -178545 206859
7527 206859 -185989 -222952 -682818 -844231 -374208 -650190 -183805 -862384 -1501210 -622576
7517 -622576 -168518 -652095 -718283 -279652 185472 729701 -172221 -861243 -1137016 -1039254
7507 -1039254 -856778 -1010712 -904061 -600264 -1088251 -1467614 -1555890 -1391095 -152764 -172538
7497 -172538 -462097 -187812 -693722 -210124 -271400 -185425 973345 385301 447595 99423
7487 99423 612239 282651 -4521 -420291 -585622 -1056964 -399825 41100 -720730 -150400
7477 -150400 388429 17779 -155059 -130258 -165609 -1865523 -1319660 -284944 -515427 -261685
7467 -261685 -380690 -349860 -934565 -1657801 -1293021 -520329 430890 42952 -134910 312026
7457 312026 113790 -517390 -370842 -799451 -357302 555904 -384757 -459280 -455491 -965063
7447 -965063 -637790 -117588 -864730 -873596 -767426 -773357 -1322225 -981934 -512231 368784
7437 368784 101929 -182311 -146080 -1397568 -1321316 -999675 -360648 -422146 -103161 901920
7427 901920 904662 301166 -94153 -393242 -1241617 -1081036 -496364 -1108388 -711422 -32620
7417 -32620 -583803 -1269301 -1112604 -349519 -556763 -1011164 -990811 -424211 -807204 -1199913
7407 -1199913 -1631100 -1229748 -957192 -528997 378592 208824 -430314 -198962 66527 66407
7397 66407 -687517 -17247 456896 -481860 -882785 -607744 -411143 -497187 99114 892591
7387 892591 652324 -378671 -397601 -88823 -248538 -508970 -1408907 -145635 67583 -798005
7377 -798005 -29739 -404629 -315047 -479488 -938157 -157309 -141933 -231506 182426 -539169
7367 -539169 -671143 -406161 -177666 -811043 -749828 -253510 -6169 -908788 -218235 -234679
7357 -234679 -1444649 -429864 20957 -333170 -76004 -273290 -770304 -1085428 -566345
7348 -566345 164465 111785 -973421 -639224 -598234 -739592 92168 -1271545 -1395377 -870789
7338 -870789 -472509 -502920 -243359 -401640 -585206 -711154 -392918 -369678 -1042427 -1245844
7328 -1245844 -590125 -472191 358639 293731 -226216 373666 -479540 -217470 143797 205968
7318 205968 283729 287850 -106144 -1716929 -1235576 -747294 -1011286 -637068 -425264 -916463
7308 -916463 -16963 -127296 -1283471 -1337557 -811868 -327036 -1122670 -674475 -838387 -1005253
7298 -1005253 -888418 -374917 -4538 195251 -578953 -1435852 -1399917 -979674 -1031053 -910775
7288 -910775 -600273 -817495 -294157 -129561 3356 -418076 -1004358 -60853 -257179 -724496
7278 -724496 -1108840 -643146 -5547 -361249 -974369 -424377 -716526 -1055536 -842329 -501095
7268 -501095 -643282 -700526 277191 -144359 -807088 -945737 -715074 -137670 -26706 -507168
7258 -507168 -1192422 -777556 -495314 -610737 -276757 -136230 -96332 -543612 -458591 -382915
7248 -382915 -817052 -298765 -1266708 -1261381 -870613 -1136424 -1743214 -1225002 -707168 -725066
7238 -725066 -240877 -645914 -8249 -174739 159437 308412 301738 -168227 -268740 -905675
7228 -905675 -1450302 -857657 -649382 -905502 -1256150 -798035 -595283 -1098250 -956695 -1204686
7218 -1204686 -1044138 -456598 241443 -200958 -582901 -34971 -464872 -1131978 -456254 -331262
7208 -331262 -310321 -802117 -1632445 -1020397 -425374 -210519 -109904 118571 -465047 -864391
7198 -864391 711520 222490 33959 196810 -232583 -201210 -404123 -425165 -642206 -530000
7188 -530000 -924498 -668540 -244160 -1082946 -852683 -728301 -1076863 -712288 -102002 -399675
7178 -399675 -1522033 -1229743 -696284 -448605 -979409 -1420492 -1585559 -60371 -387350
7169 -387350 -164822 -382953 -782568 -81676 -826251 -1035558 -1165035 -1361640 -562230 -24860
7159 -24860 -691359 -317994 206737 -471102 -1421255 -1561 -359253 -1072304 -1157022 -761149
7149 -761149 -467351 -463017 -572519 -672507 -783421 -213239 -830537 -1455682 -258486 749856
7139 749856 845854 -62098 -484592 -538885 -288909 -1035485 -1596008 -539418 141623 -170675
7129 -170675 -407416 232582 120889 -2026 -34898 53457 -1194774 -1027666 -25099 -1936776
7119 -1936776 -1673139 -597097 -117201 -55611 -313946 -748494 125517 -114890 -678119 142000
7109 142000 -340599 -106103 170911 -557613 -926604 -632544 -770291 -1221721 -1231219 -876143
7099 -876143 -628878 -1020764 -478370 -420928 -78700 -439880 -390412 -537493 -738628 -598933
7089 -598933 -274059 -566869 -576644 -796294 -628897 -600736 -277186 -163441 -902290 -680862
7079 -680862 -1006562 -1485028 -522541 -1003129 -993939 -387031 -362850 -276445 247036 323688 697359
7068 697359 1344034 1480327 213134 -511747 -347085 -368671 -366521 -736027 -687414 -267877
7058 -267877 -67047 -1044131 -473842 -376427 -594728 -541893 26486 122138 238148 -214850
7048 -214850 -681140 30794 -91468 -1241658 -1715912 -1274032 -814929 -995666 -727807 -486437
7038 -486437 -256637 -414144 -369155 -688530 -134015 -115423 -2169 -155553 -1484803 -826616
7028 -826616 -310514 37179 236349 -295294 -1080530 -1015135 -772924 -594979 -91614 -442787
7018 -442787 -398609 -697191 -520078 -1404311 -1481011 -150130 -433548 -516332 -368390 -418709
7008 -418709 147041 567243 222069 730598 146154 -229665 545638 -71480 -347953 -1154999
6998 -1154999 -1171458 -1036116 -772787 -671045 -986596 -533783 -172343 -309314 -141536 -994390
6988 -994390 -1304013 -1540654 -610376 224978 -488197 -114211 -181588 -693958 -837240 -718275
6978 -718275 -173700 -407617 -1091946 -1058455 -514518 39149 -300116 704591 642818 791722
6968 791722 189963 -249115 -7397 88585 198235 -356342 -787026 -613263 -474959 250043
6958 250043 -100335 -615349 -348616 -653099 -619324 -419543 -358616 54797 291367 470986
6948 470986 41182 -692246 -924795 -1144278 -640517 -671883 -1012926 -688241 -212635 -393927
6938 -393927 -164763 -274949 -102780 146418 932843 947034 455713 996416 1843235 1844970
6928 1844970 2187213 1641003 1756742 1263768 930198 192680 -421553 85441 -85635 -406663
6918 -406663 -797763 -298611 127224 273782 78194 684142 448446 303505 233631 162654
6908 162654 331467 -104622 -195137 16599 235671 -301811 -381360 -121106 -694054 -138032
6898 -138032 492249 -92855 -1046910 -1044455 -216306 28853 -835101 -893780 -688700 102289
6888 102289 109825 -177076 -343535 -216373 -345892 154995 723205 57319 -675026 -193401
6878 -193401 -415881 -350334 -246656 -1012766 -779961 -1031297 -1751049 -709245 -453156 -442490
6868 -442490 -436494 -240225 -729046 -884876 -461266 -291396 107191 192236 422280 -233674
6858 -233674 262213 -354686 -1318901 -530872 -276472 -85046 -277823 89054 276462 -2082
6848 -2082 75837 62310 -186536 -655924 -862496 -515647 -316506 -59680 -74180 394902 129362
6837 129362 -975457 -1122278 -1473278 -1066111 63278 69025 -367856 318393 262730 -561638
6827 -561638 -673006 -537259 -819687 -97149 -87856 131245 -1000952 -993945 -964524 -819814
6817 -819814 -589351 -403089 -127881 -478082 -396490 -38475 -180151 -399178 -584653 161228
6807 161228 61300 -724881 -95154 -763381 -407651 -217816 -601520 -167312 -419508 -437044
6797 -437044 -1131536 -1558975 -1222512 -369451 646162 168751 161060 -235545 -785058 -1107594
6787 -1107594 -1002099 -403915 -985501 -674199 -839156 -307740 -177415 -599554 -503585 -270456
6777 -270456 -378050 -712192 -726525 -602683 190406 -434174 -674576 -576738 -1195243 -1360213
6767 -1360213 -2189851 -2275736 -1242808 -579507 -614221 -441001 -279360 -74748 -727582 -994600
6757 -994600 -855056 -756422 -1234425 -939225 -514749 -958180 -1033121 -338759 -286484 -348292
6747 -348292 657143 -160871 -110402 -571227 119348 -211164 -1046414 -1183016 -248484 262077
6737 262077 -762754 -1295203 -1913371 -890748 -299687 -1214769 -697465 -214724 -221896 -85088
6727 -85088 -174850 -322397 -1159617 -664996 94493 -50465 312925 314826 98531 -312077
6717 -312077 -473531 -653013 -795483 -672379 -630823 -423685 406665 -556627 -687136 -983558
6707 -983558 -519379 3356 -181292 -139928 -588908 -1099299 -1182943 -337427 -920987 -1603819
6697 -1603819 -1386741 -873958 -1212749 -1167730 -647385 -765365 -621460 -770978 -1204206 -1110326
6687 -1110326 -1220686 -1645101 -1846834 -1070754 -1501297 -2209011 -1876331 -818400 -1125919
6678 -1125919 -2072518 -1906667 -2009906 -1743174 -915214 -701144 -1241933 -575575 -434020 -496047
6668 -496047 -277269 -463019 -683929 -617086 -1199215 -1299179 -526268 81570 269566 -351988
6658 -351988 -483261 -408308 217228 252113 -159862 -311112 269786 680040 1715752 927439
6648 927439 569913 449576 535061 302675 -620534 -1109652 -1665792 -1716194 -665250 -459150
6638 -459150 -949724 -156038 21855 -801372 -1015994 -1096814 -536823 -143047 -125709 102226
6628 102226 -436469 -613851 -997762 -970571 -110240 -622853 -797350 -720723 327312 929547
6618 929547 -396282 -11319 -112555 427442 -475590 -184632 -50602 428439 854019 376723
6608 376723 219252 -612338 -491102 -7655 -452713 6745 -330973 -707185 -667379 -286266
6598 -286266 -706016 -1200140 -829368 -1175688 -734194 -384257 -970466 -847675 -28325 -392770
6588 -392770 -964285 -733434 -806167 112252 -21492 -466750 -335413 -186919 -212180 -20695
6578 -20695 -219740 -338462 -10750 180075 -22755 -439382 221112 899182 1064943 -108223
6568 -108223 102010 -253906 -934961 -1028859 -1116126 -1309052 -208584 -1913971 -1809629 -1193565
6558 -1193565 -791629 -1427861 -1048484 -305348 -678246 -1068857 -1289452 -412516 -421266 -319416
6548 -319416 -79510 -857574 -718713 -632431 -602190 -684595 -618243 -978599 -1212127 -333015
6538 -333015 -543655 -27208 5392 -475310 -71769 -119227 -683978 -1482613 -1466311 -634377
6528 -634377 85443 -341240 -446447 -234487 -587456 -503648 290307 816690 -433465 -1028372
6518 -1028372 -800623 6159 286815 -402991 -372771 427657 182662 53961 -588097 158489
6508 158489 -551020 -921796 -864427 -656228 -420997 -52919 278512 -208782 -909791 -1066794
6498 -1066794 -874716 -478956 -544052 -251754 19234 208668 700930 995191 1018376 1161464
6488 1161464 847119 661274 -104636 -159720 -861382 -1026173 181885 344761 -197558 -546253
6478 -546253 -794259 -167464 282535 -465967 -661144 -704717 -973199 -903174 -142895 502831
6468 502831 264587 239539 469421 -747705 -576709 -243176 -514405 -821200 -1033455 -483206
6458 -483206 -316856 -636543 -137934 -299393 -693302 -1135530 -1060702 -96765 191368 133686
6448 133686 149577 417695 511270 106239 -146759 -253735 499529 177455 8915 -549042
6438 -549042 -1137166 -235318 -364540 -1338617 -715031 -363356 -653005 -1199027 -513446 224657
6428 224657 332369 -300356 -945373 -459597 197809 -354141 -2655 236655 104722 1147554
6418 1147554 574476 -456781 -291931 -458152 -665852 -1379289 181578 921684 -383982
6409 -383982 -898355 -408986 388867 268667 -274543 -742941 -1031705 -1548146 -1010457 127660
6399 127660 649253 68416 -808123 -1074333 -718820 -930480 -740336 -402564 187701 -154995
6389 -154995 6722 102639 248124 -737867 -1009562 -360013 93233 175531 -296022 -100698
6379 -100698 -361417 -553826 -876156 -409791 -723699 -211206 176007 -329693 -525166 -1228909
6369 -1228909 -1190836 -630593 -161397 -80964 44664 -531229 -725567 -798639 -1330079 -673706
6359 -673706 362295 -458651 -506218 -429470 -285182 329772 745585 192219 -128462 -116520
6349 -116520 -303215 -225739 120531 422999 -78840 126332 -123990 -297079 -706925 -467438
6339 -467438 -176971 53621 260281 622880 -40518 -500029 -1139814 -1836281 -1188144 -419703
6329 -419703 991046 412976 767130 682000 434982 423982 1605 682198 240533 -657452
6319 -657452 -826960 -803304 -326506 -228607 -654810 -871665 -288381 -1054764 -1122843 -229897
6309 -229897 -256620 -1053729 -367432 -189847 -1400876 -1055543 -641371 -798520 -1111950 -1193832
6299 -1193832 -1382308 -716474 -166286 31847 734631 215200 -849885 -169366 -852546
6290 -852546 -1243561 -1030894 -164846 -393979 -570739 -891959 -753931 -481811 -833942 -790547
6280 -790547 -916266 -504579 -401286 -1163036 -559919 -594657 -1000910 -713948 -1005374 -1188236
6270 -1188236 -995301 -1144797 -936773 405142 -169229 -962268 -398639 -413131 -431975 -617950
6260 -617950 -541474 -184234 -127450 163771 -78052 -338599 -582546 -239854 -430551 633719
6250 633719 524300 70190 -87233 -233309 -874096 -1073192 -858713 -470032 62551 -235293
6240 -235293 185001 -582617 -63058 77147 -39293 -50864 318666 463690 -1166918 -1044004
6230 -1044004 -766629 -568252 -141455 -429439 -1064536 -727031 -33890 -61045 -190727 -761213
6220 -761213 -1425713 -1089194 -832643 -301659 -935729 -756316 -256668 -686247 -1406027 -1095824
6210 -1095824 -835332 -729326 -385162 164040 761574 416738 -177828 235710 612981 432305
6200 432305 120224 -141189 -313395 -543293 355435 -711893 -446373 -417918 -356954 -805523
6190 -805523 -1169959 -859443 -1264889 -895056 -890003 -424565 -96819 -111784 502963 696226
6180 696226 337415 -297281 -169835 -464434 -386417 -1058240 -214221 -69705 153043 35489
6170 35489 -290412 -382258 123595 278187 46528 9951 -569058 -311321 -479152 -25745
6160 -25745 502517 -372431 -524781 -70055 -330766 47339 245748 633685 72256 -101970
6150 -101970 -179844 37889 214671 -59935 1095394 1371363 -213955 164041 -544938 -437281
6140 -437281 298838 419744 247403 -1064103 -1495360 -555663 320918 328297 402517 66866
6130 66866 -600644 -525457 -467320 471003 625322 27004 -705505 -213661 292879 -278111
6120 -278111 -409355 -229139 -665012 -186941 226326 272177 484708 697901 -365326 -1077944
6110 -1077944 -378881 -729714 -508006 -11396 666902 288253 -450155 -585331 55674 610626
6100 610626 574366 419710 138169 -263577 -1475 606295 1599649 1017952 803760 1034443
6090 1034443 481497 694445 637721 99345 -982184 -1332947 -118159 -262737 -759558
6081 -759558 -292510 -94968 -160584 -829386 479397 72301 -679461 -347974 601115 937056
6071 937056 214212 -517189 -596976 -259914 233892 -448106 -1178338 -682115 -587015 -116906
6061 -116906 16075 153584 339666 460591 419622 268008 -499632 -1042984 -260350 -245551
6051 -245551 140398 -88443 -772927 -488119 -566819 -424006 -22282 -346405 -1269246 -273721
6041 -273721 6629 -195931 278813 -492909 -565473 239132 -130224 106335 -71355 -129057
6031 -129057 54713 -514062 -761388 -9247 28582 913110 358583 -540685 -1100970 -384787
6021 -384787 409991 363917 447723 694407 -160168 -345358 -505627 -44019 196532 -233231
6011 -233231 287471 858246 589227 -787206 -1035875 -719293 276741 -141638 -438796 384419
6001 384419 94416 -755213 -152498 69581 -373232 -26509 505880 13516 -65422 241422
5991 241422 326103 -229888 38291 69889 -51119 261680 -722638 -874399 -513881 -165636
5981 -165636 -457335 -1003362 -592966 -607584 -218626 188164 446585 -450589 -1125567 -410146
5971 -410146 -68902 248774 -457700 -342866 596868 420917 405128 320974 288036 -232624
5961 -232624 -700996 -140727 -35832 -546538 -376363 80213 -414715 -137082 543977 787330
5951 787330 960662 278054 783228 989771 1331640 689180 684147 177024 186713 682188
5941 682188 89357 405746 992594 865876 328487 -211702 -64749 87393 143549 941599
5931 941599 181936 117697 403948 1930675 1717799 423597 401675 514292 198862 541044
5921 541044 385319 248217 26100 -275586 -246185 -350842 -9200 1018589 863759 -587025
5911 -587025 306239 419910 336404 89128 -78006 34851 476391 -74868 -378306 363104
5901 363104 299701 243615 252243 16129 -323665 227290 1204735 635768 291835 216257 -402958
5890 -402958 -57533 924088 981047 177096 106884 -207681 -421014 -62734 90155 509508
5880 509508 13364 -156598 -221834 -548203 167528 1040436 339856 -182241 -128928 -504555
5870 -504555 -291423 119383 -513871 -213707 429510 396252 1483906 474065 158741 414426
5860 414426 -200630 311723 632667 600990 396895 626620 -106810 548227 366626 -378410
5850 -378410 -291858 -173790 229961 330945 1193948 774545 508603 554046 852710 1115359
5840 1115359 796394 757231 130904 98978 193137 420919 515759 -76723 -505743 -562061
5830 -562061 -304520 -442714 -171016 -98539 522884 490850 481005 -103451 98883 563192
5820 563192 387771 133803 899578 479304 -417840 -612301 -175978 473710 213041 -6098
5810 -6098 542824 1002542 702707 1400132 1221517 624833 917746 142972 838956 1283475
5800 1283475 781428 687033 1150202 1056383 702125 940960 926907 849346 757272 320792
5790 320792 531943 874062 -35679 -400437 448115 298573 317228 1050840 1153512 577059
5780 577059 699137 1067968 1430394 1884848 1728175 1845057 1477208 1029817 1173017 1404264
5770 1404264 1538412 2082525 1805751 1986774 1465366 2044663 2298658 2848171 3255739 3305283
5760 3305283 3462749 4255572 4064946 4264301 4466295 4351897 3996727 3959037 3901120 3267833
5750 3267833 3107441 3365938 3685604 2933091 3008396 2333447 2211174 1575394 1490817 1190001
5740 1190001 499714 114205 389575 809471 821506 1131511 1210174 1207654 1051382 771969
5730 771969 609954 1026677 1165479 1443848 1414699 927340 695421 1090459 1528567 1373383
5720 1373383 543059 189268 730453 1063032 468894 1092642 1822269 2015470 1636621 1327052
5710 1327052 1398017 148818 501800 1254771 1785628 1560336 1461809 791672 -89962 -48774
5700 -48774 599492 899163 590682 931819 705834 943293 1102149 1378657 540816 630708
5690 630708 -257737 117091 402643 268377 188086 -177768 433859 899372 1399061 794030
5680 794030 555625 -176939 -317000 27436 284872 124470 336926 864897 -165691 -115562
5670 -115562 10251 622715 1241350 1014214 765750 759532 846471 202201 1095915 1094406 933374
5659 933374 986541 867537 1320151 381523 407784 574092 554482 1156102 1000096 755700
5649 755700 60255 789537 1305888 172073 -398019 -263619 239637 187161 343179 512164
5639 512164 279271 -41007 175931 777851 9182 355234 104542 42095 95740 628960
5629 628960 1007187 59872 988056 1055673 395872 534357 584962 661309 119972 457244
5619 457244 216996 864761 197510 81402 1381541 453651 -254077 352496 1008065 1218924
5609 1218924 1411040 1308544 1979403 2217012 2265681 2149283 1176706 1200784 1198901 1308143
5599 1308143 1541937 1337234 1293574 1033561 325100 1218576 1560713 1556692 1718138 2271302
5589 2271302 2277223 1803421 2052691 2031263 2271595 2668190 3394392 3568206 3875328 3461662
5579 3461662 3360637 3674685 3642522 3886704 3960167 3199489 3120074 3310945 3041233 2148878
5569 2148878 2709829 2984328 3049105 3103225 2012617 1860910 2673736 3025826 2462188 2237353
5559 2237353 1425307 2161316 2466572 2236595 1871231 1987490 2238661 2213139 2150618 1429507
5549 1429507 2055328 1826715 2640783 2211331 1693694 1671287 1790280 1504035 856940 1212041
5539 1212041 1613863 1290190 865769 1939786 2227024 2159125 1967794 1893309 1979873 1940698
5529 1940698 1351625 1948836 848448 1433165 2369960 1844692 867910 721949 1714977
5520 1714977 1749708 2168642 1509366 849814 973629 1371865 1635087 1713888 1058484 1183065
5510 1183065 941572 1711532 2066071 1827886 600404 562238 700945 832832 714987 1119076
5500 1119076 939923 1339848 1643103 1234340 871606 683775 314857 -118533 663718 1029869
5490 1029869 794304 1135492 762056 202416 74048 113069 634494 838141 1264093 1175877
5480 1175877 1224254 1192934 1587067 1105800 854346 681787 1314144 1519795 1132346 529057
5470 529057 1076446 1059172 975477 950688 1464077 1604507 1728920 1127270 288516 676612
5460 676612 663678 819050 456315 702132 1112378 1123732 602965 644172 912336 1634418
5450 1634418 935127 -34194 -394616 260485 1396515 422729 380440 1165357 1098704 1502621
5440 1502621 1089110 1183742 826471 754024 1587256 1223810 842317 1211912 1808346 885395
5430 885395 35879 192275 527768 412783 -553268 -455059 819492 1663913 1790698 804191
5420 804191 1451997 1776104 987188 1010596 941815 813078 695707 138340 335655 383994
5410 383994 405800 -141556 23555 932362 1494460 1115283 1211996 1531853 1526208 1219935
5400 1219935 491387 767672 721050 1077825 1183324 1792848 2017708 1600965 1799458 563246
5390 563246 -18322 -169254 1250938 712099 751112 677285 486418 1086205 1224361 1312782
5380 1312782 847014 498616 303890 932748 719041 898061 4291 31071 1421797 1843071
5370 1843071 1481120 1542943 1991252 1912104 1546004 1800934 1440924 882880 500257 1559417
5360 1559417 646869 981573 1401333 294946 857718 1037529 651125 534778 1160403
5351 1160403 1531154 1075187 871002 1197074 1182630 178106 -206267 -299208 642171 482920
5341 482920 583880 1624524 1329520 655163 601841 808810 1662109 1419298 853633 823797
5331 823797 302667 1374914 1132378 487823 1034379 1673147 1323054 1329919 636380 563925
5321 563925 332400 420840 1203965 1520402 1743530 1099842 753000 69097 1048092 603584
5311 603584 -13776 1073815 1051343 458850 -329117 -72474 458000 138532 850964 2106272
5301 2106272 2660975 1632357 1417368 1346423 588461 1099112 855966 700765 64384 74994
5291 74994 833255 1987365 1309479 -184279 -45880 75338 182251 526098 672644 1206161
5281 1206161 1457322 830573 1523726 1682160 815650 932081 614748 642537 1120506 908692
5271 908692 749686 1012637 886572 772800 972876 192868 -341843 268480 1176135 770777
5261 770777 661570 391099 626706 701622 366393 944379 1469749 964309 893317 1347964
5251 1347964 761422 956190 1060508 531516 1184732 978995 1031224 161773 -355899 28680
5241 28680 61190 1105937 654713 927369 405732 771500 632197 -121800 379712 1175254
5231 1175254 1073705 971891 683198 491643 1435664 1873045 2407603 2145905 1684003 1597769
5221 1597769 875291 473163 935201 1435659 1638553 1226017 1664847 1477062 116361
5212 116361 492773 474862 1501860 1902533 1316255 1019013 754933 132674 746977 564526
5202 564526 71398 374698 897014 1724761 1234732 1161947 1653043 1735360 1064745 1364609
5192 1364609 1289335 1399256 1510708 1747814 1160583 1185006 1201626 1109494 681122 1472691
5182 1472691 1026184 1005559 958889 -130714 67229 693614 1123628 580155 1443047 530511
5172 530511 385229 1197435 1336463 1463903 724776 1397644 1929919 1455215 1205869 909390
5162 909390 1209644 1742504 2509332 2148739 1587770 1201858 693914 363766 1146221 1525309
5152 1525309 1849536 917946 620592 208414 517275 844081 1871118 2148796 1790085
5143 1790085 1855125 1436620 1805459 1864265 2083576 1207363 2496534 2769740 2090062 2517512
5133 2517512 2181067 1750789 2996439 2979763 2644644 2424224 2607824 2471588 2217163 2736651
5123 2736651 2733201 2555203 2075307 1439467 2071415 2474382 2077760 2396202 2598809 1950034
5113 1950034 1657836 2233700 2325068 1923138 2378115 2129906 2358394 2181621 1841102 1747393
5103 1747393 2558968 2814413 2405284 2000415 1499415 816157 1549896 3045138 3386191
5094 3386191 2260120 1875844 1589921 1457626 1535186 1030971 1042237 1606535 2139541 2613341
5084 2613341 2627227 1753570 1618224 1601280 2162894 1982451 1628946 2129795 2508535 2161789
5074 2161789 2321061 2111615 2363792 2128884 2422246 2457293 1327856 1196544 1397444 1456977
5064 1456977 1819306 2051947 2179372 2121624 3066557 2393683 2565476 2510281 1780799 1883620
5054 1883620 1252771 1221373 1641734 1674870 1669910 1627319 1846805 2355144 2681931 2157247
5044 2157247 2455493 1612450 1916770 2451604 2085522 2277991 2406139 2407296 2850840 2971953
5034 2971953 2761652 3325812 2377886 2385368 2870789 2743403 2980993 3630381 3769834 2326319
5024 2326319 2077251 2857482 3003298 2443020 2983747 3140843 3120481 3579508 2731905 3328452
5014 3328452 3346217 2985859 2863370 2901359 2580557 3189097 2873768 3087474 3188268 2821212
5004 2821212 3341179 3154955 2782892 2746777 2700937 2952062 3380448 3521282 2992139 2610165
4994 2610165 2789756 3506529 3578539 3130949 3172277 2808986 3045861 2525537 2853727 2797438
4984 2797438 2566210 2482689 3403428 3959409 3676124 2844808 3315415 3577092 3991819 3722174
4974 3722174 3466810 3699866 3559734 4147152 3952211 3292003 4029084 4189504 3110561
4965 3110561 2897340 3252812 3884043 3362573 3917279 4474135 4949532 3672741 3741882 3696763
4955 3696763 3509077 3736476 4195248 4627253 4963985 5098801 4904019 4981692 5419725 4788898
4945 4788898 5139952 5184703 4954865 5256012 4914714 4115483 4886271 5315304 5560335 4962249
4935 4962249 4960140 5798741 5346972 5103162 5505282 5919448 5475370 6139976 5576459 6030719
4925 6030719 6091716 6226919 6489707 6375511 6258518 6215571 6167132 6276406 6454068 6802806
4915 6802806 6638266 6062071 6512396 7381284 7431095 7383431 7619524 6741053 7238422 7291073
4905 7291073 6371004 6744407 7130266 7833682 7760525 7935658 8215749 7677702 8053490 8582591
4895 8582591 8605406 8119436 7833998 7937573 9155410 9782717 8571383 8516294 8882548 8999252
4885 8999252 9110642 9312003 9272637 9446532 9283696 9568377 10040940 9962714 10042594 10592051
4875 10592051 11029114 10189074 10338874 10810413 10553879 11409599 12081080 11899168 11684309
4866 11684309 11714398 12073949 12920857 12820840 12246264 12781349 13201846 13520864 13594188 13844866
4856 13844866 13515650 14092031 14483020 13883857 13523381 14679984 14263216 13837828 14365856
4847 14365856 15253482 15879430 15470597 16115151 16782977 16720707 16263331 16669167 17162371 17706756
4837 17706756 17719764 18243271 18141815 18891892 19341109 19203511 19695388 20918812 20450231
4828 20450231 19745462 19593196 20755526 22185229 22571972 23363497 24629274 24082404 24403209
4819 24403209 24770275 25676385 27027429 27390948 27592105 28382479 29557618 29498746 30122655
4810 30122655 30998989 31678820 31940545 32390517 33297820 34376795 34710125 35210343 36648886
4801 36648886 36843997 37530466 39320246 40681918 41068282 41964608 42808150 43572715 44829600
4792 44829600 45655087 46339179 47262843 49063323 49860272 50890768 52665982 53886111 54732196
4783 54732196 56482571 58267031 60274398 62080514 63850017 65124934 67740980 69471487
4775 69471487 71846338 73360848 75791130 77597972 79282247 82478565 84980548 87439658
4767 87439658 90738575 94043503 96995384 100055130 103145382 107563873 110506869 114041913
4759 114041913 117947269 121935144 126306902 131617611 136101510 140166670 145924739 151260269
4751 151260269 156951935 163652607 170753965 178069669 185765884 193453369 202281208 211649209
4743 211649209 220819026 231708127 243748828 256029473 268209831 281337272 294870193
4736 294870193 308291538 322629446 335868673 348307698 360226382 371399025 380135107
4729 380135107 385972739 389539947 389579739 386481555 381248647 372820832 360371772 347038445
4721 347038445 333452228 318072296 302977128 288054354 272479811 256553558 241495972
4714 241495972 228362342 216794543 204876148 193770878 183697144 174248396 164671414
4707 164671414 156404102 148310439 139812771 132376759 125953677 120057673 114892806 109069964
4699 109069964 103596036 99655473 95538646 91944256 88345542 84638657 80437912 77869780
4691 77869780 74787083 72406450 70062781 67199800 64227006 62341376 60909864 58310951
4683 58310951 55920837 54326854 52213087 50773804 49714485 48598746 47307204 46032131
4675 46032131 45076797 43635882 41100725 39535830 38377800 36904278 36587646 36689613 35653412
4666 35653412 33397061 32216200 32079763 30755910 30016493 30027120 29155554 28465242 28286609
4657 28286609 27271780 25956264 25536284 24873300 24585056 24160006 23589466 23331084 22757951
4648 22757951 21803822 20826744 20257032 20137520 19984710 20038825 20138916 19688739 19001077 18320570
4638 18320570 17943916 17371061 16594177 16797412 16746215 17135990 17134187 16857103 16586772 16502161
4628 16502161 16023614 15289899 14393493 14420356 14700668 14380801 14453127 13830504 13090774 12776936
4618 12776936 13153796 13220064 13276290 12469764 12612018 12629330 12469029 12829823 12605841 12255135
4608 12255135 12504434 12441071 12371956 12346146 11727053 11980343 11954594 11993006 11520786 11208847
4598 11208847 11450423 11947555 12870649 12795167 12147454 11434681 12015111 12272685 13465334
4589 13465334 13542765 12528897 11653951 12130761 13484119 14053424 14840357 14040596 13669922
4580 13669922 14447589 15363688 16071239 17160206 17644079 18113312 16923925 17685613 18170925
4571 18170925 18444408 19736251 21110230 21295625 21633819 21332390 20627507 21358973 20506025
4562 20506025 20506929 21698586 22287258 22808470 22424390 20747318 19780632 18792715 18212405 18610933
4552 18610933 19186185 19462979 18974956 17194029 15499573 15174618 13881972 12769663 12512910
4543 12512910 12246517 11973380 11364510 10502540 7858305 7435484 8245386 8119942 7003433
4534 7003433 7925900 7590881 6379832 5788726 5205904 5220925 5783251 5616486 5276224 4946013
4524 4946013 5024921 4910236 5170488 5808593 5646059 5685048 5030327 4417070 3823119 3930641
4514 3930641 3567366 4721598 4653141 3636765 4119817 4844871 5268403 4542336 4237233
4505 4237233 4533510 4166770 5048192 5417703 4880983 4856763 3516546 3767509 4459211 4612244
4495 4612244 4479341 4359944 4467458 3793508 3090540 3183168 3330213 3958391 3828834 2883221
4485 2883221 1961304 1462195 2648908 2758528 2855166 2818731 2721998 2156429 2108743 2396048
4475 2396048 3305125 3137433 2339088 1856306 2352791 1783853 1615906 1452945 1112125 1063713
4465 1063713 1901671 2973593 2608209 2127525 2329292 1790195 1978026 2049816 1769785 1870117
4455 1870117 2018453 2098071 2268067 2380161 2218429 1603154 2230525 2204602 1994590 1968650
4445 1968650 1680733 1860535 1874546 1466322 998362 1588170 1704896 1833162 1877635 1434427
4435 1434427 1305435 1488240 1839662 1619574 1757643 1330144 103546 -112654 621548
4426 621548 946307 -16044 23912 1295643 2221832 1399364 1836635 1922541 1150138 1104827
4416 1104827 1454619 1817675 2548674 2183227 2072052 2140996 2315010 847334 1460729 2279942
4406 2279942 2306433 975598 473195 292770 77407 210460 577285 818985 1892152
4397 1892152 1892636 1246632 1324513 968319 732435 1035145 -149814 942778 2114270 1514864
4387 1514864 929358 -108845 188373 1049729 1085565 1749403 2295073 1804769 1457958 1336849
4377 1336849 1520291 1743105 1684145 2126323 1343719 1007040 904952 1460100 1420062 1404299
4367 1404299 2017524 1347060 1630802 847566 1313398 1317935 1300325 1015764 474153 281772
4357 281772 1269342 2036191 1114052 302546 -176201 630073 1397144 1008187 657054 453410
4347 453410 685404 451242 569641 -17756 583355 373963 -391599 -139929 666426 1338324
4337 1338324 1201279 1696076 2312474 960769 863078 554006 590245 976666 768330 -14986
4327 -14986 546466 211466 242664 1216680 802357 376574 639327 471897 125232 586063
4317 586063 513644 1097986 300853 -61557 1071061 1320704 1181188 1230610 556200 504664
4307 504664 -6793 116436 729669 519678 515197 527953 780449 1297361 920360 251417
4297 251417 1340764 1263368 2140131 2121117 1940202 1076435 1027564 685882 1388910 2009029
4287 2009029 1928369 1775205 1662422 1608341 1584103 1897656 1653158 1569172 1699314 2142809
4277 2142809 2493083 2638012 2235032 2444997 3523082 3654696 3807588 3680894 3105050
4268 3105050 2811021 3922971 3901713 2801963 3422650 3577016 3836983 3689783 2796657
4259 2796657 2978217 3292112 3005772 3180063 3549717 2986736 2343381 2880566 2744436 1919027
4249 1919027 2015866 2113307 1508574 1268443 807427 637895 31309 911295 1201218 1629414
4239 1629414 735125 1081766 1282768 1339382 520825 804126 854234 1136885 1322795 1766107
4229 1766107 1327528 902549 1402311 1331333 939902 1239501 453555 370248 1178467 1492931
4219 1492931 772156 418423 1112041 1284894 670818 382888 966354 565788 1364754 1929862
4209 1929862 1824221 2038384 2601755 2612173 2274838 2503600 2144560 1534585 1297249 803147
4199 803147 1102869 885305 733213 1540714 2019081 1365548 1046994 1023941 981175 1758573
4189 1758573 1922728 1699106 1484348 1837177 1228942 442384 833829 511666 1014957 962382
4179 962382 690732 200475 116555 313731 381891 529786 797537 1274334 1061602 509141
4169 509141 391125 741860 880994 384467 779259 985797 1139449 1193103 841702 708640
4159 708640 623839 887710 687478 760178 1010080 1681598 1379946 1102997 244851 452585
4149 452585 177947 -540004 -393648 -417754 413604 741828 1220177 1067305 1451672 1222156
4139 1222156 736182 920913 1546579 1366266 801736 22272 -75134 356010 249074 -653738
4129 -653738 -281371 291325 500303 299981 1111831 250858 740105 1277138 569094 378663
4119 378663 28377 197506 602838 841375 432067 -184564 -446047 -25107 263575 135946
4109 135946 197074 260627 844837 782887 403443 39631 -628350 -468908 -403773 -36812
4099 -36812 371454 279077 634157 -504302 469603 346526 -441827 -360924 -728272 203927
4089 203927 498973 634347 -143497 -181905 73432 845627 904947 621582 282071 -635883
4079 -635883 -925924 322854 956525 655382 730661 199427 80045 -281250 -1465218 -296287
4069 -296287 491792 689044 1096022 831989 589660 349001 -287251 -110081 -339196 -198530
4059 -198530 -479398 48336 -601666 -850596 -418690 599160 -75950 71450 130941 -910724
4049 -910724 -221651 276648 -504635 -406632 187342 44685 -135624 -310966 242210 -785334
4039 -785334 -1529244 -984911 -489144 -364181 -547464 -1049832 -227013 297844 636584 130890
4029 130890 106141 1010349 1078102 147301 -191759 -312159 -673239 -1095028 -1134060 -1045484
4019 -1045484 -374664 -585124 -1390809 -1460866 -696865 -1697507 -1519464 -1795045 -891075 -473269
4009 -473269 -588849 84756 -188479 -525445 -793429 -582098 -781114 -24036 77909 -467631
3999 -467631 -711407 16470 -398953 -136209 -68669 91457 -225670 428803 1188881 1140021
3989 1140021 88623 -470907 90069 588049 35276 359723 390873 200532 598872 -690197
3979 -690197 -545345 368046 -42194 455158 101131 459529 -163993 -4876 745359 440488
3969 440488 175687 -48049 92222 -623298 -1123442 -688763 -388065 -205418 479631 -1336
3959 -1336 -167433 302129 231680 141189 729071 612347 630879 -675782 -694203 364141
3949 364141 207796 -12626 -56963 -373652 -677062 -495908 470012 976157 1218746 -304235
3939 -304235 193895 -69479 -194382 530009 565437 959652 1256466 1283023 516392 -765890
3929 -765890 234056 822643 1065865 1008292 161444 1214074 761436 1139352 1199771 421615
3919 421615 274899 1235637 871491 586313 970558 188743 244871 312940 -365971 -376720
3909 -376720 311351 872917 843892 342896 1013400 1626735 1036787 1647416 1130096 1648388
3899 1648388 1639912 729260 856384 1021369 582584 673216 777352 839138 687633 460365
3889 460365 1008443 1414926 921635 368320 1196138 1392893 394844 -164326 194680 99204
3879 99204 250669 -31052 548315 363798 284308 814496 1295839 699614 572684 1254826
3869 1254826 710771 906814 303753 10443 1173646 1029752 269395 -78284 53740
3860 53740 683426 -482581 -753772 90582 542961 378079 563747 848371 465626 510818
3850 510818 435207 630165 1037296 1010280 666487 478264 755933 635220 -382736 579841
3840 579841 253428 512648 653684 531922 387614 -6926 277629 198290 -409329 -156462
3830 -156462 507772 249520 866453 574803 250196 255128 113016 169049 281111 -233395
3820 -233395 225703 847741 823081 854625 84307 -832302 -383952 616605 778969 904171
3810 904171 226273 532810 335505 15406 409407 819484 431307 -382786 586091 -201252
3800 -201252 -251862 658403 311344 -249544 49959 -55903 -391161 -339100 -12789 383031
3790 383031 962129 1001030 641574 1314211 1278913 692636 191529 705703 437582 -546836
3780 -546836 557590 654121 377473 396717 180508 167446 273878 655450 30098 -173431
$$ [...]
##END NTUPLES=NMR SPECTRUM
##END=
