##TITLE=1H_CA-9234-22
 CDCl3
 8 sc, 
 6.2.2024
##JCAMPDX= 6.0         $$ Bruker NMR JCAMP-DX V2.0
##DATA TYPE= NMR SPECTRUM
##DATA CLASS= NTUPLES
##ORIGIN= UXNMR, Bruker Analytische Messtechnik GmbH
##OWNER= root
$$ XWIN-NMR		Version 3.5
$$ Tue Feb  6 13:52:55 2024 Russian Standard Time (UT+4h)  she@DPX200
##.OBSERVE FREQUENCY= 200.1313
##.OBSERVE NUCLEUS= ^1H
##.ACQUISITION MODE= SIMULTANEOUS
##.ACQUISITION SCHEME= undefined
##.AVERAGES= 8
##.DIGITISER RES= 18
##SPECTROMETER/DATA SYSTEM= spect
##.PULSE SEQUENCE= zg30
##.SOLVENT NAME= D2O
##.SHIFT REFERENCE= (INTERNAL, D2O, 0, 15.4725)
##AUDIT TRAIL= $$ (NUMBER, WHEN, WHO, WHERE, WHAT)
$$ ##TITLE= Audit trail, XWIN-NMR		Version 3.5
$$ ##JCAMPDX= 5.01
$$ ##ORIGIN= Bruker BioSpin GmbH
$$ ##OWNER= she
$$ F:/spectra/data/she/nmr/H-F/1/pdata/1/auditp.txt
$$ ##AUDIT TRAIL=  $$ (NUMBER, WHEN, WHO, WHERE, WHAT)
(   1,<2024-02-06 13:51:49.84 +0400>,<she>,<DPX200>,
      <created by zg, POWCHK disabled, PULCHK disabled
       configuration hash MD5:
       00 E9 B6 7A A2 85 ED C7 34 08 36 98 17 FE 4E 26
       data hash MD5: 16K
       E5 3E 69 C7 3D 22 D4 47 D5 3D 4E 27 07 85 08 DC>)
(   2,<2024-02-06 13:51:52.04 +0400>,<she>,<DPX200>,
      <Start of raw data processing
       efp BC_mod = 2 LB = 0.24 FT_mod = 6 PKNL = 1 PHC0 = -24592.72 PHC1 = 9.652679 SI = 16K 
       data hash MD5: 16K
       6F 5A E4 C3 67 44 E7 1C 94 62 46 1C 11 2F D1 35>)
(   3,<2024-02-06 13:52:07.31 +0400>,<she>,<DPX200>,
      <pk PHC0 = 0.8239945 PHC1 = -1.8 
       data hash MD5: 16K
       7E B1 BF 76 3A FB 42 AD A4 EA EC 05 CA FF 2E 77>)
(   4,<2024-02-06 13:52:10.18 +0400>,<she>,<DPX200>,
      <abs ABSG = 5 
       data hash MD5: 16K
       8E 30 C5 8A 4C CB 11 8C 19 78 27 1A 17 36 A8 6D>)
(   5,<2024-02-06 13:52:33.93 +0400>,<she>,<DPX200>,
      <abs ABSG = 5 
       data hash MD5: 16K
       7F F1 24 01 B9 03 21 C6 DC 79 E9 F2 8C 07 49 34>)
$$ ##END=
$$ 
$$ hash MD5
$$ CC 71 5D AA 3B 25 E9 36 5E A4 8A 35 BD 71 38 58
##$RELAX= 
##$RELAX= 
##$RELAX= 
##$RELAX= 
##$RELAX= 
##$RELAX= 
$$ Bruker specific parameters
$$ --------------------------
##$DU= <F:/spectra>
##$EXPNO= 1
##$NAME= <H-F>
##$PROCNO= 1
##$TYPE= <nmr>
##$USER= <she>
##$AMP= (0..31)
100 100 100 100 100 100 100 100 100 100 100 100 100 100 100 100 100 100 
100 100 100 100 100 100 100 100 100 100 100 100 100 100 
##$AQSEQ= 0
##$AQ_mod= 1
##$AUNM= <au_zg>
##$AUTOPOS= <>
##$BF1= 200.13
##$BF2= 200.13
##$BF3= 200.13
##$BF4= 200.13
##$BF5= 200.13
##$BF6= 200.13
##$BF7= 200.13
##$BF8= 200.13
##$BYTORDA= 1
##$CFDGTYP= 0
##$CFRGTYP= 5
##$CHEMSTR= <none>
##$CNST= (0..31)
1 1 145 1 1 1 1 1 1 1 1 1 1 1 1 1 1 1 1 1 1 1 1 1 1 1 1 1 1 1 1 1 
##$CPDPRG= <>
##$CPDPRG1= <>
##$CPDPRG2= <>
##$CPDPRG3= <>
##$CPDPRG4= <mlev>
##$CPDPRG5= <mlev>
##$CPDPRG6= <mlev>
##$CPDPRG7= <mlev>
##$CPDPRG8= <mlev>
##$CPDPRGB= <>
##$CPDPRGT= <>
##$D= (0..31)
0 1.2 0 0 0 0 0 0 0 0.06 0 0.03 0 0 0 0 0.0002 0 0 0 0 0 0 0 0 0 0 0 0 
0 0 0 
##$DATE= 1707213109
##$DBL= (0..7)
$$ [...]
##$SUBNAM3= <"">
##$SUBNAM4= <"">
##$SUBNAM5= <"">
##$SUBNAM6= <"">
##$SUBNAM7= <"">
##$SUBNAM8= <"">
##$SUBNAM9= <"">
##$SW= 18.0517328524113
##$SWIBOX= (0..15)
0 0 2 0 0 0 0 0 0 0 0 0 0 0 0 0 
##$SW_h= 3612.71676300578
##$TD= 16384
##$TD0= 1
##$TE= 0
##$TE2= 300
##$TE3= 300
##$TEG= 300
##$TL= (0..7)
0 120 120 120 120 120 120 120 
##$TP= (0..7)
150 150 150 150 150 150 150 150 
##$TP07= 0
##$TPNAME0= <>
##$TPNAME1= <>
##$TPNAME2= <>
##$TPNAME3= <>
##$TPNAME4= <>
##$TPNAME5= <>
##$TPNAME6= <>
##$TPNAME7= <>
##$TPOAL= (0..7)
0.5 0.5 0.5 0.5 0.5 0.5 0.5 0.5 
##$TPOFFS= (0..7)
0 0 0 0 0 0 0 0 
##$TUNHIN= 0
##$TUNHOUT= 0
##$TUNXOUT= 0
##$USERA1= <user>
##$USERA2= <user>
##$USERA3= <user>
##$USERA4= <user>
##$USERA5= <user>
##$V9= 5
##$VALIST= <valist>
##$VCLIST= <CCCCCCCCCCCCCCC>
##$VD= 0
##$VDLIST= <DDDDDDDDDDDDDDD>
##$VPLIST= <PPPPPPPPPPPPPPP>
##$VTLIST= <TTTTTTTTTTTTTTT>
##$WBST= 1024
##$WBSW= 4
##$XGAIN= (0..3)
0 0 0 0 
##$XL= 0
##$YL= 0
##$YMAX_a= 50453
##$YMIN_a= -61512
##$ZGOPTNS= <>
##$ZL1= 120
##$ZL2= 120
##$ZL3= 120
##$ZL4= 120
##$ABSF1= 15.47254
##$ABSF2= -2.579309
##$ABSG= 5
##$ABSL= 3
##$ALPHA= 0
##$AQORDER= 0
##$ASSFAC= 0
##$ASSFACI= 0
##$ASSFACX= 0
##$ASSWID= 0
##$AUNMP= <proc_1d>
##$AZFE= 0.1
##$AZFW= 0.1
##$BCFW= 0
##$BC_mod= 2
##$BYTORDP= 0
##$COROFFS= 0
##$CY= -3
##$DATMOD= 1
##$DC= 0
##$DFILT= <>
##$DTYPP= 0
##$F1P= 0
##$F2P= 0
##$FCOR= 1
##$FTSIZE= 16384
##$FT_mod= 6
##$GAMMA= 0
##$GB= 0
##$INTBC= 1
##$INTSCL= 3.70164e-10
##$ISEN= 128
##$LB= 0.24
##$LEV0= 0
##$LPBIN= 0
##$MAXI= 10000
##$MC2= 0
##$MEAN= 0
##$ME_mod= 0
##$MI= 1.114404
##$NCOEF= 0
##$NC_proc= -9
##$NLEV= 6
##$NOISF1= 3.799351
##$NOISF2= 2.8
##$NSP= 0
##$NTH_PI= 0
##$NZP= 0
##$OFFSET= 15.47254
##$PC= 1
##$PHC0= -24591.9
##$PHC1= 7.852679
##$PH_mod= 1
##$PKNL= yes
##$PPARMOD= 0
##$PSCAL= 0
##$PSIGN= 0
##$REVERSE= no
##$SF= 200.130009839135
##$SI= 16384
##$SIGF1= 3
##$SIGF2= 2
##$SINO= 5.538805
##$SIOLD= 16384
##$SREGLST= <1H.CDCl3>
##$SSB= 0
##$STSI= 16384
##$STSR= 0
##$SW_p= 3612.71676300578
##$SYMM= 0
##$S_DEV= 0
##$TDeff= 16384
##$TDoff= 0
##$TI= <>
##$TILT= no
##$TM1= 0
##$TM2= 0
##$TOPLEV= 0
##$USERP1= <user>
##$USERP2= <user>
##$USERP3= <user>
##$USERP4= <user>
##$USERP5= <user>
##$WDW= 1
##$XDIM= 16384
##$YMAX_p= 465431346
##$YMIN_p= -9026532
$$ End of Bruker specific parameters
$$ ---------------------------------
##NTUPLES= NMR SPECTRUM
##VAR_NAME=  FREQUENCY,     SPECTRUM/REAL,   SPECTRUM/IMAG
##SYMBOL=    X,             R,               I
##VAR_TYPE=  INDEPENDENT,   DEPENDENT,       DEPENDENT
##VAR_FORM=  AFFN,          ASDF,            ASDF
##VAR_DIM=   16384,         16384,           16384
##UNITS=     HZ,            ARBITRARY UNITS, ARBITRARY UNITS
##FACTOR=    0.220516191357247, 1,           1
##FIRST=     3096.51956277031, 0,            0
##LAST=      -516.197200235466, 0,           0
##MIN=       -516.197200235466, -9026532,    0
##MAX=       3096.51956277031, 465431346,    0
$$ Real data points
##PAGE= N=1
##DATA TABLE= (X++(R..R)), XYDATA
$$ [...]
11886c49901j15396K50715j90873j90945P92639k2817L02095o17364L29006K88356
$$ -349901 -465297 -214582 -405455 -596400 196239 173422 475517 -141847 187159 475515
11876D75515m32690P87041n59620m95343L677m67137M01076K38122O93898J02431
$$ 475515 42825 829866 270246 -225097 -221420 -688557 -287481 -49359 644539 746970
11866G46970k25261L23510k90976o94904N78316K73319l29043r7086N75055R1588
$$ 746970 521709 845219 554243 -140661 437655 710974 381931 284845 859900 951488
11856I51488K30385j88050p03113L53247Q12182k13187q13979j178276l21176
$$ 951488 1181873 993823 290710 643957 1456139 1242952 428973 -749303 -1070479
11847a070479O71063J147216m60267j30224N5773o86600j85920P7748P10372L37332
$$ -1070479 -399416 747800 287533 157309 213082 -473518 -659438 -581690 128682 466014
11837D66014N5612l75112r647m06186o07388J042596K07215p3953J20741j27712
$$ 466014 521626 146514 136867 -269319 -876707 165889 373104 299151 419892 292180
11827B92180j85889J6870r3911o21174j08651O91761J34402j78818r51916m4419
$$ 292180 106291 123161 29250 -591924 -700575 -8814 125588 -53230 -1005146 -1049565
11817a049565M40128n5008k33612L87438O92456m15826J00459O34269N91515k76324
$$ -1049565 -609437 -664445 -898057 -510619 181837 -233989 -133530 500739 1092254 815930
11807H15930j173821Q78056L28333J75105q32857m45497l0590J4609p19868J193148
$$ 815930 -357891 520165 848498 1023603 190746 -254751 -285341 -270732 -990600 202548
11797B02548O12994q58270J015798m56420J27567r76334l52752P23037R80944
$$ 202548 815542 -42728 973070 516650 644217 -332117 -684869 38168 1019112
11788A019112l0492n78321q5605K84379m56186j93293P292j30650O83089K8419
$$ 1019112 988620 410299 324694 609073 152887 -40406 -33114 -163764 519325 547744
11778E47744L32131P4282k84657j64676n05220L09707m19119N59219j78305j059822
$$ 547744 879875 954157 669500 504824 -396 309311 -109808 449411 271106 -788716
11768g88716N92214r6685l77333j44648J05803O57058n47489P80895k70750l8340
$$ -788716 -196502 -293187 -670520 -815168 -709365 -52307 -599796 181099 -89651 -127991
11758a27991j2713J37745N99799l64560M13609p43863k41177K35595K80584k20984
$$ -127991 -140704 -2959 596840 232280 645889 -97974 -339151 -103556 177028 -43956
11748d3956K51633M31375o52837r6341K2904O48656M2160n78141N2374l29617
$$ -43956 207677 639052 -13785 -110126 -87222 561434 603594 25453 77827 -251790
11738b51790l46673k49558J95366O45018m006L23400J96605m4473P0523L95355
$$ -251790 -598463 -848021 -652655 -7637 -11643 311757 508362 463889 534412 929767
11728I29767P8891j439199Q84644j76860j612573J478556J66753L1695l90648
$$ 929767 1008658 -430541 454103 277243 -1335330 143226 309979 341674 -48974
11719d8974J7066P6264K5359K60066q67189J46625O18880l00826k64761l19478
$$ -48974 -31908 44356 69715 329781 -537408 -390783 228097 -72729 -337490 -656968
11709f56968l13356N36809K51308M15141M49331m99047m13491K81623l67581K67142
$$ -656968 -970324 -433515 -182207 232934 682265 183218 -230273 51350 -316231 -49089
11699d9089j093474N09282P03730l29552K99061J39255j054739K05771N16186
$$ -49089 -1142563 -633281 70449 -259103 39958 179213 -875526 -669755 -153569
11690a53569j164249K19465J04930O73198R83822k77051k78981M32883k39392
$$ -153569 -1317818 -1098353 -993423 -320225 663597 386546 107565 540448 301056
11681C01056j3774k999j090466j62121K06000p9763j69385M80367J68304j89307
$$ 301056 287282 284283 -806183 -968304 -762304 -842067 -1011452 -531085 -362781 -552088
11671e52088L90380p23794K57447k45756J31935J312407r112J30353n15768K64004
$$ -552088 -161708 -885502 -628055 -873811 -741876 570531 561419 691772 176004 440008
11661D40008k80017L1166L67481o03528J86083J78121o39174r2135k86035j08169
$$ 440008 159991 191157 558638 -44890 141193 319314 -319860 -411995 -698030 -806199
11651h06199p84427J95128Q28305k61279P5291j87781K52839M53524L15812p12427
$$ -806199 -1590626 -1395498 -567193 -828472 -753181 -940962 -688123 -234599 81213 -631214
11641f31214l63378k24090J031732J65803P03535l3256k36363k46446j122920
$$ -631214 -994592 -1218682 -186950 -21147 682388 649132 412769 166323 -956597
11632i56597P08887j80382p56652M14007M96619J95688L56619k24846k45876p42810
$$ -956597 -247710 -428092 -1184744 -770737 -274118 -78430 278189 53343 -192533 -935343
11622i35343J02923O432O23453N1090l63543K19345L03386m66137j53279j3661
$$ -935343 -832420 -825988 -202535 -151445 -514988 -295643 7743 -458394 -611673 -625334
11612f25334O14286K30923n72444M06370m37073q3802j85221P30680n67999j50920
$$ -625334 -11048 219875 -352569 53801 -383272 -467074 -652295 78385 -489614 -640534
11602f40534R2423j1100Q45814k14452k49039n3442l37398M86097p35100L81688
$$ -640534 -548111 -559211 286603 72151 -176888 -230330 -567728 -81631 -816731 -435043
11592d35043O15819Q9994L60899k96203L91096j45737m04181K95585M60761j100602
$$ -435043 180776 270770 631669 335466 726562 580825 176644 472229 932990 -167612
11582a67612k89713m76231Q66294K96339m81011O81983o51081N51280m7457k17538
$$ -167612 -457325 -933556 -67262 229077 -251934 430049 -221032 330248 282791 65253
11572F5253q7206P91060O36643j314856J02041R93081q78932n36409L43067J38771
$$ 65253 -21953 769107 1405750 90894 192935 1186016 307084 -229325 113742 252513
11562B52513o80631k53001Q51126j01985J210Q52133j29577p24373n52739Q21495
$$ 252513 -428118 -681119 170007 68022 69232 921365 791788 67415 -485324 336171
11552C36171l01674L07706J143500O216K6209m1322K3026k38865l69657N697l75097
$$ 336171 34497 342203 1485703 1491919 1518128 1476806 1499832 1260967 891310 897007 521910
11541E21910m68155j90932j20155O08179k88252M81570m48044k27614J008402
$$ 521910 53755 -137177 -257332 350847 62595 544165 96121 -131493 876909
11532H76909J44195k77430K22392r93178K52281r3471N64025K81653k01373l67640
$$ 876909 1021104 743674 966066 -27112 225169 131698 695723 977376 776003 408363
11522D08363o44625R8411J34751l15610L64787m05126O73848P84320R9115l42371
$$ 408363 -236262 -137851 -3100 -318710 46077 -359049 314799 1099119 1198234 855863
11512H55863q44443o44803L1813J260156J9712K80171k5401n71535j66007N68419
$$ 855863 11420 -633383 -601570 658586 678298 958469 933068 361533 195526 763945
11502G63945m41729O60098n53920l87694J25725m84312J71518J66019L22652q45781
$$ 763945 322216 982314 428394 40700 166425 -317887 -146369 19650 342302 -503479
11492e03479j36040N23917Q182l5272m18919O6632L96019L79306J48723r61738
$$ -503479 -639519 -115602 -107420 -142692 -561611 -494979 -98960 280346 429069 -532669
11482e32669O56496j3353J88849P7782n32668M42636m74932K74042o6397L89783
$$ -532669 123827 110474 299323 377105 -155563 287073 -187859 86183 19786 409569
11472D09569K27k8465K65824k41733l70723J29959j39882n11295j66190K78547
$$ 409569 409796 381331 647155 405422 34699 164658 24776 -486519 -652709 -374162
11462c74162R1553q3994P20957k74682j656317o4241O46168K31147j55767N21312
$$ -374162 -282609 -366603 354354 79672 -1576645 -1640886 -994718 -763571 -919338 -398026
11452c98026j95328m91705q4831N22718m2717l7878k24608j18290Q98336p4813
$$ -398026 -593354 -1085059 -1169890 -647172 -689889 -727767 -952375 -1070665 -172329 -247142
11442b47142m65896m73395P04157M90105J46983m03037k75883J08124P81566k37008
$$ -247142 -713038 -1186433 -482276 7829 154812 -248225 -524108 -415984 365582 128574
11432A28574n00188M6675K08618J30888Q45236q52705j167026J1995N51814J16408
$$ 128574 -371614 -324939 -116321 14567 859803 7098 -1159928 -1147933 -596119 -479711
11422d79711q9119J82305m88219k97392o5226P50885k7576l59267l32376R17049
$$ -479711 -568830 -386525 -874744 -1172136 -1237362 -486477 -514053 -873320 -1205696 -288647
11412b88647k38931q4915k02122J342458j44946r51860L5499L20121O59478q15647
$$ -288647 -527578 -612493 -814615 527843 382897 -568963 -533464 -213343 446135 -369512
11402c69512l65129m20187j76709J90868J81038m86529J32399K71773m06409N57434
$$ -369512 -734641 -1154828 -1331537 -1140669 -959631 -1446160 -1313761 -1041988 -1448397 -890963
11392h90963L31635m05679J74050o86456Q57970J284709n92019j029235m95090
$$ -890963 -559328 -965007 -790957 -1477413 -619443 665266 73247 -955988 -1451078
11383a451078Q47826k07496o96926N18664J41396L84287K19505r0739L49899N8301
$$ -1451078 -603252 -810748 -1507674 -989010 -847614 -463327 -243822 -334561 15338 73639
11373G3639o46266l45680k23951K037P85580J59554J78425k46873k93554K86806
$$ 73639 -572627 -918307 -1142258 -1140221 -354641 -195087 -16662 -263535 -557089 -270283
11363b70283Q5317k31531n357k54287J56235K46565K41245l44310l28813j50293
$$ -270283 -184966 -416497 -421854 -676141 -519906 -273341 -32096 -376406 -705219 -855512
11353h55512J22359M24022N43159j16075J9007n03489p41548N46348O60263r595
$$ -855512 -733153 -309131 234028 117953 136960 -366529 -1108077 -561729 98534 88939
11343H8939l74820r5853n97946M28871K55949m83565N88203n26385m15937N94149
$$ 88939 -285881 -381734 -979680 -550809 -294860 -778425 -190222 -716607 -1132544 -538395
11333e38395J11455O99482k43012m08764Q0368O39971k31877l18370O5458M64134
$$ -538395 -426940 272542 29530 -379234 -298866 341105 109228 -209142 -143684 320450
11323C20450j78412n09175L71073K89471L73534l73r25243m56722n8778j04656
$$ 320450 142038 -367137 3936 293407 666941 666568 -258675 -715397 -774175 -878831
11313h78831J46213P09012n24457k68707R83771K48056m60578n64665q7302N30783
$$ -878831 -732618 -23606 -548063 -816770 167001 415057 -45521 -610186 -697488 -166705
11303a66705J83907N14567l35012Q30706p44890k80811K19285L75098j6104k98809
$$ -166705 17202 531769 196757 1027463 282573 1762 221047 596145 580041 281232
11293B81232k09040l36009P4540O37541k91823L99526p56J2987J49103N29188
$$ 281232 72192 -263817 -189277 448264 156441 555967 555211 568198 717301 1246489
11283A246489P5042r97570K7403P96p7414k50125L84544M44852m84357l90597
$$ 1246489 1321531 323961 351364 352160 274746 24621 409165 854017 369660 -20937
11273b0937M75312l11139M29481m45743l63601m10870L74533O17191M91707j142616
$$ -20937 454375 143236 572717 126974 -236627 -647497 -272964 344227 835934 -306682
11263c06682j84612L01931L90930p16824L26144M42375J10425M89560m35587o92383
$$ -306682 -491294 -189363 201567 -515257 -189113 253262 363687 853247 417660 -274723
11253b74723N66986L34022L28624p42851q60734N13568M45509K29872L38941K04708
$$ -274723 292263 626285 954909 212058 -648676 -135108 310401 540273 879214 1083922
11243A083922O11883q50219o61704m1774K77638l9618j76777r71105O96726P54524
$$ 1083922 1695805 845586 183882 142108 419746 380128 203351 -767754 -71028 683496
11233F83496m54327K52556r3645q06965M91229M21686J12710O2810m81831N54312
$$ 683496 229169 481725 388080 -418885 72344 494030 606740 669550 187719 742031
11223G42031N00041M51297p24273m53118N3381N72247K02775l62294j105154n46512
$$ 742031 1242072 1693369 969096 515978 569359 1141606 1344381 982087 -123067 -669579
11213f69579K69127O61114J45728J91604l28855m20275J190348r35172j037992
$$ -669579 -400452 260662 406390 597994 269139 -151136 1039212 104040 -933952
11204i33952N99169m91401j70553N91278Q36809L16239r7163n52973J40857k40425
$$ -933952 -334783 -826184 -996737 -405459 431350 747589 650426 97453 238310 -2115
11194b115r82374L50626N93451J87037O9197o99958k39191R8160N64404K66325
$$ -2115 -984489 -633863 -40412 146625 215822 -484136 -723327 -625167 -60763 205562
11184B05562L80418o14119n4139m6553P89595q52343m44362M98331K20217k14450
$$ 205562 585980 -28139 -82278 -128831 660764 -191579 -635941 -137610 82607 -131843
11174a31843R98820p17013n34396L98124m58225M53562K37951P563M75263r7042
$$ -131843 866977 149964 -384432 13692 -444533 9029 246980 254543 729806 632764
11164F32764r78316O92125K8048J56352k06979o69034q004N81101l77853K78956
$$ 632764 -345552 346573 374621 530973 323994 -345040 -353044 228057 -149796 129160
11154A29160L69937j119390k11359M34528k21349J14326L40843q07955q5043L26152
$$ 129160 499097 -620293 -831652 -397124 -618473 -504147 -163304 -971259 -1056302 -730150
11144g30150n98728J325784j03618o94079M09702L46476J60223L69801k60538
$$ -730150 -1328878 -3094 -106712 -800791 -391089 -44613 115610 485411 224873
11135B24873j65488j43708n95853O94495L64444L651k02105l44907P26221q49893
$$ 224873 59385 -84323 -680176 14319 378763 382414 180309 -164598 561623 -288270
11125b88270j01298j61355j169015N76211J091061J83258k28848J61758J73716
$$ -288270 -389568 -550923 -1719938 -1143727 -52666 130592 -98256 63502 237218
11116B37218L96240j393317O5131K00379L39156k86793l63960O26859K59149o33524
$$ 237218 633458 -759859 -694728 -494349 -155193 -441986 -805946 -179087 80062 -553462
11106e53462m54787L44973j16684L53874J61277J00110J3237L20434J82051j006697
$$ -553462 -1008249 -663276 -779960 -426086 -264809 -164699 -151462 168972 351023 -655674
11096f55674J26956P50831Q66392k30055k72109J90196o7037o04120m98852L87970
$$ -655674 -528718 222113 1088505 858450 586341 776537 709500 105380 -393472 -5502
11086e502o35450p8826J71903p01696K53551R26612o3725j00875L07744K25731
$$ -5502 -640952 -719778 -547875 -1249571 -996020 -69408 -133133 -234008 73736 299467
11076B99467n00471R28439M5126p84752j073356L38506k74086L30103O54240K18097
$$ 299467 -201004 727435 772561 -12191 -1085547 -747041 -1021127 -691024 -36784 181313
11066A81313J584P62777n64565l03903L39057l50448m44435m50132M28688k63385
$$ 181313 182897 945674 381109 77206 416263 65815 -378620 -828752 -400064 -663449
11056f63449K54790P92970j10529k73025q2402n6548o9016j36830J241530K87442
$$ -663449 -408659 384311 273782 757 -81645 -138193 -207209 -344039 897491 1184933
11046A184933n57751J54655l31304l51910K80868M37645N052K63764m17125k02794
$$ 1184933 627182 781837 450533 98623 379491 817136 822188 1085952 668827 466033
11036D66033L01311r27525k23751R03032M13166j214649o66518P51407J93611
$$ 466033 767344 -160181 -383932 519100 932266 -282383 -948901 -197494 -3883
11027c883l48952O45885k1611N40441l02441k38211J08480M31479m38793j52168
$$ -3883 -352835 293050 271439 811880 509439 271228 379708 811187 372394 220226
11017B20226N59728o31967K7901J92490N05081q8609L21535l04489m68561L84516
$$ 220226 779954 147987 175888 368378 873459 784850 1106385 801896 333335 717851
11007G17851j41296m49585m50143m46765K08798O39862L8410K476o14567R8043
$$ 717851 576555 126970 -323173 -769938 -561140 78722 117132 119608 -494959 -396916
10997c96916L70021M21534J40862l54277J99332K42639J46912k38057j060030
$$ -396916 -26895 394639 535501 181224 380556 623195 770107 532050 -527980
10988e27980P85412l03445M81897L00691K1762k7729o7301J59603M32863j7210
$$ -527980 257432 -46013 435884 736575 758337 730608 663307 822910 1255773 1238563
10978A238563n96511j199589K55845L33829j87286Q88828j52592k25653j87711
$$ 1238563 642052 -557537 -301692 32137 -155149 733679 581087 355434 167723
10969A67723p3568l8177j07044q53731l74603N52688J141816k86444j02198M35936
$$ 167723 94155 55978 -51066 -904797 -1279400 -726712 415104 128660 26462 462398
10959D62398j37477p5622o27930j19730O40066M17513m92062l19706L37592q58198
$$ 462398 324921 249299 -378631 -498361 141705 559218 67156 -252550 85042 -773156
10949g73156Q58027P93013J35275q46091m55222N83467O34814o93295j9780n07174
$$ -773156 84871 877884 1013159 167068 -288154 295313 930127 236832 217052 -290122
10939b90122l53237m01009j32333J917K08158O8415N24255M89798J068605L2558
$$ -290122 -643359 -1044368 -1176701 -1174784 -966626 -898211 -373956 115842 1184447 1217005
10929A217005q20654k63431m22766P20770M78681J73497o16285m82851R05416
$$ 1217005 396351 132920 -289846 430924 909605 1083102 466817 -16034 889382
10920H89382l84578r19118L92199R82323p42102m45764M12683j93929j50324J33920
$$ 889382 504804 -414314 -22115 960208 218106 -227658 185025 -8904 -159228 -25308
10910b5308J013109r65300o38177N77076k51911p5961R00476k03372M82192m74309
$$ -25308 987801 22501 -615676 -38600 -290511 -366472 534004 330632 812824 338515
10900C38515l50900n15776P47698P6902l42537m43896m56391P03146N66232q5593
$$ 338515 -12385 -528161 219537 296439 -46098 -489994 -946385 -243239 322993 237400
10890B37400M53245n38527j32152M10025J12850K72917n27289j09433Q9980L09347
$$ 237400 690645 152118 19966 429991 542841 815758 288469 179036 269016 578363
10880E78363j25130Q8166O5321k76028J42694m4349j59944l22249L37092k2309
$$ 578363 453233 541399 606720 330692 473386 429037 269093 -53156 283936 261627
10870B61627r73167N71286O62529N45300n50068o53788j58701l8289K30494J44157
$$ 261627 -711540 -140254 522275 1067575 517507 -136281 -294982 -333271 -102777 41380
10860D1380M68349J00714j16890k14481n7351N59147R4128o33108n33006J068760
$$ 41380 509729 610443 493553 279072 221721 780868 874996 241888 -291118 777642
10850G77642o08526j9j99931J64002L3480j80432P37223L45404j74535n05052
$$ 777642 169116 169097 -30834 133168 166648 -13784 723439 1068843 894308 389256
10840C89256N19100n52945r32940L49982O84991K06396M08253l0065l96749o23440
$$ 389256 908356 355411 -577529 -227547 457444 663840 1072093 1042028 645279 21839
10830B1839J25651M75267L41082o00442n17640l10873P7925l6115l66585j66982
$$ 21839 147490 622757 963839 363397 -154243 -465116 -387191 -423306 -789891 -956873
10820i56873M01512N31112N42332j53621k24435K12719k34503j13010L36843l1489
$$ -956873 -555361 -24249 518083 364462 140027 352746 118243 5233 342076 310587
10810C10587N0242q16889l17882P15456Q73116j12968q8559r46844o04843R75059
$$ 310587 360829 -456060 -773942 -58486 814630 701662 613103 -333741 -938584 36475
10800C6475j27683Q5081k09034J134724o1310o19144L43841l12035q7991J37819
$$ 36475 -91208 -6127 -215161 919563 858253 239109 582950 270915 182924 320743
10790C20743k77714j26466K47172j64240k08833o46258R66626j1647n93471O1376
$$ 320743 43029 -83437 163735 -505 -209338 -855596 111030 99383 -494088 -432712
10780d32712O0983L38409j49582J95654m07015R17117O11943k62466j99866k39867
$$ -432712 -371729 -33320 -182902 12752 -394263 522854 1134797 872331 672465 432598
10770D32598j9571l70079N56718O49621q84512j002017o01025R00343P15976M47637
$$ 432598 413027 42948 599666 1249287 364775 -637242 -1238267 -337924 378052 825689
10760H25689q6361j314754K80760L12174L62850P21155k17429m13623K0412P31057
$$ 825689 739328 -575426 -294666 17508 380358 1101513 884084 470461 490873 1221930
10750A221930j073985k03649O05701K17929r69244L64370J229332j92405j466161
$$ 1221930 147945 -55704 549997 767926 -201318 163052 1392384 1199979 -266182
10741b66182n93680K97653M19541m33248l63232M05424L62537J32129q21575N32053
$$ -266182 -859862 -562209 -142668 -575916 -939148 -533724 -171187 -39058 -860633 -328580
10731c28580r5342M30262K6423J18000K93219l76994K7197m25205J09315L743
$$ -328580 -423922 6340 32763 150763 443982 66988 94185 -331020 -221705 -217962
10721b17962j13559K27992l95266L76800L03980k24439o48575K9725K34637K93404
$$ -217962 -331521 -103529 -498795 -121995 181985 -42454 -691029 -661304 -426667 -133263
10711a33263K28449j102764J25999P34514J99473k40253m65697N64276J293658
$$ -133263 95186 -1007578 -881579 -147065 52408 -187845 -653542 -89266 1204392
10702A204392n60691l75605r22577n49270O13422M57840J13554L7474r1711L30692
$$ 1204392 643701 268096 -654481 -1203751 -590329 -132489 -18935 18539 -73172 257520
10692B57520J125040m63623n14998P5920R8953r91247n7667N85361l82614l87008
$$ 257520 1382560 918937 403939 479859 578812 -412435 -470102 115259 -267355 -654363
10682f54363j17269Q3280L49528O99427k01836m18179P09952k82082L99043p74004
$$ -654363 -771632 -688352 -338824 360603 158767 -259412 450540 168458 567501 -206503
10672b06503K85726J30099m97428o6779p5805q6509O82049j1115r8514j55655
$$ -206503 79223 209322 -288106 -354885 -430690 -517199 164850 153735 55221 -100434
10662a00434l85023k75271J124567q87090J7663P90066p0108M03081M3124m1986
$$ -100434 -485457 -760728 363839 -523251 -505588 284478 214370 617451 660575 618589
10652F18589k20713M36539M0254K93393m36826j96960k62292k35226Q6533j31773
$$ 618589 397876 834415 874669 1168062 731236 534276 271984 36758 123291 -8482
10642h482r57173M82513m9875M14036L9200m76772O02344J6298q62844J011454
$$ -8482 -965655 -483142 -533017 -118981 -79781 -556553 45791 62089 -800755 210699
10632B10699q27357J94024M12699J80555m32861l75420J186232j60047o39708
$$ 210699 -616658 -422634 -9935 170620 -262241 -637661 548571 388524 -251184
10623b51184P89747q08619k41961O09309K50804K39560q22279L19099M64161j22729
$$ -251184 538563 -270056 -512017 97292 348096 587656 -234623 84476 548637 425908
10613D25908q97470k0358j72732J315476o1461j83079j56413J1630j22405J18576
$$ 425908 -471562 -491920 -664652 650824 589363 406284 249871 261501 139096 257672
10603B57672p5310n59998O52963K84657L9773k03703l92929L1765L73444R0613
$$ 257672 182362 -377636 275327 559984 599757 396054 3125 34890 408334 498947
10593D98947J29915J43544N86542Q7728r39715n8591o6749n62450K98585k88118
$$ 498947 628862 772406 1358948 1446676 506961 448370 381621 -180829 117756 -170362
10583a70362L49180m1505n09679M93249o2936m67879N25881r97923O36700j15288
$$ -170362 178818 137313 -372366 120883 57947 -409932 115949 -881974 -245274 -360562
10573c60562K31375M64171k72898m99269M18701Q97796L68207l98248k48845Q67165
$$ -360562 -129187 334984 62086 -437183 -18482 879314 1247521 849273 600428 1467593
10563A467593n22419o10298N1302N042k58035l60596K91128K85357k22264O48889
$$ 1467593 945174 334876 386178 391220 133185 -227411 63717 349074 126810 775699
10553G75699l14632k05531l30152k32038K22344j75266L37113J25932m82139R06441
$$ 775699 461067 255536 -74616 -306654 -84310 -259576 77537 203469 -278670 627771
10543F27771P27246K867n97416K01736J07470j358790q04633L32396J092739M99049
$$ 627771 1355017 1357884 760468 962204 1069674 -289116 -1093749 -761353 331386 830435
10533H30435j99898m47074k51807L08452r3238J03567l60714L05155n2203L43458
$$ 830435 630537 183463 -68344 240108 146870 250437 -110277 194878 142675 486133
10523D86133P57737j29958j284582M51153j90728K80629k93300l40064Q29096
$$ 486133 1243870 1113912 -170670 280483 89755 370384 77084 -262980 566116
10514E66116K44360J87664m56035m15711M34289q3682O37654n21682l53985J74196
$$ 566116 810476 998140 542105 126394 560683 477001 1114655 592973 238988 413184
10504D13184K13329p34492p14598K22108M94819P64109p9035M26936o31091o512
$$ 413184 626513 -107979 -822577 -600469 -105650 658459 579424 1006360 375269 368757
10494C68757j5417J145156J46289l76034N1773l29871q2747N43710o95921k50974
$$ 368757 353340 1498496 1644785 1268751 1320524 990653 907906 1451616 755695 504721
10484E04721k13643Q7675J121083P70645p67133j059083q74845R431O19743J20945
$$ 504721 291078 378753 1499836 2270481 1503348 444265 -430580 -421149 198594 319539
10474C19539K82264q02818m05160J013826L53940r81524j66102L38420N34799
$$ 319539 601803 -201015 -606175 407651 761591 -219933 -386035 -47615 487184
10465D87184J52452j008L29206n91274J01746l21701N08101J111386j50320K2929
$$ 487184 639636 638628 967834 376560 478306 156605 664706 1776092 1625772 1648701
10455A648701o14908m94940L55689m29887N4371l75074M77229n36286K91426J71463
$$ 1648701 1033793 538853 894542 464655 519026 143952 621181 84895 376321 547784
10445E47784l39020M98790j46865j17001r91631n35454o5023N48074O50383J26570
$$ 547784 208764 707554 560689 443688 -547943 -1083397 -1148420 -600346 50037 176607
10435A76607q3348q59641P48805R06620k30683j02534j37500l53183O059l12214
$$ 176607 93259 -766382 -17577 889043 658360 555826 418326 65143 71202 -241012
10425b41012J43898m4186J48739O0724J11068l34757n59142O45428O73679L14164
$$ -241012 -97114 -141300 7439 68163 179231 -155526 -714668 -69240 604439 918603
10415I18603j048125M21596l141m14105k52530R2916m21970R4587M84483o9162
$$ 918603 -129522 292074 288933 -125172 -377702 -284786 -706756 -612169 -127686 -196848
10405a96848P272Q93270m89075J57001O79566k30405m79638n10078M18305N22388
$$ -196848 -189576 703694 214619 371620 1051186 820781 341143 -168935 249370 771758
10395G71758J43537K74699n75169j50323K37114l8302j375674L05737P37226O78494
$$ 771758 915295 1189994 614825 464502 701616 663314 -712360 -406623 330603 1009097
10385A009097m74140j43138M87790n67685l12657L26736L01098j49248N30911
$$ 1009097 534957 391819 879609 311924 -733 326003 627101 477853 1008764
10376A008764m1698o7967m63440K24679m59039l13769K51250J39650J14684p68002
$$ 1008764 967066 899099 435659 660338 201299 -112470 138780 278430 393114 -374888
10366c74888J110527J82423o48025L4153p9395o03182L32535l10944n68977J578549
$$ -374888 735639 918062 270037 304190 224795 -378387 -45852 -356796 -925773 652776
10356F52776O2906m8913K57686j82044q64941K81659j95832k37499p0215O875
$$ 652776 715682 666769 924455 742411 -122530 159129 -36703 -274202 -344417 -337542
10346c37542m89800m51633L78920R17101k3545l8647q623K71275l58529p28667
$$ -337542 -827342 -1278975 -900055 17046 -6499 -45146 -53769 217506 -141023 -869690
10336h69690l8800J081361J82103L51959K34411n01618r80836N87431L49304K05616
$$ -869690 -908490 172871 354974 706933 941344 439726 -541110 46321 395625 601241
10326F01241K29209J67727j1571m22384N27665m53856k95863K54690P33795m0384
$$ 601241 830450 998177 986606 564222 1091887 638031 342168 596858 1330653 1290269
10316A290269o83841L90798j43662m35419q84928J27312Q86457k57986l4253o57002
$$ 1290269 606428 997226 853564 418145 -466783 -339471 546986 289000 254747 -402255
10306d02255P06722N74317j7309n09062k26198N1005P08399o15843l72310J87624
$$ -402255 304467 878784 861475 352413 126215 177220 885619 269776 -102534 85090
10296H5090R3263L01977M55398M07591n31429j66828J39057P3242n2860j41100
$$ 85090 178353 480330 935728 1343319 811890 645062 784119 857361 804501 663401
10286F63401Q02200j094712j04745j52551j39410R5351j34282N04658l26767K46990
$$ 663401 1465601 370889 266144 113593 -25817 69534 -64748 439910 113143 360133
10276C60133J06335O80247O03758L87326o75996n54756o0707l34033P6928L42554
$$ 360133 466468 1146715 1750473 2137799 1461803 907047 846340 512307 589235 931789
10266I31789Q3101R10786J86107m83564p31249m64681M3460M82201J153147K5280
$$ 931789 1014890 1925676 2111783 1628219 896970 432289 475749 957950 2111097 2136377
10256B136377l70024o04896r74052K82104L06575l2042o01869o04132O61538L24623
$$ 2136377 1766353 1161457 187405 469509 776084 744042 142173 -461959 199579 524202
10246E24202r6227M91762N72701k75396q0478r03439L24814M65818p42629Q5505
$$ 524202 427975 919737 1492438 1217042 1136564 233125 557939 1023757 281128 366633
10236C66633J42917L37432O37841j87909J99615L05233k59252n17437k83551P41317
$$ 366633 509550 846982 1484823 1296914 1496529 1801762 1542510 1025073 741522 1482839
10226A482839n26196m64683R0880m4354L93458L74039n34940k44767N98156L03219
$$ 1482839 956643 491960 582840 538486 931944 1305983 771043 526276 1124432 1427651
10216A427651j1945N78697j64336N1471Q7500q46681l67452J08766J270444m25473
$$ 1427651 1415706 1994403 1830067 1881538 1969038 1122357 754905 863671 2134115 1708642
10206A708642L36942p31349m09588K36132L85689L96771q05234k79746n79635
$$ 1708642 2045584 1314235 904647 1140779 1526468 1923239 1118005 838259 258624
10197B58624J77153P18396o63025L74230Q32240l49387R7790J2588j30743O62068
$$ 258624 435777 1154173 491148 865378 1697618 1348231 1446021 1458609 1327866 1989934
10187A989934K5717j74882L05348p95363o48716Q7432O32488J67814O52462o21015
$$ 1989934 2015651 1840769 2146117 1350754 702038 789470 1421958 1589772 2242234 1621219
10177A621219n0395k59977j30150N28090l90606J09852K7967Q7536o22120Q8426
$$ 1621219 1570824 1310847 1180697 1708787 1318181 1428033 1456000 1543536 921416 1009842
10167A009842J095069o86228k90408M90062M53918j259227k9125k8308J09939
$$ 1009842 2104911 1418683 1128275 1618337 2072255 813028 783903 755595 865534
10158H65534k35301q6068P59255l25867m66825P00470P55051K7015L7626j75388
$$ 865534 630233 544165 1303420 977553 510728 1211198 1966249 1993264 2030890 1855502
10148A855502j158704M45274M79651n79739M18165o02367M9436L99417m87371
$$ 1855502 696798 1142072 1621723 1041984 1460149 857782 907218 1306635 819264
10139H19264K25362L27000j24174L61529j98014j61663K52036O68076q44270o92437
$$ 819264 1044626 1371626 1247452 1608981 1410967 1249304 1501340 2169416 1325146 632709
10129F32709Q1239O20605j21861K51560j01998m95338j8616L85378P91272j44247
$$ 632709 713948 1334553 1212692 1464252 1362254 866916 848300 1233678 2024950 1880703
10119A880703q10602q11237L31965O32382N86607l97889M31691R1296k33760j9356
$$ 1880703 1070101 258864 590829 1223211 1809818 1411929 1843620 1934916 1701156 1681800
10109A681800n89589L64978M80159L25571r36067L0009P9771M56591R7705j110129
$$ 1681800 1092211 1457189 1937348 2262919 1326852 1356861 1436632 1893223 1990928 880799
10099H80799K22835M36202N2414L55827j29507j07916j15660J41712k78901K32221
$$ 880799 1103634 1539836 1592250 1948077 1818570 1710654 1594994 1736706 1457805 1690026
10089A690026P1289L03282L9373q36654O65964N16818Q5157m30088j01557M00630
$$ 1690026 1761315 2064597 2103970 1267316 1933280 2450098 2535255 2105167 2003610 2404240
10079B404240k15867L7833L8130O03470k43176k75248L14965o24659N46026j51625
$$ 2404240 2188373 2226206 2264336 2867806 2624630 2349382 2664347 2039688 2585714 2434089
10069B434089m6022O11006n86150N9515Q14036m56627Q49460K42296k75758M98789
$$ 2434089 2388067 2999073 2412923 2472438 3286474 2829847 3679307 3921603 3645845 4144634
10059D144634n41100p87813M02620M79410k52155N9195m67364M03148J016834
$$ 4144634 3603534 2815721 3218341 3697751 3445596 3504791 3037427 3440575 4457409
10050D457409k70157M0883j559N65661l26389k95918M93533m09982O18019k9232
$$ 4457409 4187252 4228135 4226576 4792237 4465848 4169930 4663463 4253481 4871500 4842268
10040D842268l73798O76760M05341k49155N51803m7656M29913M36824J30690n12049
$$ 4842268 4468470 5145230 5550571 5301416 5853219 5805563 6235476 6672300 6802990 6290941
10030F290941R28938Q30734O58417O6113J53776Q40966P71186P63718N46440J35829
$$ 6290941 7219879 8050613 8709030 8775143 8928919 9769885 10541071 11304789 11851229 11987058
10020A1987058J20273L7820K23550O00870j11729Q30n4798q6885j619143k30850
$$ 11987058 12107331 12145151 12368701 12969571 12857842 12858672 12803874 12716989 11097846 10866996
10010A0866996n41685m33884r65402K37490j22839q59803m43104n95762l27464
$$ 10866996 10325311 9891427 8926025 9163515 9040676 8180873 7737769 7142007 6814543
10001F814543p2917l5012N86282J49598j214109O72565Q55628k76799l66306k93807
$$ 6814543 6741626 6706614 7292896 7442494 6228385 6900950 7756578 7479779 7113473 6819666
9991F819666O57709k85661o50373m81021L10009M9217K71963N29476k16551R32547
$$ 6819666 7477375 7191714 6541341 6060320 6370329 6419546 6691509 7220985 7004434 7936981
9981G936981k79641j362647P83191O07758M33805R5742o20401L85416n422m65850
$$ 7936981 7657340 6294693 7077884 7685642 8119447 8215189 7594788 7980204 7974782 7508932
9971G508932J31610Q63998J14887N02265o79877J95655N28807M9327J292381O42865
$$ 7508932 7640542 8504540 8619427 9121692 8441815 8637470 9166277 9215604 10507985 11150850
9961A1150850m77727n42766l31016j5243M90746k61131J49953Q50807P47944M43439
$$ 11150850 10673123 10130357 9799341 9784098 10274844 10013713 10163666 11014473 11762417 12205856
9951A2205856M56649N73469N23054M62186n6219R60420L52388Q0029P33739J44969
$$ 12205856 12662505 13235974 13759028 14221214 14164995 15125415 15477803 15557832 16291571 16436540
9941A6436540M90715N04852l56180K07412J162636K84880L77582l01864p44511
$$ 16436540 16927255 17432107 17075927 17283339 18445975 18730855 19108437 18806573 18062062
9932A8062062K92569m03235M37737n20179l083N96239M65649L87645n26187l65375
$$ 18062062 18354631 17951396 18389133 17868954 17865871 18462110 18927759 19315404 18789217 18423842
9922A8423842M12403j43027J022816L19414J35706N69866O05427L35189K87163
$$ 18423842 18836245 18693218 19716034 20035448 20171154 20741020 21346447 21681636 21968799
9913B1968799L97565Q8255K68896n43972R55681J622927Q91914O07162N27772
$$ 21968799 22366364 22454619 22723515 22179543 23135224 24758151 25650065 26257227 26784999
9904B6784999o93291J114882J168465J032664J346921l90380j47577J171968P35000
$$ 26784999 26091708 27206590 28375055 29407719 30754640 30364260 30216683 31388651 32123651
9895C2123651Q1217P68778J77455K64467P98588R51194j09730l1930M71989Q02312
$$ 32123651 32204868 32973646 33151101 33415568 34214156 35165350 35055620 35023690 35495679 36297991
9885C6297991J388708j225108J210418M28999l53357l20363M19397K64855o37890
$$ 36297991 37686699 36461591 37672009 38101008 37747651 37427288 37846685 38111540 37473650
9876C7473650Q07562p59247j46039N39281r917q7013n99405p01013j46106J3169
$$ 37473650 38281212 37521965 37375926 37915207 37905290 37818277 37218872 36517859 36371753 36384922
9866C6384922N52241m24425L45071l49755l97357R46360K259L70934J75434R50769
$$ 36384922 36937163 36512738 36857809 36508054 36110697 37057057 37059316 37430250 37605684 38556453
9856C8556453n79094n98401J394781J72248k87199N63180M88366K81405R86616
$$ 38556453 37977359 37378958 38773739 38945987 38658788 39221968 39710334 39991739 40978355
9847D0978355J795581R07419k998M66374N47724J025343J367207J569604j60850
$$ 40978355 42773936 43681355 43678357 44144731 44692455 45717798 47085005 48654609 48493759
9838D8493759j28339J098876J156275R95833J163571O23833J405708J495755L69896
$$ 48493759 48365420 49464296 50620571 51616404 52779975 53403808 54809516 56305271 56675167
9829E6675167J590636K242134K380827R35618P17547J064780J582936K311423
$$ 56675167 58265803 60507937 62888764 63824382 64541929 65606709 67189645 69501068
9821F9501068K083847J841744K079091J443470J245487K337084J913111J362220
$$ 69501068 71584915 73426659 75505750 76949220 78194707 80531791 82444902 83807122
9813H3807122J011453Q18220J317180O69359Q27204M21517l89326K80260Q07970
$$ 83807122 84818575 85636795 86953975 87623334 88450538 88872055 88482729 88762989 89570959
9804H9570959q6978j060846p80904j074187j273351j198618k001296k368578j657130
$$ 89570959 89483981 88423135 87642231 86568044 85294693 84096075 82094779 79726201 78069071
9795G8069071j775209j457825j487351j447885k154857k412433j268464k171551
$$ 78069071 76293862 74836037 73348686 71900801 69745944 67333511 66065047 63893496
9787F3893496j987837k137210j733820j329257k161568j668446k071010k084448
$$ 63893496 61905659 59768449 58034629 56705372 54543804 52875358 50804348 48719900
9779D8719900j862919j387325j184092p20013j599783j042620r18042q31968j960952
$$ 48719900 46856981 45469656 44285564 43565551 41965768 40923148 40005106 39173138 37212186
9770C7212186j286095p65933j849296n53782m95709m91799j743292j301806J68130
$$ 37212186 35926091 35160158 33310862 32757080 32261371 31769572 30026280 28724474 28892604
9761B8892604m91917m84836q04782j135618r95110m54436p09731l07716o99183
$$ 28892604 28400687 27915851 27111069 25975451 24980341 24525905 23816174 23508458 22809275
9752B2809275l15152m19102o06626m73143p22432k30781j358529m4280j30390
$$ 22809275 22494123 22075021 21468395 20995252 20272820 20042039 18683510 18639230 18508840
9743A8508840o39766L13981R4955K30432k73153r35135k28366l47471m36494l56109
$$ 18508840 17869074 18183055 18278010 18508442 18235289 17300154 17071788 16724317 16287823 15931714
9733A5931714p93191m24900J7890L7748J63531K19149j026093j349093k6574K88523
$$ 15931714 15138523 14713623 14731513 14769261 14932792 15151941 14125848 12776755 12750181 13038704
9723A3038704L57286o47442O44723L89751j1103n77995j62303j75244j016060
$$ 13038704 13395990 12748548 13393271 13783022 13771919 13193924 13031621 12856377 11840317
9714A1840317N0690L91307q45745J51153m9952p77353K81203O02423l02q56973
$$ 11840317 11891007 12282314 11436569 11587722 11537770 10760417 11041620 11644043 11643741 10786768
9704A0786768o9951m95375O82141N68730l25356r75791q4147M67184n21639M34237
$$ 10786768 10716817 10221442 10903583 11472313 11146957 10171166 10087019 10554203 10032564 10466801
9694A0466801N65627o88260p37511M51066N49125q03682o9238O40433j53624r62244
$$ 10466801 11032428 10344168 9606657 10057723 10606848 9803166 9733928 10374361 10220737 9258493
9684I258493J60170J011185j08147M47994K14735j094038P14274j62206O3115
$$ 9258493 9418663 10429848 10321701 10769695 10984430 9890392 10604666 10442460 10505575
9675A0505575o5149p32672m22779R21514k53687q78922J072619p43263l68123
$$ 10505575 10440426 9707754 9284975 10206489 9952802 9073880 10146499 9403236 9035113
9666I035113L60169o22857L05460R00765L20167O91517o66248j44192k83665o07172
$$ 9035113 9395282 8772425 9077885 9978650 10298817 10990334 10324086 10179894 9896229 9289057
9656I289057K85121J060699L68147O407j91119J8424J66577j23904k06476k11728
$$ 9289057 9574178 10634877 11003024 11009431 10818312 10836736 11003313 10879409 10672933 10461205
9646A0461205K56561K89016l56480O03777j81354n60245O35791k13945o24959
$$ 10461205 10717766 11006782 10650302 11254079 11072725 10512480 11148271 10934326 10309367
9637A0309367j52342L54125M29094L33564J87058l55097O95520l89869o38131
$$ 10309367 10157025 10511150 10940244 11273808 11460866 11105769 11801289 11411420 10773289
9628A0773289l03084M62813K98929j38515N2O30461J26293j319472o0136M98903
$$ 10773289 10470205 10933018 11231947 11093432 11093484 11723945 11850238 10530766 10470630 10969533
9618A0969533N28186l03014J63273M98934m32572N95423J84309m88407J54053
$$ 10969533 11497719 11194705 11357978 11856912 11424340 12019763 12204072 11715665 11869718
9609A1869718j82524J177916L12509j8497J28352K99641k63806o97842L96450
$$ 11869718 11687194 12865110 13177619 13159122 13287474 13587115 13323309 12625467 13021917
9600A3021917M59915M72887r4567J99606p5438j1874O69747K21950j57850J24218
$$ 13021917 13481832 13954719 13860152 14059758 13984320 13972446 14642193 14864143 14706293 14830511
9590A4830511M84180J12264M22483R08881J47199J75602k0415P15651J73633P36504
$$ 14830511 15314691 15426955 15849438 16758319 16905518 17081120 17060705 17776356 17949989 18686493
9580A8686493n3997L88312K36678J55614P24473n9074L17973L31672P07421j61806
$$ 18686493 18632496 19020808 19257486 19413100 20137573 20078499 20396472 20728144 21435565 21273759
9570B1273759O29707P0357k31540J76408J565830r903L34958J048851P00055N19955
$$ 21273759 21903466 21973823 21742283 21918691 23484521 23474618 23809576 24858427 25558482 26078437
9560B6078437J031986L52824R2909J419414K133372L60745P54738J164486J923149
$$ 26078437 27110423 27463247 27556156 28975570 31108942 31469687 32224425 33388911 35312060
9551C5312060J738444J511257J579028J558628J460533K140298J813701K783723
$$ 35312060 37050504 38561761 40140789 41699417 43159950 45300248 47113949 49897672
9543D9897672J718616J002587J276089K547979K407126K474079K685968J846753
$$ 49897672 51616288 52618875 53894964 56442943 58850069 61324148 64010116 65856869
9535F5856869K149208K577782L059112L579175L558439M304997O551762O544799
$$ 65856869 68006077 70583859 73642971 77222146 80780585 85085582 91637344 98182143
9527I8182143O947383R247757J0203000J1666639J3764530J3548599J2322351
$$ 98182143 105129526 114377283 124580283 136246922 150011452 163560051 175882402
9520A75882402J1451418R063184N250444L946718K140955J386841k0997j611926
$$ 175882402 187333820 196397004 201647448 205594166 207735121 209121962 209100965 207489039
9512B07489039l559254m846626p514153j0452968j2743075j3296892j4032682
$$ 207489039 203929785 199083159 191569006 181116038 168372963 155076071 141043389
9505A41043389j2488936j1703239j1822131r837460o585851o762914n046690m478717
$$ 141043389 128554453 116851214 105029083 95191623 88605772 81842858 76796168 72317451
9497G2317451l960699l301552l513123k660412j816992k870515j500763j434869
$$ 72317451 68356752 65055200 61542077 58881665 57064673 54194158 52693395 51258526
9489E1258526j497864r92691r73457N6574n25328q18111M0109j120360N5592k46168
$$ 51258526 49760662 48767971 47794514 47851088 47325760 46507649 46547758 45427398 45482990 45236822
9479D5236822N8663K83895k08110p6742k5901m52702P31447L17085O40011M62713
$$ 45236822 45295485 45579380 45371270 45294528 45268627 44815925 45547372 45864457 46504468 46967181
9469D6967181j35885K48695N64281J604645M73796N86837J027262J072597R94556
$$ 46967181 46831296 47079991 47644272 49248917 49722713 50309550 51336812 52409409 53403965
9460E3403965Q26357P11625R76510J564799J606270J011324K468284K606768K250943
$$ 53403965 54230322 54941947 55918457 57483256 59089526 60100850 62569134 65175902 67426845
9451F7426845K765169L522346K725329L752726N498793M970078N024595P732073
$$ 67426845 70192014 73714360 76439689 80192415 85691208 90661286 95685881 103417954
9443A03417954Q348365J0748704J1334031J3308100J5490980J6644273J5197436
$$ 103417954 111766319 122515023 133849054 147157154 162648134 179292407 194489843
9436A94489843J1316395P371866L510194K7867n42162L27400J553821K675234
$$ 194489843 205806238 213178104 216688298 216716165 216174003 216501403 218055224 220730458
9428B20730458j185891m685977r444586j3582477j5344700j6841198j4428718
$$ 220730458 219544567 214858590 205414004 191831527 176486827 159645629 145216911
9421A45216911j2086836j0192898p155564m659182k826202j157385j34150J000888
$$ 145216911 133130075 122937177 115781613 111122431 108296229 107138844 107004694 108005582
9413A08005582J143308R54090j368468j428905k959853l215344j290537j351955
$$ 108005582 109148890 110102980 108734512 107305607 104345754 101130410 99839873 98487918
9405I8487918q34530k037076l537305n255841o267440n066315o550279n839628
$$ 98487918 97653388 95616312 92079007 86823166 80555726 75489411 68939132 63099504
9397F3099504m278027m299419k808623l672958l042133l019446k258493j773295
$$ 63099504 58821477 54522058 51713435 48040477 44998344 41978898 39720405 37947110
9389C7947110k032583j969375r96409j010792j350567j464012j351157p38363
$$ 37947110 35914527 33945152 32948743 31937951 30587384 29123372 27772215 27033852
9381B7033852j544326p84907m99947r10259j893640j323968J108853o20459j100236
$$ 27033852 25489526 24704619 24204672 23294413 21400773 20076805 21185658 20565199 19464963
9372A9464963k10786p30013j351615l829n51265l18916j12519q44933o36833p17077
$$ 19464963 19254177 18524164 17172549 17168720 16617455 16298539 16186020 15341087 14704254 13987177
9362A3987177p61105o39685K19642j58535r26396j32009N78395j10942j5401o28981
$$ 13987177 13226072 12586387 12806029 12647494 11721098 11589089 12167484 12056542 12041141 11412160
9352A1412160o75606r47399M78456k06227J66098j19213p14797j86963L13973
$$ 11412160 10736554 9789155 10267611 10061384 10227482 10108269 9393472 9206509 9520482
9343I520482n37224l78339j15627m76890j34174P544M570K21492J94204K72502
$$ 9520482 8983258 8604919 8489292 8012402 7878228 7885772 7890342 8111834 8306038 8578540
9333H578540J56596m69882p15604k36413j27475m74629n43643m36234O4912O63154
$$ 8578540 8735136 8265254 7549650 7313237 7185762 6711133 6167490 5731256 5796168 6459322
9323F459322M60746m10451o69136l13942j50497J166081q60536L51788J76154
$$ 6459322 6920068 6509617 5840481 5526539 5376042 6542123 5681587 6033375 6209529
9314F209529j103442N27555K41530K14644L0654J75794j414221m3210O38565k24884
$$ 6209529 5106087 5633642 5875172 6089816 6120470 6296264 4882043 4838833 5477398 5252514
9304E252514M49992M78947j184712k42213K95876N23544Q4692M05677n31259o59669
$$ 5252514 5702506 6181453 4996741 4754528 5050404 5573948 5658640 6064317 5533058 4873389
9294D873389L02316M06795k59438M43914k27644R041n09541J90883o5307N6357
$$ 4873389 5175705 5582500 5323062 5766976 5539332 5548373 5038832 5229715 5164408 5220765
9284E220765P46773j47259N35343p69670m73769m16504L35776J347624O3077l4587
$$ 5220765 5967538 5820279 6355622 5585952 5112183 4695679 5031455 6379079 6442156 6407569
9274F407569p22951o37511l2160N71020n23852J88530Q52176k30567K45512k27470
$$ 6407569 5684618 5047107 5014947 5585967 5062115 5250645 6102821 5872254 6117766 5890296
9264E890296k24J039369m51847j2883l29729k54682m16060J11426K04593K64329
$$ 5890296 5890072 6929441 6477594 6464711 6134982 5880300 5464240 5575666 5780259 6044588
9254F044588L61339J95717j75180O67858L88718m99280L4791n2269K4567J57730
$$ 6044588 6405927 6601644 6426464 7094322 7483040 6983760 7018551 6966282 6990849 7148579
9244G148579M52584J14363j62886l3736m39648M59616j11802M38957L65353j072899
$$ 7148579 7601163 7715526 7552640 7518904 7079256 7538872 7427070 7866027 8231380 7158481
9234G158481M66952L9483N59976p17896L97967J44146J29338N00417j32992J66233
$$ 7158481 7625433 7664916 8224892 7506996 7904963 8049109 8178447 8678864 8545872 8712105
9224H712105J01606P31969l9833K67687n47020p11056N21305l54480j16018J054824
$$ 8712105 8813711 9545680 9505847 9773534 9226514 8515458 9036763 8682283 8566265 9621089
9214I621089L04964r97060J184929k18153j06788L91374O17794r45566R36334
$$ 9621089 9926053 8928993 10113922 9895769 9788981 10180355 10798149 9852583 10788917
9205A0788917J114650p35517L421M94204O40024K97622K80091K64038Q48167O7075
$$ 10788917 11903567 11168050 11171471 11665675 12305699 12603321 12883412 13147450 13995617 14062692
9195A4062692m12301L17714k61348Q31661M8074R36752O4204m56920P58042O63123
$$ 14062692 13650391 13968105 13706757 14538418 14586492 15523244 15587448 15130528 15888570 16551693
9185A6551693n7178N6998K37986K75942O15232K07997P02018M37592Q81071L27907
$$ 16551693 16494515 16551513 16789499 17065441 17680673 17888670 18590688 19028280 19909351 20237258
9175B0237258Q02802J182930O99843O07390M02194J53307l42759Q34704L04746
$$ 20237258 21040060 22222990 22922833 23530223 23932417 24085724 23742965 24577669 24882415
9166B4882415n95524o34356m780J529839P66110k35947o88780R40033M49729P97513
$$ 24882415 24286891 23652535 23647755 25177594 25943704 25707757 25018977 25959010 26408739 27206252
9156B7206252K52637L67632J098823J27549N88515J030628L92548J526882J141051
$$ 27206252 27458889 27826521 28925344 29052893 29641408 30672036 31064584 32591466 33732517
9147C3732517P17205L32385L64888J676585J459344J474104J586563J739562K269396
$$ 33732517 34449722 34782107 35146995 36823580 38282924 39757028 41343591 43083153 45352549
9138D5352549J627120K175353K922588K867763K726002K794057K020033M14428
$$ 45352549 46979669 49155022 52077610 54945373 57671375 60465432 62485465 62899893
9130F2899893j072700j647893q17102o92275q05819o77599K78987j01838N02146
$$ 62899893 61827193 60179300 59362198 58669923 57864104 57186505 57465492 57363654 57865800
9121E7865800J546847P60736J060667J609893J832489K133254Q02791K151878
$$ 57865800 59412647 60173383 61234050 62843943 64676432 66809686 67612477 69764355
9113F9764355K452423L615896L646595L535735N138042N259141N703305M814712
$$ 69764355 72216778 75832674 79479269 83015004 88153046 93412187 99115492 103930204
9105A03930204O535285Q096543R622310J0075505J0077925R439720N967864J875281
$$ 103930204 110465489 118562032 128184342 138259847 148337772 157777492 163745356 165620637
9097A65620637o51266j225197r7566J850431K282638K195556J31048k376663m525426
$$ 165620637 164969371 163744174 163646608 165497039 167779677 169975233 170106281 167729618 163204192
9088A63204192o062270m774298m058842k158545r25301l70423M06120K009262
$$ 163204192 157141922 152367624 148308782 146150237 145224936 144854513 145260633 147269895
9080A47269895K856705L424753L017223N082568O353212O919225Q786786R834255
$$ 147269895 150126600 153551353 156568576 161651144 168004356 174923581 183710367 193544622
9072A93544622J1919508J4644375J7777637K0668191K5009329K8549078L1408887
$$ 193544622 205464130 220108505 237886142 258554333 283563662 312112740 343521627
9065C43521627L4066449K7927552J9419069J4066511Q105347L176475J628044
$$ 343521627 377588076 405515628 424934697 439001208 447106555 450283030 451911074
9058D51911074L493152O650522L376598k534007o365263j0427317j5045874j7423119
$$ 451911074 455404226 462054748 465431346 462897339 456532076 446104759 431058885 413635766
9050D13635766j4592449j0222215m882649Q7533j67640m694085q400075j3830593
$$ 413635766 399043317 388821102 383938453 384025986 383858346 379164261 370764186 356933593
9042C56933593j8403577k5854402k8895939k8419049k6072205k1890443k0578405
$$ 356933593 338530016 312675614 283779675 255360626 229288421 207397978 186819573
9035A86819573j6509824j2888928j0989033j0075451q370735p284494o142504
$$ 186819573 170309749 157420821 146431788 136356337 127985602 120701108 114558604
9028A14558604m871745m147082l804309k972531k664149k593756j440274j899288
$$ 114558604 109686859 105539777 101735468 98762937 96098788 93505032 92064758 90165470
9020I0165470k163748k504209j864673j306017j231162k94291J79525r01680q98049
$$ 90165470 88001722 85497513 83632840 82326823 81095661 80801370 80980895 80079215 79181166
9011G9181166n755L11423Q65242J742516J460418K23238p09189j212145j932098
$$ 79181166 79175411 79486834 80352076 82094592 83555010 83778248 83069059 81856914 79924816
9002G9924816k827893m222365l485298j896137k670587l173594j763730j639137
$$ 79924816 77096923 72874558 69389260 67493123 64822536 61648942 59885212 58246075
8994E8246075k674538k284816k301263k856849j483286j921601j637166p14761
$$ 58246075 55571537 53286721 50985458 48128609 46645323 44723722 43086556 42371795
8986D2371795p69612o27363j763585j221452p38072q72813j679315j548860j07817
$$ 42371795 41602183 40974820 39211235 37989783 37251711 36378898 34699583 33150723 33042906
8977C3042906j02905p82488m63883p93900n33568N2492j04526k0712M3794j09428
$$ 33042906 32940001 32157513 31693630 30899730 30366162 30418654 30314128 30293416 30337210 30227782
8967C0227782J36730K34407n24785p0618K91757m37335K97510Q39814q2306Q048
$$ 30227782 30364512 30598919 30074134 30003516 30295273 29857938 30155448 30995262 30912956 30921004
8957C0921004J207992L60388M31265N41719p70131O55680K16678K01099K77793
$$ 30921004 32128996 32489384 32920649 33462368 32692237 33347917 33564595 33765694 34043487
8948C4043487J501224J368772J03287O93217J659108J154853J379185J704179
$$ 34043487 35544711 36913483 37016770 37709987 39369095 40523948 41903133 43607312
8940D3607312J296808J825893J704679J184911M036244M156850M541066P123198
$$ 43607312 44904120 46730013 48434692 49619603 53655847 57812697 62353763 69476961
8932F9476961R532425J0993147J1934058J5296255J5547803J4757667P575853
$$ 69476961 79009386 90002533 101936591 117232846 132780649 147538316 155114169
8925A55114169m530693j3171751j6316074j6235569j4458305j2467259j0654887
$$ 155114169 150583476 137411725 121095651 104860082 90401777 77934518 67279631
8918F7279631p623366o171908m773474m206396l469295k475094k658297k533623
$$ 67279631 59656265 53484357 48710883 44504487 41035192 38560098 35901801 33368178
8910C3368178j337336j589296k287778j575969n00202r90381r25443j266669j055885
$$ 33368178 32030842 30441546 28153768 26577799 26077597 25087216 24161773 22895104 21839219
8901B1839219j055844p91402l97232o77449m33623r10648l50647q28815J31130
$$ 21839219 20783375 19991973 19594741 18917292 18483669 17573021 17222374 16393559 16524689
8892A6524689p73860j48398k99796j297115p43626l74991q81317O01484J71234
$$ 16524689 15750829 15602431 15302635 14005520 13261894 12886903 12005586 12607070 12778304
8883A2778304n58934l45092m17677l67925l68354K49968L57370m73143o5662q4909
$$ 12778304 12219370 11874278 11456601 11088676 10720322 10970290 11327660 10854517 10788855 10703946
8873A0703946o1213n3363O70096k31174r55828l57193m47090q23365N8059n84817
$$ 10703946 10642733 10589370 11259466 11028292 10072464 9715271 9268181 8444816 8502875 7918058
8863G918058q58423N40911K09553J39378m78022p62891n31096k05266j05542N43071
$$ 7918058 7059635 7600546 7810099 7949477 7471455 6708564 6177468 5972202 5866660 6409731
8853F409731J20932j172992k4066J066996j93264n57175l7431n11856q44582r908
$$ 6409731 6530663 5357671 5333605 6400601 6207337 5650162 5612731 5100875 4256293 4246385
8843D246385j1398P75662O78075o29654o27846K03878K73633K4427j577K47659
$$ 4246385 4234987 5010649 5688724 5059070 4431224 4635102 4908735 4933162 4931585 5179244
8833E179244k56155m70210K67854n03902m02828j44325l97138m92544k07007J94729
$$ 5179244 4923089 4452879 4720733 4216831 3814003 3669678 3272540 2779996 2572989 2767718
8823B767718M05252P08118o9294J58957L41973j153274j36695L1184q32884k32800
$$ 2767718 3172970 3881088 3811794 3970751 4312724 3159450 3022755 3053939 2221055 1988255
8813A988255L31733Q11945K37089q0014n43600l08182j01396M20223J86064K88300
$$ 1988255 2319988 3131933 3369022 3289008 2745408 2437226 2335830 2756053 2942117 3230417
8803C230417m68672j94836O7052n59116Q6793L86769n54390p14739j49139J485
$$ 3230417 2761745 2566909 2633961 2074845 2161638 2548407 1994017 1279278 1130139 1131624
8793A131624M25095J32048K29559J61376j327505N7318L09952Q43563J12130k88616
$$ 1131624 1556719 1688767 1918326 2079702 752197 809515 1119467 1963030 2075160 1786544
8783A786544L08232l68220J52441j53874k21139l78950k7975J59800M69324l36571
$$ 1786544 2094776 1726556 1878997 1725123 1503984 1125034 1097059 1256859 1726183 1389612
8773A389612l61692m7675l54987Q87702M39407L98850n63073j34932M75334r9673
$$ 1389612 1027920 980245 625258 1512960 1952367 2351217 1788144 1653212 2128546 2028873
8763B028873l9592q21996k68537P06035J26135J42735N04990p14269J48970K72652
$$ 2028873 1989281 1167285 898748 1604783 1730918 1873653 2378643 1664374 1813344 2085996
8753B085996k80039j98998K74369p20613L67540J174109m80847o11658q1566o32962
$$ 2085996 1805957 1606959 1881328 1160715 1528255 2702364 2221517 1609859 1528293 895331
8743H95331J31231J99638j29824K76081L28889K07707o23597j0749L97344K00707
$$ 895331 1026562 1226200 1096376 1372457 1701346 1909053 1285456 1274707 1672051 1872758
8733A872758J35999M55099r86863J29663j10580J95068Q23313j96977N80018l60945
$$ 1872758 2008757 2463856 1476993 1606656 1496076 1691144 2514457 2317480 2897498 2536553
8723B536553l86071l14970J34413P7078q2922K11758j84989L46786Q21230J84454
$$ 2536553 2150482 1835512 1969925 2047003 1964081 2175839 1990850 2337636 3158866 3343320
8713C343320J69900m03651o85373N65234k70428R621l26918O6313l5695J61845
$$ 3343320 3513220 3109569 2424196 2989430 2719002 2728623 2401705 2468018 2432323 2594168
8703B594168N22491K11195l45646l81931M07107j49240l36083p6733O20L58562
$$ 2594168 3116659 3327854 2982208 2600277 3007384 2858144 2522061 2445328 2445948 2804510
8693B804510n5276j058223J08454M70522M54242O11840N3430J27854J30691j19287
$$ 2804510 2749234 1691011 1799465 2269987 2724229 3336069 3389499 3517353 3648044 3528757
8683C528757N46861n68873L96326L80332O2553M9613L99602L0149k57242j384436
$$ 3528757 4075618 3506745 3903071 4283403 4345956 4395569 4795171 4825320 4568078 3183642
8673C183642l83741K76336L95144k71213m64372N37456n08727J42753M34081k0457
$$ 3183642 2799901 3076237 3471381 3200168 2735796 3273252 2764525 2907278 3341359 3320902
8663C320902q44589r4257l42461K26540m36996n74433O07398K21663j2987K87092
$$ 3320902 2476313 2382056 2039595 2266135 1829139 1254706 1862104 2083767 2070780 2357872
8653B357872O94448n58341o69353Q4008M7235k29782j06683l41935J281200q19097
$$ 2357872 3052320 2493979 1824626 1908634 1955869 1726087 1619404 1277469 2558669 1739572
8643A739572n03003J120914m16470l81901n73576j44720K86041O77245K55865
$$ 1739572 1236569 2357483 1941013 1559112 985536 840816 1126857 1804102 2059967
8634B059967k92070n7736N94082o57277j69501P36048J23488k81850m34874m72189
$$ 2059967 1767897 1710161 2304243 1646966 1477465 2213513 2337001 2055151 1620277 1148088
8624A148088P37883m77329N23595R17360j94272j36490q7752j139177r0970J3936
$$ 1148088 1885971 1408642 1932237 2849597 2655325 2518835 2431083 1291906 1200936 1214872
8614A214872q05770O19980P01296k83918J4064n70145j60155N00156j24851n10933
$$ 1214872 409102 1029082 1730378 1446460 1460524 890379 730224 1230380 1105529 594596
8604E94596m54189L83068M67243J8617L80848j96154k56328K77043n62241R6717
$$ 594596 140407 523475 990718 1009335 1390183 1194029 937701 1214744 652503 749220
8594G49220L86152P5887n35320P4170L26072J49145j554552m55355J057851M22774
$$ 749220 1135372 1211259 675939 750109 1076181 1225326 -329226 -784581 273270 696044
8584F96044m7827n94896J20708R90453q58487K36713m60014O3211O00645M84879
$$ 696044 648217 53321 174029 1164482 305995 542708 82694 145905 746550 1231429
8574A231429n40135k00170N74447m70165l21513m64307R2739o60484L24934J1669
$$ 1231429 691294 491124 1065571 595406 273893 -190414 -97675 -758159 -433225 -421556
8564d21556j74307R00551L1450L08821M44487o2067p54536l65583l28959j0669
$$ -421556 -595863 304688 336138 644959 1089446 1027379 272843 -92740 -421699 -432368
8554d32368K83408l22296P41969k12271R3430m07305l50351O77065O37315p20161
$$ -432368 -148960 -471256 270713 58442 151872 -255433 -605784 71281 708596 -11565
8544a1565j44656j04639L62133Q76827n13233L45278m78404l84679m6574k59804
$$ -11565 -156221 -260860 101273 978100 464867 810145 331741 -52938 -99512 -359316
8534c59316k01655k78502J55758J43715K86780n50975L55169P0268K45764l11056
$$ -359316 -560971 -839473 -683715 -540000 -253220 -804195 -449026 -378758 -132994 -444050
8524d44050K87142L93019l63152l87362J56815M18061L58911L19471j134502k21221
$$ -444050 -156908 236111 -127041 -514403 -357588 60473 419384 738855 -395647 -616868
8514f16868K6918N13230K78959m32748j94560M39669K25857j67591L29326r45821
$$ -616868 -589950 -76720 202239 -230509 -425069 14600 240457 72866 402192 -543629
8504e43629P40549Q22729r16698j13767l26443L53064o86006m98740K28634K99143
$$ -543629 196920 1019649 102951 -10816 -337259 15805 -670201 -1168941 -940307 -641164
8494f41164P44870Q8896J12846M02113k39941j018591M53153L59050k42121p58470
$$ -641164 103706 192602 305448 707561 467620 -550971 -97818 261232 19111 -739359
8484g39359P4701J00023r8497k7294j1678J69678M31444n10713j92811P61335
$$ -739359 -664658 -564635 -663132 -690426 -702104 -532426 -100982 -611695 -804506 -43171
8474d3171n20758m33607Q5536O91804J91712N16606n89804q54854n9931O90154
$$ -43171 -563929 -997536 -912000 -220196 -28484 488122 -101682 -956536 -1016467 -326313
8464c26313j8901J54421M28640J043570n44270q04322J129513l4551p41058K38176
$$ -326313 -345214 -190793 237847 1281417 737147 -67175 1062338 1027787 286729 524905
8454E24905K05653n85068O65403n47621k09645O88839Q2575l38969m64897l07184
$$ 524905 730558 145490 810893 263272 53627 742466 825041 486072 21175 -286009
8444b86009l13694J93511M26750Q82615K19204J46098l04751p63454l57930J15617
$$ -286009 -599703 -406192 20558 903173 1122377 1268475 963724 200270 -157660 -42043
8434d2043M87109k04285j67102k72313L18876k01425J91837L24138l41491J37407
$$ -42043 445066 240781 73679 -198634 120242 -81183 110654 434792 93301 230708
8424B30708j58740j005807M25039R52722o91934M07259j8288L63319k02622p75459
$$ 230708 71968 -933839 -508800 443922 -248012 159247 140959 504278 301656 -473803
8414d73803k86684J56918j18976p22514k19018P51647O1303J289522J57685m5145
$$ -473803 -760487 -603569 -722545 -1445059 -1664077 -912430 -851127 438395 596080 550935
8404E50935m70640k82453R2169p8379K52102J99550j0265k04911m5345n49773
$$ 550935 80295 -202158 -109989 -188368 63734 263284 253019 48108 2763 -547010
8394e47010J202113o09559J7377l43588k61437L19634k72360N50174n1856m97928
$$ -547010 655103 45544 62921 -280667 -542104 -222470 -494830 55344 3488 -494440
8384d94440K73770l26925J454864J62142j04988o84661p2113J98758p59616n47979
$$ -494440 -220670 -547595 907269 1069411 964423 279762 207649 406407 -353209 -901188
8374i01188R23121O6169j130654J384034n76427J25145Q66323J202O6112l2429
$$ -901188 21933 88102 -1042552 341482 -234945 -109800 756523 757725 823837 791408
8364G91408K19394m37339l34549J035097j39902l60514l21362n4118J11078k54905
$$ 791408 1010802 573463 238914 1274011 1134109 773595 452233 398115 509193 254288
8354B54288l77047R6503l00749Q60672J32026j0191l87719n38772n45076l11156
$$ 254288 -122759 -26256 -327005 533667 665693 655502 267783 -270989 -816065 -1127221
8344a127221N61951k13991J35485j44625N85127N64321k89771L8818O94140n0249
$$ -1127221 -565270 -779261 -643776 -788401 -203274 361047 71276 110094 804234 753985
8334G53985r4999k05471j188092M24438R29854k10134l56338K15573K21888l32672
$$ 753985 658986 453515 -734577 -310139 619715 409581 53243 268816 490704 158032
8324A58032k7362l95716O01473J92445m3310R6724r510p73062m59538J143056
$$ 158032 130670 -265046 336427 528872 485562 582286 572776 -200286 -659824 483232
8314D83232O74009q69190j174483r16847J236697Q49505J93287l70197P57741
$$ 483232 1157241 288051 -886432 -1803279 -566582 282923 476210 106013 863754
8305H63754R759p98915l56950k04251M89007K37494l56194m47947l16756K35354
$$ 863754 873513 74598 -282352 -486603 2404 239898 -116296 -564243 -880999 -645645
8295f45645L38728l56843R49622p90632j50170L97722k1280j72364M65902R8057
$$ -645645 -306917 -663760 285862 -504770 -654940 -257218 -278498 -450862 15040 113097
8285A13097k94295l03420Q9045M27548K00339m91298p21991K14001M69881M43329
$$ 113097 -181198 -484618 -395573 31975 232314 -258984 -980975 -766974 -297093 146236
8275A46236O25240j82603j92557n91072j052849P08739J239316M75960j003986
$$ 146236 771476 588873 396316 -194756 -1247605 -538866 700450 1176410 172424
8266A72424n60606K18352N61164k16896o25536P86505P64647l31342j171393o0043
$$ 172424 -388182 -169830 391334 174438 -451098 335407 1100054 768712 -402681 -462724
8256d62724R68419j29836o11242R32779k59105n28473K57333k42919r53582M98245
$$ -462724 505695 375859 -235383 697396 438291 -90182 167151 -75768 -1029350 -531105
8246e31105M01717q74209M293J48782L87002Q32266J70749j55094p73398j09327
$$ -531105 -129388 -1003597 -999304 -850522 -463520 368746 539495 384401 -388997 -498324
8236d98324M62035N90329K60052m45893K88928p52055L5087K65128J85660n42472
$$ -498324 -36289 554040 814092 368199 657127 -94928 -59841 205287 390947 -151525
8226a51525K05141J22351K04503o40433J557m5595l97118K93351M07286j49189
$$ -151525 53616 175967 380470 -259963 -258406 -304001 -701119 -407768 -482 -149671
8216a49671J145372J44873q46962j57529o48584j47882N21568L36525k75209P94691
$$ -149671 995701 1140574 293612 136083 -512501 -660383 -138815 197710 -77499 717192
8206G17192j3435k35142N06202j223003O11937K9210o7265k35762p22696r1622
$$ 717192 703757 468615 974817 -248186 363751 392961 325696 89934 -632762 -724384
8196g24384K19801K87065m44798Q1897q446113K489249M698974k12162J52936
$$ -724384 -504583 -217518 -662316 -580419 -9026532 -6537283 -1838309 -2050471 -1897535
8187a897535Q38888M59093q39939J121359j070998l11089N51784k87658J58841
$$ -1897535 -1058647 -599554 -1439493 -318134 -1389132 -1700221 -1148437 -1436095 -1277254
8178a277254O37152J06186L2139M65269L49269k06697n14706n63397m10416L06853
$$ -1277254 -640102 -533916 -501777 -36508 312761 106064 -408642 -972039 -1382455 -1075602
8168a075602K92280k37345N27806L75312j51122K6231J167573m04941j05516q99686
$$ -1075602 -783322 -1020667 -492861 -117549 -268671 -242440 925133 520192 414676 -485010
8158d85010J222903j003041j60014P14284k4639l30476l42445J35134m329J77017
$$ -485010 737893 -265148 -425162 289122 264483 -65993 -408438 -273304 -277633 -100616
8148a00616l00473q3150M30746m39510o09586L1863P32690k37582j02944j1540
$$ -100616 -401089 -484239 -53493 -493003 -1102589 -1070726 -338036 -575618 -678562 -690102
8138f90102J71487M37803j10571R7891o67692L97788M87904o86352N73925o6040
$$ -690102 -518615 -80812 -191383 -93492 -761184 -363396 124508 -561844 12081 -53959
8128e3959p90056O47823k07579R2801o67517J60334K178L47K26618K41033L03214
$$ -53959 -844015 -196192 -403771 -310970 -978487 -818153 -815975 -815628 -589010 -347977 -44763
8117d4763j85330J97223P98766m0884o64814l08202J150332Q7132L88309n82176
$$ -44763 -230093 -32870 765896 725012 60198 -248004 902328 989460 1377769 795593
8107G95593l8038L0046r71881j120327j62810J431755O4632l69326l66898J87991
$$ 795593 757555 787601 -184280 -1304607 -1467417 -35662 28970 -340356 -707254 -519263
8097e19263M28462j34207m54571K13092o9933L6478K39196l4519n67107K07298
$$ -519263 -90801 -225008 -679579 -466487 -536420 -499942 -260746 -295265 -862372 -655074
8087f55074l06076o10449P74747M14136l98751M75765O23327m20447m38588l74621
$$ -655074 -961150 -1571599 -796852 -382716 -781467 -305702 317625 -102822 -541410 -916031
8077i16031L6097O04699K19867q4634p87682N11801N40204o44890L54526M88896
$$ -916031 -879934 -275235 -55368 -140002 -927684 -415883 124321 -520569 -166043 322853
8067C22853l21829l5122k33226m26039j30571J47710K62232j0044N50988l40669
$$ 322853 1024 -34098 -267324 -693363 -823934 -676224 -413992 -424036 126952 -213717
8057b13717L50038L34320r42597m98060J87849L66150K33779O156k86346o8469
$$ -213717 136321 470641 -471956 -970016 -782167 -416017 -182238 -176082 -462428 -530897
8047e30897L80162p16737M30887M56733K04581k19966l83310L81579J70198m37935
$$ -530897 -150735 -867472 -436585 20148 224729 4763 -378547 3032 173230 -264705
8037b64705j26248K81373J38101M13822p1231j83547k93496K33745j08405k79111
$$ -264705 -390953 -109580 28521 442343 371112 187565 -105931 127814 19409 -259702
8027b59702j54142J9096K68089L08500J94770N00390p58999l64956j023954P82240
$$ -259702 -413844 -394748 -126659 181841 376611 877001 118002 -246954 -1270908 -488668
8017d88668J152067l96361n77363n5072O903P83306L88285q63542r5802l9707
$$ -488668 663399 267038 -310325 -365397 -358494 424812 813097 -50445 -146247 -185954
8007a85954o06128j33010L84013K6818L85912j68559n49653j77800P33725j80794
$$ -185954 -792082 -925092 -541079 -514261 -128349 -296908 -846561 -1024361 -290636 -471430
7997d71430Q56091j81499j90133m14044P7844n9155j22660K21147J70436N93638
$$ -471430 384661 203162 13029 -401015 -323171 -382326 -504986 -283839 -113403 480235
7987D80235r4239J80702l69339l74605K26155J26857K12460k51142m56602O792
$$ 480235 385996 566698 197359 -177246 48909 175766 388226 137084 -319518 -312726
7977c12726O26321M2044k08544R8867L82360M99533o33752n75128o57264N48931
$$ -312726 313595 355639 147095 245962 628322 1127855 494103 -81025 -738289 -189358
7967a89358L79685L30666K94054k22045k68148L09460k74658j355o47487j1852
$$ -189358 190327 520993 815047 593002 324854 634314 359656 358301 -289186 -301038
7957c01038O87927M76167q78794m81890L62530P529o7129L0507j003835J36344
$$ -301038 386889 863056 -15738 -497628 -135098 -127569 -194698 -164191 -1168026 -1031682
7947a031682J141068m90822l08077K47715k28751O24262N79855L75537m1586n93401
$$ -1031682 109386 -381436 -689513 -441798 -670549 -46287 533568 909105 867519 274118
7937B74118n77153Q53409K80001n27233l55996L2634L1391K55160L05572j303332
$$ 274118 -303035 550374 830375 303142 -52854 -20220 11171 266331 571903 -731429
7927g31429N9538N77279M64937o76813N57913k14659K22072m58715m67436J097211
$$ -731429 -671891 -94612 370325 -306488 251425 36766 258838 -199877 -667313 429898
7917D29898P98110p35650k22921k13725j24643l05004J8061k02903M71043N03764
$$ 429898 1228008 492358 269437 55712 -68931 -373935 -355874 -558777 -87734 416030
7907D16030N9681K44899o37188m95541O07858j67045k5244j129338k09787K86597
$$ 416030 475711 720610 83422 -412119 195739 28694 3450 -1125888 -1335675 -1049078
7897a049078M85567J18424N86138o21604j274017J795445J98141j98108m39478
$$ -1049078 -563511 -445087 141051 -480553 -1754570 40875 239016 40908 -398570
7888c98570o15075n06839N66576j50994n3500L19625O48205P21717k43780k37779
$$ -398570 -1013645 -1520484 -953908 -1104902 -1158402 -838777 -190572 531145 287365 49586
7878D9586l39857n38654J6561L1794m46795P92150p67813m85487M35694L82833
$$ 49586 -290271 -828925 -812364 -780570 -1227365 -435215 -1203028 -1688515 -1252821 -869988
7868h69988P63375q94419j2077j13892N594M68530L80475K11157K49863m5061
$$ -869988 -106613 -1001032 -1013109 -1127001 -1121407 -652877 -272402 -61245 188618 143557
7858A43557j052972L3464L94245k84499J71058k0789M11018j57956K18016k94460
$$ 143557 -909415 -875951 -481706 -766205 -595147 -615936 -204918 -362874 -144858 -439318
7848d39318k50567K7054J56085k562k71506j18440L83728L04635r08137R83474
$$ -439318 -689885 -662831 -506746 -509308 -780814 -899254 -515526 -210891 -1119028 -135554
7838a35554o77756L97663O76455p39358L1280p84287l95679R38754o2395P2930
$$ -135554 -813310 -415647 260808 -478550 -447270 -1231557 -1627236 -688482 -750877 -677947
7828f77947N68380l09058m4398o66630j61366j22447P05920m8143M67756m09354
$$ -677947 -109567 -418625 -463023 -1129653 -1291019 -1413466 -707546 -755689 -287933 -697287
7818f97287M61523o16154L57096q14460O56281k55933M4035J27919M88838L72965
$$ -697287 -235764 -851918 -494822 -1309282 -653001 -908934 -864899 -736980 -248142 124823
7808A24823l07290j63500l39292J49060J31321N10424n80777j1915k5911J016495
$$ 124823 -182467 -345967 -685259 -536199 -404878 105546 -475231 -487146 -513057 503438
7798E03438j16353j558358k128883K341408N63022K0222k07169O83941n16697
$$ 503438 387085 -1171273 -3300156 -958748 -395726 -375504 -582673 101268 -415429
7789d15429m48905Q42195p8380j59770L45136m08793k66453l05965L00478L49924
$$ -415429 -864334 -22139 -100519 -260289 84847 -323946 -590399 -896364 -595886 -245962
7779b45962m85434n38896M32499M71037K52327R23589j021254q5176O71349k58706
$$ -245962 -731396 -1270292 -837793 -366756 -114429 809160 -212094 -297270 374079 115373
7769A15373n90756j74033Q20617n39228n18008M69361K58978O0350M93865o12880
$$ 115373 -475383 -649416 171201 -368027 -886035 -416674 -157696 -97346 396519 -216361
7759b16361r85355N89383K51822N26900L09201J32582q31287n04800P95576K28934
$$ -216361 -1201716 -612333 -360511 166389 475590 608172 -223115 -727915 67661 296595
7749B96595p55601M8094j83784N4047l86917K09434M35663m74448k06958N87620
$$ 296595 -459006 -410912 -594696 -540649 -927566 -718132 -282469 -756917 -963875 -376255
7739c76255K54486m61961L37739M95475n56449L22340j33133j1909p20141N11583
$$ -376255 -121769 -583730 -245991 249484 -306965 15375 -117758 -129667 -849808 -338225
7729c38225M28839m55497k00674K43630N05873k23135L24864r7618K89183J06858
$$ -338225 90614 -364883 -565557 -321927 183946 -39189 285675 188057 477240 584098
7719E84098J29624q87591L13167m7495m49821j86790Q6854j3690Q52781J81346
$$ 584098 713722 -173869 139298 91803 -358018 -544808 -457954 -471644 381137 562483
7709E62483J31598q96702l49912k4686M17236J62538O6831l4593j72230M67773
$$ 562483 694081 -202621 -552533 -577219 -159983 2555 69386 34793 -137437 330336
7699C30336J50537r2461K87351l04656l75576J73560K22009N02347p59423P42199
$$ 330336 480873 388412 675763 371107 -4469 169091 391100 893447 134024 876223
7689H76223n82756k69862L69073l59669J92121j7948n58730P0039k49121L36833
$$ 876223 293467 23605 392678 33009 225130 207182 -351548 -281509 -530630 -193797
7679a93797M98400k11657k87110o8762J577P1478J306M73560L71855K89386k41408
$$ -193797 304603 92946 -194164 -262926 -261349 -189871 -188565 284995 656850 946236 704828
7668G04828K92102R2284n46462J43005n42211N87419k34379j80904k71439j99003
$$ 704828 996930 1089214 542752 685757 143546 730965 496586 315682 44243 -154760
7658a54760P58457o12579J51191K00162o26960r2094Q98821L62496n08621j79111
$$ -154760 603697 -8882 142309 342471 -284489 -376583 522238 884734 376113 197002
7648A97002k22507K28202K46242J38993N50855P9947m43176l93500k10795k99162
$$ 197002 -25505 202697 448939 587932 1138787 1218734 775558 382058 171263 -127899
7638a27899j89974m67925J92652k56000J15029L09204m10275N54057Q1610l6701
$$ -127899 -317873 -785798 -593146 -849146 -734117 -424913 -835188 -281131 -199521 -236222
7628b36222O31539q3249o8752K62026n60754l43142j07388R17647m88579k7682
$$ -236222 395317 312068 243316 505342 -55412 -398554 -505942 411705 -76874 -104556
7618a04556j03953m63305N0023K07977P65942k12774K93759k15510l82216j14294
$$ -104556 -208509 -671814 -621791 -413814 352128 139354 433113 217603 -164613 -278907
7608b78907m3149M35611o05271N9157M66994r0159J019516p42318m08608J54403
$$ -278907 -322056 113555 -491716 -432559 34435 -55724 963792 221474 -187134 -32731
7598c2731L3324K35213L23748o8687J4217r4068k89572l79431L66949k02718k64212
$$ -32731 593 235806 559554 490867 505084 411016 121444 -257987 108962 -93756 -357968
7587c57968O92479j25990l38157l58307o16216J104375K09930q80448N06248J8106
$$ -357968 334511 208521 -129636 -487943 -1104159 216 210146 -670302 -164054 -145948
7577a45948j029879l1879P90147R28641k29012m79546M84650M99749r46714q76901
$$ -145948 -1175827 -1207706 -417559 511082 282070 -197476 287174 786923 -159791 -1036692
7567a036692K62484J91640k34362j88972L72443j18621K16605M66529m71571j35577
$$ -1036692 -774208 -582568 -816930 -1005902 -633459 -752080 -535475 -68946 -540517 -676094
7557f76094M49891O81071K00126p41290L44591m42984p40321L80418J036556j480268
$$ -676094 -226203 454868 654994 -86296 258295 -184689 -925010 -544592 491964 -988304
7547i88304J50556M85185j91262J61571J67003k37442o31612J12970P6492M72650
$$ -988304 -837748 -352563 -543825 -382254 -215251 -452693 -1084305 -971335 -894843 -422193
7537d22193k71206k42255L14562o58090M14073K04040Q55970r32284q56180M89038
$$ -422193 -693399 -935654 -621092 -1279182 -865109 -661069 194901 -737383 -1593563 -1104525
7527a104525o36821K05201L22597P85906P60215j85661j22709o8625l2752l21712
$$ -1104525 -1741346 -1536145 -1213548 -427642 332573 146912 24203 -44422 -77174 -398886
7517c98886Q1584Q358j27045j42049j33935k9085J022214k20968n69676o59603
$$ -398886 -317302 -308944 -435989 -578038 -711973 -741058 281156 60188 -509488 -1169091
7507a169091M95608K17411j11541K58200N38323k96391j473134N27831m64727
$$ -1169091 -673483 -456072 -567613 -309413 228910 -67481 -1540615 -1012784 -1477511
7498a477511J81795l45943m5602l42294R67344N03801j33966J154760M4250j251063
$$ -1477511 -1295716 -1641659 -1687261 -2029555 -1062211 -558410 -692376 462384 506634 -744429
7488g44429P14298P93092j090686J83259l34817L00922n8344q63699L58240K70261
$$ -744429 -30131 762961 -327725 -144466 -479283 -178361 -236705 -1100404 -742164 -471903
7478d71903P53218j35091k09628m69121Q9999N92891J24278o46149p128r21090
$$ -471903 281315 146224 -63404 -532525 -442526 150365 274643 -371506 -378634 -1299724
7468a299724J17825J270987m62017j05138N62891l91066j245138k55789N10558
$$ -1299724 -1181899 89088 -372929 -478067 84824 -306242 -1551380 -1807169 -1296611
7459a296611L91435N81451M95161p85655j22528m47392k59218M87257r25163Q20637
$$ -1296611 -905176 -323725 171436 -614219 -736747 -1184139 -1443357 -956100 -1881263 -1060626
7449a060626K95623K5752k4993j93009k39488M00928N03017k05289k64252J46827
$$ -1060626 -765003 -739251 -764244 -957253 -1196741 -795813 -292796 -498085 -762337 -615510
7439f15510j15007J54963M0772m15212J54770Q16167j82907o43864R42415L75206
$$ -615510 -730517 -575554 -534782 -949994 -795224 20943 -161964 -805828 136587 511793
7429E11793q17014K55076J67303j5997j53517n4546J68603O3694K2174q8661Q28163
$$ 511793 -305221 -50145 117158 101161 -52356 -106902 61701 125395 147569 58908 887071
7418H87071p15544K5602k96330R25065m06374j075242P54438J391719o76099p74417
$$ 887071 171527 197129 -99201 825864 419490 -655752 98686 1490405 814306 39889
7408C9889K95997M80451J8729J60356L64067q53392m9174N0456N58853R2322o96968
$$ 39889 335886 816337 835066 995422 1359489 506097 456923 507379 1066232 1158554 461586
7397D61586L54836P3765k78872l31491K71627N22709o96988m10630O75922O94874
$$ 461586 816422 890187 611315 279824 551451 1074160 377172 -33458 642464 1337338
7387A337338m52640r32977l59946N80217m42628Q88330N63415n68404k29249j86527
$$ 1337338 884698 -48279 -408225 171992 -270636 617694 1181109 612705 383456 196929
7377A96929p8839l9052O2908o41125K97500o8036J119934o8125n40981n5309M18302
$$ 196929 118090 79038 141946 -499179 -201679 -269715 850219 782094 241113 185804 604106
7366F04106L57805k59725j93969K31786j93252j65847p4863j1857L97191p64545
$$ 604106 961911 702186 508217 740003 546751 380904 306041 294184 691375 -73170
7356g3170L44704j69186j8178K89102M9727o66756K90035O98019l82966k33887
$$ -73170 271534 102348 84170 373272 422999 -243757 46278 744297 361331 127444
7346A27444k65011K8624K9264K89303L90317l70776n51827J009297o22566l29473
$$ 127444 -137567 -108943 -79679 209624 599941 229165 -322662 686635 64069 -265404
7336b65404K96829M38540N114m13874j62390o2841M26146l01551q4526l4586l31793
$$ -265404 31425 469965 475079 61205 -101185 -164026 262120 -39431 -123957 -158543 -490336
7325d90336M41657k66158M3005o14086j391393J392786N51828P17333p1731j057787
$$ -490336 -48679 -314837 -271832 -885918 -2277311 -884525 -332697 384636 312905 -744882
7315g44882P2686P63372J10645k48019j27054j47276l339K48188l45083k523j33708
$$ -744882 -672196 91176 201821 -46198 -173252 -320528 -323867 -75679 -420762 -423285 -556993
7304e56993L75036K65751k6221l5873M24590j07783q66022K43882J1670n41879
$$ -556993 -181957 83794 57573 21700 446290 338507 -527515 -283633 -271963 -813842
7294h13842N08177l03921K31571N02321p97990J047340J06042k92195L5379k23772
$$ -813842 -305665 -609586 -378015 124306 -673684 373656 479698 187503 222882 -890
7284h90K12045k73428L929j65203P60625l6030q16641q27049K51601N57996R1934
$$ -890 211155 -62273 -58344 -223547 537078 501048 -315593 -1142642 -891041 -333045 -241111
7273b41111m51042o41684O52261N11824j1240m3150K84968l99051p82359J37701
$$ -241111 -692153 -1333837 -681576 -169752 -180992 -224142 60826 -338225 -1120584 -982883
7263i82883M89526l61319J128002L0102q4539p58876o08389J69799J5034K09019
$$ -982883 -493357 -854676 273326 303428 218889 -539987 -1148376 -978577 -963543 -754524
7253g54524l2839K25568L68167L03100l71890L33779j10860j57684j80061j96513
$$ -754524 -787363 -561795 -193628 109472 -262418 71361 -39499 -197183 -377244 -573757
7243e73757j14602K10678Q8511j02378P00556l57243k24140n86169j17025l83485
$$ -573757 -688359 -477681 -389170 -491548 209008 -148235 -372375 -958544 -1075569 -1459054
7233a459054n5011N62174J42801P87506L81463l06337l81861K18671l22993k49875
$$ -1459054 -1514065 -951891 -809090 -21584 359879 53542 -328319 -109648 -432641 -682516
7223f82516L93069j82529k41999N83091o31682n23429P66840M48862K65177j63779
$$ -682516 -289447 -471976 -713975 -130884 -762566 -1285995 -519155 -70293 194884 31105
7213C1105k82709N8308M92885J40814j073953N1164M31908L46429o55442p28165
$$ 31105 -251604 -193296 299589 440403 -633550 -582386 -150478 195951 -459491 -1187656
7203a187656R24910o32111Q88483N76623r03640k76260L43547J89391o04595n14771
$$ -1187656 -262746 -894857 -6374 570249 -333391 -609651 -266104 -76713 -681308 -1196079
7193a196079J07703J295146Q7491m11189j48042M1489j35775O01078k52045p19815
$$ -1196079 -1088376 206770 294261 -116928 -264970 -223481 -359256 241822 -10223 -730038
7183g30038M21591M63787J4409r05188L36029J98135Q8947M74324N25070p12887
$$ -730038 -308447 155340 169749 -735439 -399410 -201275 -112328 361996 887066 174179
7173A74179k65902l57784M15426R33225j325757P35449Q38858j69330J87695k70455
$$ 174179 -91723 -449507 -34081 899144 -426613 308836 1147694 978364 1166059 895604
7163H95604K07203O0152m22414n6676n53541N26969j61703K00386N99742L05134
$$ 895604 1102807 1162959 740545 683869 130328 657297 495594 695980 1295722 1600856
7153A600856J61917O98747O70734Q95506L9810M08166m85158r96544L82047j193314
$$ 1600856 1762773 2461520 3132254 4027760 4067570 4475736 3990578 2994034 3376081 2182767
7143B182767o42027m71788p874R50446L7577o66925j98848k19413M32609j82426
$$ 2182767 1540740 1068952 1061078 2011524 2049101 1382176 1183328 963915 1396524 1214098
7133A214098n27834k140J30807n16901J18373J23499M2877J54968r2084j05701
$$ 1214098 686264 684124 814931 298030 416403 539902 582779 737747 645663 539962
7123E39962k90182J26685M21180n94936J67310N3589L04191L7236q17422l91921
$$ 539962 249780 376465 797645 202709 370019 423608 727799 765035 -52387 -444308
7113d44308P64039L86414K89103L16630p94441q71467L34929O80291r313j032858
$$ -444308 319731 706145 995248 1311878 517437 -354030 -19101 661190 651877 -380981
7103c80981J32652K85980k36045l04542L19959J44688m48166O90050J60450M5048
$$ -380981 -248329 37651 -198394 -502936 -182977 -38289 -486455 203595 364045 409093
7093D09093m61830j05937K88993k71449p26213l20512M0328J342285l42886k57057
$$ 409093 -52737 -158674 130319 -141130 -867343 -1187855 -1147527 194758 -148128 -405185
7083d05185k55519M89210l96177m9464K66621j94589j94748L02301R74346l58264
$$ -405185 -660704 -171494 -567671 -617135 -350514 -545103 -739851 -437550 536796 178532
7073A78532j80335O0138R1777j65339r0566m34260M07227M96199l04900j15963
$$ 178532 -1803 58335 150112 -15227 -105793 -540053 -132826 363373 58473 -57490
7063e7490K75581l38787j25239K90859l670J57444m08519j2868k63045O8669J146733
$$ -57490 218091 -120696 -245935 44924 41254 198698 -209821 -222689 -485734 -417065 729668
7052G29668p11301j11277N10772N16205j79642j27177p18754O75764N25357k05586
$$ 729668 18367 -92910 417862 934067 754425 627248 -91506 584258 1109615 904029
7042I04029k45899q90734l21621M38944L97609l39838K74088q52445J89008P87326
$$ 904029 658130 -232604 -554225 -115281 282328 -57510 216578 -635867 -446859 340467
7032C40467n61610N35609J35534M85810M64714m6197J193649m70049o36156J35014
$$ 340467 -221143 314466 450000 935810 1400524 1354327 2547976 2077927 1441771 1576785
7022A576785K71911o51784N08676n34934m40075m54973N2979L7688O66328j04547
$$ 1576785 1848696 1196912 1705588 1170654 730579 275606 328585 366273 1032601 928054
7012I28054p81183K09560n1849m19470K32163j76899K80975r2937j289L38240
$$ 928054 146871 356431 304582 -114888 117275 -59624 221351 128414 127125 465365
7002D65365m62599j69799M5695J012684p96388J13738M96255n19211o44563n75722
$$ 465365 2766 -167033 -121338 891346 94958 208696 704951 185740 -458823 -1034545
6992a034545K41172K95446L23896R05013n81020J12299n96855p468k25947j92181
$$ -1034545 -793373 -497927 -174031 730982 149962 262261 -334594 -342062 -568009 -760190
6982g60190K08105M72849M42642n44766l3135K98485p15512K52827M35832l39389
$$ -760190 -552085 -79236 363406 -181360 -214495 83990 -631522 -378695 57137 -282252
6972b82252L09198k72581K25539J28413O28977K56923r13552p15190O81170M17550
$$ -282252 26946 -245635 -20096 108317 737294 994217 80665 -634525 46645 464195
6962D64195n57196q45684K94839O02986p20781J1572k84305Q03660R8975j16542
$$ 464195 -93001 -938685 -643846 -40860 -761641 -750069 -1034374 -230714 -131739 -248281
6952b48281l44551r4860R08714N010q24979n15018l39895M19885O20635k23717
$$ -248281 -592832 -687692 221022 226032 -598947 -1113965 -1453860 -1033975 -413340 -637057
6942f37057p41161J52061Q87260j52085j30824J50019N39433J52856j106357K44899
$$ -637057 -1378218 -1226157 -338897 -490982 -621806 -471787 67646 220502 -885855 -640956
6932f40956O88689k29928J079180q33471J36136K83446L1024j8316m28751J0647
$$ -640956 47733 -182195 896985 63514 199650 483096 514120 495804 67053 77700
6922G7700J56933r99630M34882O31264j26717l15991K69356k8729q9219M01438
$$ 77700 234633 -764997 -330115 301149 174432 -141559 127797 99068 9849 411287
6912D11287j97941m93927j87342m10842J23791N70307j58887O2714p40355L03676
$$ 411287 213346 -280581 -467923 -878765 -754974 -184667 -343554 -280840 -1021195 -717519
6902g17519p23514L35688n71211O24893j69990j0428J63049k5348P46628j50672
$$ -717519 -1441033 -1105345 -1676556 -1051663 -1221653 -1232081 -1069032 -1094380 -347752 -498424
6892d98424k54250J05176l76899p02214O33372L87332l69665O61889J56107n75709
$$ -498424 -752674 -647498 -1024397 -1726611 -1093239 -705907 -1075572 -413683 -257576 -833285
6882h33285L04370j12409K56327l48655q3843L25865K98464P9471n23728q06890
$$ -833285 -528915 -641324 -384997 -733652 -817495 -491630 -193166 -113695 -637423 -1444313
6872a444313k41523J33050K28994J48029J5579M65532l21208k59705m68325R92934
$$ -1444313 -1685836 -1552786 -1323792 -1175763 -1160184 -694652 -1015860 -1275565 -1743890 -750956
6862g50956P34301q34951J97035m73738L5356O56785P93561q29537n03193Q3839
$$ -750956 -16655 -851606 -654571 -1128309 -1092953 -436168 357393 -472144 -975337 -891498
6852h91498O70229l67070j38118P56661k21381M58756j75928o05848p07094k74300
$$ -891498 -221269 -588339 -726457 30204 -191177 267579 91651 -514197 -1221291 -1495591
6842a495591P85690K45452K96099K16832M18247m16177p26228l5648l06979J102111
$$ -1495591 -709901 -464449 -168350 48482 466729 50552 -675676 -711324 -1018303 83808
6832H3808o42286K98388m36426n04774N20072m75452L51449l17824j7258M11646
$$ 83808 -558478 -260090 -696516 -1201290 -681218 -1156670 -805221 -1123045 -1140303 -728657
6822g28657R79786k04268q32141n80249P51076L70202L01388n91979L41011N03886
$$ -728657 251129 46861 -785280 -1365529 -614453 -244251 57137 -534842 -193831 310055
6812C10055n84409p9604L55399M50661L863o78831l80010l62965k61981K28433
$$ 310055 -274354 -353958 1441 452102 455965 -222866 -602876 -965841 -1227822 -999389
6802i99389J41655J090537J10701q25058j011246J89765O80663L13097N20353
$$ -999389 -857734 232803 343504 -481554 -1492800 -1303035 -622372 -309275 211078
6793B11078l62788P7698R2905p82189L93312m62148n44666J252649K82369j09370
$$ 211078 -151710 -74012 18893 -763296 -369984 -832132 -1376798 -124149 158220 48850
6783D8850m05879p6283R34245j16990n2830o58517m5919Q38305j84307k29670
$$ 48850 -357029 -433312 500933 383943 331113 -327404 -373323 464982 280675 51005
6773E1005L82440j86099j272098M63136M75360J84039M74765k64808j728871n14520
$$ 51005 433445 247346 -1024752 -561616 -86256 97783 572548 307740 -1421131 -1935651
6763a935651J102322J262284K84019k0914O7238L01921k24329r86606M00057N75194
$$ -1935651 -833329 428955 712974 692060 759298 1061219 836890 -149716 250341 825535
6753H25535l11828j17956J46370J17642O73507k2155m61597p66069l59673K49242
$$ 825535 513707 395751 542121 659763 1333270 1311115 849518 83449 -276224 -26982
6743b6982L41097M36072J93508k83162k70717q39312K34678k87859M88271q74173
$$ -26982 314115 750187 943695 660533 389816 -449496 -214818 -502677 -14406 -888579
6733h88579L14062n16269M92558J98269l29589K63044l36184P16943l37052k02758
$$ -888579 -574517 -1090786 -598228 -399959 -729548 -466504 -802688 -85745 -422797 -625555
6723f25555L53967K70614l18153Q13085P4319J07501m12565j20560K77222p37394
$$ -625555 -271588 -974 -319127 493958 568277 675778 263213 142653 419875 -317519
6713c17519m17817O85444O64389M82179p59488p50297P61599n9580l16649o90774
$$ -317519 -735336 -49892 614497 1096676 337188 -413109 348490 288910 -27739 -718513
6703g18513L98202K41563J3534m46953n1541O28182l5744L00179j58559k02543
$$ -718513 -320311 -78748 -65214 -512167 -563708 64474 28730 328909 170350 -32193
6693c2193M00762l14558m36694L86868j89479o60170R10395l01660n25488L16528
$$ -32193 368569 54011 -382683 4185 -185294 -845464 64931 -236729 -762217 -445689
6683d45689L9994K63271K95172L07139k24150P53419p65415k54598M04134m29515
$$ -445689 -405695 -142424 152748 459887 235737 989156 223741 -30857 373277 -56238
6673e6238K51504k65017k71924k23431J86395K32664o95967k29787N08696j52658
$$ -56238 195266 -69751 -341675 -565106 -378711 -146047 -842014 -1071801 -563105 -715763
6663g15763R91424N38581l21374l0021j99201R1361p2487k39878L04643j67229
$$ -715763 275661 814242 492868 462847 263646 355007 282520 42642 347285 180056
6653A80056k42557M6300q68349l6283K15972j051774N27262M18332o66548J024842
$$ 180056 -62501 -16201 -884550 -920833 -704861 -1756635 -1229373 -811041 -1477589 -452747
6643d52747P47820J97751k38487Q7416o3206L96888p19286l18654n92920P9031
$$ -452747 295073 492824 254337 341753 278547 675435 -43851 -362505 -955425 -876394
6633h76394K74914K87416r44851L34299L44678M53858n42353k6470P16663n72994
$$ -876394 -601480 -314064 -1258915 -924616 -579938 -126080 -668433 -694903 21760 -551234
6623e51234J441j07624M24483n27206O95832j46145m18868m07559m42637N4932
$$ -551234 -549793 -657417 -232934 -760140 -64308 -210453 -629321 -1036880 -1479517 -1424585
6613a424585J69298J030744p0794j67269J41832n09977Q26208L96922m83158k67475
$$ -1424585 -1255287 -224543 -295337 -462606 -320774 -830751 -4543 392379 -90779 -358254
6603c58254p4491J8472m84625n42480L08189P86847l28704M83215m08202Q51953
$$ -358254 -432745 -414273 -898898 -1441378 -1133189 -346342 -675046 -191831 -600033 251920
6593B51920K60818n58712j79568L39576N75161K66690j167000P7702L83674n7470
$$ 251920 512738 -45974 -225542 114034 689195 955885 -211115 -133413 250261 192791
6583A92791M23078M656n39009l05541Q16620o77214J59272K20611o11420P72205
$$ 192791 615869 620525 81516 -224025 592595 -84619 74653 295264 -316156 456049
6573D56049L4536q03556R63533L76338l50722j23052K43833j41046J64073k83802
$$ 456049 490585 -312971 650562 1026900 676178 553126 796959 655913 819986 536184
6563E36184o18623L6422n18644m2713q8878K96759M55371q46435n76339L39583
$$ 536184 -82439 -46017 -564661 -607374 -696252 -399493 55878 -790557 -1366896 -1027313
6553a027313N44001o52852R77732l56881l75969Q8724J90120K33803R5021L08787
$$ -1027313 -483312 -1136164 -158432 -515313 -891282 -802558 -612438 -378635 -283614 25173
6543B5173q92451j51256J480607j73098k74802o20806M6973k0518O36837l59134
$$ 25173 -867278 -1018534 462073 288975 14173 -606633 -559660 -580178 56659 -302475
6533c02475O37778M99373r30950j1141L48531o01364m47323L75615j47315k97854
$$ -302475 335303 834676 -96274 -107415 241116 -360248 -807571 -431956 -579271 -877125
6523h77125M53139K6734K62383J76204K22139J50712l61389o30311k96803K45908
$$ -877125 -423986 -397252 -134869 41335 263474 414186 52797 -577514 -874317 -628409
6513f28409p5632l04918j95677O56760M94956J71243k82932m41110M39452O28137
$$ -628409 -704041 -1008959 -1204636 -547876 -52920 118323 -164609 -605719 -166267 461870
6503D61870O87526q11130j247936J1959P93781M58559o31422M65477k47417j58017
$$ 461870 1149396 338266 -909670 -897711 -103930 354629 -276793 188684 -58733 -216750
6493b16750J76068l57147J91989k7825j63721Q2348l98873O96642n557j69315
$$ -216750 -40682 -397829 -205840 -233665 -397386 -315038 -713911 -17269 -22826 -192141
6483a92141M8881M12713m93307o57033o56930K42737N6067l65726Q26768N27601
$$ -192141 -143260 269453 -223854 -880887 -1537817 -1295080 -1239013 -1604739 -777971 -250370
6473b50370l79687J78378M29678k2020q7938q99954k33382J268910L66360j97039
$$ -250370 -630057 -451679 -22001 -44021 -131959 -1031913 -1265295 3615 369975 172936
6463A72936n67637k47241j94674K62528M59845l93887l91819R23199J60180J91899
$$ 172936 -394701 -641942 -836616 -574088 -114243 -508130 -899949 23250 183430 375329
6453C75329r8175k85565k50790M33208p68758J34880O25893j13580r4044n05837
$$ 375329 277154 -8411 -259201 174007 -594751 -459871 166022 52442 -41602 -547439
6443e47439R89340j02056n03029P2010n37487M18092q35373m44863O93111l32038
$$ -547439 441901 339845 -163184 -91174 -628661 -210569 -1045942 -1490805 -797694 -1129732
6433a129732N83988J37276J33989K36080p13844K35829M88396k90950L85702M83974
$$ -1129732 -545744 -408468 -274479 -38399 -752243 -516414 -28018 -318968 66734 550708
6423E50708M63666j200555k38729j53808J24845m45533k87575L70475K72600R86693
$$ 550708 1014374 -186181 -424910 -578718 -453873 -899406 -1186981 -816506 -543906 442787
6413D42787J26757P1835r29904k42385r9377o02999M87693p62704Q31369M45674
$$ 442787 569544 641379 -288525 -530910 -630287 -1233286 -745593 -1508297 -676928 -231254
6403b31254J5228L46258N27000J43768j9393j28155j12509n7404o848Q3235o68057
$$ -231254 -216026 130232 657232 801000 781607 653452 540943 483539 476691 559926 -108131
6392a08131m45060l10119N46458m27463K51121K49445j41389l28310j17n91704
$$ -108131 -553191 -863310 -316852 -744315 -493194 -243749 -385138 -713448 -713565 -1305269
6382a305269J045207J144647O412j64964l8364L91394p61524m69984m29792k74054
$$ -1305269 -260062 884585 890997 726033 687669 1079063 317539 -152445 -582237 -856291
6372h56291J016506p0018L41400L02826J09607J03028q31361L17702J63133n98402
$$ -856291 160215 90197 431597 734423 844030 947058 115697 433399 596532 -1870
6362a870j54439M19903p0889R4263M67150n24871k71322m00348J064714L99513
$$ -1870 -156309 263594 192705 286968 754118 229247 -42075 -442423 622291 1021804
6352A021804j73993r21817m31887j74043L09483O78714k15020P5606l46728R01367
$$ 1021804 847811 -74006 -505893 -679936 -370453 308261 93241 168847 -177881 723486
6342G23486K06299p55676j099123R75131R43406n24385K15581J05506o45241J79864
$$ 723486 929785 174109 -925014 50117 993523 469138 684719 790225 144984 324848
6332C24848l18836K20041M42464m36253J53436L34538p35498K85090j84616j73537
$$ 324848 6012 226053 668517 232264 385700 720238 -15260 269830 85214 -88323
6322h8323l95450L79826l71176j066599L53145L75041p4045M47862L13086J16913
$$ -88323 -483773 -103947 -475123 -1541722 -1188577 -813536 -887581 -439719 -126633 -9720
6312i720j69535j60313P1461L05528O90502J95515n73135n61174R91146m49500
$$ -9720 -179255 -339568 -268107 37421 727923 923438 350303 -210871 780275 330775
6302C30775L8503l44158j26792M74118j18527j08192l66230Q59862o34505l77334
$$ 330775 369278 25120 -101672 372446 253919 145727 -220503 639359 4854 -372480
6292c72480R2980k2686j1539Q6051l74251O78564m28952k15405L7669j25766l99565
$$ -372480 -279500 -302186 -313725 -227674 -601925 76639 -352313 -567718 -530049 -655815 -1055380
6281a055380M36377J16072l55110M16944O03011m60136r43524O61383Q78658l14457
$$ -1055380 -619003 -502931 -858041 -441097 161914 -298222 -1241746 -580363 298295 -16162
6271a6162P8074m23726n33811R12361L98578m15110j38970M0568n45953K83102
$$ -16162 61912 -361814 -895625 16736 415314 204 -138766 -98198 -644151 -361049
6261c61049p62577O00982q0303l98077m6278j55627N95257J78326k04976R37129
$$ -361049 -1123626 -522644 -602947 -1001024 -1047302 -1202929 -607672 -429346 -634322 302807
6251C02807k80019j08429K655k50360j29976J71317p5691n40189m10771R17964
$$ 302807 22788 -85641 -82986 -333346 -463322 -292005 -367696 -907885 -1318656 -400692
6241d00692J01176j33655K79207O15791k63291l18365p29026n02340R81465J71474
$$ -400692 -299516 -433171 -153964 461827 198536 -119829 -848855 -1351195 -369730 -198256
6231a98256q4542j38082N35455j70498l71631l71701m86233J78669J41869p78028
$$ -198256 -282798 -420880 114575 -55923 -427554 -799255 -1285488 -1106819 -964950 -1742978
6221a742978P41121N9876P9793O3325p9105k73113N44475J15419k17118m9416
$$ -1742978 -1001857 -941981 -862188 -798863 -877968 -1151081 -606606 -491187 -708305 -757721
6211g57721L52071P78872q11629L72163j63835R6759K11189m21167L51450m84896
$$ -757721 -405650 373222 -438407 -66244 -230079 -133320 77869 -343298 8152 -476744
6201d76744L31319J1009M3965k46324J68987k68698p92909P41193o08014J172968
$$ -476744 -145425 -134416 -90451 -336775 -167788 -436486 -1229395 -488202 -1096216 76752
6191G6752p23311K16531l97139n8042N1016M17135R2421P16447L32090j124198
$$ 76752 -646559 -430028 -827167 -885209 -834193 -417058 -324637 391810 723900 -400298
6181d00298r59306L93447Q42522n38753p32622N13228M57114n54466L36341J30910
$$ -400298 -1359604 -966157 -123635 -662388 -1395010 -881782 -424668 -979134 -642793 -511883
6171e11883L31918L15303L17401M71838m15065n77169j78127O68591K7044r7742
$$ -511883 -179965 135338 452739 924577 509512 -67657 -245784 422807 449851 352109
6161C52109n84609q3290N35461q16609p6788J041701J97128n28435J99157j165676
$$ 352109 -232500 -315790 219671 -596938 -673726 367975 565103 36668 235825 -929851
6151i29851l33971J041933m5483P9268J8809J83353K55777m14401m59106j65810
$$ -929851 -1263822 -221889 -267372 -188104 -169295 14058 269835 -144566 -603672 -769482
6141g69482j64046l64519P70778K92907J65786L0522l86460l49881L71372K74863
$$ -769482 -933528 -1298047 -527269 -234362 -68576 -38054 -424514 -774395 -403023 -128160
$$ [...]
##END NTUPLES=NMR SPECTRUM
##END=
