##TITLE=1H_CA-9223-2
 CDCl3
 8 sc, 
 12.1.2024
##JCAMPDX= 6.0         $$ Bruker NMR JCAMP-DX V2.0
##DATA TYPE= NMR SPECTRUM
##DATA CLASS= NTUPLES
##ORIGIN= UXNMR, Bruker Analytische Messtechnik GmbH
##OWNER= root
$$ XWIN-NMR		Version 3.5
$$ Fri Jan 12 14:12:45 2024 Russian Standard Time (UT+4h)  she@DPX200
##.OBSERVE FREQUENCY= 200.1313
##.OBSERVE NUCLEUS= ^1H
##.ACQUISITION MODE= SIMULTANEOUS
##.ACQUISITION SCHEME= undefined
##.AVERAGES= 8
##.DIGITISER RES= 18
##SPECTROMETER/DATA SYSTEM= spect
##.PULSE SEQUENCE= zg30
##.SOLVENT NAME= CDCl3
##.SHIFT REFERENCE= (INTERNAL, CDCl3, 0, 15.4736)
##AUDIT TRAIL= $$ (NUMBER, WHEN, WHO, WHERE, WHAT)
$$ ##TITLE= Audit trail, XWIN-NMR		Version 3.5
$$ ##JCAMPDX= 5.01
$$ ##ORIGIN= Bruker BioSpin GmbH
$$ ##OWNER= she
$$ F:/spectra/data/she/nmr/H-F/1/pdata/1/auditp.txt
$$ ##AUDIT TRAIL=  $$ (NUMBER, WHEN, WHO, WHERE, WHAT)
(   1,<2024-01-12 14:11:33.28 +0400>,<she>,<DPX200>,
      <created by zg, POWCHK disabled, PULCHK disabled
       configuration hash MD5:
       00 E9 B6 7A A2 85 ED C7 34 08 36 98 17 FE 4E 26
       data hash MD5: 16K
       77 B8 16 F1 F3 B6 74 A7 B8 23 18 35 09 84 C9 C0>)
(   2,<2024-01-12 14:11:35.84 +0400>,<she>,<DPX200>,
      <Start of raw data processing
       efp BC_mod = 2 LB = 0.24 FT_mod = 6 PKNL = 1 PHC0 = -24576.66 PHC1 = 12.2527 SI = 16K 
       data hash MD5: 16K
       4D 1D E4 BC 4B 96 DE 33 9C A8 14 15 A3 58 4D 01>)
(   3,<2024-01-12 14:11:55.42 +0400>,<she>,<DPX200>,
      <pk PHC0 = 1.659471 PHC1 = -0.8 
       data hash MD5: 16K
       F0 4E 33 17 C1 0E 8E 9A A8 33 B8 03 22 7B D0 F9>)
(   4,<2024-01-12 14:11:58.98 +0400>,<she>,<DPX200>,
      <abs ABSG = 5 
       data hash MD5: 16K
       CE 96 21 0E 68 B5 C4 DD 8F CE 11 E7 C5 8E 58 2A>)
$$ ##END=
$$ 
$$ hash MD5
$$ 80 AB D6 4E 07 89 D6 F5 05 76 81 85 C4 DC 91 F2
##$RELAX= 
##$RELAX= 
##$RELAX= 
##$RELAX= 
##$RELAX= 
##$RELAX= 
$$ Bruker specific parameters
$$ --------------------------
##$DU= <F:/spectra>
##$EXPNO= 1
##$NAME= <H-F>
##$PROCNO= 1
##$TYPE= <nmr>
##$USER= <she>
##$AMP= (0..31)
100 100 100 100 100 100 100 100 100 100 100 100 100 100 100 100 100 100 
100 100 100 100 100 100 100 100 100 100 100 100 100 100 
##$AQSEQ= 0
##$AQ_mod= 1
##$AUNM= <au_zg>
##$AUTOPOS= <>
##$BF1= 200.13
##$BF2= 200.13
##$BF3= 200.13
##$BF4= 200.13
##$BF5= 200.13
##$BF6= 200.13
##$BF7= 200.13
##$BF8= 200.13
##$BYTORDA= 1
##$CFDGTYP= 0
##$CFRGTYP= 5
##$CHEMSTR= <none>
##$CNST= (0..31)
1 1 145 1 1 1 1 1 1 1 1 1 1 1 1 1 1 1 1 1 1 1 1 1 1 1 1 1 1 1 1 1 
##$CPDPRG= <>
##$CPDPRG1= <>
##$CPDPRG2= <>
##$CPDPRG3= <>
##$CPDPRG4= <mlev>
##$CPDPRG5= <mlev>
##$CPDPRG6= <mlev>
##$CPDPRG7= <mlev>
##$CPDPRG8= <mlev>
##$CPDPRGB= <>
##$CPDPRGT= <>
##$D= (0..31)
0 1.2 0 0 0 0 0 0 0 0.06 0 0.03 0 0 0 0 0.0002 0 0 0 0 0 0 0 0 0 0 0 0 
0 0 0 
##$DATE= 1705054292
##$DBL= (0..7)
120 120 120 120 120 120 120 120 
##$DBP= (0..7)
150 150 150 150 150 150 150 150 
##$DBP07= 0
##$DBPNAM0= <>
##$DBPNAM1= <>
##$DBPNAM2= <>
##$DBPNAM3= <>
##$DBPNAM4= <>
$$ [...]
##$SUBNAM3= <"">
##$SUBNAM4= <"">
##$SUBNAM5= <"">
##$SUBNAM6= <"">
##$SUBNAM7= <"">
##$SUBNAM8= <"">
##$SUBNAM9= <"">
##$SW= 18.0517328524113
##$SWIBOX= (0..15)
0 0 2 0 0 0 0 0 0 0 0 0 0 0 0 0 
##$SW_h= 3612.71676300578
##$TD= 16384
##$TD0= 1
##$TE= 0
##$TE2= 300
##$TE3= 300
##$TEG= 300
##$TL= (0..7)
0 120 120 120 120 120 120 120 
##$TP= (0..7)
150 150 150 150 150 150 150 150 
##$TP07= 0
##$TPNAME0= <>
##$TPNAME1= <>
##$TPNAME2= <>
##$TPNAME3= <>
##$TPNAME4= <>
##$TPNAME5= <>
##$TPNAME6= <>
##$TPNAME7= <>
##$TPOAL= (0..7)
0.5 0.5 0.5 0.5 0.5 0.5 0.5 0.5 
##$TPOFFS= (0..7)
0 0 0 0 0 0 0 0 
##$TUNHIN= 0
##$TUNHOUT= 0
##$TUNXOUT= 0
##$USERA1= <user>
##$USERA2= <user>
##$USERA3= <user>
##$USERA4= <user>
##$USERA5= <user>
##$V9= 5
##$VALIST= <valist>
##$VCLIST= <CCCCCCCCCCCCCCC>
##$VD= 0
##$VDLIST= <DDDDDDDDDDDDDDD>
##$VPLIST= <PPPPPPPPPPPPPPP>
##$VTLIST= <TTTTTTTTTTTTTTT>
##$WBST= 1024
##$WBSW= 4
##$XGAIN= (0..3)
0 0 0 0 
##$XL= 0
##$YL= 0
##$YMAX_a= 51585
##$YMIN_a= -52192
##$ZGOPTNS= <>
##$ZL1= 120
##$ZL2= 120
##$ZL3= 120
##$ZL4= 120
##$ABSF1= 15.51551
##$ABSF2= -2.53634
##$ABSG= 5
##$ABSL= 3
##$ALPHA= 0
##$AQORDER= 0
##$ASSFAC= 0
##$ASSFACI= 0
##$ASSFACX= 0
##$ASSWID= 0
##$AUNMP= <proc_1d>
##$AZFE= 0.1
##$AZFW= 0.1
##$BCFW= 0
##$BC_mod= 2
##$BYTORDP= 0
##$COROFFS= 0
##$CY= -3
##$DATMOD= 1
##$DC= 0
##$DFILT= <>
##$DTYPP= 0
##$F1P= 0
##$F2P= 0
##$FCOR= 1
##$FTSIZE= 16384
##$FT_mod= 6
##$GAMMA= 0
##$GB= 0
##$INTBC= 1
##$INTSCL= 3.70164e-10
##$ISEN= 128
##$LB= 0.24
##$LEV0= 0
##$LPBIN= 0
##$MAXI= 10000
##$MC2= 0
##$MEAN= 0
##$ME_mod= 0
##$MI= 1.114404
##$NCOEF= 0
##$NC_proc= -10
##$NLEV= 6
##$NOISF1= 3.799351
##$NOISF2= 2.8
##$NSP= 0
##$NTH_PI= 0
##$NZP= 0
##$OFFSET= 15.47364
##$PC= 1
##$PHC0= -24575
##$PHC1= 11.4527
##$PH_mod= 1
##$PKNL= yes
##$PPARMOD= 0
##$PSCAL= 0
##$PSIGN= 0
##$REVERSE= no
##$SF= 200.130009618326
##$SI= 16384
##$SIGF1= 3
##$SIGF2= 2
##$SINO= 5.538805
##$SIOLD= 16384
##$SREGLST= <1H.CDCl3>
##$SSB= 0
##$STSI= 16384
##$STSR= 0
##$SW_p= 3612.71676300578
##$SYMM= 0
##$S_DEV= 0
##$TDeff= 16384
##$TDoff= 0
##$TI= <>
##$TILT= no
##$TM1= 0
##$TM2= 0
##$TOPLEV= 0
##$USERP1= <user>
##$USERP2= <user>
##$USERP3= <user>
##$USERP4= <user>
##$USERP5= <user>
##$WDW= 1
##$XDIM= 16384
##$YMAX_p= 428677456
##$YMIN_p= -10073097
$$ End of Bruker specific parameters
$$ ---------------------------------
##NTUPLES= NMR SPECTRUM
##VAR_NAME=  FREQUENCY,     SPECTRUM/REAL,   SPECTRUM/IMAG
##SYMBOL=    X,             R,               I
##VAR_TYPE=  INDEPENDENT,   DEPENDENT,       DEPENDENT
##VAR_FORM=  AFFN,          ASDF,            ASDF
##VAR_DIM=   16384,         16384,           16384
##UNITS=     HZ,            ARBITRARY UNITS, ARBITRARY UNITS
##FACTOR=    0.220516191357247, 1,           1
##FIRST=     3096.73981046687, 0,            0
##LAST=      -515.97695253891, 0,            0
##MIN=       -515.97695253891, -10073097,    0
##MAX=       3096.73981046687, 428677456,    0
$$ Real data points
##PAGE= N=1
##DATA TABLE= (X++(R..R)), XYDATA
$$ [...]
12284F1179R05737r7141j760991J02924q05424J611514J32128m91394J815935
12275A474467J385761j482079q07145N92290Q24538j041349n99493P53299k103316
12266a003027k72318L85684J2037J555748k24234J76354K10077n92834R24442
12257A171929K333631l062063j716032J989419J072512o56999m47234n05849R6482
12248B75796K93995J24861K1177K94532N52407j22733l186410O9654J324358p4333
12238d26696P12744J130617n84456j847983K789370O92837k928168J091418L00613
12229I30296k53889R91573m04042O96070n76472j70675r86752j165031O44239
12220b94683P54773O22860N38370J026Q68978r8750l87636j257553j916851N70372
$$ y = [61179, 966916, 869775, -891216, -788292, -1593716, 17798, 149926, -341468, 1474467, 2860228, 1378149, 571004, 1163294, 1987832, 946483, 346990, 1100289, -1003027, -1275345, -889661, -877624, 678124, 453890, 630244, 840321, 247487, 1171929, 3505560, 443497, -1272535, 716884, 1789396, 1132397, 685163, 179314, 275796, 569791, 694652, 715829, 1010361, 1562768, 1440035, -1746375, -1676721, -352363, -426696, 286048, 1416665, 832209, -1015774, 1773596, 2466433, -461735, 629683, 930296, 676407, 1667980, 1263938, 1960008, 1383536, 1212861, 226109, -938922, -294683, 460090, 1082950, 1621320, 1622346, 2491324, 2392574, 2004938, 747385, -1169466, -599094]
12210e99094P66128O29928m4533o49031L95690O15593k84977o91585j85179J209092
12200A162032p25359p41229L87146p05765r47194K38646Q36307O28889j029452
12191h95979J361064q85403K40069O45138j857634K156263O45958j814184J110365
12182G05657n06056J654795M64938l257523o9296M60897J753530p74552n25482
12173i3092r34368Q44844j247825J88749J035078N80716o39579R47050j127861
12164d46288l34782j325582O6963J526216Q07179j71725J747392m65853O37702
12155B041222j480611m84128M09932j732860J374864J171146k002079l36466p01545
12146a740525P04472J343209O97302P57883j325952L81722n48197l08340n81218
$$ y = [-599094, 167034, 796962, 752429, 103398, 499088, 1114681, 829704, 138119, -47060, 1162032, 436673, -304556, 82590, -623175, -1570369, -1331723, -495416, 133473, -895979, 465085, -420318, -180249, 464889, -1392745, 763518, 1409476, -404708, 705657, 199601, 1854396, 2319334, -938189, -1007485, -546588, 1206942, 432390, -93092, -1027460, -182616, -1430441, -1241692, -206614, 374102, -265477, 681573, -446288, -781070, -2106652, -2039689, -513473, 293706, 121981, 1869373, 1403520, 2041222, 560611, 76483, 486415, -1246445, 128419, 1299565, -702514, -1038980, -1740525, -1036053, 307156, 1004458, 1762341, 436389, 818111, 269914, -38426, -619644]
12137f19644m63417M99982J205253J01702j097607N79869n50106M98081J05688
12128B59801j80400k03037n8465J20900k13363Q95802J02669j72820K12679n88929
12118A74837j219168K64415J66297N11608M09693N58379k167384R48501R23336
12109E70514M58348O54201m29569j154399R41994j629238m1260j273507J659586
12100b43330l26596K0578r60746k61235m68600Q71241o4054j068441L83410J443687
12090f74086J11529N63667J23185k79054r3188j242697N55110P2446J014606J408
12080A52926N41679n77565R11038N01799k681643Q58525k01265l38414m3380m84256
12070a360556O71785o07220O30818K401387k98050o14491l6999k24550J099153
$$ y = [-619644, -1083061, -583079, 622174, 723876, -373731, 206138, -343968, 154113, 259801, 79401, -123636, -182101, -61201, -274564, 621238, 723907, 551087, 763766, 174837, -1044331, -779916, -613619, -102011, 307682, 866061, -1301323, -352822, 570514, 1028862, 1683063, 1253494, 99095, 1041089, -588149, -629409, -1902916, -243330, -569926, -549348, -1510094, -1771329, -2239929, -1368688, -1432742, -2501183, -2117773, -674086, -562557, 1110, 124295, -154759, -247947, -1490644, -935534, -863088, 151518, 152926, 694605, 117040, 1028078, 1529877, -1151766, -293241, -494506, -832920, -876300, -1360556, -688771, -1295991, -665173, 1736214, 1438164, 823673, 786674, 562124, 1661277]
12061A661277K61191l42862j120622J3547l52700P58904j913136n317L196580
12052B156862k315334L62673J707444N44331k241969j471035K053392n64765m30239
12043a98640L04898L0263j49042k77107k134690J119839p14593K922098m22318
12034D80708j540810K36963o81922R45415N79951J495657r36169k27162L31826
12025F84457m09166N2396l04476j378954J57417O75267O22267j90040M59690R63712
12015A332570N91500n01989j826306N85077J88665j585924j122376J151190J697938
12006E10345O67925j129322o93228p98770L36770O32483J141600j785530P10948
11997d06779K827755j432068r53625Q80158m85986k20361l41083j130336L31842
$$ y = [1661277, 1922468, 1579606, 458984, 472531, 119831, 878735, -1034401, -1039718, 2156862, -158472, 204201, 1911645, 2455976, 214007, -1257028, 796364, 231599, -198640, 106258, 136521, -12521, -289628, -2424318, -1304479, -2019072, 903026, 480708, -1060102, -823139, -1505061, -559646, 20305, 1515962, 579793, 352631, 684457, 275291, 327687, 23211, -1355743, -1198326, -523059, 99208, -90832, 368858, 1332570, 1924070, 1422081, -404225, 180852, 369517, -1216407, -2338783, -1187593, 510345, 1178270, 48948, -644280, -1443050, -1106280, -473797, 667803, -1117727, -406779, 2420976, 988908, 35283, 915441, 429455, 209094, -131989, -1262325, -930483]
11988i30483R24094j224754N09309M11684K39752r29204p87027K15995J414607
11979a56027n61368j392387o71995K375410O0042L89673q32847J201099o63849
11970b52249K80637L51781j908677Q73716j315362N90321l69143o86103j59435
11961b594514K155327J722719N81546l110040q9720J566391P89503P68343P1779
11952A861334N45496K1535k107192M29958M3584l47339j296133k50258J902604
11943H03589M79224o02374p49534j178940k55037j40411J730036j88782L41847
11934B39618n54982J408291k04177k48664J626738j30940j376770p1106o6882
11925F21126N0324Q77168j96931R03204j962512j373686J51465J174141j69478
$$ y = [-930483, -6389, -1231143, -721834, -310150, -70398, -999602, -1786629, -1570634, -156027, -717395, -2109782, -2781777, -406367, -346325, 43348, -789499, 411600, -252249, 28388, 380169, -1528508, -654792, -1970154, -1379833, -1748976, -2435079, -2594514, -439187, 1283532, 1865078, -1244962, -1334682, 231709, 1021212, 1789555, 1861334, 2406830, 2428365, 321173, 751131, 794715, 447376, -848757, -1099015, 803589, 1282813, 680439, -69095, -1248035, -1503072, -1643483, 86553, -102229, 239618, -315364, 1092927, 888750, 640086, 2266824, 2135884, 759114, 688008, 621126, 671450, 1548618, 1351687, 2254891, 292379, -1081307, -929842, 244299, 74821]
11916G4821j730809J306831J195742J30832m43835p44791L12564J111697j576924
11907c63872P87019K63403J022701j173781p08299J437094J011680M48403m016414
11898a292066l73290P48298q70032k66724L724166k34393j217472n1583j258283
11889a091379n86362J659687n71016N60847j581549m959J159753j308927O31228
11880a132677R03419R5940j074286p04916j845339K8152J789013N72284N14638
11871h53772N26304m29778J352804m1869j822016J39245O59798j027384O31938
11862h64730L69025j28120M53000P24761j04688J114080J405015k248731j299359
11853e79747K343691J33969m11723k05631K85223n41495K47597N25482k53814
$$ y = [74821, -1655988, -349157, 846585, 977417, 533582, -211209, 101355, 1213052, -363872, 423147, 686550, 1709251, 535470, -172829, 1264265, 2275945, 2724348, -1292066, -1665356, -917058, -1787090, -2053814, 1670352, 1435959, 218487, 166904, -1091379, -1677741, -18054, -589070, -28223, -1609772, -1614731, -454978, -1763905, -1132677, -229258, -133318, -1207604, -1912520, -3757859, -3729707, -1940694, -1368410, -853772, -327468, -757246, 595558, 553689, -1268327, -1129082, -469284, -1496668, -864730, -495705, -623825, -170825, 553936, 449248, 1563328, 2968343, 719612, -579747, 1763944, 1897913, 1486190, 1280559, 1565782, 1024287, 1271884, 1797366, 1543552]
11844A543552n89021o64712j186586M76223J025794j541254N84434k00830O90195
11835A37795R74758j200080k38605L71923l18126o59848N15424M39346Q52817
11826H75404r8661j654134k26158L83448J521265r06126r56028J938693p86532
11817I1171r73469J297922k20458j75138j383147R32027j438095O24804P20402
11808e23981K014798j57025q12607j740892n42876K182160k56116p80531Q05499
11799A88429p68845n71035P76740J191133p76681j018844J114665N2127L26374
11790E14063k995210k8791J574046O02680K66494J4505O24101L80567k93566r34058
11780b75169k9143R60458O4945k78085l95007j205855l97572J976596L42653o4064
$$ y = [1543552, 954531, 289819, -896767, -420544, 605250, -936004, -351570, -552400, 137795, 1112553, -87527, -326132, 45791, -272335, -932183, -416759, 22587, 875404, 776743, -877391, -1103549, -720101, 801164, -104962, -1060990, 877703, 91171, -882298, 415624, 195166, 20028, -1363119, -431092, -1869187, -1244383, -523981, 1490817, 1333792, 521185, -1219707, -1762583, 419577, 163461, -617070, 188429, -580416, -1151451, -374711, 816422, 39741, -979103, 135562, 187689, 514063, -2481147, -2509938, -935892, -333212, -66718, -52213, 571888, 952455, 658889, -275169, -304312, 656146, 721091, 443006, 47999, -1157856, -1555428, 421168, 763821, 699757]
11770F99757r22135Q78965m6695M14795k26109m86436k23071j129596J880J943699
11760I05054J92961j341770M15955L03844J077353k082633j46122J122809Q08153
11751A255604p13951j186558J144488q75865j967201K38185r8496J191266O75577
11742c36951k178331J205580R02599J296971M21789k359810m65784J032629L59758
11733a21550o5388n84315P84084K59576o8862L22607n74257Q19352N65842Q11283
11723B148372j246823j736882P73085j91670n74470n21569j77998r30869J495368
11714i63456N79498l13398n30809q07502J96602J008896K233170O2082j434141
11705C0942p69208K18201P46146P71746j167156j154306J159025k41903k00834
$$ y = [699757, -222378, 656587, 609892, 1024687, 798578, 312142, 89071, -1040525, -1038645, 905054, 1098015, -243755, 172200, 476044, 1553397, -529236, -675358, 447451, 1255604, 541653, -644905, 499583, -376282, -2343483, -2105298, -2203794, -1012528, -336951, -2515282, -1309702, -407103, 889868, 1311657, -1048153, -1513937, -481308, -121550, -186938, -771253, 12831, 272407, 203545, 526152, -48105, 771247, 1337089, 2148372, 901549, -835333, -62248, -253918, -828388, -1349957, -1527955, -2458824, -963456, -383958, -697356, -1228165, -2035667, -1839065, -830169, 1403001, 1465083, 30942, -738266, -520065, 226081, 997827, -169329, -1323635, -164610, -406513, -607347]
11696f07347N97088J91788J98828R99445o58437k08411J33271j012345J69505
11687a96615Q00530J338435p03948J9765l83520r80943q92612m77554N7316O53777
11677g65369N48638J024147m48486m49578N09209n06859J274040K84781r83268
11668D87255j760076l26667J056237j121559Q06880J51772q36496l20655p03647
11659b566956J758923n69414Q16003m90883L08354m15783J40243q78036J10441
11650a787108L236235l07411m15785J89471j21702p42766K423992j107612j078363
11641B88951R27679J87278p22071j031470l13131n94674l87291O68766l32376
11632a308339J84996J502220K41913K77749n72860j0557l46605r69555P19064
$$ y = [-607347, -10259, 181529, 380357, 1379802, 721365, 512954, 646225, -366120, -196615, 603915, 1942350, 1238402, 1258167, 874647, -106296, -998908, -1476462, -1419146, -765369, -216731, 807416, 358930, -90648, 418561, -88298, 1185742, 1470523, 487255, -1272821, -1599488, -543251, -1664810, -857930, -706158, -1542654, -1863309, -2566956, -808033, -1377447, -561444, -1052327, -743973, -1159756, -1019513, -1897549, -1787108, 1449127, 1141716, 725931, 915402, 793700, 50934, 2474926, 1367314, 288951, 1216630, 1403908, 681837, -349633, -662764, -1257438, -1644729, -975963, -1308339, -1123343, 378877, 620790, 898539, 325679, 315122, -31483, -1001038, -281974]
11623b81974l59459J426319j59588k318183R18499J853120J90559j537589R01054
11614F32758J102536K25096j465415N0130k95765q57268J650142k03473j437529
11605e98788L24225J794565j532456j759581K51485K807785q12666k21880m47100
11596a94411j020802R92306Q84513p14120J78983J899944k30317r20109j120441
11587b44454Q99826j439167k214604M24250J296931J505541q41119K52525P58774
11578C98503j392545P97524p32208J789695J120355j234942K54928l69358J190641
11569A822593p80804j539900k098704J700067n10527K446009N71754j391784j245611
11560a026907o60476J165170K09742l90753L90709M16421j875765j272768R59534
$$ y = [-281974, -641433, 784886, 625298, -1692885, -774386, 1078734, 1269293, -268296, 632758, 1735294, 1960390, 494975, 545105, 249340, -607928, 1042214, 838741, -598788, -274563, 1520002, -12454, -1772035, -1520550, 1287235, 474569, 252689, -194411, -1215213, -222907, 661606, -52514, 126469, 2026413, 1796096, 875987, -244454, 655372, -783795, -2998399, -2574149, -1277218, 228323, -612796, -360271, 398503, -994042, -196518, -928726, 860969, 1981324, 746382, 1001310, 631952, 1822593, 1041789, -498111, -2596815, -896748, -1407275, 1038734, 1610488, 218704, -1026907, -1687383, -522213, -312471, -703224, -312515, 103906, -1771859, -3044627, -2085093]
11551b085093O43716J81823J224982j92002J213662j12066N53541j148496O22301
11542I02368M44843k38862j180470p65474L85482L29085j853067K299937M49715
11533G73557j272705k78684N02835J419267q42528k95550J238925j098461J418497
11524A565153P04639j408838j152193J45739J662567q69068N3078j807371k60648
11515a366942J712972L76270m83228p84577k32655Q5796M82804o71127K67630
11506f13057J011025L48020n00245j41033o06610J877433j42125k016842J523762
11497G40328Q24358q51620r97571l31071K05212L66339J35279k56005N45096p42444
11487c62099r1450Q96812j307577K13867R47510j06407j93664N84150r32786q06077
$$ y = [-2085093, -1441377, -1259554, -34572, -226574, 987088, 875022, 1428563, 280067, 902368, 1347211, 1108349, -72121, -837595, -452113, -123028, -1976095, 323842, 773557, -499148, -777832, -274997, 1144270, 301742, 6192, 1245117, 146656, 1565153, 2269792, 860954, -291239, -145500, 1517067, 647999, 701077, -1106294, -1366942, 346030, 722300, 239072, -545505, -778160, -692364, -209560, -880687, -613057, 397968, 745988, 245743, 104710, -501900, 1375533, 1233408, -783434, 740328, 1564686, 713066, -284505, -615576, -410364, -44025, 91254, -164751, 380345, -362099, -453549, 443263, -864314, -650447, 297063, 190656, -3008, 581142, -351644, -1157721]
11477a157721J065652J439077M05920m36391j508278j986382J97053J022307o6205
11468a024968J67699n77107P75135o24404n54423J359588J681201O0848j067334
11459A96235j554448K90754Q41145R41836n02970Q1911J041603M43115j471390
11450C07791n6216Q90362k33150m030K25675j68175p24575j4175J087000o00506
11440G10001q84630L48509o60247J239471p27239o79012o77058J06848K389211
11431A165854N91740J007251p88101J464336o89070k302064J80219K94574q12796
11422A11943p40682K7800j7094J544257O11196k951488k89968M65894n07708P49915
11412i95935P00723J576788j481214R13344J184767j260245j83850k7850r73088
$$ y = [-1157721, -92069, 1347008, 1752928, 1316537, -191741, -2178123, -1981070, -958763, -1024968, -857269, -1434376, -659241, -1283645, -1838068, -478480, 1202721, 1263569, 196235, -1358213, -1067459, -226314, 715522, 212552, 294463, 1336066, 1779181, 307791, 251575, 1141937, 908787, 904757, 1130432, 962257, 237682, 223507, 1310507, 710001, -174629, 173880, -486367, 753104, 25865, -653147, -1330205, -1223357, 1165854, 1757594, 2764845, 1976744, 3441080, 2752010, 449946, 630165, 924739, 111943, -628739, -600939, -618033, 926224, 1537420, -1414068, -1704036, -1238142, -1745850, -995935, -295212, 1281576, -199638, 713706, 1898473, 638228, 454378, 426528, -546560]
11403e46560J55253N82603L03577K19975j177164k24920K75988J014697j314739
11394g11290p9871L87176M80903R18389P9876j577293m47109J015792j203371
11385a136798J044301l06862M1435M56522Q90358K7549J60262m55863j89352j736806
11375a205254L18005J145842O72633M27909p72152k26577M0051J71524N93017
11366A164998j734985L69653J111933n50636O35182l43843q23528M45528M07955
11357F82257L11802K70509j67595p75143R78134p14773Q35960k17940p10587j157290
11347f64666j411182N80589L41428N64256O86489Q2348j311594R7220k84789O03865
11337g16036n86627j21706o71540N5897o55460j535197K158847L28625O86982
$$ y = [-546560, -391307, 191296, 494873, 714848, -462316, -687236, -411248, 603449, -711290, -791161, -403985, 76918, 995307, 1075183, -502110, -949219, 66573, -1136798, -92497, -399359, -357924, 98598, 988956, 1016505, 1176767, 720904, 531552, -1205254, -887249, 258593, 931226, 1359135, 586983, 360406, 400457, 571981, 1164998, -569987, -200334, 911599, 360963, 996145, 652302, -171226, 274302, 682257, 994059, 1264568, 1096973, 321830, 1299964, 585191, 1421151, 1203211, 492624, -664666, -2075848, -1495259, -1153831, -589575, 96914, 179262, -1132332, -1035112, -1319901, -716036, -1302663, -1424369, -2095909, -2040012, -2695472, -4230669, -2071822, -1743197, -1056215]
11328a056215q3614R40058J696429o90883N3171p97414j060811L4129J879040
11319I13890m73590l13516j196661J145275k570420Q98213J861899K04936J220179
11310A690205j153337R95327L17523k114368j104082R41777k04898O50818j216610
11301a197645N65886l50842N21852j244742p10947J919223k94496q43108R903
11292a624916J751307n03043n1714Q20480J003049j397755o34875j96880p60849
11283a595196J264475q95625q40957P94120k43184Q97432n24406R11725J23782
11274a07834j51782J854357j6075n34669j168716n26091J589842o51963j507361
11265a220292l39847K233520Q4342j021255l15389J261989J026388j635269q82842
$$ y = [-1056215, -1139829, -199771, 1496658, 805775, 858946, 61532, -999279, -965150, 913890, 440300, 126784, -1069877, 75398, -2495022, -1596809, 265090, 470026, 1690205, 536868, 1532195, 1849718, -264650, -1368732, -426955, -631853, 18965, -1197645, -631759, -982601, -460749, -1705491, -2416438, -497215, -791711, -1634819, -1624916, 126391, -376652, -428366, 392114, 1395163, -2592, -637467, -834347, -1595196, -330721, -1226346, -2067303, -1273183, -1516367, -618935, -1143341, -231616, -107834, -259616, 1594741, 1578666, 1043997, -124719, -650810, 939032, 287069, -1220292, -1560139, 673381, 757723, -263532, -578921, 683068, 1709456, 74187, -808655]
11256h08655J078657J404350p01371k048497M3351K71434j39788O19187K029238
11247A747906l03338j323017O16531J16153o37942O56446p6694N20230L94435
11238A710710j718579m13346J181538Q990j406496j134378J507393P86726j536827
11229a014269J149569j251061J14194J636405J76701k44964J145041n21172K47916
11220A438360m9328j088389j236673R49919j75502J515420j501308j356995M56844
11211a047652R67269J47495n27293M53030N6989J879724m03233r16236n88976
11202B1117n18177L64761N60152j779675J028426L0040p30539q20002L91469L10326
11192a142102J424701O42680m18637J315648j252303J568747n28881l19812n72078
$$ y = [-808655, 270002, 1674352, 972981, -1075516, -1032165, -760731, -900519, -281332, 1747906, 1444568, 121551, 738082, 854235, 216293, 872739, 796045, 1316275, 1710710, -7869, -421215, 760323, 769313, -637183, -1771561, -264168, 522558, -1014269, 135300, -1115761, -1001567, 634838, 811539, 566575, 1711616, 1190444, 1438360, 1389032, 300643, -936030, 13889, -161613, 1353807, -147501, -1504496, -1047652, -80383, 67112, -460181, -7151, 49838, 1929562, 1526329, 610093, 21117, -497060, -132299, 427853, -1351822, -323396, -293356, -1023895, -1843897, -1452428, -1142102, 282599, 925279, 506642, 1822290, 569987, 2138734, 1609853, 1290041, 717963]
11183G17963n51452p3246l34351j601694R15014J726692J806802L0132k395200
11174B40660q0954O23630q2667K01133p65244k16251p62988r98802J334633k23120
11164g29970j319642p72383J083204J914733M5454k9694J828306j631458j298719
11155i10169j81051M63409J052246O47584K29524j326621q80751k3145q47199
11146a776173J23997L19829r42267J694624J656023m16364q14573k059544O98798
11137a515650J565150n12071L91647N33047m05112n60114J606501J87173j909027
11128f18456l27798L81362j544855Q31841Q76463J211753o18221Q17549J39425
11119A149063k787693J07988M66440R82562j086672J476089J197595p15016k0918
$$ y = [717963, 166511, 93265, -241086, -1842780, -927766, 798926, 2605728, 2635860, 240660, 159706, 783336, 700669, 901802, 136558, -79693, -842681, -1841483, -506850, -729970, -2049612, -2821995, -1738791, 175942, 221396, 191702, 2020008, 388550, -910169, -1091220, -627811, 424435, 1072019, 1301543, -25078, -905829, -928974, -1776173, -1652176, -1332347, -2274614, -579990, 1076033, 659669, -154904, -2214448, -1515650, 49500, -462571, -70924, 462123, 57011, -503103, 1103398, 1290571, -618456, -946254, -564892, -2109747, -1277906, -401443, 810310, 192089, 1009638, 1149063, -1638630, -1530642, -1064202, -81640, -1168312, 307777, 1505372, 790356, 769438]
11110G69438J002498o40708j476592o55257K096407K04555r41584L47848J338650
11101B045255m92775r17306r01147n63374j184367J464738J149897J290395J036972
11092B928288k26073p36944q65675r04437k98548j64748M31592n04675O4810J716362
11082A439952J077520J04722o54324j272348j085059O80378m91052K143047J70854
11073B113690k299246k05446j87368Q80255l17783r48171j000068j155308J285530
11064a833915J210561n21532N27378P26657Q02450r69054q43729o57496N1001
11055a507679J012957j213391J092434P86504O4088M8440j883438O35422J189009
11046B24346j690125L60284M76310n80618k14196L69843o10974J566113r85372
$$ y = [769438, 1771936, 1131228, -345364, -1000621, 1095786, 1300341, 358757, 706605, 2045255, 1552480, 635174, -265973, -829347, -2013714, -548976, 600921, 1891316, 2928288, 2702215, 1965271, 1099596, 195159, -103389, -268137, 163455, -341220, -276410, 1439952, 2517472, 2622194, 1967870, 695522, -389537, 290841, -200211, 1942836, 2113690, -185556, -391002, -578370, 301885, -15898, -964069, -1964137, -3119445, -1833915, -623354, -1144886, -617508, 109149, 911599, -57455, -901184, -1558680, -1507679, -494722, -1708113, -615679, 170825, 234913, 283353, -1600085, -964663, 224346, -1465779, -1105495, -629185, -1209803, -1423999, -1054156, -1665130, -99017, -1084389]
11037a084389j218191K018935R56084q15480J393764k38287q63714q10925J615869
11028I53666p4540j846346P42346k46706J213824n72701Q38626J424935j663495
11019G69609m39084Q95730K51032j782217j101395J294536J026021r93977J06205
11010B6460K5413j625540N931N07978K97218J01949N08663j177898J271593K55419
11000A97186P22974O27300j673703P80909j050797J10307r70688K72420P86837
10991a97255r5987K57449j766779M99461J082050L59415J136233j175947J220597
10982A319237m04028J90897K61605L71569p77437J20509j298844j805788Q5073
10973a937207j9162K075543J67033o79640O50485J457175k96011j618385j275968
$$ y = [-1084389, -2302580, -283645, 672439, -143041, 1250723, 1012436, 148722, -662203, 953666, 879126, -967220, -224874, -471580, 742244, 169543, 1008169, 2433104, 769609, 330525, 1226255, 1477287, -304930, -1406325, -111789, 914232, -79745, 26460, 51873, -1573667, -1567736, -1059758, -762540, -660591, -151928, -1329826, -58233, 197186, 920160, 1547460, -126243, 654666, -396131, -285824, -1256512, -984092, -197255, -293242, -35793, -1802572, -1303111, -221061, 138354, 1274587, 98640, 1319237, 915209, 1106106, 1367711, 1739280, 961843, 1082352, -216492, -2022280, -1937207, -1956369, 119174, 286207, -393433, 257052, 1714227, 1418216, -200169, -1476137]
10964a476137J238102R99806q63814p55697l52428L72668J787169m01296j587524
10955a039151k73903J949356k41463P396j1526n68583P8130l9987r0130k004489
10945b234350J103764R14872j910368J701389J400020j833509j26847k25460l56727
10936a567216P52895P95516m2785k38041J339883j411197l65628J166759m00113
10927C0073o81307L04644J132467M67184m2944q81386j706166R9915M1677m44906
10917a680749O51081l15105j95192N69106m64920P61765N97334J83548k36334
10908a29466l10555R76237J089728m01226j804605n72876O46953J207863P77729
10899A479782p03838L16821l37017l86778j147058M33192p72228O58167J121563
$$ y = [-1476137, -238035, 761771, -102043, -857740, -1210168, -837500, 949669, 548373, -1039151, -1313054, 636302, 394839, 402235, 390709, -177874, -99744, -139731, -229861, -2234350, -1130586, -215714, -2126082, -424693, 975327, -858182, -985029, -1210489, -1567216, -814321, -18805, -61590, -299631, 1040252, -370945, -736573, 430186, 30073, -651234, -346590, 785877, 1253061, 1210117, 328731, -1377435, -1277520, -1235843, -1680749, -1029668, -1344773, -1539965, -970859, -1435779, -674014, -76680, 106868, -129466, -440021, 536216, 1625944, 1224718, -579887, -1152763, -505810, 702053, 1479782, 775944, 1092765, 755748, 368970, -778088, -344896, -1117124, -458957, 662606]
10890F62606l87554M57488l23353j055067p35765j15053J599133O98650q55036
10881e3951o14278n14601N78013L10909m11875o54927o42939J012761M38778J40691
10871d11419K536371l89950j56214j563889o78052J92648n55102N44480Q307k96443
10861g69263K378151j526972p22898n10242m28810P66918K16584J210390O12971
10852A226829j080206j484065j9236O7358J427617n43792q25512K95975J971259
10843A036227j51665O16714J86313N9325q31063o77481J036240M94468j367182
10834D01896j379433M07275J664599j253690k058654Q18251J61069J056265J459462
10825A277040q93629K39296J212871j156598P7703j260862l99694j91365n5250
$$ y = [662606, 275052, 732540, 409187, -645880, -1381645, -1496698, 102435, 801085, -53951, -668229, -1182830, -604817, -293908, -705783, -1360710, -2003649, -990888, -552110, -411419, 2124952, 1735002, 1578788, 14899, -663153, -470505, -1025607, -481127, -472820, -769263, 1608888, 81916, -640982, -1151224, -1580034, -813116, -596532, 613858, 1226829, 146623, -1337442, -1356678, -1289320, 138297, -405495, -1231007, -935032, 1036227, 884562, 1501276, 1687589, 1746914, 915851, 238370, 1274610, 1769078, 401896, -977537, -570262, 1094337, -159353, -2218007, -1399756, -1238687, -182422, 1277040, 383411, 622707, 1835578, 678980, 756683, -504179, -903873, -1095238, -1150488]
10816a150488J460961j01656o74364Q57788k86672J07906K34392m41201M35055
10807D41721M54840N76559r38445n34753m45145M68522J340067j433413K47058
10798A77011J178715j99691J95204k661635K13198J196921l51596j510L86756
10789A33373j924041j110969N42092J074270l64252L65290K543535k071104O69573
10780a42233J091802n17182j857708N00335O28843R69770J50494j407505o57094
10771a240478J855697J30673q8296J261381m99053j451674J67589k41158J88907
10762H3588j088349J062737J329688M14500q3605j148762r96482M96015R76650
10753A045980j826543j047139O1639K528029m57179p25923p37570q86492K88880
$$ y = [-1150488, 310473, 208817, -465547, 392241, 105569, 213475, 447867, 6666, 441721, 896561, 1473120, 534675, -78, -445223, 23299, 1363366, -70047, 177011, 1355726, 1156035, 1351239, -1310396, -1097198, 99723, -251873, -253383, 133373, -1790668, -2901637, -2359545, -1285275, -1649527, -1284237, 1259298, -811806, -142233, 949569, 432387, -1425321, -924986, -296143, 673627, 824121, -583384, -1240478, 615219, 745892, 657596, 1918977, 1419924, -31750, 135839, -105319, 83588, -1004761, 57976, 1387664, 1802164, 1718559, 569797, -426685, 69330, 1045980, -780563, -1827702, -1766063, 761966, 304787, -421136, -1158706, -2045198, -1756318]
10744a756318M36072J990899K012624l376974k073276K51310J896229R48769k417031
10735b087696J284777M89643N62297N9762M5367p59585J213280o80288j3674J106640
10725A220523k172993J200864N07641K58891j253110N37660L40239n1934L51691
10716I39472p51130j547978O12963K153838j802044J152780m92009l37219J099985
10707A028658p12679O22641k10355J44514l43969J216918j123303j79178j334732
10698h91485L68703Q97631n93182L14589R9481m59283p57694Q74430m72581m70842
10688a090233N95864j086070J91091J099479M91606Q00030O98243k446375m56613
10679a202978K70266O17450P23447N60356M23608n22622o86923O31237K31682
$$ y = [-1756318, -1320246, 670653, 2683277, -693697, -2766973, -2515663, -619434, 329335, -2087696, -802919, -313276, 249021, 308783, 354150, -405435, 807845, 127557, 113883, 1220523, -952470, 248394, 756035, 1014926, -238184, 299476, 639715, 587781, 939472, 188342, -1359636, -746673, 1407165, -394879, 757901, 265892, -71327, 1028658, 315979, 938620, 728265, 872779, 528810, 1745728, 622425, 443247, -891485, -522782, 374849, -218333, 96256, 195737, -263546, -1021240, -146810, -619391, -1090233, -494369, -1580439, -1389348, -289869, 201737, 1001767, 1700010, -746365, -1202978, -932712, -315262, 408185, 968541, 1392149, 869527, 182604, 813841, 1045523]
10670A045523j693250l97852J2143L52482K133154j678684r27436J580802K17239
10661F44121J205392j501669o15991M82092J64284N43813o96842r94433J088257
10652C19024j8843J203907m82688j235177p4823L01837L95222M27349j544792
10643g08984J675403K86022O89231j290176k333404J340233O32986J584299j305611
10634E69999J72980N6957J78106r73278j488280N82261Q82931J892625j559767
10625C14534k55240L46303j911724j020893J950605K324822r25451r76590j56910
10616c10544n40547Q15147Q85437l29852K14848n4846j311196Q52953O25497N56573
10606A403470P26780N26569p43673K07838p45592q83286K59195N66239m61261
$$ y = [1045523, -647727, -1045579, -1033436, -680954, 1452200, -226484, -1153920, 426882, 644121, 1849513, 347844, -268147, 213945, 378229, 922042, 225200, -769233, 319024, 300181, 1504088, 1021400, -213777, -288600, 13237, 408459, 835808, -708984, 966419, 1252441, 1941672, 651496, -1681908, -341675, 291311, 1875610, 569999, 742979, 799936, 978042, 4764, -1483516, -901255, -18324, 1874301, 314534, 59294, 405597, -1506127, -2527020, -576415, 1748407, 822956, -153634, -310544, -851091, -35944, 849493, 519641, 734489, 679643, -631553, 221400, 846897, 1403470, 2130250, 2656819, 1913146, 2120984, 1375392, 492106, 751301, 1317540, 856279]
10597H56279j784311R14904n48340K36923k72651J746208q21742J89642Q34414
10588A351326j037650k29186k07015J370561j38075j974279m81040L46272O39481
10579c59605l71419j25591j159086J211420j375298J255214J561515O071J497097
10570B140318r20942k385739j172701J492055J418758K06353j969919p2810J042261
10561b22366P50235q7640j82007N07356J027910l53819j38744k17815j319054
10552b35944N85070J147413j448883J06623j457206j15259Q64089J395525q69987
10543b8559m77035k87360J022032k00793r64223N14024J295318N46492k61838
10534A158058m52408k00747k21839K28910k141985O01142J514944j190827P67553
$$ y = [856279, -928032, -13128, -561468, -324545, -597196, 1149012, 327270, 516912, 1351326, 313676, 84490, -122525, 1248036, 1109961, -864318, -1345358, -999086, -359605, -731024, -856615, -2015701, -804281, -2179579, -924365, 637150, 643221, 2140318, 1219376, -1166363, -2339064, -847009, 571749, 778102, -1191817, -1264627, -222366, 527869, 440229, 258222, 765578, 1793488, 1439669, 1300925, 1083110, -235944, 349126, 1496539, 47656, 154279, -1302927, -1418186, -554097, 841428, -28559, -505594, -792954, 229078, 28285, -935938, -421914, 873404, 1419896, 1158058, 705650, 504903, 283064, 511974, -1630011, -1028869, 486075, -704752, 62801]
10525F2801p14752O05096K85134m29715J728424j731414k18775k09560m27980
10516a050741R54574j23660L71773r02505R0976J28230R02589l90805O7238m65033
10506d17364k02456J108511q24907L77033l26982j070762Q37529N87038K068286
10497B135926j216706q02619k55849Q84388J51258L33908J205783r91143l95540
10488A049406J24633K74689j49979J0683l36051l67121J989083j475852l01606
10479H17885m76312o35145M85889k24715l76648Q63774q23713N29660N53393P58454
10469A472522J34630k116175J085683J334251j00453R49034j356364r55126j321300
10460h73298M59469J431955m47074J652144j61965M18238j341678p82661l18232
$$ y = [62801, -651951, -46855, 238279, -191436, 1536988, -194426, -413201, -622761, -1050741, -96167, -219827, 151946, -750559, -659583, -531353, 371236, -19569, 47669, -417364, -619820, 488691, -336216, 40817, -286165, -1356927, -519398, 67640, 2135926, 919220, 116601, -139248, 745140, 896398, 1230306, 2436089, 1444946, 1049406, 1174039, 1448728, 1298749, 1309432, 973381, 606260, 2595343, 1119491, 817885, 341573, -293572, 192317, -32398, -409046, 454728, -368985, 160675, 714068, 1472522, 1607152, -509023, 576660, 1910911, 1810458, 2759492, 1403128, 448002, -873298, -413829, 1018126, 571052, 2223196, 2061231, 2479469, 1137791, 355130, 36898]
10451C6898J645998m66233Q93201R26100O60968j230114k346962K94217P59433
10442A173506o79461J394572M40788j685252M48736j608929M28688o5715M68498
10433C15431Q44351j5426K74549q42943q72143M43978O38181j58628r19519L42715
10423E0546M44861J407358M78586j488647n7568o46879k80016L51763k37225o44139
10413f21360J321949m58918n24064K40067o99738J461427p71192J75133J151886
10404A275190p49620K35941J086079o48318p40383O30589j187920J284966J74010
10395A360534m38757P36803l81395j070746R60886j36434j290837j103547K88670
10386a074823J546463K87684m27030n65817N35026p30590M38362N05640j62237
$$ y = [36898, 1682896, 1216663, 2109864, 3035964, 3696932, 2466818, 119856, 414073, 1173506, 494045, 1888617, 2329405, 644153, 1092889, -516040, -87352, -153067, 315431, 1159782, 1144356, 1418905, 575962, -296181, 147797, 785978, 627350, -292169, 50546, 495407, 1902765, 2381351, 892704, 835136, 188257, -91759, 260004, 22779, -621360, 700589, 241671, -282393, -42326, -742064, 719363, -51829, 123304, 1275190, 525570, 761511, 1847590, 1199272, 458889, 1089478, -98442, 1186524, 1360534, 921777, 1658580, 1277185, 206439, 1167325, 1030891, -259946, -1363493, -1074823, 471640, 759324, 332294, -233523, 301503, -429087, 9275, 514915, 352678]
10377C52678k332848P4406K200655L72421j766356l78739j063487m40071J874465
10368a106876n4227J855857K50428O78773j623996N93232Q37031m06559r20475
10359A03188O03754l25706J32356J491984j107540J168250q01478k39643o42562
10350C82603j27763J502242l27682J895320j028951l26710K085485n88558j363136
10341B102850o87579J117565j386334O53457J006479J124054r04093j166621j309488
10332E50290o86485J914024k37018j711914K65517L09056L00572O3131J560995
10323B328168p43312j12926l61938j819058R44359K31701m23236k47115J193247
10314I89890L46129q15143J255176k72487k58320o62481k49314R1220j099613
$$ y = [352678, -1980170, -1905764, 294891, 667312, -1099044, -1477783, -2541270, -2981341, -1106876, -1161103, 694754, 945182, 1623955, -41, 593191, 1430222, 1023663, 103188, 706942, 381236, 513592, 2005576, 898036, 2066286, 1264808, 1025165, 382603, 254840, 1757082, 1429400, 3324720, 2295769, 1969059, 4054544, 3465986, 2102850, 1415271, 2532836, 1146502, 1799959, 2806438, 3930492, 3026399, 1859778, 550290, -136195, 1777829, 1540811, -171103, 94414, 403470, 704042, 767173, 2328168, 1584856, 1471930, 1109992, -709066, 235293, 466994, 43758, -203357, 989890, 1336019, 520876, 1776052, 1503565, 1245245, 582764, 333450, 424670, -674943]
10305f74943K675010K050698j69935l22841k55302J09888J06069J121490P25263
10296E365397Q9395L9306J214321J77374p10452R1606M22736N39177q84874j596481
10286D747505o77833J18642k77889m0376O24045L75911o20996m2914j885216l15508
10276B005371J245748J20078J051475j059046j798050J406177J38568j242164
10268A868157L15877K376518j481107k85104J54454j903090L93840R48537o23522
10259A764560J202954J154068l46991K706017p63128k121792j01416J515188m14626
10250D594834j763377k17203r57509J08871P31393N79114J50396L06586K41797
10241C774902P98153r23835r61747n97420Q64638M65963j305305J112791K627484
$$ y = [-674943, 2000067, 4050765, 3880830, 3557989, 3302687, 3412575, 3518644, 4640134, 5365397, 5454792, 5494098, 6708419, 6885793, 6175341, 6266947, 6689683, 7228860, 6343986, 4747505, 4069672, 4188314, 3910425, 3870049, 4494094, 4870005, 4249009, 4206095, 2320879, 2005371, 3251119, 3371197, 4422672, 3363626, 1565576, 2971753, 3110321, 1868157, 2184034, 4560552, 3079445, 2794341, 2948795, 1045705, 1439545, 2388082, 1764560, 2967514, 4121582, 3774591, 6480608, 5717480, 3595688, 3494272, 5009460, 4594834, 2831457, 2614254, 1656745, 1765616, 2497009, 3076123, 3226519, 3533105, 3774902, 4573055, 3649220, 2687473, 2090053, 2954691, 3420654, 2115349, 3228140, 5855624]
10232E855624p98620k67543o15626o361j447p54453J15413J211066J24405J33046
10222D995504M02292r99974J047074P97843q37032R41735o91647K540159K146722
10213A0342676L22158J475086R72786l44791O21693j083226O69545o48332j338059
10204A0989536L033554M61006n47511j985576K09768J20789k005532j819148j58109
10195H298777k407085n3487K47631m64069q36744K88106k541287n20247L26900
10186B338495N30076j08354K190539p09634k911667k94928j75437O19182j73200
10177A305072J493869j43621K39445p51581r22002J095707j51773j459544p6792
10168F28780J315562J11805k21378J738320K14647L83500j387858q96857r4073
$$ y = [5855624, 5057004, 4789461, 4173835, 4167474, 4166027, 3411574, 3526987, 4738053, 4862458, 4995504, 5397796, 4397822, 5444896, 6242739, 5405707, 6347442, 5655795, 8195954, 10342676, 10664834, 12139920, 13112706, 12767915, 13389608, 12306382, 12975927, 12327595, 10989536, 14023090, 14484096, 13936585, 11951009, 12160777, 12281566, 10276034, 8456886, 8298777, 5891692, 5838205, 6085836, 5621767, 4785023, 5073129, 2531842, 2011595, 2338495, 2868571, 2760217, 4950756, 4241122, 1329455, 1034527, 859090, 1478272, 1305072, 2798941, 2655320, 2894765, 2143184, 1221182, 2316889, 2165116, 705572, 628780, 1944342, 2056147, 1834769, 3573089, 3787736, 4171236, 2783378, 1886521, 1792448]
10159A792448J58215M23463o71661K214860o5352k71109k199426J754673Q81278
10150D017389J58178p68072L98757k61070j770453J068736L02079l81477m78244
10141B285823O68656m44924k08531j65917k025460l27959L61491J262800Q00059
10132B206038m57162J73485L097822n52460k186901j10536j62058M47901n41202
10123A914927J297020P27054N6860p7949q46936J261949J589994k640196q92954
10114B389769n51360j51023q4556O79482J65520r51891L434838J270924j441372
10105D760331o31692j297787J133144l65330l48916M32406J33723j544414m06647
10096A864818P98566Q45475O80133m39882j797091M07139P88438j450223J542190
$$ y = [1792448, 1950663, 2374126, 1702465, 3917325, 3851973, 3580864, 1381438, 3136111, 4017389, 4175567, 3407495, 3806252, 3545182, 1774729, 2843465, 3145544, 2764067, 2285823, 2954479, 2509555, 2301024, 2135107, 109647, -218312, 143179, 1405979, 2206038, 1748876, 1922361, 5020183, 4467723, 2280822, 2170286, 2008228, 2456129, 1914927, 3211947, 3939001, 3995861, 3917912, 3070976, 4332925, 5922919, 3282723, 2389769, 1838409, 1687386, 1602830, 2282312, 2447832, 1495941, 4930779, 6201703, 4760331, 4128639, 2830852, 3963996, 3598666, 3249750, 3682156, 3815879, 2271465, 1864818, 2663384, 3508859, 4188992, 3749110, 1952019, 2359158, 3147596, 1697373, 3239563]
10087C239563O89301n51615N57296m926O79901j450364j20623K06453M60645m80352
10077C225279J109756p95085M49574P14674o51275p02535j226921J213897J878535
10068E215899k743027o28922K692400j745164J64392J207308O76883R30338q86117
10059D883990j42116n87576j204292K241987n62159n78352N58314j369709n61126
10050B678961r4264Q04669J223565n44835J24745J443648l38858j057065k31878
10041D008688J18209J52891J128959P71329N3946j405817M87446m49997j96020
10032D669634o70215o38140J506124l63474j271826k57118P27967M39705J308385
10023E451042m39785p27936p67121O49342J456046n4393J299004k6367J6424Q51094
$$ y = [3239563, 3928864, 3377249, 3934545, 3929619, 4609520, 3159156, 3038533, 3244986, 3705631, 3225279, 4335035, 3539950, 3989524, 4704198, 4052923, 3350388, 2123467, 3337364, 5215899, 2472872, 1843950, 4536350, 2791186, 2955578, 4162886, 4839769, 5770107, 4883990, 4741874, 4154298, 2950006, 5191993, 4629834, 4051482, 4609796, 3240087, 2678961, 2584697, 3389366, 4612931, 4068096, 4192841, 5636489, 5297631, 4240566, 4008688, 4126897, 4279788, 5408747, 6180076, 6234022, 4828205, 5315651, 4865654, 4669634, 3999419, 3361279, 4867403, 4503929, 3232103, 2974985, 3702952, 4142657, 5451042, 5011257, 4283321, 3516200, 4165542, 5621588, 5567195, 6866199, 6839832, 6856256, 7707350]
10013G707350l60682J251419k95240j98381n79526j017641K214875p99871q57638
10004G064665o41195j061676L11756J660714R01331q98213k13416j060740k3026
9995F040200o66671q9062r72420L84137J154090Q9422o20933q10974J154362J096435
9985F758586J023367K08014j113039q67887J468746K93984k16219J512853k384509
9976F683896j61994J263626J653372p17510n52306j653913K276194J67147p17255
9967H241257K60388l91623M80088Q17494M31209J03191L86054j201486k29675
9958H896897N11816Q9982J398863k2106r86653K55192r16263J298117p84023j677919
9948H063903P97715J012747M56403p30406r94817J448938p09440J00239K094895
$$ y = [7707350, 7346668, 8598087, 8302847, 8104466, 7524940, 6507299, 8722174, 7922303, 7064665, 6423470, 5361794, 5673550, 7334264, 8235595, 7337382, 7123966, 6063226, 6040200, 5373529, 5284467, 4312047, 4696184, 5850274, 5939696, 5318763, 4507789, 5662151, 6758586, 7781953, 7989967, 6876928, 6009041, 7477787, 7771771, 7555552, 9068405, 6683896, 6521902, 7785528, 9438900, 8721390, 8169084, 6515171, 8791365, 8958512, 8241257, 8501645, 8110022, 8590110, 9407604, 9838813, 9942004, 10328058, 9126572, 8896897, 9408713, 9498695, 10897558, 10875452, 9888799, 10143991, 9227728, 10525845, 9741822, 8063903, 8861618, 9874365, 10330768, 9600362, 8605545, 10054483, 9345043, 9445282, 11540177]
9939A1540177L31542j61993j6033k72145n73283j02045J28317l27441q24940J697219
9929A1419375J673656j717381O00389J353122p72995n50527M3053R85291j008058
9920A2025925L18870J552444L10398k55953J205873m09980M49048O50723M02361
9911A6249709O21436Q1781K94950m87047J234848J77364Q5070N52743J123385
9902A9934239n60922K020253q38287R23514N03332j957471N76665J411100J57225
9893B2169648p48959R79404N03495J4419O58120J709292j87875R82238K686349
9884B8766131K58211Q89103J15479o80668N52049P95606j024300J027449N41827
9875C1240887m89277K19611R68308Q9142Q95754K903089L36296Q78817J957721
$$ y = [11540177, 11871719, 11709726, 11693693, 11421548, 10848265, 10746220, 10874537, 10547096, 9722156, 11419375, 13093031, 11375650, 11976039, 13329161, 12556166, 12005639, 12048692, 13033983, 12025925, 12344795, 13897239, 14207637, 13951684, 15157557, 14747577, 15196625, 15847348, 16249709, 16871145, 16952926, 17247876, 16760829, 17995677, 18173041, 18258111, 18810854, 19934239, 19373317, 21393570, 20555283, 21478797, 21982129, 20024658, 20601323, 22012423, 22169648, 21420689, 22400093, 22903588, 22918007, 23576127, 25285419, 25097544, 26079782, 28766131, 29024342, 29913445, 30028924, 29348256, 29900305, 30695911, 29671611, 30699060, 31240887, 30751610, 30971221, 31939529, 32028671, 32924425, 35827514, 36163810, 37042627, 39000348]
9866C9000348K006735J73953n77515o97973N50889J80912K66638K559427J036814
9857D4500228J509394M13823O96251J208969Q56674J318805j496213k57071K135354
9848E0886214O75079J739173J513456J177621J946197K103961K954939J113536
9840F4110176J253396k019334l87113K076240l31264J120895J473295J033514
9832F8329805J060455J119350K21162J945608J137264J647997J599652L298896
9824H0360189L015589J770550K995205J332493K377238K428180J722105K759451
9816I8761000M059669L589243K985871L980743L529385L117395M867554N192281
9808A30083141K678949N058510M790685M633649N377292O696011L756864M876469
$$ y = [39000348, 41007083, 41181036, 40603521, 39905548, 40456437, 40637349, 40903987, 43463414, 44500228, 46009622, 46423445, 47119696, 48328665, 49185339, 50504144, 49007931, 48750860, 50886214, 51561293, 53300466, 54813922, 55991543, 57937740, 60041701, 62996640, 64110176, 65363572, 63344238, 62957125, 65033365, 64702101, 65822996, 67296291, 68329805, 69390260, 70509610, 70730772, 72676380, 73813644, 75461641, 77061293, 80360189, 83375778, 85146328, 88141533, 89474026, 91851264, 94279444, 96001549, 98761000, 102820669, 106409912, 109395783, 113376526, 116905911, 120023306, 124890860, 130083141, 132762090, 137820600, 142611285, 147244934, 152622226, 159318237, 163075101, 167951570]
9800A67951570O215175L583653M678691O552803N798107K930810L051335L938844
9792B04700988L181745J427240L911362J93244o86307j757453l033803k020772
9784B05916244k411762m650507l891369n572133o177103n014540m282226o192266
9776A67724338o506561l342478n140757m137190m115259n874021o681767n146352
9768A26779953m688009o37970l603668m346668m380761m380872l994085n414476
9760I5333444q14473j562930k011676m540056k437644k281027l219650j591505
9752G6874483j659984j209373j857350j35698l543202k895665m72623j854981
9744F3245607k73101k064527j070083J90831j74787k407703m10345j643857k012729
$$ y = [167951570, 174166745, 177750398, 182429089, 188981892, 194779999, 197710809, 200762144, 204700988, 207882733, 209309973, 213221335, 213414579, 212728272, 210970819, 207937016, 205916244, 203504482, 198853975, 194962606, 189390473, 183213370, 178198830, 173916604, 167724338, 161217777, 157875299, 152734542, 148597352, 144482093, 138608072, 131926305, 126779953, 122091944, 121453974, 117850306, 113503638, 109122877, 104742005, 100747920, 95333444, 94518971, 92956041, 90944365, 86404309, 83966665, 81685638, 78465988, 76874483, 75214499, 74005126, 72147776, 72012078, 68468876, 65573211, 65100588, 63245607, 62972506, 60907979, 59837896, 60028727, 59853940, 57446237, 57035892, 55392035, 53379306]
9735E3379306r83322n33721L3031p3390j33751m63961r65779j247087O42263P0497
9725D9724086n99502R99661j561408L00087o90559j386098j08013Q20722j21893
9716D7377083J591399J201346k60306k46301P31873m25181J363908l27224k41011
9707E0765586r47045J98016J244597J21564M03678m51738L84132J657284J353915
9698E4729989M02584P25283k32392K089305J296893Q65783j782639N95248J019596
9689E9709650P8263J055643M07875N71210L054992K784269J050781L72366L653833
9680G2738882M001496R37498L542051M249324L699740N218877O341478M320484
9672A05049830J606349J758780J011988K231366K768018L187479K476063M809181
$$ y = [53379306, 52395984, 51862263, 51895294, 51821904, 51688153, 51224192, 50258413, 49011326, 49653589, 49724086, 49124584, 50124245, 48562837, 48862924, 48172365, 46786267, 46678254, 47498976, 47377083, 48968482, 50169828, 49909522, 49663221, 50395094, 49969913, 51333821, 51006597, 50765586, 49818541, 50016557, 51261154, 51382718, 51786396, 51334658, 51718790, 53376074, 54729989, 55132573, 55857856, 55625464, 57714769, 59011662, 59877445, 58094806, 58690054, 59709650, 59787913, 60843556, 61251431, 61822641, 64877633, 67661902, 68712683, 69085049, 72738882, 76740378, 77677876, 81219927, 85469251, 89168991, 94387868, 100729346, 105049830, 106656179, 108414959, 109426947, 111658313, 114426331, 117613810, 120089873, 124899054]
9664A24899054L082552R90297k75650j205270J7522m61684k395157r33497J313645
9655A25031812M943573J865031L799602M975400K977410N173922R463369J1822927
9647A70053046J3533612J5782990K3294713L0393057L1751869L1618083K9916545
9640C46343915K3184307R836141O27268l239018m016001O35778M129130N450678
9632C82952198M075302j764183j6199092k4205539k9708383l1751523l4029761
9625B49369019k5581974k0926744j8348440j3390272j0249645q195520p173523
9618A45502901m959929m649066l636072m297066k186599j213393m96144k231963
9610A21832669j595005q34508j28245R5753N20811j13136J417438K781121L751834
$$ y = [124899054, 127981606, 128971903, 128696253, 127490983, 127508505, 127046821, 124651664, 123718167, 125031812, 129975385, 131840416, 135640018, 140615418, 143592828, 148766750, 158230119, 170053046, 183586658, 199369648, 222664361, 253057418, 284809287, 316427370, 346343915, 369528222, 379364363, 379991631, 376752613, 372736612, 373372390, 377501520, 382952198, 387027500, 385263317, 369064225, 344858686, 315150303, 283398780, 249369019, 223787045, 202860301, 184511861, 171121589, 160871944, 152676424, 145502901, 140542972, 135893906, 132257834, 127960768, 125774169, 124560776, 124064632, 121832669, 120237664, 119403156, 119274911, 119370664, 119891475, 119778339, 121195777, 123976898, 127728732]
9601A27728732J861962K585632M211487N437431M848165O313376R249225J0443070
9593A72679080J1981658J5059730J9778458L0106198L9049998M2583745L6172500
9586C67411367K2005659J3011522J781386j2223581l898010R802741J6431411
9579D14322495L995536r540769j6958247l1018592m2879826l9268542l3171541
9572B45480514k5650047j8618332j7251881j2841866r661411q257937n698264
9565A47500776k439313l030586k957099q38181M23793K590978L222775N685419
9557A50158562R459797J3899705J8278746J5392270Q623855O525246J020963m095577
9549B19263567m062496J689675L982275J388653k767159p003852j4508914k3455125
$$ y = [127728732, 129590694, 132176326, 136387813, 141825244, 146673409, 152986785, 162236010, 172679080, 184660738, 199720468, 219498926, 249605124, 288655122, 331238867, 367411367, 389417026, 402428548, 404209934, 391986353, 388088343, 397891084, 414322495, 418318031, 408777262, 391819015, 360800423, 317920597, 278652055, 245480514, 219830467, 201212135, 183960254, 171118388, 161456977, 153199040, 147500776, 145061463, 142030877, 139073778, 138235597, 138659390, 141250368, 144473143, 150158562, 159618359, 173518064, 191796810, 207189080, 215812935, 222338181, 223359144, 219263567, 215201071, 216890746, 220873021, 222261674, 219494515, 212490663, 197981749, 174526624]
9541A74526624k0410733j7178788j4229372j1042489q244516o731657r416144
9534H7272925o201641l104813l381245m647565m828402m709013k899317j908942
9526E5591987l334413j283546k483621j334584k319347j600411k259149r78359
9518C9998557l80494k848523j221948r21278j376961j233340p19278N68318K161574
9509C4026627j124218j522282l05362o80105j340809m55578j533975o17960k24801
9500B6221537o0926J35671m17457L11521k574071P6164Q3832p25280Q81713q23836
9490B3108868k400708o86853j364252Q31156R88362J117606k24804M01631p49797
9481B1021209O71855r06882j552197L51290k66141l14131J336880n63994j347038
$$ y = [174526624, 154115891, 136937103, 122707731, 111665242, 103420726, 96689069, 87272925, 81071284, 77966471, 74585226, 69937661, 65109259, 60400246, 57500929, 55591987, 52257574, 50974028, 48490407, 47155823, 44836476, 43236065, 40976916, 39998557, 39618063, 36769540, 35547592, 34626314, 33249353, 32016013, 31296735, 31865053, 34026627, 32902409, 31380127, 31074765, 30394660, 29053851, 28598273, 27064298, 26446338, 26221537, 26160611, 26296282, 25878825, 26190346, 23616275, 23692439, 23776271, 23050991, 23932704, 23108868, 20708160, 20021307, 18657055, 19488211, 20476573, 21594179, 21369375, 21771006, 21021209, 21693064, 20786182, 19233985, 19585275, 19319134, 19005003, 20341883, 19777889, 18430851]
9472A8430851K39340l47327j227094J066695R54191j959225M11684J859903o45110
9463A8783908j563995J412080M2339m70682p87757o58948j020222K36066K070953
9454A8043742m68630J442405l14499K72333k40484j642026k46982M89362K069852
9445A9405073J144124p50990j262917k92843N95525Q19546n11461K186408k307525
9436A9024940L72684L35299q37157J944897J764800O27104l50409N31453R46941
9427B4360552O26347L785751l96770j690592O81698p29204k373513J092200J954150
9418B7310619J96912k53150J273412J332258J614009L219834J931600J958594
9410C8584088K671934K072894K700490L442496J780038l525233m370663j612068
$$ y = [18430851, 18670191, 18322864, 17095770, 18162465, 19116656, 17157431, 17569115, 19429018, 18783908, 17219913, 18631993, 18674332, 18203650, 17415893, 16756945, 15736723, 15972789, 18043742, 17575112, 19017517, 18703018, 18975351, 18734867, 17092841, 16845859, 17335221, 19405073, 20549197, 19798207, 18535290, 18242447, 18837972, 19657518, 19146057, 21332465, 19024940, 19397624, 19732923, 18895766, 20840663, 22605463, 23232567, 22882158, 23413611, 24360552, 24986899, 28772650, 28375880, 26685288, 27366986, 26637782, 24264269, 25356469, 27310619, 27507531, 27254381, 28527793, 29860051, 31474060, 34693894, 36625494, 38584088, 41256022, 43328916, 46029406, 49471902, 51251940, 47726707, 43356044, 41743976]
9402D1743976k618357l50023O98543l22736k020275k29996j113462l24361M25609
9393C5888918r16668k47845R23837q12126L32809N13269J723974J778551K560195
9384D1744914K971268K350387J704325M002721J991307q39153m873614j236890
9376D7815265Q24439J239641J35969O86522K164393k678029l55919j040853j079167
9367D7712261p09083j745029J319340N35679j16115J652165J313902J499323M99782
9358E1962225N42465j78612R65766K999931J725045J627055K783566Q21970J236787
9349F4486198K105294J859131J896861K202391K466983K593427L805534M654629
9341H6070448K740948N164201M399685L396621O355297O796144R271582R034975
$$ y = [41743976, 39125619, 38775596, 39474139, 39151403, 37131128, 36901132, 35787670, 35463309, 35888918, 34972250, 34724405, 35648242, 34836116, 35168925, 35682194, 37406168, 39184719, 41744914, 44716182, 47066569, 48770894, 52773615, 54764922, 53925769, 49052155, 47815265, 48639704, 49879345, 50015314, 50701836, 52866229, 50188200, 49832281, 48791428, 47712261, 47003178, 45258149, 46577489, 47113168, 46997053, 48649218, 49963120, 51462443, 51962225, 52504690, 52326078, 53291844, 56291775, 58016820, 59643875, 62427441, 63249411, 64486198, 66591492, 68450623, 70347484, 72549875, 75016858, 77610285, 81415819, 86070448, 88811396, 93975597, 98375282, 101771903, 108127200, 114923344, 124194926, 133229901]
9333A33229901J2446686J8600309K5788058L2014107J8857923n520995j4036007
9326B21379982j0265517l335590Q134190J3766171J5903648j505047k1766949
9319B22310888k1680301j9783986j6834243j1420025q380940m052709l644105
9312A36514579j156100P78669j67970L53280K436894K111801N869883M393685
9304A51134721Q086001J0626803Q382346J3711994J9657572K7359732M0536686
9297B79495855N5657073O0693431L2831097j7289325l1814114k3243130p581124
9290C48749763J1956110K8696028K6569863j0721150m8296571n1994478m5893423
9283B59066142l5596803k7577398k1063922j7318597j4288622j0190359r476682
$$ y = [133229901, 145676587, 164276896, 190064954, 222079061, 240936984, 235415989, 221379982, 211114465, 207778875, 215913065, 229679236, 245582884, 244077837, 222310888, 200630587, 180846601, 164012358, 152592333, 144211393, 140158684, 136514579, 135358479, 136137148, 135969178, 136322458, 138759352, 140871153, 146741036, 151134721, 159220722, 169847525, 178229871, 191941865, 211599437, 238959169, 279495855, 335152928, 395846359, 428677456, 411388131, 379574017, 356330887, 348749763, 360705873, 389401901, 415971764, 405250614, 356954043, 304959565, 259066142, 223469339, 195891941, 174828019, 157509422, 143220800, 133030441, 123553759]
9276A23553759p553080o664704o583162o126823m886576k974124l032129l303761
9268H2429400k006805j338535l831478l742175l46958l124588k044510j409922
9260F4584429j725926j858525k7623j482309k5629o91005j79499k986081n16248
9251E5091584k184381m53785r45142j227087Q34487k408810K40931J136145j730466
9242D8353476n24821K35522r89930r473M01067L03088J571190K411457J86838
9233E1938414K353903k50048l47849r24589P00253K506361J772166J100755J379700
9224F0229066J339899J240085j33453J530041J776861J964050J164348K088299
9216G1199196K643855K891336M085137K589524N444128O290395J0442681J0090975
$$ y = [123553759, 116000679, 109335975, 102752813, 96625990, 91739414, 88765290, 85733161, 82429400, 80422595, 79084060, 75252582, 71510407, 71163449, 68038861, 65994351, 64584429, 62858503, 60999978, 60972355, 59490046, 59464417, 58773412, 58593913, 55607832, 55091584, 52907203, 52453418, 51508276, 50281189, 51115676, 48706866, 48947797, 50083942, 48353476, 47828655, 48064177, 47074247, 47064774, 47465841, 47768929, 49340119, 51751576, 51938414, 54292317, 54042269, 53694420, 52769831, 53470084, 55976445, 57748611, 58849366, 60229066, 61568965, 62809050, 62675597, 64205638, 65982499, 67946549, 69110897, 71199196, 73843051, 76734387, 80819524, 83409048, 88853176, 95143571, 105586252, 115677227]
9208A15677227J1078813J8536815K1909136J7664479M276672o709468j0932314
9201A71501360o801690l573092K515006J0869546J3186837O335578q856083j6019714
9193A69157748j6495422j5514118j0334340r838476o027414l832618l752370m368873
9185I8994117k361537o54418k44805P94338j387332J393636J118155Q17281K049361
9176A00518796M416358M493577M557235O015168Q706178J1437191J6209857J9434904
9168A75789264K5960486L5415263K9968415Q211953j5505020j6753764j3512055
9161B29574542o382867K739044J2301808J8585553R494951j0376809k6578104
9154B29358118l1391934k6244491k1278746j5681697j4772344j1327004q876504
$$ y = [115677227, 126756040, 145292855, 167201991, 184866470, 189143142, 182433674, 171501360, 164699670, 161126578, 163641584, 174511130, 187697967, 194033545, 185177462, 169157748, 152662326, 137148208, 126813868, 116975392, 110947978, 107115360, 103362990, 98994117, 96632580, 95978162, 95733357, 96527695, 95140363, 96533999, 97652154, 98469435, 100518796, 104935154, 109428731, 113985966, 120001134, 128707312, 140144503, 156354360, 175789264, 201749750, 237165013, 267133428, 275345381, 259840361, 243086597, 229574542, 223191675, 225930719, 238232527, 256818080, 266313031, 255936222, 229358118, 197966184, 171721693, 150442947, 134761250, 119988906, 108661902, 99785398]
9147I9785398q650054n660991n271340j930113m185025m734877l394139k900946
9139F3057913j322680j446741k631520m967o27346l73200j627393j081166P71635
9130E4714535J335587J591909J388075J508654j628680l489952k213337k655140
9122E0551651j028040J999367K99688J472949k09831k473035m743018l292379
9114D2577352l301658l589554j448604p91717n00599j298408J86954k295813j170010
9105B8367943j78210m39522Q20851l61049q55424P8485j86653K68799j351644
9096B6163576K01993P43761P2033k356550k52931m4781j476543J295309O34475
9087B4980342j473240n06638J011737N2971j404403k59179J045435m53318J024132
$$ y = [99785398, 91135344, 85474353, 80203013, 78272900, 74087875, 69352998, 65958859, 63057913, 61735233, 60288492, 57656972, 57652005, 57024659, 56651459, 55024066, 53942900, 54714535, 56050122, 57642031, 59030106, 60538760, 58910080, 55420128, 53206791, 50551651, 49523611, 51522978, 51822666, 53295615, 53085784, 50612749, 45869731, 42577352, 39275694, 35686140, 34237536, 33445819, 32945220, 31646812, 31833766, 29537953, 28367943, 28189733, 27750211, 28571062, 28210013, 27354589, 27433074, 27246421, 27515220, 26163576, 26365569, 27109330, 27181363, 24824813, 24571882, 24527101, 23050558, 24345867, 24980342, 23507102, 23000464, 24012201, 24065172, 22660769, 22401590, 23447025, 22993707, 24017839]
9078B4017839J763093n69537l78893M34878q24548j19081R98426Q93782L89539
9069B6605498J463356k01809l17899L7055n08787M35915k69557R63193N55122
9060B8762087J955927N26929K46161j512073J568247J226474l81133K93094K282733
9051C4968446Q4965j416269J973640Q65398p97692J469067K081073q15287J867767
9042D0281108J793167k037J243150K187035J736941K751999K146117J292938J913008
9033E5343426J977207J001267K772803O53468Q68720K051902J209007O82038K147998
9024F8707836M457680M105165L588401M635609O437730N357627O062253J0597398
9016A13949699J0683658J1600244J6749332K0181133K5087058L3113151M3229295
$$ y = [24017839, 25780932, 25211395, 24832502, 25267380, 24442832, 24323751, 25322177, 26215959, 26605498, 28068854, 27867045, 27549146, 27586201, 27077414, 27513329, 27243772, 28206965, 28762087, 30718014, 31244943, 31491104, 29979031, 31547278, 32773752, 32392619, 32685713, 34968446, 35053411, 33637142, 35610782, 36476180, 35678488, 37147555, 39228628, 38413341, 40281108, 42074275, 42072238, 43315388, 45502423, 47239364, 49991363, 52137480, 53430418, 55343426, 57320633, 58321900, 61094703, 61748171, 62616891, 64668793, 65877800, 66559838, 68707836, 73165516, 77270681, 80859082, 85494691, 91932421, 97290048, 103352301, 113949699, 124633357, 136233601, 152982933, 173164066, 198251124, 231364275, 274593570]
9009B74593570M2709227K7652872J1060043r385093l1533174m1387654l7689071
9002B36020720l2451670k5363922j9140637j4577222j2521902r295494n002283
8995A17667590o833560n084329n139087k191434k570275l027022p7180j715248
8987I1029455j205552l03143l16063r84027J965199Q77474K907778L782944M757779
8978A02511844M213903K495776P402085J0417283J2593075J4740856K2272961
8971A76647783K8534801L0095024K0012618R586162l594724j7874729k5214082
8964B18192853k5638417j7626179j4635596j0240583r642433p142312q955916
8957A24311417q823846q550430p054248n027997n004794m226406l934645l175501
$$ y = [274593570, 317302797, 344955669, 356015712, 346630619, 315097445, 273709791, 236020720, 203569050, 178205128, 159064491, 144487269, 131965367, 122669873, 117667590, 110834030, 105749701, 100610614, 98419180, 95848905, 92821883, 92744703, 91029455, 89823903, 89520760, 89204697, 88220670, 90185869, 91063343, 93971121, 97754065, 102511844, 106725747, 109221523, 116623608, 127040891, 139633966, 154374822, 176647783, 205182584, 235277608, 255290226, 264876388, 261281664, 243406935, 218192853, 192554436, 174928257, 160292661, 150052078, 140409645, 133267333, 124311417, 115487571, 106937141, 99882893, 94854896, 89850102, 85623696, 81689051, 78513550]
8949G8513550j855775k075953k849805l763216J277933m62957r78754J247679
8941F9052702N71495J227948J551549L52473P30298M038089L415824N832143Q930275
8932I5702796O627857J0490630J3567159K2322429L3953973M3456622L7303949
8925B63425415o570122l3553554l2244502k7783438k0796005j6388378j5470606
8918A10618810j2204039j0324185r469898q343057o337246m414059l086598l959629
8910E2480099l787915j890321l95267l866678q04129l056545p78829k605574j591945
8901C3702896j078376k519573q54924k369225R27494q76610o62726m35252j478410
8892B4355294j322861j679200k184835J645457M70146j791617O32140m06437j770416
$$ y = [78513550, 76657775, 74581822, 71732017, 67968801, 69246734, 68783777, 67805023, 69052702, 69624197, 70852145, 72403694, 72756167, 73486465, 77524554, 80940378, 86772521, 95702796, 102330653, 112821283, 126388442, 148710871, 182664844, 226121466, 263425415, 256855293, 223301739, 191057237, 163273799, 142477794, 126089416, 110618810, 98414771, 88090586, 78620688, 70277631, 63940385, 59526326, 56439728, 52480099, 48692184, 46801863, 46406596, 42539918, 41735789, 38679244, 37900415, 35294841, 33702896, 32624520, 30104947, 29250023, 26880798, 27808292, 26931682, 26268956, 25833704, 24355294, 23032433, 21353233, 19168398, 20813855, 21284001, 19492384, 20124524, 19718087, 17947671]
8883A7947671k188360j44980P40018q15186o6114L73337q52304L36677J14428
8874A5445187k179319j156897N00478p80765m60161J056107N5990j409027l78101
8865A0693492J368753k11410j036329k25838J189669r05203p03890O67634K41277
8856A1078155p35185K26721n73628j139549k98692J013678R89720j50510n04515
8847I906195q28039j133673N74163L30157j250619L77865N2081m82265p67732
8838F778133K384432o15711J17188q53878n12775j611597o20276Q80318J689241
8829G635075J52391k035897K07458M3159J509126J837619J0788j655919p53356
8820F950444k35891R26323O42494j318354M27507K9798k491127Q20577J551466
$$ y = [17947671, 15759311, 15614331, 16354349, 15539163, 15473049, 15846386, 14994082, 15330759, 15445187, 13265868, 12108971, 12609449, 11828684, 11368523, 12424630, 12480620, 11071593, 10693492, 12062245, 11850835, 10814506, 10588668, 11778337, 10873134, 10169244, 10836878, 11078155, 10342970, 10569691, 9996063, 8856514, 8557822, 9571500, 10561220, 10410710, 9906195, 9078156, 7944483, 8518646, 8848803, 7598184, 7976049, 8028130, 7545865, 6778133, 9162565, 8546854, 8664042, 7810164, 7297389, 5685792, 5065516, 5945834, 7635075, 7787466, 5751569, 5959027, 6002186, 7511312, 9348931, 9359719, 7703800, 6950444, 6714553, 7640876, 8283370, 6965016, 7392523, 7422321, 4931194, 5751771, 7303237]
8811G303237j609304j007934J540439j120024L31389J002361J763329r86120M94008
8802G711381m11271M9220J64513o57872l16473r08603N17394R8168n1094N22295
8792F717658j295494r98613M60661j110816m2550K87806K169110p01000n11227
8783D975535o80874J097761P63179j225264o31109P69638j381369n32693J056609
8774D211413R43800P66619q60453k379667J576784J883188j27718n61820j388406
8765D063740M12896j696273J387232N23874q37749j149698o91726p56395R55418
8756B211319r22777n64944P88285o87669j304974K238786O80188M42198m30256
8747B450156r81474M97878K9384Q25737o6676M36720P5310J90787j01148N04279
$$ y = [7303237, 5693933, 4685999, 6226438, 5106414, 5437803, 6440164, 8203493, 7217373, 7711381, 7300110, 7349330, 7513843, 6855971, 6539498, 5630895, 6148289, 6246457, 6195363, 6717658, 5422164, 4423551, 4884212, 3773396, 3730846, 4018652, 6187762, 5486762, 4975535, 4294661, 5392422, 6155601, 4930337, 4299228, 5068866, 3687497, 3154804, 4211413, 5155213, 5921832, 5061379, 2681712, 4258496, 6141684, 6013966, 5452146, 4063740, 4476636, 2780363, 4167595, 4691469, 3853720, 2704022, 2012296, 1255901, 2211319, 1288542, 723598, 1511883, 824214, -480760, 1758026, 2438214, 2880412, 2450156, 1468682, 1966560, 1995944, 2821681, 2755005, 3191725, 3267035, 3457822, 3356674, 3860953]
8737C860953o67743p89427L80198J811358J033828k002452p2909K76339j8112
8728C812033q41156l55337N22983j438479J503J43516P1708J5089r9519J494601
8718C326942K08005j381401O52213m51025Q1380m76948j45202J352051m38863
8709B727152J32150r95078j005271N63251m15267R99535R25362k69349k37537
8700B424948q01667j049138p07162J30141K487113P90673p17160k435256L46633
8691D69125J646158n43749k43094k039493J002101O79160J207424n77863q70005
8682G29764K01087j837825o0078L46911J879498L3798j33912r37328N36293J30396
8672H88604j237759k03327K98100J155321L33099J366419J44124j227627Q30027
$$ y = [3860953, 3193210, 2403783, 2783981, 4595339, 5629167, 3626715, 3553806, 3830145, 3812033, 2970877, 2615540, 3138523, 1700044, 1701547, 1845063, 1916771, 1931860, 1832341, 3326942, 3534947, 2153546, 2805759, 2354734, 2436114, 1959166, 1813964, 3166015, 2727152, 2859302, 1864224, 858953, 1422204, 1006937, 2006472, 2931834, 2662485, 2424948, 1623281, 574143, -133019, -2878, 2484235, 3274908, 2557748, 122492, 469125, 2115283, 1571534, 1328440, -711053, 291048, 970208, 2177632, 1599769, 729764, 930851, -906974, -967052, -620141, 1259357, 1293155, 1159243, 221915, 758208, 888604, -349155, -552482, -254382, 900939, 1234038, 2600457, 2744581, 1516954, 2346981]
8663B346981k8045m52734k99517K8929j34212j503542J91176m0099n80214J782420
8653A311143N58517m38744L24767J9713m59333O22410J669637j195154j080474
8644A332482l03253L25388R48550l72608j500957j91849K554728K123928k397861
8635B518548o45325M01086k31371P77365j59519p96558N2093j247368J225052
8626A894003r0316q81K77143K53382L67235j753099j084504k40460K02383j002405
8616a177519J003064M83381Q37130j25851k30192m40369k76347J044623J79975
8607A297895Q44539q00502L25317O59751R51475r36964q42481r78714O13561J710042
8597B843919L1924o27243j12433j410824m65423l66261k2507j61834J608676r5623
$$ y = [2346981, 2318936, 1866202, 1566685, 1595614, 1461402, -42140, 149036, 108937, -471277, 1311143, 1869660, 1430916, 1755683, 1775396, 1316063, 1938473, 3608110, 2412956, 1332482, 1029229, 1354617, 2303167, 1930559, 429602, 237753, 2792481, 4916409, 2518548, 1873223, 2274309, 2042938, 2820303, 2660784, 1864226, 1916319, 668951, 1894003, 1803687, 1802806, 2079949, 2333331, 2700566, 947467, -137037, -377497, -175114, -1177519, -174455, 308926, 1146056, 1020205, 790013, 349644, 73297, 1117920, 1297895, 2142434, 1341932, 1667249, 2327000, 3278475, 2341511, 1499030, 520316, 1133877, 2843919, 2875843, 2248600, 2136167, 725343, 259920, -106341, -128848, -290682, 1317994, 1222371]
8587A222371o26069Q87414r49289P160682k682846k816251J56740j832796n54576
8578c4620J07m39699R16776j76577J42268J004907j163387P70018K068140k27391
8568B860542j156074j16225J785054J90372j202971p85403l69382p32605J28835
8559F02143k5672j897847K140042j26646O65935J370830j229076o68160Q6089
8550I17638J569265k61848l68663k259211O70347m8739o93490O20852P50691n07294
8540C89548j104110J390622q07917p1389J683031j199598j153643K9158J105368
8531B61070o51578P74820J495792r70590o46940j333368J153688Q74227r72364
8522a5243J83016J079091l34119J7605o67586n31845R11372k59144N63217j372793
$$ y = [1222371, 596302, 1483716, 534427, 7695109, 5012263, 2196012, 2352752, 519956, -34620, -34513, -474212, 442564, 265987, 408255, 1413162, 249775, 1019793, 3087933, 2860542, 1704468, 1588243, 3373297, 3563669, 2360698, 1575295, 1205913, 473308, 602143, 576471, -1321376, 818666, 692020, 1357955, 2728785, 1499709, 831549, 917638, 2486903, 2225055, 1856392, -402819, 267528, 218789, -474701, 146151, 896842, 389548, -714562, 676060, -131857, -203246, 1479785, 280187, -873456, -844298, 261070, -390508, 384312, 1880104, 909514, 262574, -1070794, 82894, 957121, -15243, 167773, 1246864, 912745, 930350, 262764, -269081, 642291, 383147, 946364, -426429]
8512d26429k17875J702327k253848J724899M80938J14367P121l49293j533090
8503g50883J533788K22036q64992j094505K686408o38693p77611J931570L4460
8494B281578j217729k84753q31135o89958l13160L48700J417337j514288J216638
8485D13230P12016q98336J398716p29791j077918L60521n58979J896518p09715
8476H06262q27631L04626o0328m00339l34153O84035m05159j312294O6730O13623
8466h64628p6730r55747j690321J516475L211634j170415j010381o97679j69526
8457a907318m83590J699307K22530j62770J453370o61292N63170o17115J75161
8448B81453j799853J15898Q88892j272971J157608J160191j368583J41673L24017
$$ y = [-426429, -644304, 1058023, -1195825, 529074, 1010012, 1124379, 1131500, 782207, -750883, 782905, 1004941, 139949, -954556, 1731852, 1093159, 315548, 2247118, 2281578, 1063849, 779096, -52039, -741997, -1055157, -706457, 710880, -803408, 413230, 1125246, 226910, 1625626, 895835, -182083, 178438, -380541, 1515977, 806262, -21369, 283257, 222929, -177410, -511563, 172472, -232687, -1544981, -1478251, -864628, -941358, -1897105, -3587426, -2070951, 1140683, -29732, -1040113, -1737792, -1907318, -2390908, -691601, -469071, -631841, 821529, 160237, 723407, 106292, 281453, -1518400, -1402502, -513610, -1786581, -628973, 531218, -837365, -695692, -371675]
8439c71675J335554k143677k9867J143993o60390l01665j883043J096770M36993
8430a377007J259242k60644K17497N09686m62424j864195k03734O05638J080733
8421d95208O56966K647007k540221k202198J938732n68929k84747P84034m2313
8412a06877R50799Q24170j695554J35325j066844n12803R33740q74832P6417N34363
8402h02096M55913m59138R60736p77469j336886O25789O45983Q38861P73670L43203
8392A268566j088402P789J071351k58253j976199r9260k43783k57546J978551
8383D02814n73896l2445m55083N84598r60257J33107K363016j773636p89952J096295
8373e439N25261j904598r04505J783939p83785Q67692J432927j152873L30300
$$ y = [-371675, 963879, -1179798, -1209665, -65672, -726062, -1027727, -2910770, -1814000, -1377007, -117765, -378409, -160912, 348774, -113650, -1977845, -2181579, -1575941, -495208, 161758, 2808765, 268544, -1933654, 5078, -563851, -848598, -64564, -106877, 843922, 1668092, -27462, 107863, -958981, -1471784, -538044, -1412876, -1336459, -802096, -346183, -805321, 155415, -622054, -1958940, -1333151, -687168, 151693, 925363, 1268566, 180164, 187953, 1259304, 1001051, -975148, -1074408, -1318191, -1575737, 402814, -171082, -203527, -658610, -74012, -1034269, -901162, 1461854, -311782, -1101734, -5439, 519822, -1384776, -2289281, -505342, -1289127, -421435, 1011492, -141381, 188919]
8364A88919N22625J284078q20276j917963J658596q69877r09205O57036r44073
8355a150140K44077K186165o99594p76250J269877L48531N11752j19650r11321
8346I03447r20400n3573p54051J335613J60081N77855l49466P90503m72939k05795
8336A011275L36072o80890j354277l69937J159757j392829j024271J609104k10569
8327i16565L25183j569951J063493J391564j668745L8101n59473M39952L69138
8318a087303P51461J332405k62761p48206N73071k013367O49544K53262J329494
8309G77600n03973o78059J802216J589985K91596j833544p42648j024941Q09209
8300D87441j299524J03105R24682j280426J174775K54547j32769n72541n86447
$$ y = [188919, 711544, 1995622, 1175346, -742617, 915979, 46102, -863103, -206067, -1150140, -906063, 1280102, 580508, -195742, 1074135, 1422666, 1934418, 1814768, 903447, -16953, -70526, -824577, 511036, 671117, 1248972, 899506, 1690009, 1217070, 1011275, 1347347, 666457, -687820, -1057757, 102000, -1290829, -2315100, -705996, -916565, -591382, -2161333, -1097840, 293724, -1375021, -1336920, -1896393, -1456441, -1087303, -335842, 996563, 733802, -14404, 558667, -1454700, -805156, -551894, 777600, 273627, -404432, 1397784, 2987769, 3279365, 1445821, 703173, -321768, 487441, -812083, -708978, 215704, -1064722, 110053, 364600, 231831, -340710, -927157]
8291i27157J387830J20728N44215k38180P40844j725389k75788J698771o64978
8282F60896P53468o19791k90315j330j705831m57837j78960J133868P07153j80707
8272a79386Q59054L54660p4892o21002j312855o07086J063345l72873j090757
8263a981792N37861P60669m7024Q99127L34704P5215j693763r2003k8766J275652
8253C9880j234193j75882L05545m41964J806744P21626k75107j8943N80400q94216
8243D13890L18835r74667k65563J129858p43662m90999J28822j77737O2804K80846
8233c17573Q53878j267363r93194l51185J575889P81634m78749k236794M7060
8224b386397K335159R58948j834630m41340o42212n16959J021548J389199M68606
$$ y = [-927157, 460673, 581401, 1125616, 887436, 1628280, -97109, -372897, 1325874, 660896, 1414364, 794573, 504258, 502928, -1202903, -1660740, -1839700, -705832, 1321, -179386, 679668, 1034328, 959436, 338434, -974421, -1581507, -518162, -891035, -1981792, -1443931, -683262, -730286, 168841, 503545, 578760, -1115003, -1207006, -1235772, 39880, -1194313, -1370195, -1064650, -1506614, 300130, 1021756, 746649, 727706, 1308106, 413890, 732725, -241942, -507505, 622353, -121309, -612308, -483486, -661223, -598419, -317573, 536305, -731058, -1724252, -2075437, -499548, 282086, -196663, -2433457, -2386397, -51238, 907710, -926920, -1368260, -2010472, -2527431, -1505883, -116684, 351922]
8215C51922j902773p70900M75780J07256j355653R10631L92935j21343J631124
8206b81021n63820j80355j557697J68956j73237J205151l64427j468788J227568
8197a987670k91189J416412l748603j989578l472469J7071478O775103r761266
8189D012218j86449j633647Q13657q57669j315989M95634N71611J39541l94704
8180A644203q12113j03675j40576O61475j037222P76531J94792j128760j150458
8171a095803P51225M03431j266189j100431J699165j55480K36181J502763J132568
8162B107430k320905j695418Q90496J02615r5828K91295J349580O48525O5127
8153A342917p80635J015763p72237k557290J381002J595272k90927m07094o61275
$$ y = [351922, -1550851, -2321751, -1845971, -1738715, -3094368, -2183737, -1790802, -1912145, -281021, -844841, -1025196, -2582893, -2413937, -2587174, -1382023, -1746450, -3215238, -1987670, -2278859, -862447, -4611050, -6600628, -10073097, 6998381, 13773484, 4012218, 3825769, 2192122, 3005779, 2148110, 832121, 1327755, 1899366, 2038907, 1644203, 832090, 728415, 587839, 1249314, 212092, 988623, 1183415, 54655, -1095803, -344578, 58853, -1207336, -2307767, -608602, -764082, -527901, 974862, 2107430, -213475, -1908893, -1018397, -915782, -1011610, -720315, 629265, 1277790, 1342917, 562282, 1578045, 805808, -1751482, -370480, 1224792, 933865, 526771, -134504]
8144a34504q31238r35858J553650m9668j014378Q73926j096206K62871J649012
8135B77607L27054j264110M80536r1068j854141J169183Q02848k68084j091110
8126a511285K070974k54321j479766J22176k76261L25183Q41236J460112N61218
8117A859266j785713r90693L57455j022154J061757j3990n22690J265111l28717
8108a20368J63922L08189K76765j387113J628730o66245j002821J246413j051434
8099f03962m77987O06835j9193n12811R47378M730j239017o55556K058348J321604
8089A430369K71473r70340j301342J168559p61164Q88563n6523j283094m07926
8080a021425R64002j75942j172225J678565j421334P5583J67222L05009L98447
$$ y = [-134504, -965742, -1901600, -347950, -397618, -1411996, -538070, -1634276, -1371405, 277607, 604661, -659449, -178913, -269981, -2124122, -954939, -152091, -420175, -1511285, 559689, 305368, -1174398, -1052222, -1328483, -1003300, -162064, 1298048, 1859266, 73553, -917140, -559685, -1581839, -520082, -534072, -1056762, 208349, -120368, 43554, 351743, 628508, -758605, 870125, 203880, -798941, 447472, -603962, -1081949, -475114, -494307, -1007118, -59740, -55010, -1294027, -1949583, 108765, 1430369, 1701842, 731502, -569840, 598719, -162445, 726118, 669595, -613499, -1021425, -57423, -233365, -1405590, 272975, -1148359, -1072776, -905554, -600545, -202098]
8071b02098j371971m95559O00888n7890M19208K94217q5619l57803q89778r89637
8061c136042L29330K61323m05095J04557K20119J859361J61672K24834K19441
8052a60500p43353r79144O91276J411019J087588j51685J219796O8460p89053
8043A654404k035790j047519J553291j39679J84589n69448j606004j042019J286052
8034a762123M03885M42465P23131L6293k159575P26520Q3233l64050J033392N49475
8024b87354R54003M6498j275711M08975Q94610J2534j268425N1931p02188l14932
8014a480059P96258P93663J221592p68590j189720j981760J565860q5704m09871
8005a538331K762860k69246j377966L74694l32130p21815N65350J82983q52825
$$ y = [-202098, -1574069, -2069628, -1468740, -1526630, -1107422, -813205, -898824, -1256627, -2146405, -3136042, -2806712, -2545389, -2950484, -2845927, -2625808, -766447, -604775, -379941, -160500, -903853, -1882997, -1191721, 219298, 1306886, 1155201, 2374997, 2443457, 1654404, -381386, -1428905, 124386, -15293, 169296, -400152, -2006156, -3048175, -1762123, -1358238, -915773, -192642, -156349, -2315924, -1589404, -1506171, -1870221, -836829, -287354, 666649, 713147, -562564, -153589, 741021, 753555, -514870, -462939, -1165127, -1480059, -683801, 109862, 1331454, 562864, -626856, -2608616, -1042756, -1128460, -1538331, 1224529, 955283, -422683, -47989, -380119, -1101934, -536584, -353601, -1206426]
7996a206426L43770j188871o95097K359886O13067m85983m35862K05371K04768
7987b85377l53444K09066l14193J066872R59453k209041J070019j081989O68903
7978b69731J09608L75415O81198k006722j101148J007369J875882n66563L59544
7969D64852n52392R17132K71273j149373l83874l05589n25318L33471J362703
7960D32885j48044o21214M679J238154J99836q90236p46k97436q00396j89317
7950a071835j95941O4135N42440K162858o56874r97045m61476j424683J505977
7941e32444N20915R55940R94420j739969J000253q84607n19344K15650q48618
7932h37804j09543O97262J71212o46842J403256j250369o06070L14173J352709
$$ y = [-1206426, -862656, -2051527, -2746624, -386738, 226329, -259654, -695516, -490145, -285377, -638821, -429755, -743948, 322924, 1282377, -926664, 143355, -938634, -269731, -160123, 215292, 896490, -1110232, -2211380, -1204011, 671871, 105308, 464852, -87540, 829592, 1100865, -48508, -432382, -737971, -1263289, -929818, 432885, 284841, -336373, -331694, 906460, 1106296, 216060, 215314, -82122, -882518, -1071835, -1267776, -1203641, -661201, 1501657, 844783, -152262, -613738, -2038421, -532444, -11529, 944411, 1938831, 198862, 1199115, 314508, -204836, 10814, -837804, -947347, -250085, -78873, -725715, 677541, -572828, -1178898, -864725, 487984]
7923D87984j539747m66427Q82800M49440l03738J777207j012279P25380n8187
7914I42433j115591k341763n75538l15577N09022J691007p12386O75652p17271
7905a960012n5355O16301O65277O90165N0877K20499J062178l07684O734q53889
7895A35091p98809l34833l84195J099423R29082N68302j026969q60785M31616
7886b42077r56476j98371K43907j293330L81884J176442J509546j136351m72287
7877i87113J090868M96126p85707o33352R95348l00898q64040o019n01953n29978
7867b026718J025254n41975L94752P27469K24228j02237q77076L32034N2467k12406
7857a004208K2483p58843j36416m14597k31016K149633K1638K75973n5195O871
$$ y = [487984, -1051763, -1518190, -635390, -185950, -489688, 1287519, 275240, 1000620, 942433, -173158, -2514921, -3090459, -3406036, -2897014, -1206007, -1918393, -1242741, -1960012, -2015367, -1399066, -733789, -43624, 7253, 227752, 1289930, 982246, 988980, 135091, -663718, -998551, -1382746, -283323, 645759, 1214061, 187092, -673693, -242077, -1198553, -1396924, -1153017, -2446347, -2064463, -888021, 621525, -514826, -987113, 103755, 599881, -185826, -819178, 176170, -124728, -988768, -994787, -1496740, -2026718, -1001464, -1543439, -1148687, -421218, -196990, -299227, -1176303, -844269, -791802, -1004208, -981725, -1740568, -1876984, -2291581, -2522597, -372964, -351326, -75353, -130548, -123677]
7847a23677M54636r06585l76827M97918L64000J25185M80425J45186J26813k94485
7837D92589n62020k233587J8792Q19884J749850K09885p30035m66326J041133
7828C40165j42121M7757j094555k0215q66694K81716R10214J61520j056848P51330
7818f87731L08529r06151m14200J783501j52582j875622J230481L10025r79490
7809a383240Q29878J456954q33889q71620J582094k48204k299165K04345j034507
7800b597354j480370R48928K276390l93551J885513r69244j098084J71181L81828
7791h74763M4394o43581K9707m59328n32947L24508J788504M01308N64591j298348
7781f55955P92507J334729j716940j98685M6165q95794p46025O83451M56191L55085
$$ y = [-123677, 330959, -575626, -952453, -454535, -90535, 34650, 515075, 660261, 787074, 492589, -69431, -2303018, -2284226, -1464342, 285508, 495393, -234642, -700968, 340165, 198044, 245801, -848754, -868969, -1735663, -1453947, -543733, -382213, -1439061, -687731, -379202, -1285353, -1699553, 83948, -68634, -1944256, -713775, -403750, -1383240, -553362, 903592, 69703, -801917, 780177, 531973, -1767192, -1562847, -2597354, -4077724, -3128796, -852406, -1245957, 639556, -329688, -1427772, -1256591, -874763, -830369, -1473950, -1444243, -1903571, -2436518, -2112010, -323506, 77802, 642393, -655955, 136552, 1471281, -245659, -444344, -398179, -1293973, -2039998, -1356547, -900356, -545271]
7771e45271J106072k28885j283522J201703Q44817l76193j476391M54483M72786
7762A69599o93928Q81227O92230j287247l72208L72901o33727R61241J17686J56789
7752C64563j142326L14784R480n6258p65615j71321J029157j28851J72904j99765
7742e73248O93883k32951k45202m59590m37960R8345K24783J051760R10643K08347
7732A238810n587R10789j080629K47683q23936m54673N7178N18306K67169N382
7722H80492p82859m94441k53086j337965K303284J549176J16776j071063j506093
7713e95779J047669r31208r81318J409830J193541j149080n41075R58626q1890
7704C29316l63864n53313K049581j077977N74126n10175r16197P38619l89890
$$ y = [-545271, 560801, 331916, -951606, 250097, 1094914, 718721, -757670, -303187, 169599, -524329, 356898, 1049128, -238119, -610327, -237426, -871153, 90088, 207774, 364563, -777763, -462979, -453499, -509757, -1275372, -1446693, -417536, -546387, -373483, -573248, 120635, -112316, -357518, -817108, -1255068, -1156723, -931940, 119820, 1030463, 1238810, 1233223, 2144012, 1063383, 1311066, 487130, 32457, 89635, 607941, 875110, 880492, 97633, -396808, -649894, -1987859, 315425, 1864601, 1981377, 910314, -595779, 451890, -479318, -1460636, -50806, 1142735, -6345, -547420, 411206, 329316, -34548, -587861, 1461720, 383743, 957869, 447694, -468503, 270116, -119774]
7695a19774J396599J253818j075930p14529n54918N86719r0182q52524k223870
7686b394591Q77830j049584K29445K52398l35535J489984l82078Q89480k51097
7677f73748M69456J415317r99451m96278j209218R7603M09341P90394R88514p50846
7667D1084M33690K21045j081180J34757n60310J41162J4224n42098R32940J148807
7657H84121J5239j819460j06721p3633j14866L70648j364785K30505J233406L78349
7647c67197K22905p28020L70911R67488l73082k67939p73609p9642L92146j279342
7637a915381J54192N28024K236597k85837n02044p57175j605630J076727J644546
7628E74019l83909j138071J158760o8680j037339P92439N07175N7699r61442J181058
$$ y = [-119774, 1276825, 2530643, 1454713, 740184, 185266, 771985, 681803, -170721, -2394591, -1516761, -2566345, -2336900, -2084502, -2420037, -930053, -1312131, -422651, -673748, -204292, 1211025, 211574, -284704, -1493922, -1396319, -986978, -196584, 791930, 41084, 474774, 695819, -385361, -250604, -810914, -669752, -655528, -1197626, -264686, 884121, 899360, -920100, -1026821, -1100454, -1215320, -844672, -2209457, -1978952, -745546, -367197, -144292, -872312, -501401, 466087, 93005, -174934, -948543, -1028185, -636039, -1915381, -1761189, -1233165, 1003432, 717595, 215551, -541624, -2147254, -1070527, 574019, 190110, -947961, 210799, 142119, -895220, -102781, 404394, 462093, -499349, 681709]
7618F81709J97425j305851l5371r64053k3268m75425Q67908J39079j054156M84282
7608a487721m51896l52944J202346Q20836Q60907P37541q03186J73967o62770
7599C7080P46480m14540q03743j6672N46508q40099k56069m37783O26831J22411
7589f89596q40719J879748J276189m71952j532545n42739J433468n27505l90715
7580d06366j09698J23177J465865m50895r21884K41451l90469L46415O62838m61287
7570I9147o78758N07075M13596J19681k37024k05600j115478k14589m47002J835625
7560G6673o9862j429585J368871J664320l45765K85715j316612O6041K72416o36036
7550f3824J828011j107820l79067J037237j418893o477j76952k089961J111127
$$ y = [681709, 879134, -426717, -462088, -1426141, -1449409, -1924834, -1056926, -917847, -1972003, -1487721, -1939617, -2292561, -1090215, -269379, 591528, 1329069, 525883, 699850, 37080, 783560, 369020, -434723, -451395, 95113, -744986, -1001055, -1438838, -812007, -689596, -1530315, 349433, 1625622, 1153670, -378875, -921614, 511854, -15651, -406366, -516064, -392887, 1072978, 622083, -299801, -58350, -448819, -102404, 560434, 99147, -579611, -72536, 341060, 460741, 223717, 18117, -1097361, -1311950, -1758952, 76673, 6811, -1422774, -53903, 1610417, 1264652, 1550367, 233755, 299796, 572212, -63824, 1764187, 656367, 277300, 1314537, -104356, -110833, -287785, -2377746, -1266619]
7541a266619J465032L43024q84447R62846j58836j019548R46469L22199j242724
7532e32604J38057o03588Q5640J278505Q66330k044168o60046J401405N15075
7523D44606N48809j172204q43317L61961j260637J48588k160266O76449J361747
7514a894264J221182K209610p51858J945489j569751j820189N21640r88248r71659
7505b098048K073879J358491j033104L24439j797119J5543N69539R04954M00795
7496G19369j000793p34809k60442j03320Q80757n66222j43227N28746J734819
7487A054878k78787r46528N8700l53394M1488P76228n37014j51475l19222l71872
7477a026998o48307l8222R72039J91344R75562m61221k22857J072140k218012
$$ y = [-1266619, 198413, 541437, -343010, 619836, 461000, -558548, 387921, 710120, -532604, -394547, -998135, -912495, 366010, 1232340, -811828, -1471874, -70469, 444606, 993415, -178789, -1022106, -660145, -1920782, -1772194, -3932460, -3256011, -1894264, -673082, 1536528, 784670, 2730159, 1160408, -659781, -138141, -1126389, -2098048, -24169, 1334322, 301218, 625657, -1171462, -1155919, -586380, 318574, 719369, -281424, -1016233, -1276675, -1379995, -499238, -1065460, -1208687, -679941, 1054878, 776091, -170437, -111737, -465131, -423643, 352585, -184429, -335904, -655126, -1026998, -1675305, -1713527, -741488, -550144, 425418, -35803, -258660, 813480, -1404532]
7468a404532L29962M90731K77177j18136j124544R67016P66149l95157r37222
7459a148556K82448J64086m63920p39414j2701J431261J251321r61658o82540
7450h79673p1829K450563n10087n22134K46323o98335r16259m24505P78393N09450
7440c8093J87811j23531N20552K335838j487580n60131j721284J307845R40701
7431A362128o85899J008488j454563Q96578J099079k221582l59377J8827J2777
7422c23544m45192o24420o1185L25996J472309J18503J064475n24514j528936
7413e26508K17990K66568j607377K538803M74909k232566j141280O06568P01134
7404g01759j474082J255627k9153n57947k63283J134552l42367J50250J084761
$$ y = [-1404532, -1074570, -583839, -306662, -424798, -1549342, -582326, 183823, -211334, -1148556, -866108, -702022, -1165942, -1905356, -1918057, -486796, 764525, -197133, -879673, -951502, 1499061, 988974, 466840, 713163, 14828, -901431, -1325936, -547543, -38093, 149718, 26187, 546739, 2882577, 1394997, 834866, -886418, 421427, 1362128, 676229, 1684717, 230154, 1126732, 2225811, 4229, -355148, -336321, -323544, -768736, -1393156, -1454341, -1128345, 343964, 462467, 1526942, 1002428, -526508, -308518, -41950, -1649327, 889476, 1364385, -868181, -2009461, -1402893, -701759, -2175841, -920214, -949367, -1507314, -1770597, -636045, -978412, -828162, 256599]
7395B56599j038550o07300M28757k90692l13905J541710q5619O72237m14887M32792
7385E81142q51441M65989m63508p73595k86079R84458K862251j450270k079650
7376a010703k75374P5106l29911l688q8317K19837m03122J576657J397504K79818
7366A437807j813671M75551N21044J647578j964264J7517l78792k76930j691597
7357b025757j16345Q08152m52421R9261M64648J642696j408526O14494o65503
7348a039301M8962p36120J439233J76714Q96115n81703o63923P16585l89383o9581
7338b02402j695980J08071L85305M8737P84054r5346P76192j69668J266869j585320
7328c79488J33188O2037K85796m38278o52392l52924M29645N65239Q16791q69911
$$ y = [256599, -781951, -1389251, -960494, -1251186, -1565091, -23381, -109000, 563237, 148350, 581142, -270299, 195690, -267818, -1041413, -1327492, -343034, 2519217, 1068947, -1010703, -1286077, -1210971, -1540882, -1544570, -1632887, -1413050, -1816172, -239515, 1157989, 1437807, -375864, 99687, 620731, 2268309, 304045, 321562, -57230, -334160, -2025757, -2142102, -1333950, -1786371, -1687110, -1222462, 420234, -988292, -373798, -1039301, -990339, -1726459, -287226, -110512, 785603, 203900, -460023, 256562, -132821, -202402, -1898382, -1790311, -1405006, -1356269, -572215, -667561, 108631, -61037, 1205832, -379488, -246300, -184263, 101533, -336745, -989137, -1342061, -912416, -347177, 469614, -400297]
7318d00297r92619P006Q22857n54630L63064j023537r43637R73049j079730J917062
7308i11412k78719m63342R38572K20084m84666j64851j752100K281107J678958
7299A063631L17731k026949j943434J292850J439793j410771J55061J544790M00344
7290H33046P69524o72779l04685J049962j79859j071611j294745o85304k305K619671
7280A060915r01731j444661q32647j87562k52677R86382J878306j031392j271358
7271a996425J431203n9587n88771M58778j060535j09113m16348N13166l36330
7262b163962J359986Q36206J5107K57850R43913Q28683j161707n44961O47333
7253A018448Q62398l63451j304206j167520N389j84472o92541O06331j23361P2666
$$ y = [-400297, -1392916, -1385910, -563053, -1117683, -754619, -1778156, -2721793, -1748744, -2828474, -911412, -1190131, -1653473, -714901, -494817, -979483, -1144334, -2896434, -615327, 1063631, 1381362, -645587, -2589021, -1296171, 143622, -1267149, -1112088, 432702, 833046, 1602570, 929791, 625106, 1675068, 1495209, 423598, -871147, -1556451, -1558756, 1060915, 159184, -1285477, -2118124, -2305686, -2558363, -1571981, 306325, -725067, -1996425, -565222, -624809, -1213580, -754802, -1815337, -1924450, -2340798, -1827632, -2163962, -803976, 32230, 47337, 305187, 1249100, 2077783, 916076, 371115, 1018448, 1880846, 1517395, 213189, -954331, -948942, -1133414, -1825955, -1219624, -1342985, -1270319]
7243a270319Q52039j629661L6618L58903R26109n35412j251056J107515Q068n77933
7233a975129k32229o95240K102651J433799j566172r17691n17370O43714L10732
7224a412935Q02399N15021j278747m54271P09296j06235N46500n44936M47833
7215g76075K89630L137p72518J686200K95061j224681J2555l75968n55520J59356
7205a258823J280788J44740r06580R83636j823936O64876k51415P49576Q85242
7196D68104n64465P90849l71832j366751m46734j052833R15385K27459p0473J8478
7186a452813R34895J717917j123879L49764K38202o77699j88736K61880q5888
7177b6357n65888L86782P38551p85264o98069L57118Q9719N03658m72804O05989
$$ y = [-1270319, -418280, -2047941, -2011323, -1652420, -726311, -1261723, -2512779, -1405264, -1397196, -1975129, -2207358, -2902598, -799947, 633852, -932320, -1850011, -2367381, -1723667, -1412935, -610536, -95515, -1374262, -1828533, -1119237, -1225472, -678972, -1223908, -776075, -486445, -483308, -1255826, 430374, 725435, -499246, -486691, -862659, -1418179, -1258823, 21965, 166705, -739875, 243761, -1580175, -915299, -1166714, -417138, 468104, -96361, 694488, 322656, -1044095, -1490829, -2543662, -1628277, -1400818, -1471291, -1452813, -517918, 1199999, 76120, 425884, 664086, -13613, -202349, 59531, -26357, -592245, -205463, 533088, -252176, -950245, -593127, -503408, 250, -472554, 133435]
7167A33435L07848K67208m07016j490749K051246M36151J01410p96309q32519
7158b29295J621940M83353l318720N40070J019114k07773m68818J209140j0528
7149F38483O49038q34143M58034l19750k39153M21954j102725r75510M14830R52340
7139F3398k042238r23349J541646K32430k58059k2733K811r61794K547582j53415
7129B6279r36746M56020N57039j62263R8358N84958N44143j547029j762124J6494
7119b124871J130088K568981q51020l02989j251998j24553J688839j90254j110713
7110e68490Q88549J38737J72987j929966o70136Q31045J88107P72867K006946
7101A830646j482607J62819l36614J34432o57155M12325m08085L97765m66551
$$ y = [133435, 441283, 708491, 301475, -1189274, 861972, 1298123, 1399533, 603224, -229295, 1392645, 1875998, -1442722, -902652, 116462, -91311, -560129, 649011, 638483, 1287521, 453378, 911412, 591662, 352509, 774463, -328262, -1303772, -888942, 63398, -1978840, -2902189, -1360543, -1128113, -1386172, -1408905, -1406094, -2367888, 179694, 26279, -910467, -454447, 102592, -59671, 38687, 623645, 1167788, -379241, -2141365, -2124871, -994783, 1574198, 723178, 420189, -831809, -956362, 732477, 542223, -568490, 320059, 458796, 631783, -1298183, -1968319, -1137274, -949167, -176300, 1830646, 348039, 510858, 174244, 308676, -348479, 63846, -344239, 53526, -413025]
7092d13025J245187R41519j676022p01195j096077r42011j601536J861409Q86463
7083a495288K63829r35758K16388P57567K27452q78010M82172O59557j959729
7074b661820M5209K61915l38428Q46993j325715J658243J182855n56761p62152
7065a649661J069332P0395M15763k197627K75554K450322Q62220m21970N03024
7056A377352j2875j688442J418314j056940j072705o07752q04519K10976R97434
7047a239157J991152J165418j172365k239529J00799J058285N01223M76891j203984
7038e61267n6071J27353k87425J368313j016365J83277n97180M80116k64824l52720
7028i76793Q41419J76363k37916L21186J281222q03954O83925k74372l40392k457721
$$ y = [-413025, 832162, 1773681, 97659, -603536, -1699613, -2641624, -4243160, -2381751, -1495288, -1231459, -2167217, -1950829, -1193262, -965810, -1843820, -1361648, -702091, -2661820, -2616611, -2354696, -2693124, -1846131, -3171846, -1513603, -330748, -887509, -1649661, -580329, -509934, -94171, -2291798, -2016244, 434078, 1296298, 874328, 1377352, 1364477, -323965, 1094349, 37409, -1035296, -1643048, -2447567, -2236591, -1239157, 751995, 1917413, 745048, -1494481, -1393682, -335397, 165826, 642717, -561267, -617338, -489985, -777410, 590903, -425462, -242185, -839365, -359249, -624073, -976793, -135374, 40989, -196927, 124259, 1405481, 601527, 1285452, 1011080, 670688, -1787033]
7018a787033n31243K029054J325635r38057r51158o27123L73371J724650j294747
7009f76651o14471q60170J339370J893685l62333p8859j488253p84274Q76195
7000g55761j467309j083704J043618K811140o46976l90571K363182k009527k59201
6991c95109o28320R83104o86492J332354o26777j249171o9669j81903J612715
6982I0732R00886p43296o55817n2154J29200N54847n15880n24633J181404l4132
6972C31157n11150j29738n09812l39021K217292R94206o46822n19138J407576
6963B294550k511755P64583m7751j132129O35574J515229k55697j687653r79671
6954a404720m98698P26697M32595R44989j315858N42733O13601r3990p27913r80833
$$ y = [-1787033, -2318276, -289222, 1036413, 98356, -852802, -1479925, -1106554, 618096, -676651, -1291122, -2151292, -811922, 1081763, 719430, 640571, -847682, -1631956, -755761, -2223070, -3306774, -2263156, 547984, -98992, -489563, 1873619, -135908, -395109, -1023429, -40325, -726817, 605537, -21240, -1270411, -1340080, -1521983, 90732, 991618, 248322, -407495, -459649, -330449, 224398, -291482, -816115, 365289, 331157, -179993, -309731, -819543, -1158564, 1058728, 2052934, 1406112, 886974, 2294550, -217205, 547378, 499627, -632502, 3072, 1518301, 1262604, -425049, -1404720, -1903418, -1176721, -744126, 200863, -1114995, -572262, 41339, -52651, -780564, -1761397]
6944a761397K239777m56024k035663K67681R55J111439j720529R99303N34680
6935h19778J135879r15758r68614J145271O99949K241766m55763j972454q41638
6926g51140P81328m90779j004106l58320N72994O98948N14556n22997m91905M14082
6916f37339J812404K07098j094853R59460j135450j205297j027012R17972n12662
6907a715679q39164Q94405J790777P95650j136610N49889Q19770j837570J02225
6898e76307j007263J973097j027200N2545q54590J596132J66112K1503r4624N07881
6888G57286J62647j175319j97364q00546n57640J692288r65014j296181O07559
6879a772284J30187k11549O64719J192116R60670j000197m20063K078504k82390
$$ y = [-1761397, 478380, 22356, -2013307, -1745626, -1744671, -633232, -2353761, -1354458, -819778, 316101, -599657, -1568271, -423000, 276949, 2518715, 2062952, 90498, -751140, 30188, -460591, -1464697, -1823017, -1250023, -551075, -36519, -559516, -1051421, -637339, 1175065, 1382163, 287310, 1246770, 111320, -1093977, -2120989, -1203017, -1715679, -2554843, -1660438, 130339, 925989, -210621, 339268, 1159038, -678532, -576307, -1583570, 389527, -637673, -585128, -1439718, 156414, 322526, 344029, 249405, 757286, 919933, -255386, -452750, -1253296, -1810936, -118648, -1083662, -2379843, -1772284, -1642097, -1853646, -1188927, 3189, 963859, -36338, -456401, 1622103, 1339713]
$$ [...]
##END NTUPLES=NMR SPECTRUM
##END=
