##TITLE=1H_CA-9221-2
 CDCl3
 8 sc, 
 9.1.2024
##JCAMPDX= 6.0         $$ Bruker NMR JCAMP-DX V2.0
##DATA TYPE= NMR SPECTRUM
##DATA CLASS= NTUPLES
##ORIGIN= UXNMR, Bruker Analytische Messtechnik GmbH
##OWNER= root
$$ XWIN-NMR		Version 3.5
$$ Tue Jan  9 13:54:05 2024 Russian Standard Time (UT+4h)  she@DPX200
##.OBSERVE FREQUENCY= 200.1313
##.OBSERVE NUCLEUS= ^1H
##.ACQUISITION MODE= SIMULTANEOUS
##.ACQUISITION SCHEME= undefined
##.AVERAGES= 8
##.DIGITISER RES= 18
##SPECTROMETER/DATA SYSTEM= spect
##.PULSE SEQUENCE= zg30
##.SOLVENT NAME= CDCl3
##.SHIFT REFERENCE= (INTERNAL, CDCl3, 0, 15.5309)
##AUDIT TRAIL= $$ (NUMBER, WHEN, WHO, WHERE, WHAT)
$$ ##TITLE= Audit trail, XWIN-NMR		Version 3.5
$$ ##JCAMPDX= 5.01
$$ ##ORIGIN= Bruker BioSpin GmbH
$$ ##OWNER= she
$$ F:/spectra/data/she/nmr/H-F/1/pdata/1/auditp.txt
$$ ##AUDIT TRAIL=  $$ (NUMBER, WHEN, WHO, WHERE, WHAT)
(   1,<2024-01-09 13:52:26.20 +0400>,<she>,<DPX200>,
      <created by zg, POWCHK disabled, PULCHK disabled
       configuration hash MD5:
       00 E9 B6 7A A2 85 ED C7 34 08 36 98 17 FE 4E 26
       data hash MD5: 16K
       BC FD 12 FB A1 AA 30 2F 9B 0B E5 48 4E 39 48 3B>)
(   2,<2024-01-09 13:52:28.21 +0400>,<she>,<DPX200>,
      <Start of raw data processing
       efp BC_mod = 2 LB = 0.24 FT_mod = 6 PKNL = 1 PHC0 = -24593.52 PHC1 = 13.25273 SI = 16K 
       data hash MD5: 16K
       37 0C 56 17 D9 35 A7 B3 28 08 C5 11 AC 5C E6 08>)
(   3,<2024-01-09 13:52:49.73 +0400>,<she>,<DPX200>,
      <pk PHC0 = 5.261472 PHC1 = -4 
       data hash MD5: 16K
       D0 B8 C0 C9 C8 9E E4 41 2D 3E F4 59 C7 EF EF 51>)
(   4,<2024-01-09 13:52:55.04 +0400>,<she>,<DPX200>,
      <abs ABSG = 5 
       data hash MD5: 16K
       90 F7 3F BE 33 B9 A3 D5 68 AB 92 6D F2 93 8C 4E>)
(   5,<2024-01-09 13:53:33.17 +0400>,<she>,<DPX200>,
      <pk PHC0 = 0.1549985 PHC1 = 2.799999 
       data hash MD5: 16K
       7E 9C FC 36 35 43 D3 C4 75 AE F9 7D 72 18 10 D3>)
$$ ##END=
$$ 
$$ hash MD5
$$ 8A BF 4C CB FB 8B D5 DA D4 0F 67 F3 2C B6 E2 F6
##$RELAX= 
##$RELAX= 
##$RELAX= 
##$RELAX= 
##$RELAX= 
##$RELAX= 
$$ Bruker specific parameters
$$ --------------------------
##$DU= <F:/spectra>
##$EXPNO= 1
##$NAME= <H-F>
##$PROCNO= 1
##$TYPE= <nmr>
##$USER= <she>
##$AMP= (0..31)
100 100 100 100 100 100 100 100 100 100 100 100 100 100 100 100 100 100 
100 100 100 100 100 100 100 100 100 100 100 100 100 100 
##$AQSEQ= 0
##$AQ_mod= 1
##$AUNM= <au_zg>
##$AUTOPOS= <>
##$BF1= 200.13
##$BF2= 200.13
##$BF3= 200.13
##$BF4= 200.13
##$BF5= 200.13
##$BF6= 200.13
##$BF7= 200.13
##$BF8= 200.13
##$BYTORDA= 1
##$CFDGTYP= 0
##$CFRGTYP= 5
##$CHEMSTR= <none>
##$CNST= (0..31)
1 1 145 1 1 1 1 1 1 1 1 1 1 1 1 1 1 1 1 1 1 1 1 1 1 1 1 1 1 1 1 1 
##$CPDPRG= <>
##$CPDPRG1= <>
##$CPDPRG2= <>
##$CPDPRG3= <>
##$CPDPRG4= <mlev>
##$CPDPRG5= <mlev>
##$CPDPRG6= <mlev>
##$CPDPRG7= <mlev>
##$CPDPRG8= <mlev>
##$CPDPRGB= <>
##$CPDPRGT= <>
##$D= (0..31)
0 1.2 0 0 0 0 0 0 0 0.06 0 0.03 0 0 0 0 0.0002 0 0 0 0 0 0 0 0 0 0 0 0 
0 0 0 
##$DATE= 1704793945
##$DBL= (0..7)
$$ [...]
##$SUBNAM3= <"">
##$SUBNAM4= <"">
##$SUBNAM5= <"">
##$SUBNAM6= <"">
##$SUBNAM7= <"">
##$SUBNAM8= <"">
##$SUBNAM9= <"">
##$SW= 18.0517328524113
##$SWIBOX= (0..15)
0 0 2 0 0 0 0 0 0 0 0 0 0 0 0 0 
##$SW_h= 3612.71676300578
##$TD= 16384
##$TD0= 1
##$TE= 0
##$TE2= 300
##$TE3= 300
##$TEG= 300
##$TL= (0..7)
0 120 120 120 120 120 120 120 
##$TP= (0..7)
150 150 150 150 150 150 150 150 
##$TP07= 0
##$TPNAME0= <>
##$TPNAME1= <>
##$TPNAME2= <>
##$TPNAME3= <>
##$TPNAME4= <>
##$TPNAME5= <>
##$TPNAME6= <>
##$TPNAME7= <>
##$TPOAL= (0..7)
0.5 0.5 0.5 0.5 0.5 0.5 0.5 0.5 
##$TPOFFS= (0..7)
0 0 0 0 0 0 0 0 
##$TUNHIN= 0
##$TUNHOUT= 0
##$TUNXOUT= 0
##$USERA1= <user>
##$USERA2= <user>
##$USERA3= <user>
##$USERA4= <user>
##$USERA5= <user>
##$V9= 5
##$VALIST= <valist>
##$VCLIST= <CCCCCCCCCCCCCCC>
##$VD= 0
##$VDLIST= <DDDDDDDDDDDDDDD>
##$VPLIST= <PPPPPPPPPPPPPPP>
##$VTLIST= <TTTTTTTTTTTTTTT>
##$WBST= 1024
##$WBSW= 4
##$XGAIN= (0..3)
0 0 0 0 
##$XL= 0
##$YL= 0
##$YMAX_a= 68507
##$YMIN_a= -88761
##$ZGOPTNS= <>
##$ZL1= 120
##$ZL2= 120
##$ZL3= 120
##$ZL4= 120
##$ABSF1= 15.39652
##$ABSF2= -2.655328
##$ABSG= 5
##$ABSL= 3
##$ALPHA= 0
##$AQORDER= 0
##$ASSFAC= 0
##$ASSFACI= 0
##$ASSFACX= 0
##$ASSWID= 0
##$AUNMP= <proc_1d>
##$AZFE= 0.1
##$AZFW= 0.1
##$BCFW= 0
##$BC_mod= 2
##$BYTORDP= 0
##$COROFFS= 0
##$CY= -3
##$DATMOD= 1
##$DC= 0
##$DFILT= <>
##$DTYPP= 0
##$F1P= 0
##$F2P= 0
##$FCOR= 1
##$FTSIZE= 16384
##$FT_mod= 6
##$GAMMA= 0
##$GB= 0
##$INTBC= 1
##$INTSCL= 3.70164e-10
##$ISEN= 128
##$LB= 0.24
##$LEV0= 0
##$LPBIN= 0
##$MAXI= 10000
##$MC2= 0
##$MEAN= 0
##$ME_mod= 0
##$MI= 1.114404
##$NCOEF= 0
##$NC_proc= -9
##$NLEV= 6
##$NOISF1= 3.799351
##$NOISF2= 2.8
##$NSP= 0
##$NTH_PI= 0
##$NZP= 0
##$OFFSET= 15.53094
##$PC= 1
##$PHC0= -24588.11
##$PHC1= 12.05273
##$PH_mod= 1
##$PKNL= yes
##$PPARMOD= 0
##$PSCAL= 0
##$PSIGN= 0
##$REVERSE= no
##$SF= 200.129998152602
##$SI= 16384
##$SIGF1= 3
##$SIGF2= 2
##$SINO= 5.538805
##$SIOLD= 16384
##$SREGLST= <1H.CDCl3>
##$SSB= 0
##$STSI= 16384
##$STSR= 0
##$SW_p= 3612.71676300578
##$SYMM= 0
##$S_DEV= 0
##$TDeff= 16384
##$TDoff= 0
##$TI= <>
##$TILT= no
##$TM1= 0
##$TM2= 0
##$TOPLEV= 0
##$USERP1= <user>
##$USERP2= <user>
##$USERP3= <user>
##$USERP4= <user>
##$USERP5= <user>
##$WDW= 1
##$XDIM= 16384
##$YMAX_p= 495594921
##$YMIN_p= -2654893
$$ End of Bruker specific parameters
$$ ---------------------------------
##NTUPLES= NMR SPECTRUM
##VAR_NAME=  FREQUENCY,     SPECTRUM/REAL,   SPECTRUM/IMAG
##SYMBOL=    X,             R,               I
##VAR_TYPE=  INDEPENDENT,   DEPENDENT,       DEPENDENT
##VAR_FORM=  AFFN,          ASDF,            ASDF
##VAR_DIM=   16384,         16384,           16384
##UNITS=     HZ,            ARBITRARY UNITS, ARBITRARY UNITS
##FACTOR=    0.220516191357247, 1,           1
##FIRST=     3108.20700468487, 0,            0
##LAST=      -504.509758320914, 0,           0
##MIN=       -504.509758320914, -2654893,    0
##MAX=       3108.20700468487, 495594921,    0
$$ Real data points
##PAGE= N=1
##DATA TABLE= (X++(R..R)), XYDATA
$$ [...]
$$ plain form
11793 -236860 -459291 -1108311 -447584 -17912 -58584 -60947 -388564 522080 228250 -445490
11783 -445490 -357827 698515 303410 -109336 -715517 -932512 -589785 -746121 318251
11774 318251 -151233 -528558 -629548 -7248 601528 -403411 -514529 -154790 -139696 -456752
11764 -456752 43891 550720 -70836 -995726 -281748 217752 -557416 -66636 136495 170649
11754 170649 439189 724573 256259 23094 180952 407896 403269 365155 618683 562814
11744 562814 -364602 1139 668774 261520 704187 282091 202329 -290021 43438 144153
11734 144153 262279 412785 -481661 -587029 -44405 261284 502735 1142079 1288711 1217240
11724 1217240 702787 1100473 602374 -324778 851575 1537190 1005491 615717 -179768
$$ packed form
11793b36860k22431o49020O60727M29672m0672k363l27617R10644k93830o73740
11783d45490Q7663J056342l95105m12746o06181k16995L42727j56336J064372
11774C18251m69484l77325j00990O22300O08776j004939j11118L59739J5094l17056
11764d56752N00643N06829o21556r24890P13978M99500p75168M90780K03131L4154
11754A70649K68540K85384m68314k33165J57858K26944m627l8114K53528n5869
11744E62814r27416L65741O67635m07254M42667m22096p9762m92350L33459J00715
11734A44153J18126J50506q94446j05368N42624L05689K41451O39344J46632p1471
11724A217240n14453L97686m98099r27152J176353O85615n31699l89774p95485
$$ plain form
11715 -179768 -231393 -14641 -286189 447382 797877 953807 740269 340104 219008 380424
11705 380424 290379 -88499 129298 68179 422054 -115044 -58180 370273 10796 729456
11695 729456 -315024 -296168 -155443 -538519 -56397 -347587 -62014 645894 943644 575385
11685 575385 -34068 44880 559949 983483 -115322 -163499 -254330 283842 1320105 479304
11675 479304 -362196 -327937 -162828 -976298 -508470 72880 33564 -291545 58081 -117296
11665 -117296 -100535 -69825 -221298 -703037 -174140 290792 -535368 -547013 268145 59224
11655 59224 -375264 -54894 510563 -187165 -370549 302053 141895 568444 1100360 592088
11645 592088 233054 -63090 88052 -11637 -55696 -137977 283005 1098892 625031 427113
$$ packed form
11715a79768n1625K16752k71548P33571L50495J55930k13538m00165j21096J61416
11705C80424r0045l78878K17797o1119L53875n37098N6864M28453l59477P18660
11695G29456j044480J8856J40725l83076M82122k91190K85573P07908K97750l68259
11685E75385o09453P8948N15069M23534j098805m8177r0831N38172J036263q40801
11675D79304q41500L4259J65109q13470M67828N81350l9316l25109L49626j75377
11665a17296J6761L0710j51473m81739N28897M64932q26160j1645Q15158k08921
11655E9224m34488L20370N65457o97728j83384O72602j60158M26549N31916n08272
11645E92088l59034k96144J51142r9689m4059q2281M20982Q15887m73861j97918
$$ plain form
11635 427113 399872 557475 914520 839305 270762 147759 650068 604160 193091 383291
11625 383291 555516 446257 242264 459119 421839 521468 802344 1378171 -12769 -106843
11615 -106843 306223 452903 375751 -266631 496405 1178220 597188 259766 650198 476395
11605 476395 -454970 -186034 165797 968621 1554022 385231 486886 982372 532895
11596 532895 164197 613433 858499 1792902 2062086 788957 777005 1401056 1494544 1354222
11586 1354222 81605 -67027 1393069 1471072 493936 1666020 1373427 974834 1180173
11577 1180173 1341353 1420382 997651 1035673 870427 1069241 799132 72752 343958 434630
11567 434630 407120 859988 1142935 853388 802468 422100 -349770 -81636 -490020 -90158
$$ packed form
11635D27113k7241J57603L57045p5215n68543j23003N02309m5908m11069J90200
11625C83291J72225j09259k03993K16855l7280R9629K80876N75827j390940r4074
11615a06843M13066J46680p7152o42382P63036O81815n81032l37422L90432j73803
11605D76395r31365K68936L51831Q02824N85401j168791J01655M95486m49477
11596E32895l68698M49236K45066R34403K69184j273129j1952O24051R3488j40322
11586A354222j272617j48632J460096P8003r77136J172084k92593l98593K05339
11577A180173J61180P9029m22731L8022j65246J98814k70109p26380K71206R0672
11567D34630k7510M52868K82947k89547n0920l80368p71870K68134m08384L99862
$$ plain form
11557 -90158 1048805 454482 561514 401982 415817 437467 -26924 1547911 1300420 751623
11547 751623 769916 732990 1157983 1011366 973330 1061663 1480482 773077 157385 1239040
11537 1239040 1916632 980806 340474 958092 390222 118084 532812 496866 589983 572637
11527 572637 942827 956943 568463 1492436 924596 409093 407399 593873 1134007 1983920
11517 1983920 951551 1277018 823017 338180 484847 590333 378116 22164 746256
11508 746256 417188 629197 936756 1679331 1450476 515146 726542 1069510 1236181 2432850
11498 2432850 1333728 1057357 696417 770853 649436 762294 621086 661573 607755 810483
11488 810483 1164132 1055917 863274 647579 646706 1072192 1353962 937845 1413410 1103700
$$ packed form
11557i0158J138963n94323J07032j59532J3835K1650m64391J574835k47491n48797
11547G51623J8293l6926M24993j46617l8036Q8333M18819p07405o15692J081655
11537A239040O77592r35826o40332O17618n67870k72138M14728l5946R3117j7346
11527E72637L70190J4116l88480R23973n67840n15503j694J86474N40134Q49913
11517A983920j032369L25467m54001m84837J46667J05486k12217l55952P24092
11508G46256l29068K12009L07559P42575k28855r35330K11396L42968J66671J196669
11498B432850j099122k76371l60940P4436j21417J12858j41208M0487n3818K02728
11488H10483L53649j08215j92643k15695q73M25486K81770m16117M75565l09710
$$ plain form
11478 1103700 1368689 1640091 1724365 2165765 2030024 1788421 2118252 1867017 2008445 2053544
11468 2053544 1733581 1654488 1400659 1209646 1239281 1689778 1656139 1430769 1349283 1409164
11458 1409164 1568594 1714462 1734588 2415507 2556375 2541545 2221309 2601164 2101363 1403827
11448 1403827 2059849 1603553 2272058 2236505 2055074 2363534 2523970 3186535 2972200 2138202
11438 2138202 2050834 2131911 2839564 3296074 3954563 2934408 2408288 2841335 3117432 3616869
11428 3616869 3607859 4325982 4127706 3451603 3169219 3058939 3412243 3517667 3857560 4390217
11418 4390217 4159926 4301767 4229591 4030001 3919010 4757725 4675415 4962654 5112200 4488881
11408 4488881 4573182 4687475 5283111 5946388 5925103 5231608 5862198 5455594 5745374 6764559
$$ packed form
11478A103700K64989K71402Q4274M41400j35741k41603L29831k51235J41428M5099
11468B053544l19963p9093k53829j91013K9635M50497l3639k25370q1486N9881
11458A409164J59430J45868K0126O80919J40868j4830l20236L79855m99801o97536
11448A403827O56022m56296O68505l5553j81431L08460J60436O62565k14335q33998
11438B138202q7368Q1077P07653M56510O58489j020155n26120M33047K76097M99437
11428C616869r010P18123j98276o76103k82384j10280L53304J05424L39893N32657
11418D390217k30291J41841p2176j99590j10991Q38715q2310K87239J49546o23319
11408D488881Q4301J14293N95636O63277k1285o93495O30590m06604K89780J019185
$$ plain form
11398 6764559 6806500 6788851 7237685 7975261 7715395 8057045 8522357 8753040 9342278 8664779
11388 8664779 8369483 9052672 9113513 9117074 9147589 9839690 9924085 10176732 10352707 11302909
11378 11302909 11590541 11992554 12180387 12211013 12021595 12484444 13585104 13831167 13793429
11369 13793429 13419367 13868697 13434759 12927175 12832255 13440794 13593743 13945149 14159039
11360 14159039 13421391 13593838 12688255 12446753 12640460 12730956 13537169 13384634 12780817
11351 12780817 13106618 13467396 13164587 14101426 14517542 13565698 13885574 14988725 15638972
11342 15638972 16388339 15545808 16204344 15845916 16631482 17227202 17270181 17272744 18386803 18328839
11332 18328839 17959017 19176918 18886755 18529209 19651048 20008317 20165776 19729382 18725365
$$ packed form
11398F764559M1941j7649M48834P37576k59866L41650M65312K30683N89238o77499
11388H664779k95296O83189O0841L561L0515O92101Q4395K52647J75975R50202
11378A1302909K87632M02013J87833L0626j89418M62849J100660K46063l7738
11369A3793429l74062M49330m33938n07584r4920O08539J52949L51406K13890
11360A4159039p37648J72447r05583k41502J93707R0496Q06213j52535o03817
11351A2780817L25801L60778l02809R36839M16116r51844L19876J103151O50247
11342A5638972P49367q42531O58536l58428P85566N95720M2979K563J114059n7964
11332A8328839l69822J217901k90163l57546J121839L57269J57459m36394j004017
$$ plain form
11323 18725365 18475872 18762371 18438743 17425411 17616532 17441852 16920684 16488884 16077439
11314 16077439 14761158 14166117 13573609 13438843 12421700 11484668 11030095 11123814 11080597
11305 11080597 10977185 10650789 9766245 9251045 9159118 9075657 8912440 8580880 8218317 8765975
11295 8765975 8908299 7587257 6919210 6851422 7214316 7149637 5672027 5239050 5426973
11286 5426973 5024915 5296749 5863082 5695457 4363727 4489452 4886738 4156666 4411322
11277 4411322 4477970 4372588 3360118 2725057 3827656 2966570 3102331 3401289 3441348
11268 3441348 3605742 3198379 2623075 2029834 1647763 3030594 3190722 2557871 2273934
11259 2273934 2489579 2571791 1991942 1856889 2045681 1837892 2141625 3017392 2839454 2626976
$$ packed form
11323A8725365k49493K86499l23628j013332J91121j74680n21168m31800m11445
11314A6077439j316281n95041n92508j34766j017143r37032m54573R3719m3217
11305A1080597j03412l26396q84544n15200r1927q3461j63217l31560l62563N47658
11295H765975J42324j321042o68047o7788L62894o4679j477610m32977J87923
11286E426973m02058K71834N66333j67625j331730J25725L97286p30072K54656
11277D411322O6648j05382j012470o35061J102599q61086J35761K98958M0059
11268C441348J64394m07363n75304n93241l82071J382831J60128o32851k83937
11259B273934K15645Q2212n79849j35053J88792k07789L03733Q75767j77938k12478
$$ plain form
11249 2626976 2777430 2112532 2385116 2366903 2542976 2876427 2747321 2129999 2493737 2024218
11239 2024218 1506757 2148561 1395931 1574669 1966657 2293681 2770657 2464748 1642147
11230 1642147 1742830 2193814 1317122 1663848 2342255 1891355 2116477 2428033 2092749
11221 2092749 1806545 2134972 1474077 2089583 2046616 2504216 2332667 1942317 1233774 1610248
11211 1610248 2126812 2265734 1421496 1596619 1292262 1683418 1193667 572635 1826563
11202 1826563 1362566 1612743 1876958 1496453 1807956 1408270 1187240 1072721 1805990
11193 1805990 2071879 2490110 2263100 2058154 1961689 1755331 1329939 1609723 1909604 1561414
11183 1561414 1207866 2103053 2220355 954526 1436408 934064 1865674 2596241 1020331
$$ packed form
11249B626976J50454o64898K72584j8213J76073L33451j29106o17322L63738m69519
11239B024218n17461O41804p52630J78738L91988L27024M76976l05909q22601
11230A642147J00683M50984q76692L46726O78407m50900K25122L11556l35284
11221B092749k86204L28427o60895O15506m2967M57600j71549l90350p08543L76474
11211A610248N16564J38922q44238J75123l04357L91156m89751o21032J253928
11202A826563m63997K50177K64215l80505L11503l99686k21030j14519P33269
11193A805990K65889M18231k27010k04946r6465k06358m25392K79784K99881l48190
11183A561414l53548Q95187J17302j265829M81882n02344R31610P30567j575910
$$ plain form
11174 1020331 1589942 1876306 1312314 1279989 890664 846029 421841 897171 1262031 1308994
11164 1308994 1174032 1812951 1496221 1452293 1403511 1910791 1308678 1989845 2872311 2007610
11154 2007610 1479087 1834084 2195407 2378475 1613661 1884921 2226308 1716641 1029482
11145 1029482 1764479 1904296 1097401 1981519 2165483 2625573 1987857 2232635 2414327
11136 2414327 2552180 2521757 2191168 1724007 1417917 1788910 1805417 2052159 2028775 2030276
11126 2030276 1728090 1985870 2374968 1502894 2249501 1899207 1580297 1786526 2218297
11117 2218297 2602278 2763858 2420336 2389514 2465071 2738925 2932662 2938141 2625029 2231576
11107 2231576 2352452 3535968 3239663 2448216 2765096 2040285 2176561 1340703 2688023
$$ packed form
11174A020331N69611K86364n63992l2325l89325m4635m24188M75330L64860M6963
11164A308994j34962O38919l16730m3928m8782N07280o02113O81167Q82466q64701
11154B007610n28523L54997L61323J83068p64814K71260L41387n09667o87159
11145A029482P34997J39817q06895Q84118J83964M60090o37716K44778J81692
11136B414327J37853l0423l30589m67161l06090L70993J6507K46742k3384J501
11126B030276l02186K57780L89098q72074P46607l50294l18910K06229M31771
11117B218297L83981J61580l43522l0822P5557K73854J93737N479l13112l93453
11107B231576J20876J183516k96305p91447L16880p24811J36276q35858J347320
$$ plain form
11098 2688023 3614304 3526314 2779223 3536398 3304790 3736755 3910322 3826717 3244358 3161847
11088 3161847 3912421 4805440 4633578 3954933 4150123 4397139 3633775 3458723 3245622
11079 3245622 4164085 3875676 3394761 4522576 4524476 4859445 5231219 5553122 5415462 5190342
11069 5190342 4930374 5888112 6273593 6466199 5733439 5447102 5447805 6075034 5857801 6122289
11059 6122289 6001972 6298454 6529065 6281106 7106343 7566343 7142112 7260232 7664721
11050 7664721 7702658 7449581 7701610 8270013 8456078 8629572 8779645 8380353 8644446 8549596
11040 8549596 9829526 10968685 11146179 10849828 11337146 11133071 10595726 10868410 11343276
11031 11343276 11748339 11991650 12557555 11923824 12931003 12747959 13576641 13798775 14287410
$$ packed form
11098B688023R26281q7990p47091P57175k31608M31965J73567q3605n82359q2511
11088C161847P50574Q93019j71862o78645J95190K47016p63364j75052k13101
11079C245622R18463k88409m80915J127815J900L34969L71774L21903j37660k25120
11069E190342k59968R57738L85481J92606p32760k86337P03O27229k17233K64488
11059F122289j20317K96482K30611k47959Q25237M60000m24231J18120M04489
11050G664721L7937k53077K52029N68403J86065J73494J50073l99292K64093r4850
11040H549596J279930J139159J77494k96351M87318k04075n37345K72684M74866
11031A1343276M05063K43311N65905o33731J007179j83044Q28682K22134M88635
$$ plain form
11022 14287410 14541900 14634240 15373599 15854185 16352340 15363932 15801831 16888032 17634493
11013 17634493 17318717 17510580 18199184 18041071 18680778 18926403 19006863 18640669 18226302
11004 18226302 18710290 19046517 19433647 18732781 18433426 18371658 18007334 16988142 16197926
10995 16197926 16476485 15599479 15379160 16058923 16003377 14462018 13984350 13588644 13365906
10986 13365906 13126590 12664927 12424316 12447726 11897739 11107151 10005386 10614487 10903686
10977 10903686 10732962 10907071 10098244 10204448 9913625 9212004 8149243 7671729 7404568
10968 7404568 7856922 7815282 7549058 7777643 7622824 7054573 7317038 7048357 7610761 7259810
10958 7259810 6598134 6108047 6315642 6194530 5091020 4395285 5129847 5138650 4666559 4298693
$$ packed form
11022A4287410K54490R2340P39359M80586M98155r88408M37899J086201P46461
11013A7634493l15776J91863O88604j58113O39707K45625Q0460l66194m14367
11004A8226302M83988L36227L87130p00866k99355o1768l64324j019192p90216
10995A6197926K78559q77006k20319O79763n5546j541359m77668l95706k22738
10986A3365906k39316m61663k40611K3410n49987p90588j101765O09101K89199
10977A0903686j70724J74109q08827J06204k90823p01621j062761m77514k67161
10968G404568M52354m1640k66224K28585j54819n68251K62465k68681N62404l50951
10958G259810o61676m90087K07595j21112j103510o95735P34562Q803m72091l67866
$$ plain form
10948 4298693 4725663 3975360 3626218 4530259 4699836 4596723 4578251 3920843 4412331 4983204
10938 4983204 4098944 3722680 4596676 3680566 2694225 2980380 3632041 3987571 3513285
10929 3513285 4113207 3635402 3517802 4734690 4356940 3447151 3227577 3278814 3219267 3906094
10919 3906094 3530299 3970114 4333244 4132622 4524029 3292329 3102358 2757743 2814560
10910 2814560 3786026 4261276 4136677 3878557 3850233 4811099 4379488 4073995 4158293 3974843
10900 3974843 3080722 3023981 3003673 3322642 2993188 4106283 4644417 3699438 3533160 3814465
10890 3814465 3636797 3532472 3286251 2961269 2480897 3272014 2836134 3528688 3803328
10881 3803328 3755084 3921080 3936523 3738003 4060230 4638973 4213545 3890156 3959606 3388505
$$ packed form
10948D298693M26970p50303l49142R04041J69577j03113j8472o57408M91488N70873
10938D983204q84260l76264Q73996r16110r86341K86155O51661L55530m74286
10929C513285N99922m77805j17600J216888l77750r09789k19574N1237n9547O86827
10919C906094l75795M39815L63130k00622L91407j231700j89971l44615N6817
10910B814560R71466M75250j24599k58120k8324R60866m31611l05493Q4298j83450
10900C974843q94121n6741k0308L18969l29454J113095N38134r44979j66278K81305
10890C814465j77668j04325k46221l24982m80372P91117m35880O92554K74640
10881C803328m8244J65996J5443j98520L22227N78743m25428l23389O9450n71101
$$ plain form
10871 3388505 3358665 3352172 3462042 3258504 3476957 3385632 2636999 3696436 4027343 4480771
10861 4480771 3940792 3060286 3281051 3985965 3316085 3836489 3751793 3803525 4937320 4196410
10851 4196410 3821924 3532863 3375319 4316005 4015534 4962085 4803726 3515491 3682428
10842 3682428 4336985 4016445 3961062 4883797 5030642 4933179 5020127 5447049 5721690 4952931
10832 4952931 4252856 4392158 4168438 4926356 5413231 5353888 5608232 5252392 5722571 5393591
10822 5393591 5082843 5659303 5472035 5422614 5324950 4863296 5260207 5876720 7022036 6792379
10812 6792379 5999122 6591452 6414918 6489830 7272275 7097159 7603966 7303366 7262442 7828626
10802 7828626 7675546 7833004 7611503 7535919 7313327 6798020 7687592 8292097 8541851 9306483
$$ packed form
10871C388505k9840o493J09870k03538K18453r1325p48633J059437L30907M53428
10861D480771n39979q80506K20765P04914o69880N20404q4696N1732J133795p40910
10851D196410l74486k89061j57544R40686l00471R46551j58359j288235J66937
10842C682428O54557l20540n5383R22735J46845r7463Q6948M26922K74641p68759
10832D952931p00075J39302k23720P57918M86875n9343K54344l55840M70179l28980
10822E393591l10748N76460j87268m9421r7664m61654L96911O16513J145316k29657
10812F792379p93257N92330j76534P4912P82445j75116N06807l00600m0924N66184
10802G828626j53080J57458k21501p5584k22592n15307Q89572O04505K49754P64632
$$ plain form
10792 9306483 8819664 9107542 9510630 9190260 8291351 8693143 9704525 8529529 9820713
10783 9820713 10164111 9864979 10273815 9725580 10245707 10319133 10142593 10430826 10728599 11733936
10773 11733936 12040316 11272593 11798056 12706519 13280876 13462413 13207128 13170011 12760352
10764 12760352 14541872 14125576 14556874 15218197 14632281 15073925 15274025 15756375 16084324
10755 16084324 17119416 17345042 17016200 16687429 17515875 18508774 18911650 19540732 19105406
10746 19105406 19233524 20112332 20435344 20799829 21425902 22152194 22621559 22680400 23560857
10737 23560857 24558628 24319284 24952531 25494334 26215446 27317246 28170846 28811479 28797897
10728 28797897 29562619 30419798 30610168 31253569 32714589 33990107 34703199 35558023 36208818
$$ packed form
10792I306483m86819K87878M03088l20370q98909M01792J011382j174996J291184
10783I820713L43398k99132M08836n48235N20127P3426j76540K88233K97773J005337
10773A1733936L06380p67723N25463R08463N74357J81537k55285l7117m09659
10764A2760352J781520m16296M31298O61323n85916M41644K00100M82350L27949
10755A6084324J035092K25626l28842l28771Q28446R92899M02876O29082m35326
10746A9105406J28118Q78808L23012L64485O26073P26292M69365N8841Q80457
10737B3560857R97771k39344O33247N41803P21112J101800Q53600O40633j3582
10728B8797897P64722Q57179J90370O43401J461020J275518P13092Q54824O50795
$$ plain form
10719 36208818 37555893 38137139 39329564 40398222 41336102 42911911 43274524 43854660 45667195
10710 45667195 46642716 48469481 49768881 49967902 50409465 51291752 52422571 53108920 53781224
10701 53781224 54516072 55440767 55268235 56253112 56413223 57426985 58316668 58602717 58881114
10692 58881114 58563379 58052628 58057698 57149920 56911950 56273872 55092387 54452976 52741702
10683 52741702 52163897 50680525 49974320 48147061 47710167 45829048 44242314 42510652
10675 42510652 42119175 41476972 40400814 38859352 37432286 36370917 34618987 33552644
10667 33552644 33289541 32171593 30867952 30580970 29693953 28953765 28339123 27623385 27120326
10658 27120326 25881312 24582393 24471495 23606251 22917775 22648895 22191820 21048682 20789463
$$ packed form
10719C6208818J347075N81246J192425J068658R37880J575809L62613N80136J812535
10710D5667195R75521J826765J299400J99021M41563Q82287J130819O86349O72304
10701E3781224P34848R24695j72532R84877J60111J013762Q89683K86049K78397
10692E8881114l17735n10751N070r07778k37970o38078j181485o39411j711274
10683E2741702n77805j483372p06205j827259m36894j881119j586734j731662
10675D2510652l91477o42203j076158j541462j427066j061369j751930j066343
10667C3552644k63103j117948j303641k86982q87017p40188o14642p15738n03059
10658B7120326j239014j298919j10898q65244o88476k68880m57075j143138k59219
$$ plain form
10649 20789463 19934853 19424053 18971182 18073014 17300111 17080628 16089225 16106942 16436114
10640 16436114 15737056 16247506 14619844 14422024 14909443 14578883 14726594 14176674 13203334
10631 13203334 12726591 12105844 11207177 12414310 11631215 11753317 11006850 10930775 10168122
10622 10168122 9917753 10085697 11058146 10019353 9184453 9263211 9077892 9140140 7782424
10613 7782424 7459764 8380063 8217899 7507683 8454893 8444908 8991788 8572823 8155999 7304863
10603 7304863 7881968 7730419 6901438 6547073 6850565 6174019 5900754 6904930 6858085
10594 6858085 6392042 6230355 6474535 6563572 7264298 7566882 6310878 5118878 4657297
10585 4657297 5538974 5156034 5443332 4984553 4760977 5592272 6058603 5411647 5136403
$$ packed form
10649B0789463q54610n10800m52871q98168p72903k19483r91403J7717L29172
10640A6436114o99058N10450j627662j97820M87419l30560J47711n49920r73340
10631A3203334m76743o20747q98667J207133p83095J22102p46467p6075p62653
10622A0168122k50369J67944R72449j038793q34900P8758j85319O2248j357716
10613G782424l22660R20299j62164p10216R47210r985N46880m18965m16824q51136
10603G304863N77105j51549q28981l54365L03492o76546k73265J004176m6845
10594F858085m66043j61687K44180Q9037P00726L02584j256004j192000m61581
10585D657297Q81677l82940K87298m58779k23576Q31295M66331o46956k75244
$$ plain form
10576 5136403 6073834 5602548 6015618 4962345 5378518 6266902 5350570 5504754 5352710
10567 5352710 4649138 4471005 4724216 4362294 4214758 4192327 4315943 5519654 5667515
10558 5667515 6036765 5593459 4335786 3955071 4437307 3816142 4170565 4912866 5067978
10549 5067978 4590881 4156926 3784943 4278817 4983983 5215884 4441498 3202515 3295787
10540 3295787 3394028 4182182 3960294 4156928 3800356 4102707 4726978 4409316 3939764 3139433
10530 3139433 3642463 3296058 2767185 2744548 3082390 3361898 3320295 3194777 3278800 3042377
10520 3042377 3296665 3517380 3223227 2892424 3192467 3251809 3281842 3361290 3827866 3392558
10510 3392558 4107135 3644602 3423299 3428411 3662945 3190012 3913445 4001588 2925281 2940320
$$ packed form
10576E136403R37431m71286M13070j053273M16173Q88384r16332J54184j52044
10567E352710p03572j78133K53211l61922j47536k2431J23616J203711J47861
10558E667515L69250m43306j257673l80715M82236o21165L54423P42301J55112
10549E067978m77097m33955l71983M93874P05166K31901p74386j238983R3272
10540C295787R8241P88154k21888J96634l56572L02351O24271l17662m69552q00331
10530C139433N03030l46405n28873k2637L37842K79508m1603j25518Q4023k36423
10520C042377K54288K20715k94153l30803L00043N9342L0033P9448M66576m35308
10510C392558P14577m62533k21303N112K34534m72933P23433Q8143j076307J5039
$$ plain form
10500 2940320 1964105 2225282 3119632 3554066 3443767 3836791 3459816 3499005 3569433 4046425
10490 4046425 3050672 3501720 3512517 3721668 3706987 3868580 3770906 3770125 3928142 3672904
10480 3672904 2942210 2658735 3717231 4060622 3539382 3304894 2748801 3440356 3012988
10471 3012988 3586527 3806103 3639679 3195081 2706202 2952512 3189697 3169953 2709005 2446127
10461 2446127 3370425 3836812 2398609 2175610 3209824 3069555 2242806 2264197 2024984
10452 2024984 2527672 1255691 2194135 2988167 2990338 2729268 2455402 3132574 2562290 1926130
10442 1926130 2044485 2218965 1940702 1313194 2314421 2655756 2302427 2197071 2333360
10433 2333360 2490718 2828173 2755581 2319302 3070029 2606116 2469933 2822942 1796075
$$ packed form
10500B940320r76215K61177Q94350M34434j10299L93024l76975L9189P0428M76992
10490D046425r95753M51048J0797K09151j4681J61593r7674p81J58017k55238
10480C672904p30694k83475J058496L43391n21240k34488n56093O91555m27368
10471C012988N73539K19576j66424m44598m88879K46310K37185j9744m60948k62878
10461B446127R24298M66387j438203k22999J034214j40269q26749K1391k39213
10452B024984N02688j271981R38444P94032K171k61070k73866O77172n70284o36160
10442A926130J18355J74480k78263o27508J001227L41335l53329j05356J36289
10433B333360J57358L37455p2592m36279P50727m63913j36183L53009j026867
$$ plain form
10424 1796075 959764 1612371 1807418 1213820 1579638 2294075 2193314 1898166 1461961
10415 1461961 1799969 1619703 1845045 2067426 1866714 1980231 2510074 1666967 1994353
10406 1994353 2409594 1857326 1570483 2012652 2081933 2179761 2268142 2074654 2017654 2038905
10396 2038905 3056573 2602198 2190768 2122631 1732158 1286339 1398321 1594644 1653766 1341523
10386 1341523 1576489 1973613 1939036 1384729 2160681 2426924 2542030 2917947 2779097 2034256
10376 2034256 1722791 1698984 2151730 2184141 1900306 2064756 1718636 1612589 1890749 2317727
10366 2317727 1975102 1240349 1905088 1646863 2026565 1855890 1519118 1802983 1875760 1499840
10356 1499840 1338558 1632521 1124362 1951023 1393569 1654662 1020876 733912 1251538
$$ packed form
10424A796075q36311O52607J95047n93598L65818P14437j00761k95148m36205
10415A461961L38008j80266K25342K22381k00712J13517N29843q43107L27386
10406A994353M15241n52268k86843M42169O9281R7828Q8381j93488n7000K1251
10396B038905J017668m54375m11430o8137l90473m45819J11982J96323N9122l12243
10386A341523K34966L97124l4577n54307P75952K66243J15106L75917j38850p44841
10376B034256l11465k3807M52746L2411k83835J64450l46120j06047K78160M26978
10366B317727l42625p34753O64739k58225L79702j70675l36772K83865P2777l75920
10356A499840j61282K93963n08159Q26661n57454K61093o33786k86964N17626
$$ plain form
10347 1251538 1379503 2680660 3081188 2596724 1985939 1529244 1304443 1267937 1035655
10338 1035655 2061163 2070091 2422343 1414956 543923 1165860 1326020 1361605 514802 292464
10328 292464 752395 1633527 1634493 1611558 335289 526196 997026 1575458 1760924 1259690
10318 1259690 1255382 1515499 1864292 1345873 1226995 1589227 1225466 1802042 2368300 1506345
10308 1506345 2481116 2365886 1875278 2436194 2003438 1651367 1427918 1617290 2071759
10299 2071759 2165364 1899419 1572136 1147855 1428558 1117548 1290228 1535062 802909 1550238
10289 1550238 1601577 1407695 811007 752356 795559 1418248 1475991 1590587 1028788 1994522
10279 1994522 2040741 1656380 1702963 1771404 1807694 1758407 1316143 884198 1725408 1779174
$$ packed form
10347A251538J27965J301157M00528m84464o10785m56695k24801l6506k32282
10338A035655J025508Q928L52252j007387q71033O21937J60160L5585q46803k22338
10328B92464M59931Q81132R66k2935j276269J90907M70830N78432J85466n01234
10318A259690m308K60117L48793n18419j18878L62232l63761N76576N66258q61955
10308A506345R74771j15230m90608N60916m32756l52071k23449J89372M54469
10299B071759R3605k65945l27283m24281K80703l11010J72680K44834p32153P47329
10289A550238N1339j93882n96688n8651M3203O22689N7743J14596n61799R65734
10279A994522M6219l84361M6583O8441L6290m9287m42264m31945Q41210N3766
$$ plain form
10269 1779174 2011593 1700250 1847329 2212545 1900222 2217086 2881798 2431237 1116709
10260 1116709 775276 1513296 1665505 1173435 1090311 1734813 1311453 1655054 1819968 1524528
10250 1524528 1827768 2799686 2459386 1856674 1112561 1223039 1331513 773832 850464 938627
10240 938627 873637 996319 572689 1231811 723379 697549 1250446 1195195 1471231 1476027
10230 1476027 1499879 1586209 1708543 1618299 1292842 945577 239865 1135770 991666 403962
10220 403962 1393179 1447433 1701823 1939680 1712596 2461212 2587146 2482577 2414959 1654556
10210 1654556 1468022 2600798 2596998 2466649 2086003 1753114 2041273 2328319 2709913 3007255
10200 3007255 3269490 3299319 2990360 3708300 3819257 2660999 3100902 2949696 2152845
$$ packed form
10269A779174K32419l11343J47079L65216l12323L16864O64712m50561j314528
10260A116709l41433P38020J52209m92070q3124O44502m23360L43601J64914k95440
10250A524528L03240R71918l40300o02712p44113J10478J08474n57681P6632Q8163
10240I38627o4990J22682m23630O59122n08432k5830N52897n5251K76036M796
10230A476027K3852Q6330J22334r0244l25457l47265p05712Q95905j44104n87704
10220D03962R89217N4254K54390K37857k27084P48616J25934j04569o7618p60403
10210A654556j86534J132776l800j30349l80646l32889K88159K87046L81594K97342
10200C007255K62235K9829l08959P17940J10957j158258M39903j51206p96851
$$ plain form
10191 2152845 2146390 1857951 1420851 1950317 1270905 1678333 1824074 2255415 2233383 2125545
10181 2125545 2088255 2191264 1911797 2036702 2028389 1876955 3061373 2373334 2015861 2602008
10171 2602008 2678530 2358672 2398703 2052949 2296609 2885906 3089447 3173024 2336391 2959035
10161 2959035 2968496 2890025 2505196 2750015 2928546 2562369 2152812 2475871 2730517 3154726
10151 3154726 3410451 3087385 3943946 3246296 2748607 3615222 3163847 3101429 3057851 3696215
10141 3696215 3096807 3271929 3110542 2657721 2806079 2008572 2717682 3340791 3604275
10132 3604275 3355525 3897856 3916943 3845439 4692722 3876796 4160419 4879016 4549650 4340335
10122 4340335 3919783 3634200 3408753 3119932 3393202 3396217 3745546 4054994 3556325 3210366
$$ packed form
10191B152845o455k88439m37100N29466o79412M07428J45741M31341k2032j07838
10181B125545l7290J03009k79467J24905q313j51434J184418o88039l57473N86147
10171B602008P6522l19858M0031l45754K43660N89297K03541Q3577q36633O22644
10161B959035R461p8471l84829K44819J78531l66177m09557L23059K54646M24209
10151C154726K55725l23066Q56561o97650m97689Q66615m51375o2418m3578O38364
10141C696215n99408J75122j61387m52821J48358p97507P09110O23109K63484
10132C604275k48750N42331J9087p1504Q47283q15926K83623P18597l29366k09315
10122D340335m20552k85583k25447k88821K73270L015L49329L09448m98669l45959
$$ plain form
10112 3210366 3368434 2596234 2208208 2657055 3063151 3492902 4008243 3420628 2862399
10103 2862399 3192790 2674899 3122841 2870231 2259840 2225979 2452656 2601415 2668079 2654743
10093 2654743 2945023 2381359 2345546 2150009 2035720 1943008 2001060 1793137 1777293 1977417
10083 1977417 2345625 1977566 1974133 1098179 1143742 1328856 1813994 1681940 2342337 2440122
10073 2440122 1323389 1903007 2396576 2090546 1638593 2036947 2166724 1921266 2148279
10064 2148279 2068079 1656945 1910172 1405650 1289649 1543498 1611446 2050202 2141097 1124721
10054 1124721 629916 1109359 2009187 2195617 2405805 1938033 2738509 2538841 2095694
10045 2095694 2275846 2219230 2369013 2336974 1481894 1636142 2074668 1437498 1514577 1775090
$$ packed form
10112C210366J58068p72200l88026M48847M06096M29751N15341n87615n58229
10103B862399L30391n17891M47942k52610o10391l3861K26677J48759O6664j3336
10093B654743K90280n63664l5813j95537j14289r2712N8052k07923j5844K00124
10083A977417L68208l68059l433q75954M5563J85114M85138j32054O60397R7785
10073B440122j116733N79618M93569l06030m51953L98354J29777k45458K27013
10064B148279q0200m11134K53227n04522j16001K53849O7948M38756R0895j016376
10054A124721m94805M79443Q99828J86430K10188m67772Q00476j99668m43147
10045B095694J80152n6616J49783l2039q55080J54248M38526o37170P7079K60513
$$ plain form
10035 1775090 2297696 1518309 1541847 1719576 2287124 1422296 735084 963425 1927851 2454960
10025 2454960 2733071 2084377 1955155 1771226 1339319 1690789 1451127 2306063 1643859
10016 1643859 2170727 2782613 3005969 1789412 1735268 2354775 2479238 1961387 1210247
10007 1210247 1467991 2668684 1982297 1822128 3662729 4009803 3051355 2301842 2422500
9998 2422500 2271839 2111041 2473123 2684812 2121652 2501994 2629623 2685843 2142969 1998078
9988 1998078 2828538 2412787 1520693 2019859 3269458 3356302 3199954 3854557 3749930 2985137
9978 2985137 2874038 2208802 2518426 2851511 2585293 2105190 2321542 2138698 2021514 2560457
9968 2560457 3371524 3641669 2531323 2928037 2760230 3140885 2932368 3148461 3437312
$$ packed form
10035A775090N22606p79387K3538J77729N67548q64828o87212K28341R64426N27109
10025B454960K78111o48694j29222j83929m31907L51470k39662Q54936o62204
10016A643859N26868O11886K23356j216557n4144O19507J24463n17851p51140
10007A210247K57744J200693o86387j60169J840601L47074r58448p49513J20658
9998B422500j50661j60798L62082K11689n63160L80342J27629N6220n42874j44891
9988A998078Q30460m15751q92094M99166J249599Q6844j56348O54603j04627p64793
9978B985137j11099o65236L09624L33085k66218m80103K16352j82844j17184N38943
9968B560457Q11067K70145j110346L96714j67807L80655k08517K16093K88851
$$ plain form
9959 3437312 2482629 1554813 2500804 2483053 2703574 3370509 4099386 4370689 3672246 3616062
9949 3616062 3523297 3314839 2878857 2928541 3246000 3387276 4362221 4827495 4412394 4301537
9939 4301537 4624442 4756299 4496816 5339126 5634837 5826303 5659316 6301064 5920414 5167339
9929 5167339 5020400 5099044 4240534 4510370 4647563 4015283 3587281 3455693 2895165 3780943
9919 3780943 3920980 3031240 3197135 2745679 3209484 3016370 2378293 2813479 3571948 3172112
9909 3172112 3191075 3245148 2841734 3152736 3268360 3206185 2856693 2877118 2953085 2908702 3182664
9898 3182664 3304200 2511743 2457768 2508674 2314588 2696705 2516482 1910712 1791022 2184478
9888 2184478 2696662 2971650 2330521 2782000 2695461 2678467 2607676 2516891 2994294 3272599
$$ packed form
9959C437312r54683r27816R45991j7751K20521O66935P28877K71303o98443n6184
9949C616062r2765k08458m35982M9684L17459J41276R74945M65274m15101j10857
9939D301537L22905J31857k59483Q42310K95711J91466j66987O41748l80650p53075
9929E167339j46939P8644q58510K69836J37193o32280m28002j31588n60528Q85778
9919C780943J40037q89740J65895m51456M63805j93114o38077M35186P58469l99836
9909C172112J8963N4073m03414L11002J15624o2175l49492K0425P5967m4383K73962
9898C182664J21536p92457n3975N0906j94086L82117j80223o05770j19690L93456
9888B184478N12184K74988o41129M51479q6539j6994p0791r0785M77403K78305
$$ plain form
9878 3272599 4420081 3619601 3132411 3309584 2616232 2658340 2453170 2784993 2471050 2878684
9868 2878684 2369980 2560315 2925309 2495108 3402462 3289838 3573784 3277522 2838157 3261178
9858 3261178 2671074 2158283 3139440 3460509 3470231 3840053 3593636 3454294 3079959 3299374
9848 3299374 2992407 3791812 4388730 4715337 4778052 4228636 3665001 4136165 4706345 4938425
9838 4938425 3716962 3600332 4434809 3247337 3675199 4558689 4806564 5284579 4762021
9829 4762021 4255337 3652765 3751640 4854292 5146736 5433509 5768762 5651894 5307327 5568047
9819 5568047 5027705 4444855 4723526 4552345 4746678 4744704 4456570 5715285 5201474 5526028
9809 5526028 5829615 6114551 5986344 5517107 6731529 6428246 5934153 6357607 6278343 6192918
$$ packed form
9878C272599J147482q00480m87190J77173o93352M2108k05170L31823l13943M07634
9868B878684n08704J90335L64994m30201R07354j12624K83946k96262m39365M23021
9858C261178n90104n12791R81157L21069R722L69822k46417j39342l74335K19415
9848C299374l06967P99405N96918L26607O2715n49416n63635M71164N70180K32080
9838D938425j221463j16630Q34477j187472M27862Q83490K47875M78015n22558
9829D762021n06684o02572R8875J102652K92444K86773L35253j16868l44567K60720
9819E568047n40342n82850K78671j71181J94333j974k88134J258715n13811L24554
9809E526028L03587K84936j28207m69237J214422l03283m94093M23454p9264q5425
$$ plain form
9799 6192918 6451314 6259927 5581389 5582609 6517211 6124829 6642070 7018799 6302475 7040080
9789 7040080 7496273 7263466 6821881 6832850 7173187 7448674 7116303 6978902 7635254 7634330
9779 7634330 7590777 7148509 8068211 8605259 7938000 7652758 8457878 8626667 7685761 8049912
9769 8049912 8168011 8613253 8497194 9122255 9735508 9790315 9499897 9609945 9053435 9644802
9759 9644802 10592368 10090474 11011542 11002722 10494170 11004409 11214848 11155384 11221352 11718437
9749 11718437 12195409 11860067 12679373 13142617 13482934 13836015 13232386 12566634 13504845
9740 13504845 14270562 14566644 14566665 15421734 15623020 16144950 17248662 17393425 17368514 17817552
9730 17817552 17304356 17620224 19206977 19942181 20949938 20707982 20940927 21382692 23348029
$$ packed form
9799F192918K58396j91387o78538J220R34602l92382N17241L76729p16324P37605
9789G040080M56193k32807m41585J0969L40337K75487l32371j37401O56352r24
9779G634330m3553m42268R19702N37048o67259k85242Q05120J68789r40906L64151
9769H049912J18099M45242j16059O25061O13253N4807k90418J10048n56510N91367
9759I644802R47566n01894R21068q820n08552N10239K10439n9464O5968M97085
9749A1718437M76972l35342Q19306M63244L40317L53081o03629o65752R38211
9740A3504845P65717K96082K1Q55069K01286N21930J103712J44763k4911M49038
9730A7817552n13196L15868J586753P35204J007757k41956K32945M41765J965337
$$ plain form
9721 23348029 24197213 23829597 24284116 25292839 26578679 27553213 28085396 29218338 30491548
9712 30491548 31879997 33337309 35808031 37577010 40110531 42942615 46541374 50648536
9704 50648536 53706797 55737956 58085959 59580114 60689914 61671667 61262958 61865373 62007163
9695 62007163 61968679 62946882 62137948 60860565 58756058 56341477 53969112 51328884 49057699
9686 49057699 47130579 45993348 45456286 45090623 44031610 43525138 43492806 43909819 44832386
9677 44832386 45046277 45773431 47247841 47771202 48188607 49000913 50086323 50965247 52423223
9668 52423223 53469147 54784772 56024076 57809294 59084262 60718646 63151324 64151195
9660 64151195 66090352 69312091 71910416 76099097 80054656 84793830 90073688 95851846
$$ packed form
9721B3348029Q49184l67616M54519J008723J285840R74534N32183J132942J273210
9712C0491548J388449J457312K470722J768979K533521K832084L598759M107162
9704E0648536L058261K031159K348003J494155J109800R81753m08709O02415J41790
9695F2007163l8484R78203q08934j277383k104507k414581k372365k640228k271185
9686D9057699j927120j137231n37062l65663j059013n06472l2332M17013R22567
9677D4832386K13891P27154J474410N23361M17405Q12306J085410Q78924J457976
9668E2423223J045924J315625J239304J785218J274968J634384K432678R99871
9660F4151195J939157L221739K598325M188681L955559M739174N279858N778158
$$ plain form
9652 95851846 102688633 110421214 117038426 123375899 130142940 134822442 137762477 140631180
9644 140631180 143432922 146915094 151763483 156609252 161724659 167078807 171545323 177014208
9636 177014208 182125652 189253588 196060492 203612071 211817009 220189534 226475419 230018545
9628 230018545 230767094 229057203 224208332 216128918 205625583 194333771 181371124 167858279
9620 167858279 156281152 144764705 135025795 126418697 119915581 114579033 110532347 107412669
9612 107412669 106305241 105060992 105120798 106096418 107589129 110472828 113513011 116966189
9604 116966189 122893951 129474650 138271439 149144822 160558426 173774502 186671746
9597 186671746 197371638 207656843 215948273 221681437 223134707 221578193 217064920 210347064
$$ packed form
9652I5851846O836787P732581O617212O337473O767041M679502K940035K868703
9644A40631180K801742L482172M848389M845769N115407N354148M466516N468885
9636A77014208N111444P127936O806904P551579Q204938Q372525O285885L543126
9628B30018545P48549j709891m848871q079414j0503335j1291812j2962647j3512845
9620A67858279j1577127j1516447r738910q607098o503116n336548m046686l119678
9612A07412669j107428j244249N9806R75620J492711K883699L040183L453178
9604A16966189N927762O580699Q796789J0873383J1413604J3216076J2897244
9597A86671746J0699892J0285205Q291430N733164J453270j556514m513273o717856
$$ plain form
9589 210347064 199916812 186191707 171087378 155408591 141093221 127726625 116323291
9582 116323291 107356423 101665254 96280017 93309922 91258972 89265593 87768878 86583372
9574 86583372 85273985 84449208 83963859 81520306 79400465 75470893 71300746 67277118
9566 67277118 63156859 59118971 54812755 51351018 48061042 44762491 42476931 40224371
9558 40224371 38912388 36929530 36008615 35662028 33846348 33160430 32242336 31813119 31022811
9549 31022811 31428056 31362404 30719767 30932288 31794860 33452912 35198715 37166706 38143090
9540 38143090 38429271 39273002 40925601 41213807 42248293 42532604 41446183 39931593 38521271
9531 38521271 36759037 34289614 31682590 29947261 27477168 25359189 24953375 22750874
$$ packed form
9589B10347064j0430252j3725105j5104329j5678787j4315370j3366596j1403334
9582A16323291q966868n691169n385237k970095k050950j993379j496715j185506
9574H6583372j309387q24777m85349k443553k119841l929572m170147m023628
9566F7277118m120259m037888m306216l461737l289976l298551k285560k252560
9558D0224371j311983j982858r20915l46587j815680o85918r18094m29217p90308
9549C1022811M05245o5652o42637K12521Q62572J658052J745803J967991R76384
9540C8143090K86181Q43731J652599K88206J034486K84311j086421j514590j410322
9531C8521271j762234k469423k607024j735329k470093k117979m05814k202501
$$ plain form
9523 22750874 20744711 19562561 18727164 17845891 17219362 16782509 16244930 16143132 15947261
9514 15947261 14944466 14429871 13898136 12906320 12977510 12052073 11746683 12051790 11637112
9505 11637112 11218130 11287755 10271255 10138908 9936225 9332009 8385178 7941945 8168207
9496 8168207 8602333 9260551 9157987 9781533 9241086 8989419 9142577 9458933 9309394 9063239
9486 9063239 9229365 8460610 8036318 9065239 8590324 8425175 8280346 8182757 8276256 8556524
9476 8556524 8510512 7880991 8041255 7673139 6841219 7011463 8158795 8015164 6647705
9467 6647705 6807413 7405014 7140565 7702643 7793218 7384736 6880158 6377645 6128273 6770600
9457 6770600 6908450 6214148 6369263 6475921 6385956 6585561 6281607 5774428 6930975 6525486
$$ packed form
9523B2750874k006163j182150q35397q81273o26529m36853n37579j01798j95871
9514A5947261j002795n14595n31735r91816P1190r25437l05390L05107m14678
9505A1637112m18982O9625j016500j32347k02683o04216r46831m43233K26262
9496H168207M34126O58218j02564O23546n40447k51667J53158L16356j49539k46155
9486I063239J66126p68755m24292J028921m74915j65149j44829r7589R3499K80268
9476H556524m6012o29521J60264l68116q31920J70244J147332j43631j367459
9467F647705J59708N97601k64449N62078R0575m08482n04578n02513k49372O42327
9457F770600J37850o94302J55115J06658q9965J99605l03954n07179J156547m05489
$$ plain form
9447 6525486 6371085 6224476 6871280 7520678 7106188 6999743 7744198 7161791 7058286 7307705
9437 7307705 7953641 8423539 8370822 8259441 8703398 7997036 7732894 7462521 7970416 8364692
9427 8364692 7335825 7369982 7099147 7238660 7387498 7862173 7560217 7303008 7394083 7210311
9417 7210311 7326720 7805817 7994657 7890613 7960530 8042989 7898753 8394825 8225009 8567354
9407 8567354 8750706 8982472 7672194 7606803 8770747 8550635 8953706 9186827 8457382
9398 8457382 8853836 9045502 8692390 8118010 8784209 8493433 8713139 9229577 8948711 9275069
9388 9275069 8955267 8860178 8813737 9242694 8685649 9380701 10100770 9477026 8385252 8595931
9378 8595931 9415231 9107183 8739716 8915384 9590324 10243630 10504222 10316004 9989599 9580090
$$ packed form
9447F525486j54401j46609O46804O49398m14490j06445P44455n82407j03505K49419
9437G307705O45936M69898n2717j11381M43957p06362k64142k70373N07895L94276
9427H364692j028867L4157k70835J39513J48838M74675l01956k57209R1075j83772
9417G210311J16409M79097J88840j04044O9917Q2459j44236M96072j69816L42345
9407H567354J83352K31766j310278o5391J163944k20112M03071K33121p29445
9398H457382L96454J91666l53112n74380O66199k90776K19706N16438k80866L26358
9388I275069l19802r5089m6441M28957n57045O95052P20069o23744j091774K10679
9378H595931Q19300l08048l67467J75668O74940O53306K60592j88218l26405m09509
$$ plain form
9368 9580090 9904246 10664027 10843063 10102785 9765419 9603117 9888400 10352106 9771628 9047229
9358 9047229 8023960 8263370 8975182 9659413 10481138 10459185 10002956 9553204 9087539 8902969
9348 8902969 9531649 9651530 10603007 10055183 10366511 10604672 10818953 11295342 11766218 12144307
9338 12144307 11284692 11533058 11926027 12413631 13338065 12408861 12563566 13633456 12560311
9329 12560311 12049923 12446311 13297425 13149413 13072654 12617687 12661952 13812300 13918187 14110534
9319 14110534 14876780 15678118 16518748 17516251 18593189 19658957 20646115 22146009 23223975
9310 23223975 22704404 21817768 21638664 21489047 21377031 21389028 20511676 20182566 19805670 17674014
9300 17674014 16791172 16519308 15079092 13428201 12893330 12826325 13103435 12346387 12808511
$$ packed form
9368I580090L24156P59781J79036p40278l37366j62302K85283M63706n80478p24399
9358I047229j023269K39410P11812O84231Q21725k1953m56229m49752m65665j84570
9348H902969O28680J19881R51477n47824L11328K38161K14281M76389M70876L78089
9338A2144307q59615K48366L92969M87604R24434r29204J54705J069890j073145
9329A2560311n10388L96388Q51114j48012p6759m54967M4265J150348J05887J92347
9319A4110534P66246Q01338Q40630R97503J076938J065768R87158J499894J077966
9310B3223975n19571q86636j79104j49617j12016J1997q77352l29110l76896k131656
9300A7674014q82842k71864j440216j650891n34871o7005K77110p57048M62124
$$ plain form
9291 12808511 12522964 12646590 12472938 11401859 11654256 12470972 13556746 13017337 12978443
9282 12978443 12750961 12623214 12963131 12686538 14187148 14761924 14853951 15655121 15716713 15114340
9272 15114340 15888623 16783931 17373409 18958071 19642538 21269325 22907605 24575194 25705383
9263 25705383 25108199 23786995 23734109 23108164 22800957 22896665 22480562 22096290 20841280
9254 20841280 19173285 18348747 17527549 16729913 15725235 15453547 15183867 13920722 12801898
9245 12801898 13028802 12869669 13024944 13081445 12735936 12493800 12497311 12817742 12548783 11305306
9235 11305306 11709999 13059307 13671334 13238348 13041127 12950352 12810128 12766800 12379131 12654086
9225 12654086 12778589 12849578 12978030 12579363 12863271 13380406 13339377 12951356 13491863 13358639
$$ packed form
9291A2808511k85547J23626j73652j071079K52397Q16716J085774n39409l8894
9282A2978443k27482j27747L39917k76593J500610N74776R2027Q01170O1592o02373
9272A5114340P74283Q95308N89478J584662O84467J626787J638280J667589J130189
9263B5705383n97184j321204n2886o25945l07207R5708m16103l84272j255010
9254B0841280j667995q24538q21198p97636j004678k71688k69680j263145j118824
9245A2801898K26904j59133J55275N6501l45509k42136L511L20431k68959j243477
9235A1305306M04693J349308O12027m32986j97221r0775j40224m3328l87669K74955
9225A2654086J24503P0989J28452l98667K83908N17135m1029l88021N40507j33224
$$ plain form
9215 13358639 13243775 13239745 13903971 13494212 13846346 13519971 14205293 14678336 14102138 13940513
9205 13940513 13238170 13611795 12997676 13647380 13949501 14601232 14405970 14715021 15822253
9196 15822253 16078011 16271998 16129167 15930800 15759652 15676749 16182309 17093507 16836316 17384408
9186 17384408 16980576 16421595 17317974 18709341 18644787 18229252 18210118 17877518 18471274 18778496
9176 18778496 18951237 19352997 19893203 20160514 19932925 20189133 20599113 20405126 21031043
9167 21031043 21778488 22414002 22989180 23369955 24009246 24688349 25140077 25317721 25748208
9158 25748208 26402909 26526068 26613007 27271627 28174058 28022541 28635404 29040142 29884790 30455299
9148 30455299 31043634 31138830 32452739 32696300 34102118 35028720 35297720 35703476 36692491
$$ packed form
9215A3358639j14864m030O64226m09759L52134l26375O85322M73043n76198j61625
9205A3940513p02343L73625o14119O49704L02121O51731j95262L09051J107232
9196A5822253K55758J93987j42831j98367j71148q2903N05560R11198k57191N48092
9186A7384408m03832n58981Q96379J391367o4554m15535j9134l32600N93756L07222
9176A8778496J72741M01760N40206K67311k27589K56208M09980j93987O25917
9167B1031043P47445O35514N75178L80775O39291O79103M51728J77644M30487
9158B5748208O54701J23159Q6939O58620R02431j51517O12863M04738Q44648N70509
9148C0455299N88335R5196J313909K43561J405818R26602K69000M05756R89015
$$ plain form
9139 36692491 37360317 37006168 38004427 38302822 38993374 40190717 40671716 41764133 42999843
9130 42999843 43811384 43801464 44127566 44796075 46459405 47585309 48573034 49843932 50468512
9121 50468512 51716740 52812376 53650227 54856265 55959885 57742903 58493019 59432304 61603808
9112 61603808 63114382 64792153 68094384 70453855 73085275 76911305 81323597 86715993
9104 86715993 91091460 95291642 99763569 102566729 102884346 102809428 102893311 104373908 107028938
9095 107028938 110622877 113423268 115397994 116414555 115617962 114948715 114603921 115589869 117159315
9086 117159315 119639999 121856549 124282433 127273598 130416802 134992485 139445274 145782941
9078 145782941 150948052 154881987 158319711 162764064 167561093 171892707 175268063 179132371
$$ packed form
9139C6692491O67826l54149R98259K98395O90552J197343M80999J092417J235710
9130D2999843Q11541r920L26102O68509J663330J125904R87725J270898O24580
9121E0468512J248228J095636Q37851J206038J103620J783018P50116R39285K171504
9112F1603808J510574J677771L302231K359471K631420L826030M412292N392396
9104H6715993M375467M200182M471927K803160L17617p4918Q3883J480597K655030
9095A07028938L593939K800391J974726J016561p96593o69247l44794R85948J569446
9086A17159315K480684K216550K425884K991165L143204M575683M452789O337667
9078A45782941N165111L933935L437724M444353M797029M331614L375356L864308
$$ plain form
9070 179132371 184552479 190787341 194391465 197371782 200847521 202506140 203351418 203112888
9062 203112888 202694118 201603928 200669244 200845266 203531697 208898267 216839534 224242322
9054 224242322 232168372 240371665 247334102 253903114 263228815 273933997 285953154 301346455
9046 301346455 317784843 337406473 359651195 384431292 408717781 430192285 447108728
9039 447108728 460671193 471006698 478431474 482833484 488656400 492795957 495594921 490780117
9031 490780117 478250175 461548937 439884504 412739902 381649390 346870252 313334185
9024 313334185 284906876 261197771 242950799 228069896 217906951 210533412 205150853
9017 205150853 200535529 197043304 194871865 193060514 192861528 192987748 193383244 196495446
$$ packed form
9070A79132371N420108O234862L604124K980317L475739J658619Q45278k38530
9062B03112888m18770j090190r34684J76022K686431N366570P941267P402788
9054B24242322P926050Q203293O962437O569012R325701J0705182J2019157J5393301
9046C01346455J6438388J9621630K2244722K4780097K4286489K1474504J6916443
9039D47108728J3562465J0335505P424776M402010N822916M139557K798964m814804
9031D90780117j2529942j6701238k1664433k7144602l1090512l4779138l3536067
9024C13334185k8427309k3709105j8246972j4880903j0162945p373539n382559
9017B05150853m615324l492225k171439j811351j98986J26220L95496L112202
$$ plain form
9009 196495446 199968237 204754702 213130987 223007165 232866949 240788592 244836543 243148169
9001 243148169 238948114 233997104 228122207 219914265 207859950 191795695 174629284 160252452
8993 160252452 147780797 137695215 129382963 122843438 117338554 111889722 106850763 104207378
8985 104207378 101453280 100043899 98272417 96912495 95735111 94673971 93913845 93754419
8977 93754419 93851598 94278009 95515446 96096153 97670396 99801591 102491324 106650824 111758148
8968 111758148 116521112 119791939 122579391 123121415 123984281 124952915 125264111 125936966 126545801
8959 126545801 125741429 125715137 128005902 132721880 138255565 144998651 150658941 154972145
8951 154972145 157760923 157023944 152617767 144688425 135859423 125346471 115684541 107542307
$$ packed form
9009A96495446L472791M786465Q376285R876178R859784P921643M047951j688374
9001B43148169m200055m951010n874897q207942j2054315j6064255j7166411j4376832
8993A60252452j2471655j0085582q312252o539525n504884n448832n038959k643385
8985A04207378k754098j409381j771482j359922j177384j061140p60126j59426
8977I3754419R7179M26411J237437N80707J574243K131195K689733M159500N107324
8968A11758148M762964L270827K787452N42024Q62866R68634L11196O72855O08835
8959A26545801q04372k6292K290765M715978N533685O743086N660290M313204
8951A54972145K788778p36979m406177p929342q829002j0512952r661930q142234
$$ plain form
8943 107542307 99844645 95123993 91618596 89144220 86661731 86177897 86612282 86422901
8935 86422901 87052140 89035190 92820921 97151744 102593731 110344142 119359265 128721589
8927 128721589 138026893 143344251 143332346 135560954 124786822 114467341 106633404 101827209
8919 101827209 98739502 97908466 98826863 100332798 102358415 105193743 107973136 109016920
8911 109016920 107545508 105035526 100396175 94898244 88241847 82238516 76808460 73323476
8903 73323476 71164291 68889818 66211076 64340716 62452470 61305911 60449387 60302052
8895 60302052 60547748 59332730 58586311 58305618 58588022 58595710 58816308 58399329 58416936 58988723
8885 58988723 59454726 59682262 60825727 62636872 64109748 64585789 66489683 68483188 71197384
$$ packed form
8943A07542307p697662m720652l505397k474376k482489m83834M34385j89381
8935H6422901O29239J983050L785731M330823N441987P750411R015123R362324
8927A28721589R305304N317358j1905p771392j0774132j0319481p833937m806195
8919A01827209l087707q31036R18397J505935K025617K835328K779393J043784
8911A09016920j471412k509982m639351n497931o656397o003331n430056l484984
8903G3323476k159185k274473k678742j870360j888246j146559q56524j47335
8895F0302052K45696j215018p46419k80693K82404P688K20598m16979J7607N71787
8885E8988723M66003K27536J143465J811145J472876M76041J903894J993505K714196
$$ plain form
8876 71197384 73682933 77070194 80718853 85530606 90710878 96361399 104199288 113458395
8868 113458395 122834012 133881979 144078070 150322198 153927725 152499530 147789722 144875598
8860 144875598 143106538 143931268 146265976 147703210 146929544 141811513 133719917 124223522
8852 124223522 116429035 109292060 104853996 102059808 100175539 98614073 98922380 101112296
8844 101112296 103218197 106088734 109539943 114439101 119562148 126532923 134757607 143465583
8836 143465583 152011038 160894600 167908787 172729297 178303700 185752167 192634072 196698185
8828 196698185 196138434 190397519 181652340 173094158 164250822 158957528 153968850 147906619
8820 147906619 139459425 127077815 115991301 106158548 97637199 90068029 83910678 80067097
$$ packed form
8876G1197384K485549L387261L648659M811753N180272N650521P837889R259107
8868A13458395R375617J1047967J0196091O244128L605527j428195m709808k914124
8860A44875598j769060Q24730K334708J437234p73666n118031q091596r496395
8852A24223522p794487p136975m438064k794188j884269j561466L08307K189916
8844A01112296K105901K870537L451209M899158N123047O970775Q224684Q707976
8836A43465583Q545455Q883562P014187M820510N574403P448467O881905M064113
8828A96698185n59751n740915q745179q558182q843336n293294m988678o062231
8820A47906619q447194j2381610j1086514r832753q521349p569170o157351l843581
$$ plain form
8812 80067097 77861243 76708573 76094758 75278393 76032566 77302522 79451254 80928220 83355591
8803 83355591 86212572 90478876 94489516 97351774 97518785 96053070 92694732 89391235
8795 89391235 88471800 88203746 88033536 85118122 81125018 74766462 66023329 59505547 52844716
8786 52844716 46879165 42155592 38332942 36356668 33791859 32365348 31589012 29333305
8778 29333305 27280826 25727458 25055570 24874047 24132755 23655289 22367678 21712996 20716714
8769 20716714 19666360 19918954 19307331 18430611 18306580 17181889 15978064 15641349 15285711
8760 15285711 14933517 13928126 13614024 13839312 14158773 13239442 13344531 13294802 13331383 12365070
8750 12365070 11531537 11762838 11552733 11426301 10834591 10644148 10495644 11452142 10544907
$$ packed form
8812H0067097k205854j152670o13815q16365P54173J269956K148732J476966K427371
8803H3355591K856981M266304M010640K862258J67011j465715l358338l303497
8795H9391235r19435k68054j70210k915414l993104o358556q743133o517782o660831
8786E2844716n965551m723573l822650j976274k564809j426511p76336k255707
8778B9333305k052479j553368o71888j81523p41292m77466j287611o54682r96282
8769B0716714j050354K52594o11623q76720j24031j124691j203825l36715l55638
8760A5285711l52194j005391l14102K25288L19461r19331J05089m9729L6581r66313
8750A2365070q33533K31301k10105j26432n91710j90443j48504R56498r07235
$$ plain form
8741 10544907 9898153 9792120 10100104 10271067 9959526 9905482 9754824 9864417 10487546 10087339
8731 10087339 9803352 10441443 9558806 9291349 9161327 8732762 8027321 7422313 7842383
8722 7842383 7743767 7873149 7688604 7576227 7818019 7782400 7754564 7559119 7012064 6535223
8712 6535223 6916938 6738100 7249927 7495410 6913628 6710558 6982422 7511122 7056661 6873286
8702 6873286 7099228 7276722 7098143 7090692 8122570 7605664 7088394 6811661 5956426 5194628
8692 5194628 4512254 5147317 6244958 6548860 6848154 6480040 6270671 6151945 5282442
8683 5282442 5367573 5005134 5176196 5774230 6041366 5311270 5313889 5902833 6086646 5692105
8673 5692105 5139311 4127021 4883260 5093309 5216568 5514471 5505610 4272505 4099232 4986776
$$ packed form
8741A0544907o46754j06033L07984J70963l11541n4044j50658J09593O23129m00207
8731A0087339k83987O38091q82637k67457j30022m28565p05441o05008M20070
8722G842383r8616J29382j84545j12377K41792l5619k7836j95445n47055m76841
8712F535223L81715j78838N11827K45483n81782k03070K71864N28700m54461j83375
8702F873286K25942J77494j78579p451J031878n16906n17270k76733q55235p61798
8692E194628o82374O35063J097641L03902K99294l68114k09369j18726q69503
8683E282442Q5131l62439J71062N98034K67136p30096K619N88944J83813l94541
8673E692105n52794j012290P56239K10049J23259K97903q861j233105j73273Q87544
$$ plain form
8663 4986776 4918535 5013315 4772987 4363762 4663181 4627801 4615717 4729496 5188291 5276833
8653 5276833 4656104 4232688 3557042 4387149 4069974 3535734 4220216 4434059 4385562 4292822
8643 4292822 3886835 4162176 3659481 3748611 4029178 4082425 3352501 3786057 3135368 2832568
8633 2832568 2639861 2569352 2319216 2753781 2488830 2130050 2661316 2843314 2403532 2078380
8623 2078380 2336617 2172308 2300744 2130662 2765139 3292161 3369228 3374133 3312014 2952181
8613 2952181 2657657 2658622 2345420 3015767 3001443 3371812 3414260 2739026 3208688 2325413
8603 2325413 1860489 2425707 2447918 2366245 2304276 2762171 2259258 2395559 2724844 2424350
8593 2424350 2597547 2441671 2145139 2591958 2047682 2061056 1851658 2626026 2201112 1508927
$$ packed form
8663D986776o8241R4780k40328m09225K99419l5380j2084J13779M58795Q8542
8653E276833o20729m23416o75646Q30107l17175n34240O84482K13843m8497r2740
8643D292822m05987K75341n02695Q9130K80567N3247p29924M33556o50689l02800
8633B832568j92707p0509k50136M34565k64951l58780N31266J81998m39782l25152
8623B078380K58237j64309J28436j70082O34477N27022P7067M905o2119l59833
8613B952181k94524R65l13202O70347j4324L70369M2448o75234M69662q83275
8603B325413m64924N65218K2211q1673o1969M57895n02913J36301L29285l00494
8593B424350J73197j55876k96532M46819n44276J3374k09398P74368m24914o92185
$$ plain form
8583 1508927 1975120 3246120 2628322 797187 1719951 1025899 839463 1185836 2221755
8574 2221755 2102080 1887496 1226681 2072183 1827775 1749402 2139852 2393904 1383291 741435
8564 741435 1757673 2471713 2117601 1920891 2074849 1586133 1346933 1119857 1699480 1847668
8554 1847668 1622888 1561212 1672172 1927780 1834575 1318467 1095713 1508906 1373019 1871156
8544 1871156 1945799 1342082 1520658 1915749 1175207 2133260 2377900 2177419 2558852 2712975
8534 2712975 2511475 1817261 1721396 1908899 1738157 1553375 1217744 859046 1447426 1945614
8524 1945614 1831449 2225165 1728929 1338240 1210912 1330921 1698446 1859272 1678520 1322716
8514 1322716 1208932 877383 718150 1659695 1271310 967456 1364759 1006220 1684961 1390993
$$ packed form
8583A508927M66193J271000o17798j831135R22764o94052j86436L46373J035919
8574B221755j19675k14584o60815Q45502k44408p8373L90450K54052j010613o41856
8564G41435J016238P14040l54112j96710J53958m88716k39200k27076N79623J48188
8554A847668k24780o1676J10960K55608r3205n16108k22754M13193j35887M98137
8544A871156P4643o03717J78576L95091p40542R58053K44640k00481L81433J54123
8534B712975k01500o94214r5865J87503j70742j84782l35631l58698N88380M98188
8524A945614j14165L93716m96236l90689j27328J20009L67525J60826j80752l55804
8514A322716j13784l31549j59233R41545l88385l03854L97303l58539O78741k93968
$$ plain form
8504 1390993 1379603 1278484 847530 624630 511573 558144 1808753 1727157 1527160 1392556
8494 1392556 2070890 2233066 1449708 1341754 2163926 1465904 1208118 1994075 2479886 1973305
8484 1973305 1624050 1781171 2074779 2128897 2045745 1685270 1086073 1197287 1240431 1497322
8474 1497322 1415056 1600483 1607143 486954 1870264 2675365 1934095 1894798 2070030 1846972
8464 1846972 1660457 2880331 1875377 1546544 2008424 2047180 808003 1534851 2479583
8455 2479583 1205991 2404274 1801818 739719 1928118 2431859 2001446 1188841 1406489
8446 1406489 2339467 2228890 1727401 2611977 1803716 1263032 1830419 1380639 1265506 1419515
8436 1419515 1338882 817339 1237989 1183728 935663 1406681 403959 -403351 908513 560934
$$ packed form
8504A390993j1390j01119m30954k22900j13057M6571J250609q1596j99997j34604
8494A392556O78334J62176p83358j07954Q22172o98022k57786P85957M85811n06581
8484A973305l49255J57121K93608N4118q3152l60475n99197J11214M3144K56891
8474A497322q2266J85427O660j120189J383310Q05101p41270l9297J75232k23058
8464A846972j86515J219874j004954l28833M61880L8756j239177P26848R44732
8455B479583j273592J198283o02456j062099J188399N03741m30413q12605K17648
8446A406489R32978j10577n01489Q84576q08261n40684N67387m49780j15133J54009
8436A419515q0633n21543M20650n4261k48065M71018j002722q07310J311864l47579
$$ plain form
8426 560934 947204 1878210 1502850 1143788 962294 523502 601506 969386 963822 800419
8416 800419 679770 53147 -384610 -450437 -456174 -722188 -80510 -69748 -129913 -110259 15844
8405 15844 -459270 -354665 -187549 -259260 -316565 -421861 516452 641857 789645 1103028
8395 1103028 -237351 112384 403590 -260739 647252 498950 -283042 -5812 695648
8386 695648 687359 429382 562128 187470 230300 491672 853576 1044001 458050 -183430
8376 -183430 -144410 270493 839351 1755866 1210889 623601 -466136 408279 692167 598793
8366 598793 137968 179115 146745 -291072 -471719 -276309 -1294614 294314 1365197 1537619
8356 1537619 517635 -239185 -127733 -331650 -1249760 -1026973 -97633 31822 312213
$$ packed form
8426E60934L86270R31006l75360l59062j81494m38792P8004L67880n564j63403
8416H00419j20649o26623m37757o5827n737k66014O41678J0762o0165J9654J26103
8405A5844m75114J04605J67116p1711n7305j05296R38313J25405J47788L13383
8395A103028j340379L49735K91206o64329R07991j48302p81992K77230P01460
8386F95648q289k57977J32746l74658M2830K61372L61904J90425n85951o41480
8376a83430L9020M14903N68858R16515n44977n87288j089737Q74415K83888r3374
8366E98793m60825M1147l2370m37817j80647J95410j018305J588928J070883J72422
8356A537619j019984p56820J11452k03917r18110K22787R29340J29455K80391
$$ plain form
8347 312213 705213 1332765 381022 495844 507169 -173786 -305889 -546874 -126019 214861
8337 214861 556556 38588 -266323 -296307 -149536 -540022 -342231 -335157 -253800 -342385 -718692
8326 -718692 -84353 -241165 310968 221007 -138525 43065 241924 1068397 1805050 1008815
8316 1008815 306763 548554 360545 -372096 -239332 -1127943 -1329724 -767988 14122 248075
8306 248075 403205 263291 -185339 127178 586042 355152 -143512 -231097 701483 571137
8296 571137 674903 451315 47422 -411612 -261105 113083 369964 153900 224698 175937
8286 175937 208918 358419 776569 240364 -110512 -129 448753 383459 69673 27899
8276 27899 -263523 272777 289947 472219 1670551 1656287 404489 -81264 58890 -166434
$$ packed form
8347C12213L93000O27552r51743J14822J1325o80955j32103k40985M20855L40880
8337B14861L41695n17968l04911k9984J46771l90486J97791P074Q1357q8585l76307
8326g18692O34339j56812N52133q9961l59532J81590J98859Q26473P36653p96235
8316A008815p02052K41791j88009p32641J32764q88611k01781N61736P82110K33953
8306B48075J55130j39914m48630L12517M58864k30890m98664q7585R32580j30346
8296E71137J03766k23588m03893m59034J50507L74188K56881k16064P0798m8761
8286A75937L2981J49501M18150n36205l50876J10383M48882o5294l13786m1774
8276B7899k91422N36300J7170J82272J198332j4264j251798m85753J40154k25324
$$ plain form
8266 -166434 -438982 -399232 -491166 470334 -2456 -1137297 -499865 -198812 -902482 -125630
8256 -125630 365980 805275 884789 1042528 375861 -772752 -103064 -468016 -455405 673966
8246 673966 46385 -456524 69340 14677 -189564 -286999 699167 752715 106494 168447
8236 168447 271492 469468 499080 440942 854916 756972 235724 288995 444613 317359
8226 317359 -210602 404204 579896 915391 580890 -195513 -978883 226982 1050765 763040
8216 763040 370872 289997 193394 -295029 141311 349047 515066 -45120 -661534 72130
8206 72130 803424 1033175 1050949 541323 644340 1507261 800897 -448098 -639733 -630581
8196 -630581 -799047 -195508 -239975 766198 2029576 -331325 -715066 -921382 -75928
$$ packed form
8266a66434k72548L9750r1934R61500m72790j134841O37432L01053p03670P76852
8256a25630M91610M39295P9514J57739o66667j148613O69688l64952J2611J129371
8246F73966o27581n02909N25864n4663k04241r7435R86166N3548o46221O1953
8236A68447J03045J97976K9612n8138M13974r7944n21248N3271J55618j27254
8226C17359n27961O14806J75692L35495l34501p76403p83370J205865Q23783k87725
8216G63040l92168q0875r6603m88423M36340K07736J66019n60186o16414P33664
8206G2130P31294K29751J7774n09626J03017Q62921p06364j248995j91635R152
8196f30581j68466O03539m4467J006173J263378k360901l83741k06316Q45454
$$ plain form
8187 -75928 -378175 465464 106341 -682305 -1291021 -331246 468370 184760 -118020 -883065
8177 -883065 -45694 16368 49918 -271966 298862 -132329 180405 -429497 383439 501042
8167 501042 -28151 184124 -198065 -377858 -335415 147853 -147635 -897795 -625043 -248939
8157 -248939 -292108 -322927 -441582 -615541 -709652 -467096 -706851 -165268 24299 -475080
8147 -475080 -751011 4229 216435 189305 293465 113389 583510 643451 451362 -317629
8137 -317629 -646469 -1145135 -629348 -1007483 -1592281 -1188207 -1254927 -768066 -277474 1099
8127 1099 1275953 180706 -347885 -508566 -254444 550921 -160214 -177827 -39536 -419130
8117 -419130 -94786 513537 701146 1007873 1281469 1208518 564248 182917 -249415 75433
$$ packed form
8187g5928l02247Q43639l59123p88646o08716R59775P99616k83610l02780p65045
8177h83065Q37371O2062L3550l21884N70828m31191L12734o09902Q12936J17603
8167E01042n29193K12275l82189j79793M2443M83268k95488p50160K72752L76104
8157b48939m3169l0819j18655j73959r4111K42556k39755N41583J89567m99379
8147d75080k75931P55240K12206k7130J04160j80076M70121N9941j92089p68991
8137c17629l28840m98666N15787l78135n84798M04074o6720M86861M90592K78573
8127A099J274854j095247n28591j60681K54122Q05365p11135j7613J38291l79594
8117d19130L24344O08323J87609L06727K73596p2951o44270l81331m32332L24848
$$ plain form
8107 75433 -56136 -527023 -1169774 -813240 62254 800393 -53454 -165169 133525 112580
8097 112580 30285 635965 468759 -2483 -145514 -143447 -208025 -743505 -747620 -808754 -685952
8086 -685952 -639424 -848578 -290078 220048 -349434 -36978 -762815 -525601 146142 757555
8076 757555 479219 289730 -611018 -756345 -420773 -1249662 -1127900 -798635 -980018 -895746
8066 -895746 -371209 -601068 -660877 -139348 333776 613776 -100307 116030 583306 949803
8056 949803 385065 202799 599452 -420840 -354564 -219770 -450148 -239856 -199909 -342439
8046 -342439 151847 -412364 -244687 -72912 -332227 -636854 -92261 -1568763 -1633729 -647605
8036 -647605 -579110 -285810 -537113 208127 -221236 361825 292449 5512 313408 268471
$$ packed form
8107G5433j31569m70887o42751L56534Q75494P38139q53847j11715K98694k0945
8097A12580q2295O05680j67206m71242j43031K067o4578n35480m115o1134J22802
8086f85952M6528k09154N58500N10126n69482L12456p25837K37214O71743O11413
8076G57555k78336j89489r00748j45327L35572q28889J21762L29265j81383Q4272
8066h95746N24537k29859n9809N21529M73124K80000p14083K16337M67276L66497
8056I49803n64738j82266L96653j020292O6276J34794k30378K10292L9947j42530
8046c42439M94286n64211J67677J71775k59315l04627N44593j476502o4966R86124
8036f47605O8495K93300k51303P45240m29363N83061o9376k86937L07896m4937
$$ plain form
8026 268471 -88887 -539234 594180 1135850 1102517 -209017 -3977 448088 -731610
8017 -731610 -176152 40616 -322740 -520764 23116 188958 -1013317 -390545 -62988 -323921
8007 -323921 -80825 -639508 -709562 -397309 214677 -873741 -620164 -651565 -370642 -226181
7997 -226181 497479 720694 53993 -10365 -705195 -79929 270799 4366 -310128 -316071
7987 -316071 -710632 -294666 -391328 -283144 -165177 -889590 -142917 42882 -231586 127889
7977 127889 427784 -229910 -436136 204655 156197 -530681 -1251019 -707600 -119317 -591387
7967 -591387 -1046482 -670593 -569560 -608201 -409696 -337595 -931153 -216990 -112564 -145947
7957 -145947 604213 584877 -45493 -18098 -290896 -73133 82521 62928 339098 -15438
$$ packed form
8026B68471l57358m50347J133414N41670l3333j311534K05040M52065j179698
8017g31610N55458K16768l63356j98024N43880J65842j202275O22772L27557k60933
8007c23921K43096n58683p0054L12253O11986j088418K53577l1401K80923J44461
7997b26181P23660K23215o66701o4358o94830O25266L50728k66433l14494n943
7987c16071l94561M15966r6662J08184J17967p24413P46673J85799k74468L59475
7977A27889K99895o57694k06226O40791m8458o86878p20338N43419N88283m72070
7967e91387m55095L75889J01033l8641J98505P2101n93558P14163J04426l3383
7957a45947P50160j9336o30370K7395k72798K17763J55654j9593K76170l54536
$$ plain form
7947 -15438 -577747 -350359 -286418 459663 98746 815729 257148 -357145 168057 42616
7937 42616 -381830 -58359 -246048 -447794 -498746 -447529 -128110 568387 196713 -1038200
7927 -1038200 -302891 -670953 -101295 -577981 -456953 -820401 -607757 -882108 250995
7918 250995 819413 425002 899471 866522 -17477 7756 432077 369630 -227874 -56695
7908 -56695 -90479 -774673 -551916 -641823 -170372 -1229181 -291904 370327 364105 291060 -445389
7897 -445389 -477035 378059 5768 -497051 -40212 -129519 -59916 -410584 -181426 152248
7887 152248 171820 -90291 352398 -226509 -639949 -954091 -1166255 -628368 -24410 -494640
7877 -494640 -321549 -20056 617782 203976 -363129 -706589 -370938 712284 379206 -471824
$$ packed form
7947a5438n62309K27388O3941P46081l60917P16983n58581o14293N25202j25441
7937D2616m24446L23471j87689k01746n0952N1217L19419O96497l71674j234913
7927a038200P35309l68062N69658m76686J21028l63448K12644k74351J133103
7918B50995N68418l94411M74469l2949q83999K5233M24321o2447n97504J71179
7908e6695l3784o84194K22757q9907M71451j058809R37277O62231o222p3045p36449
7897d45389l1646Q55094l72291n02819M56839q9307O9603l50668K29158L33674
7887A52248J9572k62111M42689n78907m13440l14142k12164N37887O03958m70230
7877d94640J73091L01493O37838m13806n67105l43460L35651J083222l33078q51030
$$ plain form
7867 -471824 -488379 -429833 -33955 47196 -81704 557671 1050766 357619 42984 398563
7857 398563 612244 332228 -59888 -749083 -1050184 -943970 -899499 -1029471 -1257145 -1038719
7847 -1038719 -1044339 -482356 -82686 -572336 -891618 -268513 -261715 -817647 -28986 -177595
7837 -177595 -734197 -495799 324510 366934 204483 846936 195431 240989 398491 -504439
7827 -504439 -149525 310556 -444830 -741024 -836746 -585762 -218812 -445844 -1440332 -1294301
7817 -1294301 -541960 515440 440623 -112980 -344732 -123391 -61463 87110 -515446 -661899
7807 -661899 -845731 -660030 -826527 60576 1461579 1750501 1259046 966061 1033184 112635
7797 112635 67886 881849 -64694 -265906 -704950 -758263 -418025 -624898 -1209049 -1464586
$$ packed form
7867d71824j6555N8546L95878Q1151j28900O39375M93095o93147l14635L55579
7857C98563K13681k80016l92116o89195l01101J06214M4471j29972k27674K18426
7847a038719n620N61983L99670m89650l19282O23105O798n55932P88661j48609
7837a77595n56602K38398Q20309M2424j62451O42453o51505M5558J57502r02930
7827e04439L54914M60081p55386k96194r5722K50984L66950k27032r94488J46031
7817a294301P52341J057400p4817n53603k31752K21341O1928J48573o02556j46453
7807f61899j83832J85701j66497Q87103J401003K88922m91455k92985O7123r20549
7797A12635m4749Q13963r46543k01212m39044n3313L40238k06873n84151k55537
$$ plain form
7787 -1464586 -1072520 -882005 -860746 -895617 -1008332 135431 -266698 -1329747 -488634 43472
7777 43472 269124 -481194 -540441 -641737 -405752 -522547 -243051 -117025 -380683 -940754
7767 -940754 -639415 -385722 -178664 -414890 -617824 -160845 -413698 -80003 12066 -129470
7757 -129470 -152396 -243200 -496480 -512633 268056 154447 -329194 -655136 -653995 -170398 -700621
7746 -700621 -432598 49604 -438494 -279889 306730 -409202 -678031 -643919 -1130546 -191294
7736 -191294 -120193 -420293 -370408 -428484 -920374 -1192926 -764006 -738024 -1560747 -1824353
7726 -1824353 -524346 -733523 -1214902 -1316974 -137788 -591708 -314684 -60577 -7858
7717 -7858 589961 -775378 -606788 -907663 139317 277865 -579758 -803458 281129 580010
$$ packed form
7787a464586L92066J90515K1259l4871j12715J143763m02129j063049Q41113N32106
7777D3472K25652p50318n9247j01296K35985j16795K79496J26026k63658n60071
7767i40754L01339K53693K07058k36226k02934M56979k52853L33695R2069j41536
7757a29470k2926r0804k53280j6153P80689j13609m83641l25942J141M83597n30223
7746g00621K68023M82202m88098J58605N86619p15932k68829L4112m86627R39252
7736a91294P1101l00100M9885n8076m91890k72552M28920K5982q22723k63606
7726a824353J300007k09177m81379j02072J179186m53920K77024K54107N2719
7717g858N97819j365339J68590l00875J046980J38548q57623k23700J084587K98881
$$ plain form
7707 580010 629646 783682 425034 680117 348155 -76514 -35029 126381 23162 -221156
7697 -221156 -189633 264302 1194817 617346 772821 626714 522831 638165 93897 -161560
7687 -161560 -343009 57618 351991 1023813 487718 193412 115740 -335255 -364221 -235561
7677 -235561 -52541 -158329 -517914 -221565 381197 259120 260740 174210 -440135 -231859
7667 -231859 -479601 835259 1399488 1160667 761592 -139501 252922 -396610 -214025 -223950
7657 -223950 60616 61875 -116486 1158390 724497 820291 -241507 -334350 -198166 761223
7647 761223 785297 22033 355471 -83018 -267515 -195437 354311 334639 200803 811216
7637 811216 935714 591935 661365 793223 714924 143990 727289 280199 -83136 -164120
$$ packed form
7707E80010M9636J54036l58648K55083l31962m24669M1485J61410j03219k44318
7697b21156L1523M53935R30515n77471J55475j46107j03883J15334n44268k55457
7687a61560j81449M00627K94373O71822n36095k94306p7672m50995k8966J28660
7677b35561J83020j05788l59585K96349O02762j22077J620q6530o14345K08276
7667b31859k47742J314860N64229k38821l99075r01093L92423o49532J82585r925
7657b23950K84566J259j78361J274876m33893R5794j061798r2843J36184R59389
7647G61223K4074p63264L33438m38489j84497P2078N49748j9672j33836O10413
7637H11216J24498l43779O9430J31858p8299n70934N83299m47090l63335q0984
$$ plain form
7627 -164120 -403747 -211353 -213895 -240031 -250275 280464 731947 -261830 3359 171905
7617 171905 442891 -313264 -203646 493429 242280 -9784 186343 527116 413807 156761
7607 156761 122144 -146472 63465 -185925 -275986 177391 52061 198389 -549525 -1592265
7597 -1592265 -1268454 -875342 -508141 -9540 658549 243737 -143851 -416557 -217245 -288833
7587 -288833 157589 169805 -440682 -10033 -379972 319411 -175560 66631 787504 585347
7577 585347 -17014 -82770 -71973 -71277 -1041018 -1136035 -230461 -115499 -332531 -828802 -1028402
7566 -1028402 -807224 -150897 -232046 -157928 -459549 -462265 -11890 406555 377990 158905
7556 158905 -324281 -891052 -164005 -375944 -781268 -774970 -486788 202986 234528 -424670
$$ packed form
7627a64120k39627J92394k542k6136j0244N30739M51483r93777K65189J68546
7617A71905K70986p56155J09618O97075k51149k52064J96127L40773j13309k57046
7607A56761l4617k68616K09937k49390r0061M53377j25330J46328p47914j042740
7597a592265L23811L93112L67201M98601O68089m14812l87588k72706J99312p1588
7587b88833M46422J2216o10487M30649l69939O99383m94971K42191P20873k02157
7577E85347o02361o5756J0797O96r69741r5017R05574J14962k17032m96271j99600
7566a028402K21178O56327q1149P4118l01621k716M50375M18445k8565k19085
7556A58905m83186n66771P27047k11939m05324O298K88182O89774L1542o59198
$$ plain form
7546 -424670 -887687 -184074 -253747 -553401 -258846 14012 -87067 -983864 -992002 -529686
7536 -529686 -185837 -271103 -764680 -984603 -6477 -871117 -221603 -50986 -202596 -398796
7526 -398796 163345 277295 462140 305479 -514208 -578684 -699274 -1140882 -316493 -123487
7516 -123487 -831882 102744 451828 -332068 18468 309356 -552999 -847518 -918715 -805320
7506 -805320 -654739 -464769 -314143 593789 323720 -647058 -326884 199714 654871 -98046
7496 -98046 -293261 -333328 -555271 311961 95176 237316 276325 247238 111787 -306821
7486 -306821 -331995 -1053459 -1056864 -336793 -387172 40723 312862 315570 -133713 139746 699187
7475 699187 17031 -202853 -666787 -585104 -361543 -264463 225455 726698 898662 426205
$$ packed form
7546d24670m63017P03613o9673k99654K94555K72858j01079q96797q138M62316
7536e29686L43849q5266m93577k19923R78126q64640O49514J70617j51610j96200
7526c98796N62141J13950J84845j56661q19687o4476j20590m41608Q24389J93006
7516a23487p08395R34626L49084p83896L50536K90888q62355k94519p1197J13395
7506h05320J50581J89970J50626R07932k70069r70778L20174N26598M55157p52917
7496i8046j95215m0067k21943Q67232k16785J42140L9009k9087j35451m18608
7486c06821k5174p21464l405P20071n0379M27895K72139K708m49283K73459N59441
7475F99187o82156k19884m63934Q1683K23561R7080M89918N01243J71964m72457
$$ plain form
7465 426205 900895 869810 -108437 35378 22722 -356444 -265956 -274468 -834537 -197653 1519765
7454 1519765 524264 674693 276700 -612259 -644497 -371494 -390220 518298 315259 -661513
7444 -661513 -240196 327833 430486 199127 73272 347902 -59549 56118 -79440 79639
7434 79639 -464603 -432519 -133062 382869 725904 586017 188237 -533624 -939310 -1120836
7424 -1120836 -901660 -368535 -168783 576037 -10963 -556953 22825 -585146 -1197239 -640101
7414 -640101 -874549 -874273 -243572 -538365 -162570 -523345 -1047297 265193 -254963 -319336
7404 -319336 -235245 -938408 118671 -224966 -29477 673403 745533 -546473 -719344 44855
7394 44855 831231 1233239 707867 1084387 2202 609935 489030 -488261 -1071227 -1688008
$$ packed form
7465D26205M74690l1085r78247J43815j2656l79166R0488q512n60069O36884J717418
7454A519765r95501J50429l97993q88959l2238K73003j8726R08518k03039r76772
7444f61513M21317N68029J02653k31359j25855K74630m07451J15667j35558J59079
7434G9639n44242L2084K99457N15931L43035j39887l97780p21861m05686j81526
7424a120836K19176N33125J99752P44820n87000n45990N79778o07971o12093N57138
7414f40101k34448K76O30701k94793L75795l60775n23952J312490n20156o4373
7404c19336Q4091p03163J057079l43637J95489P02880P2130j292006j72871P64199
7394D4855P86376M02008n25372L76520j082185O07733j20905r77291n82966o16781
$$ plain form
7384 -1688008 -424826 -70011 -106034 -571269 -672595 -299841 368257 981507 1067376 498267
7374 498267 231893 -97741 194906 509937 465498 -300310 -863897 -506541 133319 -164456
7364 -164456 629971 566010 732321 708614 -90181 -803863 -347513 -487036 -170852 265148
7354 265148 300918 20949 -79031 -839698 -844958 -478490 17771 -139083 209140 415101
7344 415101 -457655 -478522 -230214 143884 -235083 825316 337326 525209 887355 577252
7334 577252 -18060 -158889 761443 -274647 -106821 -146104 -427892 -453372 -374146 210422
7324 210422 -38617 -785899 -572054 -595733 -595902 294931 110642 -155607 -263324 -602514
7314 -602514 -470212 38358 99228 67023 -781423 -693020 -593755 -1094321 -77864 184728
$$ packed form
7384a688008J263182L54815l6023m65235j01326L72754O68098O13250Q5869n69109
7374D98267k66374l29634K92647L15031m4439p65808n63587L57356O39860k97775
7364a64456P94427o3961J66311k3707p98795p13682M56350j39523L16184M36000
7354B65148L5770k79969r9980p60667n260L66468M96261j56854L48223K05961
7344D15101q72756k0867K48308L74098l78967J060399m87990J87883L62146l10103
7334E77252n95312j40829R20332j036090J67826l9283k81788k5480P9226N84568
7324B10422k49039p47282K13845k3679j69Q90833j84289k66249j07717l39190
7314f02514J32302N08570O0870l2205q48446Q8403R9265n00566J016457K62592
$$ plain form
7304 184728 143466 375467 -67610 -575799 14819 -54193 8575 107366 259468 1113544
7294 1113544 944329 644063 531667 298432 215044 844048 79990 -236218 11068 608905
7284 608905 -392241 -285478 396377 -630624 120873 -508973 -615039 151084 463326
7275 463326 -719215 50608 64937 -562389 468874 522878 261093 -22134 500146 473067
7265 473067 403880 646325 503107 409108 950581 791350 354486 494390 996883 266740
7255 266740 792994 175544 83354 265372 580938 679126 -361737 -769377 -608328 70629
7245 70629 260163 -42930 922791 485241 -264033 -1119233 -278769 425651 -60582 236174
7235 236174 149933 -497997 -127903 -389513 -190515 273952 -422551 -1097493 -1110310 -1073467
$$ packed form
7304A84728m1262K32001m43077n08189N90618o9012O2768R8791J52102Q54076
7294A113544j69215l00266j12396k33235q3388O29004p64058l16208K47286N97837
7284F08905j001146J06763O81855j027001P51497o29846j06066P66123L12242
7275D63326j182541P69823J4329o27326J031263N4004k61785k83227N22280k7079
7265D73067o9187K42445j43218r3999N41473j59231m36864J39904N02493p30143
7255B66740N26254o17450r2190J82018L15566R8188j040863m07640J61049O78957
7245G0629J89534l03093R65721m37550p49274q55200Q40464P04420m86233K96756
7235B36174q6241o47930L70094k61610J98998M64467o96503o74942j2817L6843
$$ plain form
7225 -1073467 -708414 -629022 -235753 179765 -317311 -695987 -321652 -12706 13321 -156789
7215 -156789 -583333 -509695 -739130 -170819 -714924 -552992 1029757 1102072 242611 563827
7205 563827 445523 -202500 -752749 -1079173 -950668 -333069 -335904 -661984 -577411 -284689
7195 -284689 654636 922820 440219 196813 -119555 -252574 -426197 421196 502582 2166
7185 2166 -343684 -824731 -492367 -405694 -110145 -402141 -714860 68901 376382 40224
7175 40224 -35365 251934 -76430 102807 417628 444876 88161 67853 -139441 -151981 50998
7164 50998 312577 102964 504264 -204252 762281 1790229 1932201 1114478 -136410 -390359
7154 -390359 -375671 231637 809499 893363 789423 153775 307491 2648 233780 768565
$$ packed form
7225a073467L65053P9392L93269M15518m97076l78676L74335L08946K6027j70110
7215a56789m26544P3638k29435N68311n44105J61932J582749P2315q59461L21216
7205E63827j18304o48023n50249l26424J28505O17599k835l26080Q4573K92722
7195b84689R39325K68184m82601k43406l16368j33019j73623Q47393Q1386n00416
7185B166l45850m81047L32364Q6673K95549k91996l12719P83761L07481l36158
7175D0224p5589K87299l28364J79237L14821K7248l56715k0308k07294j2540K02979
7164E0998K61579k09613M01300p08516R66533J027948J41972q17723j250888k53949
7154c90359J4688O07308N77862Q3864j03940o35648J53716l04843K31132N34785
$$ plain form
7144 768565 570252 1092300 503979 -611873 -700039 -798335 60774 -61258 870195 775627
7134 775627 130312 452510 -410567 317206 214610 190077 407333 799591 675922 688795
7124 688795 1168347 1112623 653408 -33338 302276 1025938 1056923 1723964 1317430 749517
7114 749517 -134233 318057 43976 -193987 -42476 476790 -456586 -599004 -1152658 -913631
7104 -913631 31697 -94438 165694 138474 144096 593085 625706 -133980 -252683 -452438
7094 -452438 -869548 -523176 -84191 -353377 -266584 -283022 243555 -132680 244564 142937
7084 142937 -412967 -201615 170188 181100 -666217 -623918 -78349 340461 -607972 -1062101
7074 -1062101 -665048 -306834 -344941 -611054 -684611 -1546643 -1213029 -166937 -53371 -224469
$$ packed form
7144G68565j98313N22048n88321j115852q8166r8296Q59109j22032R31453r4568
7134G75627o45315L22198q63077P27773j02596k4533K17256L92258j23669J2873
7124F88795M79552n5724m59215o86746L35614P23662L0985O67041m06534n67913
7114G49517q83750M52290k74081k37963J51511N19266r33376j42418n53654K39027
7104i13631R45328j26135K60132k7220N622M48989L2621p59686j18703j99755
7094d52438m17110L46372M38985k69186Q6793j6438N26577l76235L77244j01627
7084A42937n55904K11352L71803J0912q47317M2299N45569M18810r48433m54129
7074a062101L97053L58214l8107k66113p3557q62032L33614J046092J13566j71098
$$ plain form
7064 -224469 -601510 -860073 655224 962417 455138 -266297 -138144 -243160 -109902 -354122
7054 -354122 69081 -113446 422136 339259 -161880 79218 1098951 992146 -390092 391676
7044 391676 912155 286816 -197419 312200 -60242 503791 1102938 746216 71688 525840
7034 525840 833270 -175303 -753886 -150379 55823 273101 -75970 -762671 -1517895 -417029
7024 -417029 -605097 -151244 -631066 -1604853 -637087 -757663 -1003512 -665775 535806 870806
7014 870806 303386 -26966 296271 -83306 270189 271157 -977095 -964273 -416089 22268
7004 22268 508434 421701 -336291 -333902 131679 -44660 87139 400189 675129 879439
6994 879439 415584 -435746 161477 247400 -628518 -55843 12778 185084 352602 975085
$$ packed form
7064b24469l77041k58563J515297L07193n07279p21435J28153j05016J33258k44220
7054c54122M23203j82527N35582q2877n01139K41098J019733j06805j382238P81768
7044C91676N20479o25339m84235N09619l72442N64033N99147l56722o74528M54152
7034E25840L07430j008573n78583O03507K06202K17278l49071o86701p55224J100866
7024d17029j88068M53853m79822r73787R67766j20576k45849L37737J201581L35000
7014H70806n67420l30352L23237l79577L53495R68j248252J2822N48184M38357
7004B2268M86166q6733p57992K389M65581j76339J31799L13050K74940K04310
6994H79439m63855q51330N97223Q5923q75918N72675O8621J72306J67518O22483
$$ plain form
6984 975085 304851 -47703 -238127 -595235 -304853 -285609 -116313 -34204 23564 197029
6974 197029 408264 -93042 62993 466869 -12798 -248031 -513390 -1204791 -294972 -842193
6964 -842193 -357848 659391 -119981 -491194 -250725 -685386 -985126 -252985 345038 -34172
6954 -34172 28370 42970 -497524 273185 1254753 311671 -477354 -226331 -304969 -556161
6944 -556161 -900486 -515426 -361752 -829645 -106414 984843 530612 -48558 -366639 -133638
6934 -133638 -1788 -122618 -143936 -531971 -531390 -110846 -529552 -583731 -1155564 -1539411 -1287297
6923 -1287297 -1244913 -166140 664519 564421 240632 1155192 60217 -1111451 -1065592
6914 -1065592 -681435 -137844 -223687 -780741 -46375 -3757 144336 -190975 -666591 7468
$$ packed form
6984I75085o70234l52554j90424l57108K90382J9244J69296Q2109N7768J73465
6974A97029K11235n01306J56035M03876m79667k35233k65359o91401R09819n47221
6964h42193M84345J017239p79372l71213K40469m34661k99740P32141N98023l79210
6954c4172O2542J4600n40494P70709R81568r43082p89025K51023p8638k51192
6944e56161l44325L85060J53674m67893P23231J091257m54231n79170l18081K33001
6934a33638J31850j20830k1318l88035N81M20544m18706n4179n71833l83847K52114
6923a287297M2384J078773Q30659j00098l23789R14560j094975j171668M5859
6914a065592L84157N43591q5843n57054P34366M2618J48093l35311m75616O74059
$$ plain form
6904 7468 -57669 473818 -283227 -998402 -546789 317716 1009105 896800 10239 255685
6894 255685 -171333 -608088 -487328 -153746 -146292 -87840 162453 -638614 -577342 -371564
6884 -371564 -855596 -891127 -240927 -665427 -752005 23936 -62774 -514891 5632 -106897
6874 -106897 -918633 -1391415 -1045108 -407110 -476874 -253470 -353165 257873 -207296 -48280
6864 -48280 -725623 -1145056 55768 -116457 -1223999 -1521318 -1269824 -1174061 -698965 -811624
6854 -811624 61378 227569 52008 -8290 289616 -411322 -90727 287482 173056 366745
6844 366745 220528 -291265 348289 433469 -365144 -297596 -362633 -269179 966 123191
6834 123191 -265799 459097 -81226 -88819 -446729 -1582448 -1662359 -1027910 -1012897 -948313
$$ packed form
6904G468o5137N31487p57045p15175M51613Q64505O91389j12305q86561K45446
6894B55685m27018m36755J20760L33582P454N8452K50293q01067O1272K05778
6884c71564m84032l5531O50200m24500q6578P75941q6710m52117N20523j12529
6874a06897q11736m72782L46307O37998o9764K23404r9695O11038m65169J59016
6864d8280o77343m19433J200824j72225j107542k97319K51494R5763M75096j12659
6854h11624Q73002J66191j75561o0298K97906p00938L20595L78209j14426J93689
6844C66745j46217n11793O39554Q5180p98613O7548o5037R3454K70145J22225
6834A23191l88990P24896n40323p593l57910j135719p9911O34449J5013O4584
$$ plain form
6824 -948313 -551607 -787628 61342 -137279 -1144335 -447313 -223453 82477 46245 -273108
6814 -273108 -315484 -984356 -884107 -519242 150085 130947 7219 382720 23797 -333548
6804 -333548 -228433 -94246 -688266 86727 -312929 -296811 -257927 -22332 -364709 -1212235
6794 -1212235 -1035927 -2197183 -1110866 213994 251186 -6474 -754938 -768207 -635514
6785 -635514 -674904 -293050 -186917 -220693 -563625 -717081 -741824 -78238 -560421 -935731
6775 -935731 -704238 116421 29889 -626296 -1161682 -1382763 -491873 -507100 -1001166 -746452
6765 -746452 65674 -62782 -56248 245292 -326278 -612135 -232302 -566510 -803208 -635120
6755 -635120 -8181 -292020 8804 -580102 -937804 -8371 -109008 -1038579 -852101 -1135303
$$ packed form
6824i48313L96706k36021Q48970j98621j007056O97022K23860L05930l6232l19353
6814b73108m2376o68872J00249L64865O69327j9138j23728L75501l58923l57345
6804c33548J05115J34187n94020P74993l99656J6118L8884K35595l42377q47526
6794a212235J76308j161256J086317J324860L7192k57660p48464j3269J32693
6785f35514l9390L81854J06133l3776l42932j53456k4743O63586m82183l75310
6775i35731K31493Q20659q6532o56185n35386k21081Q90890j5227m94066K54714
6765g46452Q12126j28456O534L01540n71570k85857L79833l34208k36698J68088
6755f35120O26939k83839L00824n88906l57702R29433j00637r29571J86478k83202
$$ plain form
6745 -1135303 -1112026 -284857 337549 151815 -50798 -260812 -663603 -196286 -748005 -522708
6735 -522708 -455038 185926 -764898 -828575 -638114 -1190116 -442093 275940 626108 454738
6725 454738 -362511 -72576 -364512 444755 302182 -632249 -760405 -774220 -1234570 -931330
6715 -931330 -578712 -725574 -869154 -801024 36772 -296450 155872 552574 604178 -133987
6705 -133987 -305695 -237733 -501088 -788790 -515566 -742713 -741638 -1670155 -1374972 -459635
6695 -459635 -347044 91685 -78482 -472453 -1050879 -922168 -23983 120440 -1128872 -769100
6685 -769100 -484302 -861842 -669156 -415999 -166860 -359796 547357 290833 -835114 -361278
6675 -361278 584608 392116 -833655 -154171 127872 -743543 104903 539422 -371158 -966803
$$ packed form
6745a135303K3277Q27169O22406j85734k02613k10014m02791M67317n51719K25297
6735e22708O7670O40964r50824o3677J90461n52002P48023P18033L50168j71370
6725D54738q17249K89935k91936Q09267j42573r34431j28156j3815m60350L03240
6715i31330L52618j46862j43580O8130Q37796l33222M52322L96702N1604p38165
6705a33987j71708O7962k63355k87702K73224k27147J075r28517K95183R15337
6695d59635J12591M38729j70167l93971n78426J28711Q98185J44423j249312L59772
6685g69100K84798l77540J92686K53157K49139j92936R07153k56524j125947M73836
6675c61278R45886j92492j225771O79484K82043q71415Q48446M34519r10580n95645
$$ plain form
6665 -966803 -174712 1028736 691163 -280480 -144913 -574499 286533 225707 -314764 -184534
6655 -184534 310052 111993 -416067 -876438 -895689 -430864 200201 39864 -219025 -645627
6645 -645627 -515190 -45143 847079 -5806 -636589 -927666 -499170 -619753 -1143255 -380236
6635 -380236 139686 22100 -610818 -539962 -84544 683727 529528 375239 606780 39172
6625 39172 -1566065 -923079 41561 -96422 -750860 -385524 -896514 -1127950 -571792 -110913
6615 -110913 -740541 -317739 485515 1065251 318231 -275865 -115085 -168533 -629470 -8684
6605 -8684 -72320 503651 81692 -489873 -479747 -93960 488413 558876 -260969 -388386 -601461
6594 -601461 -385429 -374331 -166040 272646 305761 369434 -131800 -26826 477743 -37995
$$ packed form
6665i66803P92091J203448l37573r71643J35567m29586Q61032o0826n40471J30230
6655a84534M94586j98059n28060m60371j9251M64825O31065j60337k58889m26602
6645f45627J30437M70047Q92222q52885o30783k91077M28496j20583n23502P63019
6635c80236N19922j17586o32918P0856M55418P68271j54199j54289K31541n67608
6625C9172j605237O42986R64640j37983o54438L65336n10990k31436N56158M60879
6615a10913o29628M22802Q03254N79736p47020n94096J60780n3448m60937O20786
6605h684o3636N75971m21959n71565J0126L85787N82373P0463q19845j27417k13075
6594f01461K16032J1098K08291M38686L3115O3673n01234J04974N04569n15738
$$ plain form
6584 -37995 -46759 766050 510771 -94548 -463532 112826 257159 -87279 -451628 378481
6574 378481 744143 809152 427750 -367594 -579554 -159529 -182589 -249924 -464873 -840157
6564 -840157 -1126717 -375660 -538425 -305699 -450994 -613952 -653491 -435519 32167 42659
6554 42659 -901468 -452262 -66095 216030 -58705 -100223 -69187 -549019 -12312 18111
6544 18111 -84852 -234014 671084 8561 120233 76316 -334332 -39659 11642 -445501
6534 -445501 -705557 -404934 -386182 -924530 -383341 -1434656 -1252150 -1306141 -2343946 -1433312
6524 -1433312 -583539 -342380 -224713 -461062 -593126 -577532 -299787 28316 -904023 -882703
6514 -882703 -209526 479326 421489 260463 -81106 106038 -384101 -215279 -145455 -184359
$$ packed form
6584c7995q764Q12809k55279o05319l68984N76358J44333l44438l64349Q30109
6574C78481L65662O5009l81402p95344k11960M20025k3060o7335k14949l75284
6564h40157k86560P51057j62765K32726j45295j62958l9539K17972M67686J0492
6554D2659r44127M49206L86167K82125k74735m1518L1036m79832N36707L0423
6544A8111j02963j49162R05098o62523J11672m3917m10648K94673N1301m57143
6534d45501k60056L00623J8752n38348N41189j051315J82506n3991j037805R10634
6524a433312Q49773K41159J17667k36349j32064J5594K77745L28103r32339K1320
6514h82703O73177O88852n7837j61026l41569J87144m90139J68822O9824l8904
$$ plain form
6504 -184359 -76370 -221018 -225645 615804 -751134 -1438554 -1098834 -923574 -923862 -598915
6494 -598915 -980800 -1517827 -1734503 -337643 -72079 -68424 453050 515753 315352 427685
6484 427685 -486819 -678158 -984145 -622444 -674982 -751352 -99143 -309159 -805692 -589051
6474 -589051 -618118 -345984 829556 1159420 1023214 209057 -71335 -322222 -26079 817381
6464 817381 583719 85902 399819 452980 433654 -269436 37844 -211163 17055 -213432
6454 -213432 -271973 -323851 -366587 253671 -356340 -287248 483283 799130 405128 844318
6444 844318 731003 -884546 -495354 -562177 643332 -349447 521627 428042 1180469 545952
6434 545952 162153 -31398 -40696 35757 59363 703579 1302629 681904 -64826 -330102
$$ packed form
6504a84359J07989j44648m627Q41449j366938o87420L39720J75260k88L24947
6494e98915l81885n37027k16676J396860K65564L655N21474O2703k00401J12333
6484D27685r14504j91339l05987L61701n2538p6370O52209k10016m96533K16641
6474e89051k9067K72134J175540L29864j36206q14157k80392k50887K96143Q43460
6464H17381k33662m97817L13917N3161j9326p03090L07280k49007K28218k30487
6454b13432n8541n1878m2736O20258o10011O9092P70531L15847l94002M39190
6444H44318j13315j615549L89192o6823J205509r92779Q71074r3585P52427o34517
6434E45952l83799j93551r298P6453K3606O44216N99050o20725p46730k65276
$$ plain form
6424 -330102 -523547 349112 640295 637059 393768 184692 169631 58160 359962 864647
6414 864647 408259 153158 -87521 -250622 -382966 -1368914 -1148129 -440508 -1147866 -1047982
6404 -1047982 -588044 -622992 -570364 -980522 -371917 -718831 -729948 89226 -467044 -103522
6394 -103522 302426 177258 -101759 106727 209540 284640 -839104 -559001 -786477 -276887
6384 -276887 -40849 -31976 760839 643708 799521 237519 -701537 -564305 -793313 -731418
6374 -731418 -1194943 -1141810 -831532 -388194 -359664 -639693 -840162 -295087 45849 297393
6364 297393 -297482 -82144 -249571 28634 -77359 -61209 -233299 -63792 239643 -114711
6354 -114711 169809 -156326 -111556 349890 360612 212303 -48638 -513368 -182276 -481848
$$ packed form
6424c30102j93445Q72659K91183l236k43291k09076j5061j11471L01802N04685
6414H64647m56388k55101k40679j63101j32344r85948K20785P07621p07358R9884
6404a047982M59938l4948N2628m10158O08605l46914j1117Q19174n56270L63522
6394a03522M05948j25168k79017K08486J02813P5100j123744K80103k27476N09590
6384b76887K36038Q873P92815j17131J55813n62002r39056J37232k29008O1895
6374g31418m63525N3133L10278M43338K8530k80029k00469N45075L40936K51544
6364B97393n94875K15338j67427K78205j05993J6150j72090J69507L03435l54354
6354a14711K84520l26135M4770M61446J0722j48309k60941m64730L31092k99572
$$ plain form
6344 -481848 -545141 -267179 -371021 -188344 -214855 -644232 -467742 -98557 306556 644716
6334 644716 -405075 -152005 436163 308147 -329765 -189213 -52819 384985 -52289 -698213
6324 -698213 -69017 214371 -181325 -244725 457634 436480 565438 762926 -450197 -1117147
6314 -1117147 -487433 -231854 -772923 -1525491 -382636 109197 -126004 99572 -16784
6305 -16784 -469201 -223533 -700573 -798200 20419 -529274 -775057 -403458 164425 845007
6295 845007 -545275 -492379 -179429 -27576 -297935 -520094 -532384 -593110 -1083431 -724427
6285 -724427 274 187345 -698078 -286157 -1064361 -811033 -573131 -861014 526482 58695
6275 58695 -762911 -594369 -206648 -388466 -232123 -242952 -58558 -170512 237704 791007
$$ packed form
6344d81848o3293K77962j03842J82677k6511m29377J76490L69185M05113L38160
6334F44716j049791K53070N88168j28016o37912J40552J36394M37804m37274o45924
6324f98213O29196K83388l95696o3400P02359k1154J28958J97488j213123o66950
6314a117147O29714K55579n41069p52568J142855M91833k35201K25576j16356
6305a6784m52417K45668m77040r7627Q18619n49693k45783L71599N67883O80582
6295H45007j390282N2896L12950J51853k70359k22159j2290o0726m90321L59004
6285g24427P24701J87071q85423M11921p78204K53328K37902k87883J387496m67787
6275E8695q21606J68542L87721j81818J56343j0829J84394j11954M08216N53303
$$ plain form
6265 791007 593758 614600 -34666 -246468 -275086 -509613 -524278 -378393 97398 -133579
6255 -133579 686581 763249 188721 -396102 85307 269899 -474963 -500672 -478379 -361096
6245 -361096 98404 -191948 -803483 -741118 -189342 -718354 -550316 -627348 60343 702309
6235 702309 862997 846492 93605 -480069 -738877 -314355 90116 361636 -180199 181259
6225 181259 154432 243546 81824 -306112 -676568 -357612 23961 430529 244099 257618
6215 257618 256560 -492625 -2800 -86784 -164785 28111 32714 -631718 -216718 416552 297336
6204 297336 574711 -263137 -21481 55382 482154 151460 -781877 -185812 -629748 -1097466
6194 -1097466 -794600 48501 857424 259400 645756 346469 -153567 -356147 9267 1220216
$$ packed form
6265G91007j97249K0842o49266k11802k8618k34527j4665J45885M75791k30977
6255a33579Q20160P6668n74528n84823M81409J84592p44862k5709K2293J17283
6245c61096M59500k90352o11535O2365N51776n29012J68038p7032O87691O41966
6235G02309J60688j6505p52887n73674k58808M24522M04471K71520n41835L61458
6225A81259k6827Q9114j61722l87936l70456L18956L81573M06568j86430J3519
6215B57618j058p49185M89825q3984p8001J92896M603o64432M15000O33270j19216
6204B97336K77375q37848K41656P6863M26772l30694r33337N96065m43936m67718
6194a097466L02866Q43101Q08923n98024L86356k99287n00036k02580L65414J210949
$$ plain form
6184 1220216 1239064 626524 237441 731324 534071 445378 -18022 -856600 -823432 -295198
6174 -295198 -208942 145550 -26873 386609 -10057 334125 1020176 1423541 1443865 1189668
6164 1189668 720757 505772 -137648 -425027 -193463 -222620 669247 1122373 981159 332509
6154 332509 379004 576330 822415 1007684 1275138 567664 145283 817043 916978 156207
$$ packed form
6184A220216J8848o12540l89083M93883j97253q8693m63400q38578L3168N28234
6174b95198Q6256L54492j72423M13482l96666L44182O86051M03365K0324k54197
6164A189668m68911k14985o43420k87379K31564k9157Q91867M53126j41214o48650
6154C32509M6495J97326K46085J85269K67454p07474m22381O71760R9935p60771
$$ [...]
##END NTUPLES=NMR SPECTRUM
##END=
