##TITLE=1H_CA-9220-2
 CDCl3
 8 sc, 
 28.12.2023
##JCAMPDX= 6.0         $$ Bruker NMR JCAMP-DX V2.0
##DATA TYPE= NMR SPECTRUM
##DATA CLASS= NTUPLES
##ORIGIN= UXNMR, Bruker Analytische Messtechnik GmbH
##OWNER= root
$$ XWIN-NMR		Version 3.5
$$ Thu Dec 28 13:50:40 2023 Russian Standard Time (UT+4h)  she@DPX200
##.OBSERVE FREQUENCY= 200.1313
##.OBSERVE NUCLEUS= ^1H
##.ACQUISITION MODE= SIMULTANEOUS
##.ACQUISITION SCHEME= undefined
##.AVERAGES= 8
##.DIGITISER RES= 18
##SPECTROMETER/DATA SYSTEM= spect
##.PULSE SEQUENCE= zg30
##.SOLVENT NAME= CDCl3
##.SHIFT REFERENCE= (INTERNAL, CDCl3, 0, 15.5662)
##AUDIT TRAIL= $$ (NUMBER, WHEN, WHO, WHERE, WHAT)
$$ ##TITLE= Audit trail, XWIN-NMR		Version 3.5
$$ ##JCAMPDX= 5.01
$$ ##ORIGIN= Bruker BioSpin GmbH
$$ ##OWNER= she
$$ F:/spectra/data/she/nmr/H-F/1/pdata/1/auditp.txt
$$ ##AUDIT TRAIL=  $$ (NUMBER, WHEN, WHO, WHERE, WHAT)
(   1,<2023-12-28 13:49:09.65 +0400>,<she>,<DPX200>,
      <created by zg, POWCHK disabled, PULCHK disabled
       configuration hash MD5:
       00 E9 B6 7A A2 85 ED C7 34 08 36 98 17 FE 4E 26
       data hash MD5: 16K
       7C BF B3 46 22 AA 0B CC 6A A0 25 98 7F B9 C0 05>)
(   2,<2023-12-28 13:49:11.85 +0400>,<she>,<DPX200>,
      <Start of raw data processing
       efp BC_mod = 2 LB = 0.24 FT_mod = 6 PKNL = 1 PHC0 = -24591.87 PHC1 = 13.65273 SI = 16K 
       data hash MD5: 16K
       AD 5A E9 B4 D1 11 D1 B4 8F F6 A9 92 63 FE 50 5B>)
(   3,<2023-12-28 13:49:30.60 +0400>,<she>,<DPX200>,
      <pk PHC0 = 2.367639 PHC1 = -6.799999 
       data hash MD5: 16K
       35 51 9F 50 BE 6D 22 DC E0 4F ED E7 43 DA 44 9C>)
(   4,<2023-12-28 13:49:37.31 +0400>,<she>,<DPX200>,
      <abs ABSG = 5 
       data hash MD5: 16K
       7C 35 92 05 5A AE 01 42 8C 5F CC 8C 56 C4 2A 61>)
(   5,<2023-12-28 13:49:51.45 +0400>,<she>,<DPX200>,
      <pk PHC0 = 0 PHC1 = 0 
       data hash MD5: 16K
       7C 35 92 05 5A AE 01 42 8C 5F CC 8C 56 C4 2A 61>)
(   6,<2023-12-28 13:50:18.67 +0400>,<she>,<DPX200>,
      <abs ABSG = 5 
       data hash MD5: 16K
       E9 2E F6 27 2C 3E 48 11 7D 1D 6F A8 2D 5F DF 53>)
$$ ##END=
$$ 
$$ hash MD5
$$ EF 6D 6A AA E4 DE 75 76 30 BB 35 D2 B6 D9 5E 7C
##$RELAX= 
##$RELAX= 
##$RELAX= 
##$RELAX= 
##$RELAX= 
##$RELAX= 
$$ Bruker specific parameters
$$ --------------------------
##$DU= <F:/spectra>
##$EXPNO= 1
##$NAME= <H-F>
##$PROCNO= 1
##$TYPE= <nmr>
##$USER= <she>
##$AMP= (0..31)
100 100 100 100 100 100 100 100 100 100 100 100 100 100 100 100 100 100 
100 100 100 100 100 100 100 100 100 100 100 100 100 100 
##$AQSEQ= 0
##$AQ_mod= 1
##$AUNM= <au_zg>
##$AUTOPOS= <>
##$BF1= 200.13
##$BF2= 200.13
##$BF3= 200.13
##$BF4= 200.13
##$BF5= 200.13
##$BF6= 200.13
##$BF7= 200.13
##$BF8= 200.13
##$BYTORDA= 1
##$CFDGTYP= 0
##$CFRGTYP= 5
##$CHEMSTR= <none>
##$CNST= (0..31)
1 1 145 1 1 1 1 1 1 1 1 1 1 1 1 1 1 1 1 1 1 1 1 1 1 1 1 1 1 1 1 1 
##$CPDPRG= <>
##$CPDPRG1= <>
##$CPDPRG2= <>
##$CPDPRG3= <>
##$CPDPRG4= <mlev>
##$CPDPRG5= <mlev>
##$CPDPRG6= <mlev>
##$CPDPRG7= <mlev>
##$CPDPRG8= <mlev>
$$ [...]
##$SUBNAM3= <"">
##$SUBNAM4= <"">
##$SUBNAM5= <"">
##$SUBNAM6= <"">
##$SUBNAM7= <"">
##$SUBNAM8= <"">
##$SUBNAM9= <"">
##$SW= 18.0517328524113
##$SWIBOX= (0..15)
0 0 2 0 0 0 0 0 0 0 0 0 0 0 0 0 
##$SW_h= 3612.71676300578
##$TD= 16384
##$TD0= 1
##$TE= 0
##$TE2= 300
##$TE3= 300
##$TEG= 300
##$TL= (0..7)
0 120 120 120 120 120 120 120 
##$TP= (0..7)
150 150 150 150 150 150 150 150 
##$TP07= 0
##$TPNAME0= <>
##$TPNAME1= <>
##$TPNAME2= <>
##$TPNAME3= <>
##$TPNAME4= <>
##$TPNAME5= <>
##$TPNAME6= <>
##$TPNAME7= <>
##$TPOAL= (0..7)
0.5 0.5 0.5 0.5 0.5 0.5 0.5 0.5 
##$TPOFFS= (0..7)
0 0 0 0 0 0 0 0 
##$TUNHIN= 0
##$TUNHOUT= 0
##$TUNXOUT= 0
##$USERA1= <user>
##$USERA2= <user>
##$USERA3= <user>
##$USERA4= <user>
##$USERA5= <user>
##$V9= 5
##$VALIST= <valist>
##$VCLIST= <CCCCCCCCCCCCCCC>
##$VD= 0
##$VDLIST= <DDDDDDDDDDDDDDD>
##$VPLIST= <PPPPPPPPPPPPPPP>
##$VTLIST= <TTTTTTTTTTTTTTT>
##$WBST= 1024
##$WBSW= 4
##$XGAIN= (0..3)
0 0 0 0 
##$XL= 0
##$YL= 0
##$YMAX_a= 33241
##$YMIN_a= -45401
##$ZGOPTNS= <>
##$ZL1= 120
##$ZL2= 120
##$ZL3= 120
##$ZL4= 120
##$ABSF1= 15.5662
##$ABSF2= -2.485651
##$ABSG= 5
##$ABSL= 3
##$ALPHA= 0
##$AQORDER= 0
##$ASSFAC= 0
##$ASSFACI= 0
##$ASSFACX= 0
##$ASSWID= 0
##$AUNMP= <proc_1d>
##$AZFE= 0.1
##$AZFW= 0.1
##$BCFW= 0
##$BC_mod= 2
##$BYTORDP= 0
##$COROFFS= 0
##$CY= -3
##$DATMOD= 1
##$DC= 0
##$DFILT= <>
##$DTYPP= 0
##$F1P= 0
##$F2P= 0
##$FCOR= 1
##$FTSIZE= 16384
##$FT_mod= 6
##$GAMMA= 0
##$GB= 0
##$INTBC= 1
##$INTSCL= 3.70164e-10
##$ISEN= 128
##$LB= 0.24
##$LEV0= 0
##$LPBIN= 0
##$MAXI= 10000
##$MC2= 0
##$MEAN= 0
##$ME_mod= 0
##$MI= 1.114404
##$NCOEF= 0
##$NC_proc= -10
##$NLEV= 6
##$NOISF1= 3.799351
##$NOISF2= 2.8
##$NSP= 0
##$NTH_PI= 0
##$NZP= 0
##$OFFSET= 15.5662
##$PC= 1
##$PHC0= -24589.5
##$PHC1= 6.852731
##$PH_mod= 1
##$PKNL= yes
##$PPARMOD= 0
##$PSCAL= 0
##$PSIGN= 0
##$REVERSE= no
##$SF= 200.129991096414
##$SI= 16384
##$SIGF1= 3
##$SIGF2= 2
##$SINO= 5.538805
##$SIOLD= 16384
##$SREGLST= <1H.CDCl3>
##$SSB= 0
##$STSI= 16384
##$STSR= 0
##$SW_p= 3612.71676300578
##$SYMM= 0
##$S_DEV= 0
##$TDeff= 16384
##$TDoff= 0
##$TI= <>
##$TILT= no
##$TM1= 0
##$TM2= 0
##$TOPLEV= 0
##$USERP1= <user>
##$USERP2= <user>
##$USERP3= <user>
##$USERP4= <user>
##$USERP5= <user>
##$WDW= 1
##$XDIM= 16384
##$YMAX_p= 371757771
##$YMIN_p= -5882344
$$ End of Bruker specific parameters
$$ ---------------------------------
##NTUPLES= NMR SPECTRUM
##VAR_NAME=  FREQUENCY,     SPECTRUM/REAL,   SPECTRUM/IMAG
##SYMBOL=    X,             R,               I
##VAR_TYPE=  INDEPENDENT,   DEPENDENT,       DEPENDENT
##VAR_FORM=  AFFN,          ASDF,            ASDF
##VAR_DIM=   16384,         16384,           16384
##UNITS=     HZ,            ARBITRARY UNITS, ARBITRARY UNITS
##FACTOR=    0.220516191357247, 1,           1
##FIRST=     3115.26351870785, 0,            0
##LAST=      -497.453244297927, 0,           0
##MIN=       -497.453244297927, -5882344,    0
##MAX=       3115.26351870785, 371757771,    0
$$ Real data points
##PAGE= N=1
##DATA TABLE= (X++(R..R)), XYDATA
$$ [...]
7344a136048J343958n6992k245555m94440N58215J418326K119584j850027o56182
7335i99161M50122J092110j261108O1329M37049n3577j68237n149N81752j982835
7325a847705q54570L67924J650847M90566n8359K76589J46284J45132j641756
7316a325048K89410N46235O60253J04509q00770j531140M88639R56657J072163
7307D60908r37810o4759J27272k30852J433581R51908j612671n48134J436115
7298A015558o16605n21744o31628j66349L60543j72505N37551R5811j257465R15283
7288d41550j38178P17089j079005n0997k91735M63241K20812j302798o9619R71815
7278a000925n24J250840J757653k125788p62745L21151P83971J642013j496429
$$ y = [-1136048, 207910, 150918, -2094637, -2589077, -2030862, -612536, 1507048, -342979, -999161, -549039, 543071, -718037, -656708, -219659, -273236, -441473, -446622, 135130, -1847705, -2702275, -2334351, -683504, -192938, -251297, 25292, 171576, 316708, -1325048, -1035638, -489403, 170850, 275359, -525411, -2056551, -1567912, -611255, 460908, -476902, -541661, -414389, -645241, 788340, 1740248, 127577, -420557, 1015558, 398953, -122791, -754419, -920768, -560225, -732730, -195179, -99368, -1356833, -441550, -579728, 137361, -941644, -992641, -1284376, -821135, -600323, -1903121, -1972740, -1000925, -1001449, 249391, 2007044, -118744, -881489, -560338, 223633, 1865646, 369217]
7269C69217J151881J705932j658669k046324m63322Q77061P15259j924836L54255
7260i19546J917465r16645n4539j448386k16382L39331J57904J668793l08381
7251B19614N6077q72214m944j524795j410983K767997J222699M25025n37529K18980
7241E59927p68115j279039P17104j381319K237277j70905j907586Q91344J471539
7232C70227K67487n16752l59605p54173j593505K342927K11095l59501N2707k087123
7222b426216J461909P06090K10818l23354j396709j165357N91122K98616k82786
7213b325867K077726J148614o59997P11174j13692n64206k452415j812123J020325
7204b970461J187453R58405N76926R19319m33832j752138R93493J15900R0290
$$ y = [369217, 1521098, 3227030, 1568361, -477963, -941285, -64224, 651035, -1273801, -919546, 997919, 81274, 26735, -1421651, -1638033, -1298702, -1140798, 527995, 219614, 275691, -596523, -601467, -2126262, -3537245, -769248, 453451, 878476, 340947, 559927, -208188, -1487227, -770123, -2151442, 85835, -85070, -1992656, -1101312, 370227, 637714, 120962, -238643, -992816, -2586321, -243394, -32299, -391800, -339093, -2426216, -964307, -258217, -47399, -370753, -1767462, -2932819, -2341697, -2043081, -2325867, -248141, 900473, 240476, 951650, 837958, 273752, -2178663, -3990786, -2970461, -1783008, -824603, -247677, 671642, 237810, -1514328, -520835, -404935, -314645]
7195c14645n49629L04680J078212J6742k31214J72413J147358p88640j683289
7186h48012M4335N28392L6402p6798k02638k19376l93860n79641J298389k01287
7176f14094n44908J141614P20092m61437P95354j451851j749824J489517j025271
7167a700808Q19726L75890k730m97735N87564l94531m70580R97091J96312P91236
7157G01435j48873O26854n35132N7788l65913K380588r9654o74151j432812j187149
7147f77019M81657p8536j405508k023703J752994O19141O3582o45253R45027P83698
7137a83920P51347m38964J42241l58933q84743P045j455093o45134P37823j152747
7127c481078Q21729J374974n72025J48772O02598J71856r69028n68080J591356
$$ y = [-314645, -864274, -559594, 518618, 535360, 304146, 476559, 1623917, 835277, -848012, -803677, -275285, -238883, -315681, -518319, -737695, -1131555, -1711196, -412807, -614094, -1159002, -17388, 702704, 241267, 1036621, -415230, -2165054, -675537, -1700808, -881082, -505192, -507922, -1005657, -418093, -812624, -1283204, -286113, -89801, 701435, 552562, 1179416, 644284, 702072, 336159, 2716747, 2617093, 1942942, 510130, -677019, -195362, -273898, -1679406, -3703109, -1950115, -1330974, -1267392, -1912645, -967618, -183920, 567427, 128463, 270704, -88229, -972972, -965927, -2421020, -3066154, -2328331, -3481078, -2659349, -1284375, -1856400, -1707628, -1105030, -933174, -1902202, -2470282, -878926]
7118h78926l10980R0841J965468n53385n17790n91554n64462q8274R61474N6233
7108d31355r03893l17375n79454J17903K271976j00273L07515P2181o18666q4814
7098b66255r29488j33471Q44587J797865J054246m89789o5340j302353j867189
7089a357187m66359J232381Q60321N50220O22127p10481j71522m81449j457552
7080a379501p5773R24786j51969P25091j40651m92248N51186j54621J69984J69835
7070A46119m27037j99673J644242r03852n06151m85549j071448Q63853K18561
7061g20935j4966K48367m73587J764943m7542r12283j492071n1312Q39839o9510
7051i29057J160432l75215l83159J14243P50996R0077j533036l39000k5232m34490
$$ y = [-878926, -1189906, -1099065, 866403, 313018, -204772, -796326, -1360788, -1449062, -487588, -431355, -1335248, -1652623, -2232077, -2114174, 157802, 57529, 365044, 437225, -181441, -266255, -1195743, -1329214, -484627, 1313238, 2367484, 1877695, 1812355, 510002, -1357187, -1823546, -591165, 269156, 819376, 1441503, 731022, 559500, 78051, -1379501, -1455274, -530488, -682457, 42634, -98017, -590265, -39079, -193700, -23716, 146119, -280918, -480591, 1163651, 259799, -246352, -731901, -1803349, -939496, -720935, -735901, -487534, -961121, 803822, 756280, -156003, -1648074, -1699386, -859547, -929057, 231375, -143840, -526999, -412756, 338240, 428317, -1104719, -1443719, -1468951, -1903441]
7041a903441M20287P6453J108958R23000r21097r29749J380503j460123L99463
7032i05746Q1453l44991K80253Q78788m29693M9970m81404n63790j338530q9898
7022b863588J433189L1256K13425N90776K22944k91110J696441J040394q13602
7013A260125m84755p85313J412339j905114q60992J58520j99400j97694l33545
7004a935829j355605L14825K171164o60656n43992j58040R13459L74347q08856
6995a689183L83024K420725l41292j045968J092875N32224j044520K8960j248675
6986i11830q10335l83669J624252r30135j189595k33893n59918K022568M69715
6977i02840l40482M41398o96109P37180P56565q16350j428155J429212M57395
$$ y = [-1903441, -1483154, -1406701, -297743, 625257, -295840, -1225589, 154914, -1305209, -905746, -824293, -1169284, -889031, -10243, -439936, -389966, -871370, -1435160, -2773690, -2863588, -1430399, -1399143, -1185718, -594942, -371998, -663108, 1033333, 2073727, 1260125, 775370, -9943, 1402396, -502718, -1363710, -1205190, -1404590, -1602284, -1935829, -3291434, -2976609, -805445, -1466101, -2010093, -2168133, -1254674, -880327, -1689183, -1306159, 1114566, 773274, -272694, 820181, 1352405, 307885, 336845, -911830, -1722165, -2105834, -481582, -1411717, -2601312, -2835205, -3395123, -1372555, -902840, -1243322, -801924, -1498033, -760853, -4288, -820638, -2248793, -819581, -362186]
6968c62186j231895J194437J375133k006908j025701O84525M58972j00230M99392
6959e14461j021623l418J257913q80670J289499Q17759r81273k79819q82052j02169
6949a300314n24192R27245J119549j879895J071360J014165o71412k91564r77479
6940a512537n9712l57499J106931J758996J081443o55183p24061l79181l76413
6931a17216o64751m85195O86951l41913l15851J897291r46717k489241o875j12092
6921b895609J107389p9913j405058J334565Q39269R26998N71896p31992P22172
6912C89717k3444p67662j416836M89159O08911J084507N53342J677087k057525
6903E37256j764311N82213p04006j411143K071173J191728K05988j099578N35238
$$ y = [-362186, -1594081, -399644, 975489, -1031419, -2057120, -1372595, -913623, -1013853, -514461, -1536084, -1539502, -281589, -1162259, 127240, 944999, -36274, -316093, -1198145, -1300314, -1824506, -897261, 222288, -1657607, -586247, 427918, -243494, -535058, -1512537, -1572249, -1929748, -822817, 936179, 2017622, 1362439, 638378, 259197, -117216, -781967, -1267162, -580211, -922124, -1237975, 659316, -287401, -2776642, -2783517, -2895609, -1788220, -1868133, -3273191, -1938626, -1099357, -172359, 399537, -332455, 389717, 366273, -401389, -1818225, -1329066, -720155, 364352, 917694, 2594781, 537256, -1227055, -644842, -1348848, -2759991, -688818, 502910, 708898, -390680, 144558]
6894A44558j110533J02115O92115m38668K66827m31894N1391j102825M05715J545943
6884A24744N20851l1950m24786j019373q30418M13402J067476J68766r31959O74609
6874b68638J95500k033297Q35997M20806o17984K21728J78993j631432J808093
6865h90234P49381J44028k94568N30625j242727Q7881P16055q93855j430532n15860
6855c039806M94063J411892J25109R02859k58022j717229k67031K933114n62663
6846B2286k370944J490335P2188L3193r29203J019678R32424J124310M09470j241665
6836E62072K97718k071863P00932J387214q60539Q26589J626335q49010j924048
6827c04600P4418J560683P5752j698670Q84559m92697M90247j835854l65049J612248
$$ y = [144558, -965975, -863860, -171745, -610413, -343586, -775480, -724089, -1826914, -1421199, 124744, 645595, 613645, 188859, -830514, -1660932, -1247530, -180054, -11288, -943247, -268638, -73138, -2106435, -1270438, -849632, -1467616, -1245888, -1066895, -2698327, -890234, -140853, 3175, -291393, 239232, -1003495, -915614, -199559, -1093414, -2523946, -3039806, -2545743, -1133851, -1008742, -105883, -363905, -2081134, -2348165, 584949, 22286, -2348658, -858323, -786135, -752942, -1682145, -662467, 269957, 1394267, 1803737, 562072, 859790, -1212073, -511141, 876073, 15534, 842123, 2468458, 1619448, -304600, -230182, 1330501, 1406253, -292417, 592142, 99445, 589692, -1246162, -1611211, 1037]
6817A037j426254L65135o38877J75710P90350p8788k93405m03147K33285q35635
6807b110589J843073L94127p99854j007769r37656n83025O14735K396568m30735
6798f21125j090774J448714O2905J184616J7757K42346r89308j75933m44199Q7984
6788b77017k8841o05997P66382q90731P40800M34556q24392j054100j298098L05362
6778b732076K121454R59791J251864j498659n7210O10498r53485l11204M80228
6769a28799J78235k86239m04047N69524O83368L01587r3760k060936J49959J72851
6759i18257J45946j24808o24169j39453N30480N72193p48662p46769Q27410J333986
6749A07897J112081m70977N49614q58231m68257J293818M18856q09434O59494
$$ y = [1037, -1425217, -1060082, -1698959, -1523249, -732899, -811687, -1105092, -1508239, -1274954, -2110589, -267516, 126611, -673243, -1681012, -2618668, -3201693, -2586958, -190390, -621125, -1711899, -263185, -200280, 984336, 1002093, 1244439, 255131, 79198, -365001, -277017, -305858, -911855, -145473, -1036204, -295404, 139152, -685240, -1739340, -3037438, -2732076, -610622, 349169, 1601033, 102374, 45164, 655662, -297823, -609027, -128799, 49436, -236803, -640850, -71326, 612042, 913629, 819869, -1241067, -1091108, -918257, -772311, -897119, -1521288, -1660741, -1130261, -558068, -1306730, -2053499, -1226089, 107897, 1219978, 749001, 1298615, 440384, -27873, 1265945, 1684801, 875367, 1534861]
6740A534861j494222k346200K259422J344850j268449k264654J00241J176168
6732i57983J14658o10562J290183l20343j659502N25122m61446P41970J087897
6723b50006j3435m12928j466364J935318O06998q9188j112365l44562J138400
6714h132m47679j826326N54059K14204N4713j139406O82213O04685N24133K55576
6704e31960N0834O15733o21317j552359m7777O61931K464287o85544j306740R1782
6694h61130m10934P88792j91515J0345R90581j333399o51439K227257j183188
6685f14630j115788o68206p35091O60356K047455r7588K195598j099032k053997
6676a480923M92229k46169j303974J503585J512570j446607Q2245J779389K44496
$$ y = [1534861, 40639, -2305561, -46139, 1298711, 30262, -2234392, -2134151, -957983, -843325, -1453887, -163704, -484047, -2143549, -1618427, -2079873, -1337903, -250006, -263441, -676369, -2142733, -207415, 399583, 310395, -801970, -1146532, -8132, -455811, -2282137, -1728078, -1513874, -1459161, -2598567, -1916354, -1311669, -787536, -531960, -481126, 134607, -486710, -2039069, -2086846, -1424915, 1039372, 353828, -952912, -861130, -1272064, -483272, -674787, -664442, 326139, -1007260, -1658699, 568558, -614630, -1730418, -2398624, -3133715, -2473359, -425904, -523492, 1672106, 573074, -1480923, -988694, -1234863, -2538837, -1035252, 477318, -969289, -887044, 892345, 1136841]
6667A136841j932140p39441L736Q83884m28124j26861k7888J610745j98504j086999
6657i04751J371415j177566n47022R87804L51789M90104O48923l87917m67774
6648C65005j192796n4159p23954k02651R38313L88197o82648N50399j589536o69290
6638b873120n39519J066253J372861q22972m30514J405540R49917j31436j742586
6629a745576Q82812N04258j063151r10696Q1666o06559N40321J519727r8506r51482
6619a847186o92379J006115J096355k39030j509156J068373o09776J013794J92753
6610e20137m08438L18233Q30836j21687J192242l95199j320237l02158L36548
6601c89997J76280p77275P68748M82310j15339o875r61208L68711L07497q07162
$$ y = [1136841, -795299, -1534740, -1531004, -647120, -1075244, -1202105, -1229993, 380752, 182248, -904751, 466664, -710902, -1257924, -270120, 81669, 571773, 1220696, 832779, 365005, -827791, -881950, -1605904, -1808555, -870242, -482045, -1164693, -614294, -2203830, -2873120, -3412639, -2346386, -973525, -1796497, -2227011, -821471, 128446, -2990, -1745576, -862764, -358506, -1421657, -2332353, -2250687, -2857246, -2316925, -797198, -895704, -1847186, -2539565, -1533450, -437095, -676125, -2185281, -1116908, -1726684, -712890, -520137, -928575, -610342, 220494, 98807, 1291049, 895850, -424387, -726545, -389997, -213717, -990992, -222244, 260066, 144727, 137852, -823356, -454645, -147148, -954310]
6591i54310J32118N46963M80840L67430o52777j102803R12354L64562p6983K9984
6581D7378j673015r82549j36748J551018N82348r5245p41765K55519Q06966r08984
6571a295077K90650J277879k258375J37079Q0648k9321K05666J040707K32838
6562c17306M030J47902j647080N48479N45068J262177Q3177l73108n4622q33386
6552f34669j248397J08074Q06688l74545j683189O85848K432946J929852j023190
6543I99418n54273j3319j387990M44770M3254l77609j432819O00816J773441j425554
6533a329865J17916J275539N84473j273995m85757m16355J637552p93764j995335
6524b679591Q02738K358140K059969k263568q82756M3586m53376J058379P8355
$$ y = [-954310, -822192, -275229, 205611, 573041, -79736, -1182539, -270185, 94377, 17394, 47378, -1625637, -2608186, -2744934, -1193916, -611568, -706813, -1448578, -1193059, -386093, -1295077, -1004427, 273452, -1984923, -1847844, -1767196, -1796517, -1590851, -550144, -317306, -313276, -165374, -1812454, -1263975, -718907, 543270, 626447, 253339, 198717, -634669, -1883066, -1774992, -968304, -1342849, -3026038, -2340190, 92756, 2022608, 999418, 445145, 431826, -956164, -511394, -468140, -845749, -2278568, -1677752, 95689, -1329865, -1211949, 63590, 648063, -625932, -1111689, -1528044, 109508, -684256, -2679591, -1876853, 481287, 2541256, 277688, -605068, -561482, -1014858, 43521, 121876]
6515A21876k77295J197399l1614j610128J95170p08018J480114M3788j426934
6506a015642L01040J127955j348022p84906L13501J550364j207833p62796M07178
6497a419161o85834K542447r7350m17289L21947L5006j58378j030244M07407J396758
6487H95309o52891r95212R23457l50542j147657M30506j145648J276683m63076
6478a229071O49246o19865p90681J434138Q30110j054604K57106m75560L04918
6469f94263K01618J076574q32419k49512K76850j390023N06281l94893l5035k22728
6459a757550J355217o58155j330424J781084j132383N16869J723945j207769N90138
6450a19028n77885k45039k77806k163898K522392J63381p00465J037095n53774
$$ y = [121876, -155419, 1041980, 1010366, -599762, -404592, -1112610, 367504, 411292, -1015642, -714602, 413353, -934669, -1719575, -1406074, 144290, -1063543, -1826339, -1419161, -2104995, 437452, 340102, -77187, 244760, 279766, 121388, -908856, -501449, 895309, 242418, -752794, 170663, -179879, -1327536, -897030, -2042678, -765995, -1229071, -579825, -1199690, -1990371, -556233, 273877, -780727, -523621, -999181, -694263, -492645, 583929, -248490, -498002, -221152, -1611175, -1104894, -1499787, -1534822, -1757550, -402333, -1060488, -2390912, -609828, -1742211, -1225342, 498603, -709166, -119028, -696913, -941952, -1219758, -3383656, -861264, -697883, -1398348, -361253, -915027]
6441i15027N54450J487727m41322r59533p11804j123192K026093K17552q03598
6432f68654k12132P73662N25315k2703J49830o64028j343742J216421L66383j066738
6422i46386Q19907l88282m88407N23473r41631P82883P28368j222545L58879K172250
6412A398509k232994j8240j044009J244977L51345o34023J244276r77805K51650
6403d16314J930953o16176k159841p29193M44294K32677Q41606l4722j304938
6394a811654M7130K32348m69647P26096L08743l41893n03577M15730N79883J60095
6384f56746l00619n15147K404182m82570k3271j246183l03796m85371m51231O61668
6374a399084J082812j427704k204986K32457J143989J499555K39564J979502m92810
$$ y = [-915027, -360577, 1127150, 685828, -273705, -985509, -2108701, -82608, 134944, -668654, -880786, -107124, 418191, 395488, 545318, -118710, -1462452, -246031, 120352, -946386, -126479, -514761, -1003168, -479695, -1421326, -638443, 89925, -1132620, -773741, 1398509, -834485, -852725, -1896734, -651757, -300412, -934435, 309841, -667964, -416314, 1514639, 898463, -1261378, -1990571, -1546277, -1313600, -471994, -506716, -1811654, -1764524, -1532176, -2001823, -1275727, -966984, -1308877, -1812454, -1396724, -816841, -656746, -957365, -1472512, 931670, 449100, 425829, -820354, -1124150, -1609521, -2060752, -1399084, -316272, -1743976, -3948962, -3716505, -2572516, -1072961, -833397, 1146105, 653295]
6365F53295P91638j352270k100399O34827m42614J160286K53931p62766k34614
6356a398686p95074K94558K71726j291346J105253J953061K07059p06760m97921
6347h58130r12696J046511p58940J203808Q05154Q73897o4725j531561J20170
6338g6512O84278j123255N64062K38850k209650j45874n97645k12404L038347
6329A60197l83152n73028N18261j615783J66598R70400K13126J44375O64237M20617
6319F85848q50770N82298p95184M79341J040822j825359O49654j035141J73967
6310h94524R06836n12758k240K01863o57351O23443J615080o0058J05681j99582
6300A126390j337329K64635r79398O96835R42467j123916j457728j83459n08706
$$ y = [653295, 1444933, 92663, -2007736, -1372909, -1815523, -655237, -401306, -1164072, -1398686, -2193760, -1899202, -1627476, -2918822, -1813569, 139492, 346551, -360209, -858130, -1770826, -724315, -1483255, -279447, 525707, 1399604, 1334879, -196682, -76512, 607766, -515489, 48573, 287423, -1922227, -2068101, -2665746, -2878150, 160197, -222955, -795983, -277722, -1893505, -1726907, -756507, -543381, -399006, 265231, 685848, -164922, 417376, -377808, 101533, 1142355, -683004, -33350, -1068491, -894524, 12312, -500446, -502686, -300823, -958174, -334731, 1280349, 1220291, 1325972, 1126390, -210939, 53696, -925702, -228867, 713600, -410316, -1868044, -2051503, -2560209]
6291b560209o35396M21708J749465j208N55142L52106M13085r45278l83900q19251
6281a853736j26028P27884K05368J618667j064119L38340p74672J641625J319754
6272B033083O30873j960109k529178K86946J350926n80688n85425N37319m28028
6263a244281L16782P14142J157905k351140J409105P58516p26839Q33261L05586
6254A173037j142620m03430R23060r8385n23572j631753P58097R02869n40298
6245e82995k86362J01906q81805l18967Q43353P24421r68008O15347J50601J53357
6235d49152j81418L69572P58641J589608o94568Q70547k129714j504590K286J11772
6225a257016K001326j595600O41845P31013L7556r6567j736194Q7786J693494
$$ y = [-2560209, -3195605, -2773897, -1024432, -1025640, -470498, -118392, 294693, -650585, -1034485, -1853736, -1979764, -1251880, -1046512, 572155, -491964, -153624, -928296, 713329, 2033083, 2663956, 703847, -1825331, -1538385, -187459, -768147, -1353572, -816253, -1244281, -927499, -213357, 944548, -1406592, 2513, 761029, 34190, 867451, 1173037, 30417, -373013, 550047, 451662, -71910, -1703663, -945566, -42697, -582995, -869357, -767451, -1649256, -1968223, -1124870, -400449, -1368457, -753110, -602509, -449152, -630570, -260998, 497643, 2087251, 1392683, 2263230, 133516, -1371074, -1368788, -1257016, 744310, -851290, -209445, 521568, 559124, 462557, -1273637, -1185851, 507643]
6216E07643r43243K15189L51398r7899r78076L09683Q64952n15769q58449J723341
6206E78770M0839P00810P67035O52179l24245n31941j518523Q32130m33601n54967
6196B08486l72291o33872N74495J93401J529498L74475o16126j564089q67425
6187a173448J556409M52344j157507J69401J883782K28975o85022o80138J53868
6178G48664o98250J006272J59190r85624L95638N6772O62711Q57091n78579j241533
6168C82352K370351k082200j562389M82855J481736j048389M32067P2511q15476
6159b86582r71473J877924M17393q43265J473478P42513j233489q78463m75381
6150a77345k45995N82271k90780L51122L08046q16180j046537P43931M51276j57099
$$ y = [507643, -435600, -220411, 130987, 33088, -944988, -635305, 229647, -286122, -1144571, 578770, 619609, 1320419, 2087454, 2739633, 2415388, 1883447, 364924, 1197054, 763453, 208486, -163805, -797677, -223182, -29781, 1499717, 1874192, 1258066, -306023, -1173448, 382961, 835305, -322202, -152801, 1730981, 1959956, 1274934, 594796, 748664, 50414, 1056686, 1215876, 230252, 625890, 682662, 1345373, 2202464, 1623885, 382352, 2752703, 670503, -891886, -409031, 1072705, 24316, 456383, 528894, -286582, -1258055, 619869, 1037262, 193997, 1667475, 2409988, 1176499, 298036, -177345, -423340, 158931, -131849, 219273, 527319, -288861, -1335398, -591467, -140191, -297290]
6140b97290L65073q09610j416766P07993J598876N41351O94825j18568q2865q90846
6130B92173M1515O81556O16105K75382p05734k188422j170023K269140J643699
6121A755391n11312k458604J159258j98666j124717M64916J058968Q53224J37353
6112A135811J90966L60104j863985K7491k04134n0431J751028k1038j061544l95674
6102a31406m74930J218366q61887J64300j27066k32499N76826j41733n66109j520414
6092b096552J224290J159199l20671m41548l19773p23010J093207J330326k13928
6083F91540k01310P92671l76365p19604J581391k628371J93916P23449j222090
6074a164773M51466m67145O65551k6605j587629J12016O46457K1710J322780m07642
$$ y = [-297290, 67783, -741827, -2158593, -1450600, 148276, 689627, 1384452, 1265884, 1183019, 292173, 333688, 1015244, 1631349, 1906731, 1200997, -987425, -2157448, 111692, 1755391, 1244079, -1214525, -55267, -253933, -1378650, -913734, 145234, 998458, 1135811, 1326777, 1686881, -177104, -149613, -353747, -404178, 1346850, 1325812, 264268, -131406, -606336, 612030, -249857, -85557, -212623, -445122, 131704, -10029, -576138, -2096552, -872262, 286937, -33734, -475282, -795055, -1518065, -424858, 905468, 691540, 490230, 1282901, 906536, 186932, 1768323, -860048, -666132, 57317, -1164773, -713307, -1180452, -514901, -541506, -2129135, -2017119, -1370662, -1348952, -26172, -433814]
6064d33814j79810j092150Q16678O95186n43801p97483l22391J162900K836530
6055B141845j030936j901652k52080J108273k87824o5066p91000Q62832R68854
6046G53246J492388j899738j323132L14484J110797Q14754q34518J239472j120530
6037E47223m16166O99967L05699k501882N6220P63622k19767m89410N7912J371966
6027A75384m52517J203008n21325R99786n68719j455694j25597N11267m68249
6018g02656p16380P29789l12275p66850J749458N55794k447634J837293J159177
6009A085716M96529p61197l01475p09327n3623p55066J969297o68275j203090
6000i00511K89904r13030r00694N6252J53000J275251R91140j815008Q00627O16881
$$ y = [-433814, -613624, -1705774, -889096, -193910, -737711, -1535194, -1857585, -694685, 2141845, 1110909, -790743, -1042823, 65450, -222374, -287440, -1078440, -215608, 753246, 2245634, 345896, -977236, -662752, 448045, 1262799, 428281, 1667753, 547223, 131057, 831024, 1136723, -1365159, -1308939, -545317, -765084, -1254494, -1196582, 175384, -277133, 925875, 404550, 1404336, 835617, -620077, -745674, -234407, -702656, -1419036, -689247, -1001522, -1768372, -18914, 536880, -1910754, -73461, 1085716, 1582245, 821048, 519573, -189754, -243377, -998443, 970854, 302579, -900511, -610607, -1523637, -2424331, -2368079, -2215079, -939828, 51312, -1763696, -963069, -346188]
5990c46188P74102L75504K82573j245701j419475J103658J219954m28543l90617
5981g4733Q85347j276765L76583q95738J269812j756079j215240Q98450R75848
5972h12515n56280O03215R96129O16286j406484n11461N29157p91928l38280O14548
5962a057613K154527j80363o99534n23266j087188r46457K009510n35707j2254
5953h78345Q88832j36354n25670R22828j45479j045621k211j097434J840209K518034
5943B338789j140975k054773m07976j7232N31691N54732J397091n81162r00811
5934b80626J892591k220920j252819K457779l08085q37870m64039L75310N19416
5925a19263R6271l13742J775210o42658r87157K05129m28721J285789k090454
$$ y = [-346188, 427914, 803418, 1085991, -159710, -1579185, -475527, 744427, 315884, -74733, 810614, -466151, -89568, -985306, 284506, -1471573, -2686813, -1788363, -812515, -1368795, -765580, 230549, 846835, -559649, -1071110, -541953, -1333881, -1672161, -1057613, 1096914, 916551, 217017, -306249, -1393437, -2339894, -330384, -866091, -878345, 10487, -125867, -651537, 271291, 125812, -919809, -922020, -2019454, -179245, 2338789, 1197814, -856959, -1264935, -1282167, -750476, -195744, 1201347, 620185, -280626, 1611965, -608955, -1861774, 596005, 287920, -549950, -1013989, -638679, -119263, -22992, -336734, 1438476, 795818, -191339, 13790, -414931, 870858, -1219596]
5916a219596N57703O69960O06073q18755k74064m22582r74002J328836j76341
5907g22768j135965J912474J003105o19317j278023J084153L50046j156074k79055
5898h41424p18424j69956J762549j359140K93321l89122J706525R7391o09751
5889b28031q31517O52764r60938m00545J013237J008411P26660k213186J358154
5880A25009j018428j23027j41621K20754J234487k259259n48724K914497N01511
5871I05199O3660j43176k61445J069100N73737q63972j180657o24157k35084j223768
5861a920563k9996j16360R72434K50261O74676O60857m45411P46859m36211J02143
5851D58689r1299j119800P86621n99494q8539M44172n39934J336963J86197n20893
$$ y = [-1219596, -661893, 8067, 614140, -204615, -478679, -901261, -1875263, -546427, -722768, -1858733, 53741, 1056846, 437529, -840494, 243659, 593705, -562369, -841424, -1559848, -1729804, 32745, -1326395, -1033074, -1422196, 284329, 381720, -228031, -1059548, -406784, -1367722, -1768267, -755030, 253381, 980041, -1233145, 125009, -893419, -1016446, -1158067, -937313, 297174, -1962085, -2510809, 403688, 905199, 968859, 825683, 564238, 1633338, 2207075, 1343103, 162446, -461711, -696795, -1920563, -1950559, -2066919, -1094485, -844224, -169548, 491309, 45898, 792757, 356546, 458689, 367390, -752410, 34211, -565283, -653822, -209650, -749584, 587379, 773576, 252683]
5841B52683R17170l83954p43686j080456J252217j107417r85660N66667l94351
5832a706787J410233m63327J345808J421838q34692q83441p16858K019917P19472
5823B312163j446652q37365J16061Q4396J380803p52080L03331M96494j20096
5814A537055R51296k81659j386816K495203J019405O51505j139898j386345J432530
5805C892276J432896P25852L44407r60478q99289R69947k80424J476790l42802
5796F359175l35584j25901m72321l82860j147227R45220j156295j422201N38128
5787B800134l6893p52057k12630J17287r99115J115373m00903p82797K07807m37530
5777F18676r22717J302501N73234q4869P9552j802468q7429M56447J195448M77966
$$ y = [252683, 1169853, 785899, 42213, -1038243, 213974, -893443, -1879103, -1312436, -1706787, -296554, -759881, 585927, 2007765, 1173073, 289632, -427226, 1592691, 2312163, 865511, 28146, 144207, 228603, 1609406, 857326, 1160657, 1657151, 1537055, 2488351, 2206692, 819876, 3315079, 4334484, 4985989, 3846091, 2459746, 3892276, 5325172, 6051024, 6395431, 5434953, 4535664, 5505611, 5225187, 6701977, 6359175, 6023591, 5897690, 5425369, 5042509, 3895282, 4840502, 3684207, 2262006, 2800134, 2763241, 2011184, 1798554, 1915841, 916726, 2032099, 1631196, 848399, 1056206, 618676, -304041, 998460, 1571694, 1486825, 1566377, -236091, -323520, 132927, 1328375, 1806341]
5767A806341J71836o10058o39108p82041J073298j332393P09593j55609P15806
5758I57665j17477K50558J02767K75525K79173k370680Q12995L03970J487239
5749A981735j263290k37902m87720L32747k65243R60022j570690l51546J047306
5740A45419J285355k23813J85432o47214j367488l74918J039491J50137J220256
5731A412657p42765n23422l47971o33752J501646n85856p24725j08027L11626
5722d40589p95744L41112Q29513K47962p84673j759385P37200L12036J191930
5713a20638o45088k31852K17124o07316Q87992P94016N13450J73456p43240p4130
5703A63774J082487L13240j37779n0741j566488j822576K038772K39809j029770
$$ y = [1806341, 1978177, 1368119, 729011, -53030, 1020268, -312125, 397468, 241859, 957665, 840188, 1090746, 1193513, 1469038, 1748211, -622469, 190526, 494496, 1981735, 718445, 480543, -7177, 325570, 60327, 1020349, -550341, -901887, 145419, 1430774, 1206961, 1392393, 745179, -622309, -997227, 42264, 192401, 1412657, 669892, 146470, -201501, -835253, 666393, 80537, -644188, -752215, -440589, -1236333, -895221, -65708, 182254, -602419, -2361804, -1624604, -1312568, -120638, -765726, -997578, -780454, -1387770, -499778, 294238, 807688, 981144, 237904, 163774, 1246261, 1559501, 1421722, 1370981, -195507, -2018083, 20689, 260498, -769272]
5694g69272J9707n5840j23791J232244j162825J396780P43102j428373P34102
5685E85834p28657L37169J195952j196351k31095Q48559n82443j582239k48426
5676a601697R02030Q92418O98697K49843P1230J073856k430445J411020P90173
5667B057125p64732k359869Q50827K136443r49796n17850J51389P94838q36445
5658E61930n78133k39515p48590K066504K83575n71429K95355l63563l11630j106299
5648g11795O44386k3474l71175L37971p4434L96311J449218n171j966888k49086
5638e74137m50026j593169J251030R34987M96709n21459J244235o25925m82415
5629c20170k53131J503991j03539L622R14687q22759j554902p29290J695217J041942
$$ y = [-769272, -749565, -805405, -929196, 303048, -859777, 537003, 1280105, -148268, 585834, -142823, 194346, 1390298, 193947, -37148, 811411, 228968, -1353271, -1601697, -699667, 192751, 891448, 1141291, 1212521, 2286377, -144068, 1266952, 2057125, 1292393, -1067476, -216649, 1919794, 969998, 452148, 603537, 1398375, 561930, -16203, -255718, -1004308, 1062196, 1345771, 774342, 1069697, 706134, 394504, -711795, -67409, -90883, -462058, -124087, -198521, 197790, 1647008, 1641837, -325051, -574137, -1024163, -2617332, -1366302, -431315, 65394, -456065, 788170, 162245, -320170, -573301, 930690, 827151, 830773, 1745460, 922701, -632201, -1361491, 333726, 1375668]
5619A375668j104819j96837N17262N98492J55894O85228R91054l17845o11296
5610B092801r41092j422660N43530M15318j412962o77140J206050k4394M70723
5601B50174J571358j856399J488072j453043J445171j561250o6271J307023p56702
5592C68133m22175l42390L66049p74916J639786R93613O50457l86474j078415
5583A013668p88067l45494M8044p14719J68835L147337k44955j331363j118565
5574a65279j937395J177385O68726l01077k97276n78114L198075q45158L69993
5565A289880l8862k14449O49017j092472j34712j103223Q57539K83217j038619
5556e42684k26771N8996k4357J735447L4932j940302J76868J658538o35014l25005
$$ y = [1375668, 270849, 74012, 591274, 1189766, 1345660, 2030888, 3021942, 2704097, 2092801, 1151709, -270951, 272579, 687897, -725065, -1402205, -196155, -220549, 250174, 1821532, -34867, 1453205, 162, 1445333, -115917, -182188, 1124835, 368133, -54042, -396432, -30383, -805299, 834487, 1828100, 2478557, 2092083, 1013668, 225601, -119893, -71849, -786568, -617733, 2529604, 2284649, 953286, -165279, -2102674, -925289, -256563, -557640, -854916, -1433030, 1765045, 919887, 1289880, 1251018, 1036569, 1685586, 593114, 458402, -644821, 212718, 495935, -542684, -769455, -710459, -734816, 1000631, 1035563, -904739, -727871, 930667, 295653, -29352]
5546b9352N42563J965226Q76528j571559r02236j608225L21677j01116q01085
5537a307579P2286P72564j20021R3378j46975J592091j022458P4874K77973O99697
5527I85830R91882r21731l19005L64201n84054N99725j974930k79131J604253
5518D67040N62538j49752j325300O95254j81811R54766k295446J178899J47129
5509E3317J275845l54846J49202J58325Q53970k31157j271656O36222k63825q10337
5499A95060O78461N68687l5702n19252j419272O14899p19990K52652J53238l78508
5489f09727K241362o92740K78950M56581m79382l76507J06370O68714n17068O94009
5479A770562M52000J241449Q54537j930470j502433r96759p07801q87123J507032
$$ y = [-29352, 513211, 2478437, 3354965, 1783406, 881170, -727055, -405378, -506494, -1307579, -1235293, -462729, -582750, -489372, -636347, 955744, -66714, 8160, 286133, 985830, 1977712, 1055981, 736976, 1101177, 517123, 1116848, -858082, -1137213, 467040, 1029578, 879826, -445474, 249780, 67969, 1022735, -1272711, -93812, 53317, 1329162, 974316, 1123518, 1281843, 2135813, 1904656, 633000, 1269222, 1005397, 195060, 873521, 1442208, 1406506, 887254, -532018, 82881, -637109, -384457, -231219, -609727, 1631635, 938895, 1217845, 1674426, 1195044, 818537, 924907, 1593621, 1076553, 1770562, 2222562, 3464011, 4318548, 2388078, 885645, -111114, -818915, -1706038, -199006]
5470a99006K325067p27091P33530p28454m99391j281685K3427q32809J595947
5461D09535J006434p86909m89608N66011J8897O3666q47145J399858J069967p20179
5451A690527p52381O23235j049904J37158l31678j498906K317257k9910r91594
5442A13804J637969n52748p77104J419664j508738L5744l45143Q42967k29096
5433F37319Q8797J09207L06231R57525p09079l30474M63439l94948j144330j181223
5423a197536J307551O9203K66879N69633J44653m53683M66010k95679J366620
5414B243651j07300r51670P9075j592185J545980L66522m67106K88824K5640J088167
5404B519598q39822l49060P12296j176605n10946P37770j096599p74222R38387
$$ y = [-199006, 2126061, 1398970, 2132500, 1404046, 904655, -377030, -353603, -1186412, 409535, 1415969, 629060, 139452, 705463, 724360, 788026, -59119, 1340739, 2410706, 1690527, 938146, 1561381, 511477, 648635, 316957, -1181949, 1135308, 1105398, 113804, 1751773, 1199025, 421921, 1841585, 332847, 368591, 23448, 866415, 637319, 726116, 835323, 1141554, 2099079, 1390000, 1059526, 1522965, 1128017, -16313, -1197536, 110015, 179218, 446097, 1015730, 1160383, 706700, 1172710, 877031, 2243651, 2136351, 1184681, 1263756, -328429, 1217551, 1584073, 1116967, 1405791, 1431431, 2519598, 1679776, 1330716, 2043012, 866407, 355461, 1093231, -3368, -777590, 160797]
5395A60797P34824o83127m43557J269296o66059J673594n4517j75300j62845j00772
5385A552334J87994j761933k64543p18219N95476K67515l34405K248978o22824
5376A150373o5827p26248N00412J145394j428375j80603J140297p96638J05225
5367H44010J09622q28845K55831l89612k13080J960849R88622j145389r58688
5358F23320p00433m6797p93255p53598L70102J26152j84095K738587K06076k71330
5348A314729L154Q89564M2018j656686N59920l30928M76881R1112j46976R4961
5338A337749j577877Q19357k262335K843104P64748q95761O81789j225911q02101
5329c17238j389912M80234P68878p2093J467704r71760o71019K292755L20457
$$ y = [160797, 895621, 212494, -231063, 1038233, 372174, 2045768, 1991251, 1815951, 1653106, 1552334, 1740328, -21605, -286148, -1004367, -408891, -141376, -475781, 1773197, 1150373, 1084546, 358298, 858710, 2004104, 575729, 395126, 1535423, 738785, 844010, 953632, 124787, 380618, -8994, -222074, 1738775, 2727397, 1582008, 623320, -77113, -123910, -917165, -1670763, -1300661, -1174509, -1358604, 1379983, 1586059, 1314729, 1317883, 2207447, 2249465, 592779, 1152699, 821771, 1298652, 1389764, 1242788, 1337749, -240128, 579229, -1683106, 1159998, 1924746, 1028985, 1710774, 484863, -317238, -1707150, -1226916, -458038, -530131, 937573, -34187, -705206, 1587549, 1908006]
5320A908006l60778m47257L2583r36333J249851O85740j705644q38232J026299
5311F14235J391162l95956j135639M65426K401531K50964j581561p61371j305926
5302e7135Q75756J178981M07299j900383K0641L5702K23558j324113j760413J378622
5292i21485J837453p59753M54873N56524j429731Q39495l8190m34762l0154j258896
5282a184626J632713q8088n72192J150849P97285j86081O05562j232670j375681
5273d52929M12277J528751O78079J240513m67197k836161n69531K65431o60677
5264h61444Q8499J418166P39247j496731O45655P20635n86526k83444K96939J505911
5254B186907k646704j71468J915885l2641k062325O66366l78431J163971m36914
$$ y = [1908006, 1547228, 1099971, 1132554, 196221, 1446072, 2131812, 426168, -412064, 614235, 2005397, 1609441, 473802, 939228, 3340759, 3591723, 2010162, 1248791, -57135, 818621, 1997602, 2404901, 504518, 525159, 560861, 784419, -539694, -2300107, -921485, 915968, 156215, 611088, 1167612, -262119, 577376, 539186, 104424, 74270, -1184626, 448087, 359999, -212193, 938656, 1735941, 1549860, 2155422, 922752, -452929, -40652, 1488099, 2166178, 3406691, 2939494, 103333, -466198, -200767, -861444, -772945, 645221, 1384468, -112263, 533392, 1254027, 667501, 384057, 680996, 2186907, -459797, -631265, 1284620, 1251979, -810346, -143980, -522411, 641560, 204646]
5245B04646j013739R7197J035868Q45438j723666o36114L66294L92464R4606p15893
5235a052899J116373J474700M73854K1780L00271R62045N99023l782305r53132
5226h40290J005440k92882J733193m19631j135289n84567L01821m94125j410122
5217b136452J065363J856739j85473q73546J506007j930334j665752K413213j29243
5208g9478P85940j311818L41872P70371L89411L85417R3237k354507R47718J712762
5198A680925j504454j086148J037068P74127r19688N38756j219560P30670o66369
5189f34673J128230L1792p89037L75480P16043P60991m82900o48530j1485j673377
5179a227466K70859J811367J020144j413734j27245R18222j311754M43690L9049
$$ y = [204646, -809093, -711896, 323972, 1169410, -554256, -1190370, -824076, -431612, -337006, -1052899, 63474, 1538174, 2012028, 2033808, 2334079, 3296124, 3895147, 112842, -840290, 165150, -127732, 1605461, 1185830, 50541, -534026, -232205, -726330, -2136452, -1071089, 785650, 600177, -273369, 1232638, -697696, -2363448, 49765, -79478, 706462, -605356, -263484, 506887, 896298, 1281715, 1374952, -979555, -31837, 1680925, 176471, -909677, 127391, 901518, -18170, 520586, -698974, 31696, -634673, 493557, 525349, -263688, 111792, 827835, 1588826, 1105926, 457396, 445911, -1227466, -956607, 854760, 1874904, 461170, 333925, 1252147, -59607, 384083, 423132]
5170D23132j81418k033354M01508K857596n28422j895755L47512J64270j471631
5161a916562N16997N19028R3224m3174Q39371Q08924m55690Q3832n8318J7970
5151D05602m96116J675963j012481r83643R62445K143638k72994r17226l77222
5142A127966q62686J60117R61154L23756P77151j165576j553578j221294l71134
5133a824124J815159J639273k61881k138246L91854J283744J25888j90127o35289
5124B06251r77938J223172M10163J144107r4607m47154j208435J017285m68644
5115H04200l5473P10870J054954l81414j28123J169323m96062P1010o01916m59143
5105A708226n598J628395k065491j284293l779J164257k36818o68878j32861J280922
$$ y = [423132, 241714, -1791640, -1390132, 1467464, 939042, -956713, -609201, -444931, -1916562, -1399565, -880537, -787313, -830487, 8884, 817808, 362118, 445950, 387632, 405602, -90514, 1585449, 572968, -410675, 551770, 2695408, 2422414, 1505188, 1127966, 265280, 425397, 1386551, 1710307, 2487458, 1321882, -231696, -1452990, -1824124, -8965, 1630308, 1368427, -769819, -377965, 905779, 1031667, 841540, 206251, -771687, 451485, 861648, 2005755, 1911148, 1463994, 255559, 1272844, 804200, 768727, 1479597, 2534551, 2153137, 2025014, 3194337, 2698275, 2769285, 2167369, 1708226, 1702628, 3331023, 1265532, -18761, -22540, 1141717, 904899, 236021, 103160, 1384082]
5095A384082Q21989o22445n64461J28994j166055j083045m66110J304093J697879
5086A434921P37604J57739M39660j5367J13598q61092N7306j33795O59558m39278
5076B150854o3717O05227j55328r98389p48203j62381j314310M57422r6509k5906
5066c51240L06880K9612N74379k31721j377985J001802o91595M20256J732151
5057A412539l36497o65043r3526j10639P07690K47135j820496K90126J433897
5048A065186L55754L69272p22314o72028j336709J050555R21947j037374j46077
5039a51788L97380j241955J573389m21627l14139N72191L26002J157609k52833
5030A644229k191199Q15829n1627J855952p49943M33088P53781o36353j561032
$$ y = [1384082, 2206071, 1583626, 1019165, 1148159, -17896, -1100941, -1567051, -262958, 1434921, 2172525, 2330264, 2769924, 2754557, 2868155, 2007063, 2064369, 1930574, 2590132, 2150854, 2087137, 2692364, 2537036, 1538647, 790444, 628063, -686247, -228825, -325334, -351240, -44360, -14748, 559631, 327910, -1050075, -48273, -739868, -319612, 1412539, 1076042, 410999, 317473, 206834, 914524, 1161659, -658837, -368711, 1065186, 1420940, 1790212, 1067898, 395870, -940839, 109716, 1031663, -5711, -151788, 245592, -996363, 577026, 155399, -158740, 413451, 739453, 1897062, 1644229, -546970, 268859, 217232, 2073184, 1323241, 1756329, 2510110, 1873757, 312725]
5021C12725j412342J234165m07363N66373p7325j089462R82034N51220j880594
5012a220569k94429J488522Q48066P37560j48837p21837K04260q02707R39704
5003A029733J4187m07324o72678K415860p46458M0271m53530j603269l18954J075926
4993C73764J358548q65813M50216J088278q4006N2157p41090j369285J349279
4984A612048o43454r51469J288481N73799m45594k601534J776128O33583r26212
4975C15776m15616J085257j281999j688153N33039r40246J404191K72208R55653
4966B40110o57298K06925N46604R17334J41078Q3123Q51560p97816N40723l07939
4956A764404L76870j363345p45067L83295L59912r2134k48390M48948q31838O40551
$$ y = [312725, -1099617, 134548, -272815, 293558, 216233, -873229, 108805, 660025, -1220569, -1514998, -26476, 821590, 1559150, 1410313, 688476, 892736, 90029, 1029733, 1043920, 636596, -36082, 2379778, 1633320, 1673591, 1220061, -383208, -702162, 373764, 1732312, 866499, 1316715, 2404993, 2320987, 2373144, 1632054, 262769, 1612048, 968594, 17125, 1305606, 1879405, 1433811, -1167723, 608405, 1241988, 315776, -99840, 985417, -296582, -1984735, -1451696, -2391942, -987751, -715543, 240110, -417188, -210263, 336341, 1253675, 1394753, 1477876, 2329436, 1531620, 2072343, 1764404, 2141274, 777929, 32862, 416157, 776069, 683935, 435545, 884493, 52655, 693206]
4946F93206P62110Q05267L40773R83541j525874l101641l21972J898799J68060
4937G02269p93713N70711m03839m77262J172912P88862j996375J556745Q99124
4928B019434k177242J303375m10114L69890N99370N26924o2865o72241J83893
4919A680424r00209O19364m94705q06217J193098R31902n32341m47095j689264
4910d45043J072798J614962j678012J499112P84604j378040k246452R75188J966901
4901B166018p52854Q07721q8312O89723N63204k128099j162515J011997J175791
4892B282674J756309j542416k15501n30631L90936j004624j393626J010755J100635
4883A854511j91229j386034m1953J396958R24188j97240o44682j137266L53165
$$ y = [693206, 1455316, 2260583, 2601356, 3584897, 2059023, -1042618, -1364590, 534209, 702269, -91444, 479267, 75428, -401834, 771078, 1559940, -436435, 1120310, 2019434, -157808, 1145567, 735453, 1105343, 1704713, 2231637, 2168772, 1496531, 1680424, 780215, 1399579, 904874, 98657, 1291755, 2223657, 1691316, 1244221, -445043, 627755, 2242717, 564705, 2063817, 2848421, 1470381, -776071, 199117, 2166018, 1413164, 2220885, 2132573, 2822296, 3385500, 1257401, 94886, 1106883, 2282674, 4038983, 2496567, 2281066, 1750435, 2141371, 1136747, -256879, 753876, 1854511, 1663282, 277248, 235295, 1632253, 2556441, 2359201, 1714519, 577253, 930418]
4874I30418Q53728Q76211k03104o43392l65487J50389k27058Q377N61658K47686
4864B189426o43811L97579P36389R33811j208893j524683J751256P7376K19047
4855B927497L93604l54376m39384K11743j7654j97172l11981M2613o45796j266772
4845C42322J236614o93819J854131m03750J163802o23527N55961J11605j144498
4836B398841J70134m12859l12167L30426o0701k98449M61174p79043N55226m03210
4826A649372R19861k97801j50595q22688R73558P69143L2398j34093n16755R57945
4816C380345J150781k405649O44734K32314L63701q69166J375177l01658k258537
4807A312042J159211j091901m45850Q59589J56711q84152M61811J226421m8682
$$ y = [930418, 1784146, 2660357, 2457253, 1813861, 1448374, 1598763, 1371705, 1380082, 1941740, 2189426, 1545615, 1943194, 2679583, 3613394, 2404501, 879818, 2631074, 2708450, 2927497, 3321101, 2966725, 2527341, 2739084, 2721430, 2524258, 2212277, 2254890, 1609094, 342322, 1578936, 885117, 2739248, 2335498, 3499300, 2875773, 3431734, 3543339, 2398841, 2568975, 2156116, 1843949, 2174375, 2113674, 1815225, 2276399, 1497356, 2052582, 1649372, 2569233, 2271432, 2120837, 1298149, 2271707, 3040850, 3073248, 2939155, 2422400, 3380345, 4531126, 2125477, 2770211, 3002525, 3366226, 2497060, 3872237, 3570579, 1312042, 2471253, 1379352, 933502, 1793091, 1949802, 1065650, 1527461, 2753882, 2705200]
4798B705200j949956J395806n87509J028683K971747l29896l72975K8485j209831
4789C679754j821617M96422N67629j457961J345220J062408J323326j81857r19464
4780D093860P63615Q03905O65498m03534k311622j068934o57539L457578l86519
4771D956308j786984J769443L25361j605409j148245J426411m24726j360934M31551
4762B582776J185183l91463l7875J27700J124767l59292L80778O62671j134642
4753D140603L58893P67527m47622j259718J112743j21807j292606N70776J673687
4744E502476j126995o33770L28233J631201q65686o38580l96363l85834J479727
4735D894409J359098l60536n4054J571449l21506l1107j338099J126183J79700
$$ y = [2705200, 755244, 2151050, 1563541, 2592224, 5563971, 5234075, 4861100, 4889585, 3679754, 1858137, 2354559, 2922188, 1464227, 2809447, 3871855, 5195181, 5013324, 4093860, 4857475, 5661380, 6326878, 5923344, 3611722, 2542788, 1885249, 5342827, 4956308, 3169324, 4938767, 5264128, 3658719, 2510474, 3936885, 3512159, 2151225, 2582776, 3767959, 3376496, 3338621, 3466321, 4591088, 4231796, 4612574, 5275245, 4140603, 4499496, 5267023, 4819401, 3559683, 4672426, 4550619, 3258013, 3828789, 5502476, 4375481, 3741711, 4069944, 5701145, 4835459, 4196879, 3800516, 3414682, 4894409, 6253507, 5892971, 5838917, 7410366, 7088860, 7057753, 5719654, 6845837, 7025537]
4726G025537j293121k086234O56962J318956j339154J002187J270701J5667K74056
4717F845557N30904J01742N70903J96878j246634J754448j009793P1866o55470
4708G160401o88584J125814J273048K2454J724796j033250n65132J08640J374480
4699A0502667k011765J0619K75055j26238O04102M74389J684344l06222o3973
4690A1042978j71084P9818N41347L85473j254501J003343P51385N05693O64533
4681A3548985o81567o10019K104789j488464l35064m00233Q20063K82978J284418
4672A4525886n71344j315534J921480p39735O99523K464056m96424L90972r70326
4663A5908554J43800J196163K72793K89686m93001N33908l08964O54309J225544
$$ y = [7025537, 5732416, 3646182, 4303144, 5622100, 4282946, 5285133, 6555834, 6571501, 6845557, 7376461, 7478203, 8049106, 8245984, 6999350, 8753798, 7744005, 7815871, 7160401, 6471817, 7597631, 8870679, 8893133, 10617929, 9584679, 9019547, 9128187, 10502667, 8490902, 8501521, 8776576, 8650338, 9254440, 9728829, 11413173, 11106951, 11042978, 10871894, 10951712, 11493059, 11878532, 10624031, 11627374, 12378759, 12884452, 13548985, 12867418, 12257399, 14362188, 12873724, 12538660, 12138427, 12958490, 13241468, 14525886, 13954542, 12639008, 14560488, 13820753, 14520276, 16984332, 16487908, 16878880, 15908554, 16052354, 17248517, 17521310, 17810996, 17317995, 17851903, 17542939, 18197248, 19422792]
4654A9422792J242209p14839N75557m18790Q78551K72753Q1602J201027J36668
4645B2677530J378922n06613J043809l88907J116410L53257M31045J317865J875936
4636B9299254O53628k113763p20140J317188J811556J134043R52788r31852K511096
4627C3913798J981140Q15397L5790K162132J969093J465625K307219K480087O28166
4618D7758447m15771K777406M68591J893608J840661L299899K701372J34419j16035
4609F0342597J545260O77686K085588L154796M95221J891056K087356K467486
4601G4747046K441237J410033J961247K017192N33630Q72247J900574J832038
4593H7715244J796240L118647J153715R90304K071295J366507J732776K284947
$$ y = [19422792, 20665001, 19950162, 20525719, 20106929, 20985480, 21258233, 21339835, 22540862, 22677530, 24056452, 23549839, 24593648, 24204741, 25321151, 25674408, 26105453, 27423318, 29299254, 29952882, 27839119, 27118979, 28436167, 30247723, 31381766, 32334554, 31402702, 33913798, 35894938, 36710335, 36746125, 38908257, 40877350, 42342975, 44650194, 47130281, 47758447, 47342676, 50120082, 50588673, 52482281, 54322942, 57622841, 60324213, 60458632, 60342597, 61887857, 62565543, 64651131, 67805927, 68301148, 70192204, 72279560, 74747046, 77188283, 78598316, 80559563, 82576755, 83110385, 83982632, 85883206, 87715244, 89511484, 92630131, 93783846, 94774150, 96845445, 98211952, 99944728, 102229675]
4585A02229675L951751J368440K640704M391000K964007M193447K949203L348761
4577A28036988N623154N853001N491315M365532O453224Q063679Q709367R076671
4569A81672931Q194285Q828962J1287990J1415110J3979782J3740195J3847379
4562B62966634J6304637J7340564J6928033J7530939J3813662J0904049R879980
4555C65668498N238564Q50709n224278q326148j2010771j5895440j9447785j8348172
4547B92505177j8253735j7257255j7763692j5481469j5160018j2407855j4502426
4540A81678727j1374651p913762j2586654r653523p894991p874499p116727m547318
4532A12716602p107934m424562n367486o312845m450640k091276m558139m234871
$$ y = [102229675, 106181426, 107549866, 110190570, 114581570, 117545577, 121739024, 124688227, 128036988, 133660142, 139513143, 145004458, 149369990, 155823214, 163886893, 172596260, 181672931, 189867216, 198696178, 209984168, 221399278, 235379060, 249119255, 262966634, 279271271, 296611835, 313539868, 331070807, 344884469, 355788518, 365668498, 370907062, 371757771, 366533493, 358207345, 346196574, 330301134, 310853349, 292505177, 274251442, 256994187, 239230495, 223749026, 208589008, 196181153, 181678727, 170304076, 162390314, 149803660, 140150137, 132255146, 124380647, 117263920, 112716602, 105608668, 101184106, 95816620, 89503775, 85053135, 82961859, 78403720, 74168849]
4524G4168849k277066l035299m200376k314649l030220l817280k867596k426845
4516E0199518o41097j740573j603960k36706j888324l075862n56865k007657j781652
4507C6666822r03516j80614j663513m40429o59066k283921l24321N71600j705334
4498B9077708r26138j254148q31684l196227j186590l87494Q1278j087866M81387
4489B0770226k34413k049102m50474K13234J58449q20148J040657n3231j866880
4480A6708318j622433m74911O56553p02539O24025J023880j002830N10247o17620
4471A5102690O68394k907118j218596m58610m60591Q49158L6572o67234J220664
4462A2165329Q78386j622992q6041l6999J59662j521255Q89385j507572k97832
$$ y = [74168849, 71891783, 68856484, 64656108, 62341459, 59311239, 55493959, 52626363, 50199518, 49558421, 47817848, 46213888, 45977182, 44088858, 41012996, 40456131, 38448474, 36666822, 35763306, 35582692, 33919179, 33478750, 32819684, 30535763, 30211442, 30783042, 29077708, 28151570, 26897422, 26065738, 22869511, 21682921, 21295427, 21376705, 20288839, 20770226, 20535813, 18486711, 18036237, 18249471, 18407920, 17587772, 18628429, 18575198, 16708318, 15085885, 14610974, 15267527, 14564988, 15189013, 16212893, 15210063, 15720310, 15102690, 15771084, 12863966, 11645370, 11186760, 10726169, 11575327, 11611899, 10944665, 12165329, 13043715, 11420723, 11334682, 11297683, 11457345, 9936090, 10825475, 9317903, 9020071]
4453I020071J77602j042809J871264j096599l62347p40625k594752Q49582J486265
4444G567652k21573k101042j125315M58035J219795K7391J610237L26433q16028
4435F945585j652543o27776J278409M30566K67376j174903L09594P9132n82360
4426E273080n3627M81717j177463l46740k1408k73409Q73730o74648j293886J9122
4416B806468K182301L37750m94320J056369j759930r24789l81942K56113J020698
4407D098718k38582o02020O72028q13341j107770p18137P55069K94396P10010
4398C050371n98549J197649J79108o59296l5097J679226k75472j133897J630373
4389E034416O33611J97613l10886L3094l23176l8231j025197r8240J26458q61838
$$ y = [9020071, 9197673, 8154864, 10026128, 8929529, 8567182, 7826557, 5231805, 6081387, 7567652, 7346079, 5245037, 4119722, 4577757, 5797552, 5824943, 7435180, 7761613, 6945585, 5293042, 4665266, 5943675, 6374241, 6641617, 5466714, 5776308, 5855440, 5273080, 5219453, 5701170, 4523707, 4176967, 4155559, 3882150, 4755880, 4081232, 2787346, 2806468, 4988769, 5326519, 4832199, 5888568, 4128638, 3203849, 2821907, 3078020, 4098718, 3860136, 3258116, 3930144, 3116803, 2009033, 1290896, 2045965, 2340361, 3050371, 2451822, 3649471, 3828579, 3169283, 3134186, 4813412, 4537940, 3404043, 5034416, 5668027, 5865640, 5554754, 5587848, 5264672, 5226441, 4201244, 4103004, 4229462, 3367624]
4379C367624L68497P77826j906164K44754J091395N83141p91490k104639j74024
4370A456920O05274Q00002O51015O18320j343814j002443n36710l09570J224598
4361B163592K93433j485711k39847J040743j191611L49140O86629j449641Q45286
4352A012013J447920J59899k154668j297167J991050p5156L49630J011244j400412
4343A044353k246474L5331J018621K23859j11279Q08691j15521N94248j10881
4334A140948p13989J81968M22947p09124L76950J334515P5325j299398j066281
4325b56139R93778m24770R9968k98252P410M89018Q84106j180029p02313j013944
4315a401167R85897O51213K10331P49555M67742J853333j362033j679097r220
$$ y = [3367624, 3736121, 4513947, 2607783, 2852537, 3943932, 4527073, 3735583, 1630944, 1456920, 2062194, 2862196, 3513211, 4131531, 2787717, 1785274, 1248564, 938994, 2163592, 2457025, 971314, 731467, 1772210, 580599, 929739, 1616368, 166727, 1012013, 2459933, 2619832, 465164, -832003, 1159047, 1083891, 1433521, 2444765, 1044353, -1202121, -1166790, -148169, 75690, -35589, 773102, 657581, 1251829, 1140948, 426959, 608927, 1031874, 322750, 699700, 2034215, 2109540, 810142, -256139, 737639, 312869, 412837, 114585, 121995, 611013, 1495119, 315090, -387223, -1401167, -415270, 235943, 446274, 1195829, 1663571, 3516904, 2154871, 475774, 466554]
4306D66554L31536K54294O10951j081211Q10823L89206O53538N94961l50361q17503
4296A862788j514710L52308m23686K43135Q37112p25742k67450k032416O30002
4287a038659J393195M03577K004947K00572r95220n24105R71342M74555n45484
4278B344720j880257q6302P7796o29850K178629R04990j400528r74404l19080
4269B15714J205921M35361P66310k90835m19892o51544k161643J070908L41979
4260E12279K09618q45994j58419R03395k18146K71472J246101J391672Q1341Q32318
4250D225637j213291m84493N42989m73691r26464Q98297J328753j97961J361847
4241E061623k049679n24374J033522k66930j81849j80870o63832l67748o20760
$$ y = [466554, 798090, 1052384, 1663335, 582124, 1392947, 1782153, 2435691, 3030652, 2680291, 1862788, 348078, 700386, 276700, 519835, 1356947, 631205, 363755, -1668661, -1038659, 354536, 758113, 2763060, 2963632, 1968412, 1444307, 2415649, 2890204, 2344720, 464463, 378161, 455957, -173893, 2004736, 2909726, 1509198, 534794, 215714, 1421635, 1856996, 2623306, 2332471, 1912579, 1261035, -900608, 170300, 512279, 721897, -124097, -282516, 620879, 402733, 674205, 1920306, 3311978, 3393319, 4225637, 3012346, 2527853, 3070842, 2597151, 1670687, 2568984, 3897737, 3699776, 5061623, 3011944, 2487570, 3521092, 3254162, 3072313, 2891443, 2227611, 1859863, 1239103]
4232A239103M65026N75156M22897j604208k47616l91971J38783N52276J538925
4223B688371Q14395j176767K61031M21375Q4892q65586j005511j440727P39334
4214E20807k43973P86539R40850q07207j034268n00641J661456J987914l030481
4205B80996r37847J952873j017811k697J474818r50472l65286p9577O05494Q94047
4195A854538m75786P16007l57279p65786L09413j8488L46392j106417q03752K83188
4185a7970O76760l03700K58344o75402O69530j5331j012236M65646K4040j158613
4175a088932K228353K315656j294336k47447k56212J806906j484663o60256J066481
4166B385550K45591n15967n14104m53818o02758K47249J405042j383027J776400
$$ y = [1239103, 1704129, 2279285, 2702182, 1097974, 850358, 458387, 597170, 1149446, 2688371, 3502766, 2325999, 2587030, 3008405, 3093297, 2227711, 1222200, -218527, 520807, 276834, 1063373, 2004223, 1197016, 162748, -337893, 1323563, 3311477, 280996, -656851, 1296022, 278211, 275514, 1750332, 799860, 434574, 354997, 960491, 1854538, 1378752, 2094759, 1737480, 971694, 1281107, 1262619, 1609011, 502594, -301158, -17970, 658790, 355090, 613434, -61968, 607562, 592231, -420005, 45641, 69681, -1088932, 1139421, 3455077, 2160741, 1913294, 1657082, 3463988, 1979325, 1319069, 2385550, 2631141, 2115174, 1601070, 1147252, 544494, 791743, 2196785, 813758, 2590158]
4157B590158N27028j161995j676281l5910J711282j317836J35747j725675J968047
4148A014565Q07471p41771j024058Q12310L337825J62641j194331o57484j875512
4139F41656j63488l71676o23748O84027P58078q75882K08654P37233J568749j345667
4129A217936k093228Q1566J325385r66667P32606K93963l3115J773883N6324M22046
4119B810699j960005o01473Q35489P97621L81302l56500m10782J152898r16159
4110A733090J32894J160836j991294n75884j32683J631550J263898m86975k159284
4101E76148J018429q89323j027029O52804j553004R45827K502756P66259j727356
4092A265511J187860j149510q55681j52261J082063j11770N03223q88454j35033
$$ y = [2590158, 3117186, 1955191, 278910, 243000, 1954282, 636446, 772193, -953482, 1014565, 1822036, 1080265, 56207, 868517, 4206342, 4368983, 3174652, 2517168, 641656, 478168, 106492, -517256, 166771, 924849, 48967, 257621, 994854, 2563603, 1217936, -875292, -793726, 531659, -435008, 297598, 591561, 558446, 2332329, 2388653, 2810699, 850694, 249221, 1084710, 1882331, 2263633, 1907133, 1496351, 2649249, 1733090, 1865984, 3026820, 1035526, 459642, 326959, 1958509, 3222407, 2735432, 576148, 1594577, 705254, -321775, 331029, -1221975, -276148, 2226608, 2992867, 1265511, 2453371, 1303861, 448180, 295919, 1377982, 1266212, 1769435, 880981, 745948]
4083G45948J437008r46371n19768L97778l0679m23778m21483M17405J454462Q31384
4073B941906j540107k349843N86990K94725l7606Q02306j595072j145856N90041
4064a452516K137253M30499j848982l01989J163580O40218L4720p83313o20995
4055f01525J133170O16238k29848j136946n65829K62504J159468M1851j930681
4046a251598J051689P93751P8280j133480p56794n24679K08159N99494K90299
4037f44879l96916n43329Q05786L229399p83117j751740J435742o19750q96562
4028a65366r96386L96320K68435j73109O21276J350098p0778n13817P99815Q7187
4018A603675m94590j301115N25283L50724K20419M27996p13819J89580j34268
$$ y = [745948, 2182956, 1236585, 716817, 1114595, 1083916, 660138, 238655, 656060, 2110522, 2941906, 1401799, -948044, -361054, -66329, -103935, 698371, -896701, -2042557, -1452516, 684737, 1115236, -733746, -1035735, 127845, 768063, 802783, 19470, -601525, 531645, 1147883, 918035, -218911, -784740, -522236, 637232, 679083, -1251598, -199909, 593842, 672122, -461358, -1218152, -1742831, -1534672, -935178, -644879, -1041795, -1585124, -779338, 2450061, 1666944, -84796, 1350946, 731196, -165366, -1161752, -765432, -496997, -670106, -48830, 1301268, 1230490, 716673, 1516488, 1603675, 1109085, -192030, 333253, 683977, 904396, 1332392, 618573, 808153, 673885]
4009F73885j017930o67616Q43123Q53929p59065J151141K869K52091m85315k555029
3999a707917P05174R35473M14680j965494R07848N10749Q05925l99627j48316
3990E8495O92828M33346n65009J26117j970406n19857K056066M08165J912137
3981B631882n13785l299139J439746K020007k08488p84966l21726n49976k72223
3972A41332k57602j72906J126309o80703Q72362l4530p7968O92779J517951r01303
3962B225721j559415r85601q02639K08831j21051J10078J448282K52464j629823
3953h53153J285271L38759J026462j199847J18505J450140j633222m93637K18722
3944B58000n63822J010296J25536j042170j419240M76137J830544k102857j135061
$$ y = [673885, -344045, -1011661, -168538, 685391, -73674, 1077467, 1080336, 1332427, 847112, -1707917, -1002743, -67270, 347410, -1618084, -710236, -199487, 606438, 206811, 58495, 751323, 1184669, 619660, 745777, -1224629, -1744486, 311580, 719745, 2631882, 2118097, -1181042, 258704, 2278711, 2070223, 1285257, 963531, 413555, 141332, -116270, -289176, 837133, 156430, 1028792, 994262, 916294, 1609073, 3127024, 2225721, 666306, -319295, -1121934, -913103, -1034154, -924076, 524206, 776670, -853153, 432118, 770877, 1797339, 597492, 715997, 2166137, 532915, 39278, 258000, -305822, 704474, 830010, -212160, -1631400, -1155263, 675281, -1427576, -2562637]
3935b562637J230124J572259r99341L86369j12852j97328p81966j251743J853124
3926h63991L4510o85146k44498J099540L69153N66730j615065l70480J173090
3917e36157o92521k3003N23551k20464o73966p1644R97302J672118j48236j110906
3907b83926j225315J932873j001335J695630J31958j910379p80230m7211j41143
3898a629078J63024P08307J355740l62594R2360O80984k72516n00914p79836Q03789
3888B59266K8722l67945P48165l17082N22327k41969j322965P37283m63436j60270
3878e77904n91853J586554J077590j531954L19062J248014j137421j025101P91402
3869A58389R42222j949100k63518J322955k64625q81941q5562n54321P56395j34619
$$ y = [-2562637, -1332513, 239746, -759595, -373226, -486078, -683406, -1465372, -2717115, -863991, -829481, -1514627, -1759125, -659585, -290432, 276298, -1338767, -1709247, -536157, -1228678, -1251681, -728130, -948594, -1622560, -1694204, -696902, 975216, 826980, -283926, -1509241, 423632, -577703, 1117927, 1249885, -660494, -1440724, -1487935, -1629078, -1466054, -757747, 597993, 235399, 327759, 1008743, 736227, 235313, -544523, 259266, 287988, -79957, 668208, 351126, 873453, 631484, -691481, 45802, -417634, -577904, -1169757, 416797, 1494387, -37567, 281495, 1529509, 392088, -633013, 158389, 1100611, -848489, -1112007, 210948, -53677, -935618, -1021180, -1575501, -819106, -953725]
3859i53725L23556O83567P48791K44957m26321j11522q31545k38133K55217J277132
3849I71974p2973j395398j234031J318558N90383M4885n42988P41736M73351k15355
3839F80142J622532l04616M40982j071991j157398J133394k32533J450025p06121
3830A854416j927889Q63656J367715q53065R36629J013471j486849M32011j962759
3821B37336j412194J318525m29430r07390J612561L42439Q05057j183756k95313
3812H7835L43553J781306j967749p48267J857408l87185m65392P41082M10198
3803A652789j345500j64538l32488J40910J03347o4344Q33442J021196M6153J003696
3793B894663j253054M6032L98916o71400o89787l87020K80177J397291J265648
$$ y = [-953725, -630169, 53398, 802189, 1047146, 620825, 509303, -322242, -560375, -305158, 971974, 899001, -496397, -1730428, -411870, 178513, 223398, -319590, 422146, 895497, 680142, 2302674, 1998058, 2439040, 1367049, 209651, 1343045, 1110512, 2560537, 1854416, -73473, 790183, 2157898, 1304833, 2241462, 3254933, 1768084, 2200095, 237336, -1174858, 143667, -285763, -1193153, 419408, 761847, 1566904, 383148, 87835, 431388, 2212694, 244945, -503322, 1354086, 966901, 501509, 1242591, 1652789, 307289, 142751, -189737, -48827, 54520, -9824, 823618, 1844814, 1890967, 2894663, 1641609, 1687641, 2086557, 1415157, 725370, 338350, 618527, 2015818, 3281466]
3784C281466J81204j130049j047740o90433J175762K022148N71082n96298j314500
3775B452642q1980l60573r81287O76652O26110l04061K70426L85049p79598j436616
3765D66764J85457J54615k07300P36321o76883o93052O29945q95066m78618J365007
3755E87190K78094j69469j823927N16195K207195M82065j305984j50059p6690
3746E44610M7584K47820q05865n5709J005858m38335J143325o22394q83243o77098
3736d93447N0892J014387K5552m34299p01673k46442P90824R73191m52545j343594
3726h17154p5048R26939k19916k056997L01478L86672O2887J670704J628664p71162
3716A037067R33071M36497r52140l57811j901731K02573J329608N76569r78529
$$ y = [3281466, 3462670, 2332621, 1284881, 594448, 1770210, 3792358, 4363440, 3767142, 2452642, 2370662, 2010089, 1028802, 1705454, 2331564, 2027503, 2297929, 2682978, 1903380, 466764, 652221, 806836, 599536, 1335857, 658974, -34078, 595867, -299199, -777817, 587190, 865284, 695815, -1128112, -611917, 1595278, 2077343, 771359, 621300, 544610, 592194, 840014, 34149, -21560, 984298, 545963, 1689288, 1066894, 183651, -493447, -442555, 571832, 597384, 163085, -538588, -785030, 5794, 978985, 526440, -817154, -892202, 34737, -185179, -2242176, -1940698, -1554026, -1491139, 179565, 1808229, 1037067, 1970138, 2406635, 1454495, 1096684, -805047, -602474, 727134, 1303703, 325174]
3707C25174N32487j826825m90790j197767m7051K379247R7288n40885J327473
3698E58351P53814N34508n0579n14652j136341n89795q61323Q12126o58462j02413
3688a254766l05887j062455J379226K82045n19945J642109O65887m39961l90621
3679d368R33049j768423k06833N09418K97121k29584n38562j251589J503703k73488
3669a029556J055495P03943j571949J237237j342493L01024r6399q29121l55147
3660a926966l68853J004775M072L91367L14403n1410L31865p27549J191618j106206
3650i42884J715702j02275o31670N24031o35612j317906l43640L27200m40519
3641a847573J349248n19392j252142N70802L59507L1014n37264r23609K294033
$$ y = [325174, 857661, -969164, -1459954, -2657721, -2704772, -325525, -228237, -769122, 558351, 1312165, 1846673, 1796094, 1281442, 145101, -444694, -1306017, -493891, -1152353, -1254766, -1560653, -2623108, -1243882, -961837, -1481782, 160327, 826214, 386253, -4368, 928681, -839742, -1046575, -537157, -240036, -469620, -1008182, -2259771, -756068, -1029556, 25939, 729882, -842067, 395170, -947323, -646299, -742698, -1571819, -1926966, -2295819, -1291044, -1286972, -895605, -581202, -632612, -300747, -1028296, 163322, -942884, 772818, 670543, 38873, 562904, -72708, -1390614, -1734254, -1407054, -1847573, -498325, -1017717, -2269859, -1699057, -1339550, -1308536, -1845800, -2769409, -475376]
3632d75376N92384n59538o9002j035932Q6984J308241k44351j293430N90241O68167
3622d31612K244493O39440L29663m14041k230941p1496P7913J21497K96041j283202
3612g22245l97328p26786J800900J171745J037752P32580r42802k382845n53950
3603i82979N4057P64436n5635K64861L11796n53749K53697o45059k73322R14875
3593E2978j839649j08687J313134j428291m10228n783J924026m61134o50883l50659
3583a965176m98114J598990k24423J14206L81857O76817k58945j698046m26881
3574b299715L88035L77513O05774J4043j324345J668279R05988j059322J231598
3565E07848j61857o45485p00640P20339O24097p20339k16071L81839j130438J940914
$$ y = [-475376, 117008, -442530, -511532, -1547464, -1460480, -152239, -396590, -1690020, -1099779, -431612, 1812881, 2452321, 2781984, 2367943, 137002, 65506, 143419, 264916, 560957, -722245, -1119573, -1846359, -45459, 1126286, 2164038, 2896618, 1953816, -429029, -982979, -928922, -164486, -220121, 44740, 356536, -197213, 56484, -588575, -861897, 52978, -1786671, -1895358, -582224, -2010515, -2420743, -2426526, -502500, -963634, -1614517, -1965176, -2463290, -864300, -1088723, -974517, -592660, 84157, -174788, -1872834, -2299715, -1911680, -1534167, -928393, -914350, -2238695, -570416, 335572, -723750, 507848, 345991, -299494, -1000134, -279795, 344302, -376037, -592108, -210269, -1340707, 600207]
3555F00207J66198j467377J12155O42672l55219L51735j312511q18367O38964
3546a441543Q5755L80044N0840R2757n27716K537544j374738l14512K45094J670688
3536A404213q37578n60725k88416N43344P42816J963495j440771r13520j373678
3527g60820j435210J634827K601364m1707j144241j415186L54704O91287M93989
3518I79007J439003k64580k353314l11167J323601n4380O18421Q44257m36207
3509A784641k209001R8279L29900J041404j79480o0672j571685J055130j213160
3500i24644Q6175O12045L27167Q04434M45626k970334j4514J193421N83817K35059
3490C78252L55611O42144o69779j89215r21035P61104j7576j55045j932009J64348
$$ y = [600207, 766405, -700972, -588817, 53855, -301364, 50371, -1262140, -2080507, -1441543, -1355788, -975744, -924904, -832147, -1359863, 1177681, -197057, -511569, -266475, 1404213, 566635, 5910, -282506, 260838, 1003654, 2967149, 1526378, 612858, -760820, -2196030, -561203, 2040161, 1998454, 854213, -560973, -206269, 485018, 979007, 2418010, 2153430, -199884, -511051, 812550, 758170, 1376591, 2220848, 1784641, -424360, -326081, 3819, 1045223, 865743, 805071, -766614, 288516, -924644, -838469, -226424, 100743, 905177, 1350803, -1619531, -1634045, -440624, 143193, 378252, 733863, 1376007, 706228, 517013, -404022, 357082, 339506, 184461, -1747548, -1583200]
3480a583200J144681P94217j101492J761690J053642L57742q90638J956754k66568
3471C226828k412348k96565j440561L05665J898300J243269j141864J75373J400646
3462B958743N07995p9987j099083k321802J693574j78306k14021R99798j072891
3453A194020O42308P95896N34521J55443r88967J14172k261180n66774q66594
3444a247155K127659L05559o46926J810136o48694m32000K200390j64678j375298
3435A928993P13817k8421K95340L96889L71686j198119r93294m26469N83546J261100
3425B905068J1682j489348r3674K088210J699016j879047J089335J137669r37530
3416D531381N71423K69039j339891P41261J409484P97630j34555m26047r07295
$$ y = [-1583200, -438519, 355698, -745794, 1015896, 2069538, 2427280, 1536642, 3493396, 3226828, 814480, 517915, -922646, -616981, 1281319, 2524588, 1382724, 1558097, 2958743, 3466738, 3386751, 2287668, -34134, 1659440, 1481134, 1267113, 2266911, 1194020, 1836328, 2632224, 3166745, 3322188, 2333221, 2447393, 186213, -380561, -1247155, 880504, 1186063, 539137, 2349273, 1700579, 1268579, 3468969, 3304291, 1928993, 2642810, 2614389, 2909729, 3306618, 3678304, 2480185, 1486891, 1060422, 1643968, 2905068, 2916750, 1427402, 1333728, 3421938, 5120954, 3241907, 4331242, 5468911, 4531381, 5102804, 5371843, 4031952, 4773213, 6182697, 6980327, 6845772, 6419725, 5512430]
3407E512430j156163O36745K614304K38462j155561Q63227N81377M63228J016123
3398I614172r15884Q50628R86037o58272J95673l2117j158953j081715M30990
3389H230559L32664p81608j937740R99714n96914Q22251O0644j011711j132850
3380D985009J48012j017110K12830R76104r33202j908316J114886O0859k141745
3371A497327R15458l34992J073181k87964n4323L9267j201840j72339J92020Q85745
3361B551540j053010l21023K032478Q94299l02860j066217M28328k21380n06831
3352B435324M12253J725876k01271l62454q46898R4928L82901j035545k263746
3343C41368J248863K19591j689218J257244k00554P78922L12692j118361q8594
$$ y = [5512430, 4356267, 4993012, 7607316, 7845778, 6690217, 7553444, 8134821, 8598049, 9614172, 8698288, 9548916, 10534953, 9876681, 10072354, 10040237, 8881284, 7799569, 8230559, 8563223, 7781615, 5843875, 6843589, 6246675, 7068926, 7129570, 6117859, 4985009, 5133021, 4115911, 4328741, 5304845, 4371643, 2463327, 3578213, 3639072, 1497327, 2412785, 2077793, 3150974, 2863010, 2808687, 2847954, 1646114, 1473775, 1665795, 2551540, 1498530, 1177507, 3209985, 4104284, 3801424, 2735207, 3163535, 2942155, 2435324, 2847577, 4573453, 4372182, 4009728, 3162830, 3257758, 3640659, 2605114, 341368, 1590231, 1809822, 120604, 1377848, 1177294, 1956216, 2268908, 1150547, 1061953]
3334A061953j95976j447261L405J037964K85564P31547j54168m24810J178305
3325B076523n81993J129809q5503p52634k67513l93177J174511r88207j619872
3316c08056J223860j05118r74305J862741J3194j253653j026180K68294J275971
3307I76748p12926r66947J368083n54061O12869n22187J76717J253275q74665
3298G56906j088223M34806K010959l34550n07528j122491N85704P92291P110Q24668
3288B359652N9276p39408p2366j365226M62404L52015n49035M20430k47181j536368
3278h55807Q14360n51862l50563K036881J252791p22026n39362j27405n57716
3269C99291J537872r84661n04294o63985l31034J124129j057639K0069r68016
$$ y = [1061953, 865977, -581284, -577879, 460085, 745649, 1477196, 1323028, 898218, 2076523, 1494530, 2624339, 2538836, 1786202, 1518689, 1125512, 2300023, 1311816, -308056, 915804, 810686, -163619, 1699122, 1712316, 458663, -567517, -299223, 976748, 263822, -703125, 664958, 110897, 723766, 201579, 378296, 1631571, 756906, -331317, 103489, 2114448, 1779898, 1272370, 149879, 735583, 1527874, 1534984, 2359652, 2418928, 1679520, 1607154, 241928, 704332, 1056347, 507312, 927742, 680561, -855807, -41447, -593309, -943872, 1093009, 2345800, 1623774, 1084412, 957007, 399291, 1937163, 952502, 448208, -215777, -546811, 577318, -480321, -460252, -1428268]
3260a428268K037552q29712j502812J590943k04167K80638o45959k032090R9620
3251b634255K238591k7341o65404J203378j322770m90354J270864j685611l63083
3242b475985J874443j140216L57519P81709r53449j366826j005970J085899M35372
3233b407504J568387R669L84119P07838N39754n02606l83531M68808R11947K88800
3223A585681k213571K97097j090976J94812K195650k301298m03047O22655K81287
3214h31710j105211L84324j66020J294212J059094N63715O28545k624264k9289
3205h26604K018550M07618o17337q40586N9839j562211j81559P02330o05365m74147
3195a919472M49156K28118M96030J447281K62244j462668o20502l74757J330897
$$ y = [-1428268, 609284, -220428, -1723240, -132297, -336464, -55826, -701785, -2733875, -2634255, -395664, -423005, -1088409, 114969, -1207801, -1698155, -427291, -2112902, -2475985, -601542, -1741758, -1384239, -602530, -1555979, -2922805, -3928775, -2842876, -2407504, -839117, -829448, -445329, 262509, 802263, 299657, -83874, 384934, 1296881, 1585681, -627890, -330793, -1421769, -1226957, 968693, -1332605, -1735652, -1112997, -831710, -1936921, -1552597, -1718617, -424405, 634689, 1198404, 1826949, -797315, -826604, 1191946, 1599564, 982227, 141641, 201480, -1360731, -1542290, -839960, -1445325, -1919472, -1470316, -1242198, -746168, 701113, 963357, -499311, -1119813, -1494570, -163673]
3186a63673m00236Q74093P56355j521076r71280J295706l2019m63794j105313
3177a731237Q73586N24774J93300J267147j150440k161112q70801M89109Q28310
3168a737364P38430o87282j060706P89681J967673j05521n08159j836848q04673
3159c244769M72452J867422J91684O19253k83185j189742M14661r82821k17572
3150b352617K497841j129531j12132J127373Q37464m75228n98444R88017m78872
3141C03871k47696J223101j56525j051594M2688O6930K67065J248836n18894j064719
3131A13063j186606M2109K63732R02816N28278K147158j458910k930974M31355
3122a147979L88622J628274K10697l3178p85492k20936L50276j134164q50834
$$ y = [-163673, -563909, 310184, 1066539, -454537, -1425817, -130111, -162130, -625924, -1731237, -857651, -332877, -139577, 1127570, -22870, -2183982, -3054783, -2565674, -1737364, -998934, -1686216, -2746922, -1957241, 10432, -95089, -603248, -2440096, -3244769, -2772317, -904895, -713211, -93958, -377143, -1566885, -1152224, -2135045, -2352617, 145224, -984307, -1096439, 30934, 868398, 393170, -205274, 782743, 303871, 56175, 1279276, 1122751, 71157, 113845, 180775, 447840, 1696676, 1177782, 113063, -1073543, -1031434, -767702, 135114, 663392, 2810550, 1351640, -1579334, -1147979, -759357, 868917, 1079614, 1046436, 260944, 40008, 390284, -743880, -1594714]
3113a594714P36001J17814L21580P03540L82685q83328k412645L01587J870998
3104d56482q10786j75340N25053J148611j33985r32144r82287o8641K257699q20476
3094d48778o07561K23267J043924l88259n56100M06123J939476j193983J038856
3085A456965j229309K04454j299737J195583k55102p66293K52481Q4817k27212
3076e83353o26233R85537J080688l59388n9996K4922k75620L80608o1052K326344
3066B832457j694797k80774j071848j80686J006855J934199l84621J43322J324126
3057C628233l53611j430157M83026m20481J107844q60688j845409N1473p36073
3048c75843j49768n33865j72432J592696o47157R96231N6462j366707Q11508L14848
$$ y = [-1594714, -858713, -740899, -419319, 284221, 666906, -216422, -2629067, -2327480, -456482, -1267268, -1442608, -917555, 231056, 97071, -835073, -1817360, -1886001, 371698, -448778, -1056339, -833072, 210852, -177407, -733507, -327384, 1612092, 418109, 1456965, 227656, 432110, -867627, 327956, 72854, -693439, -440958, -356141, -583353, -1209586, -224049, 856639, 497251, 437255, 462177, 186557, 567165, 506113, 2832457, 1137660, 856886, -214962, -395648, 611207, 2545406, 2160785, 2304107, 3628233, 3274622, 1844465, 2327491, 1907010, 3014854, 2154166, 308757, 360230, -375843, -525611, -1059476, -1231908, 360788, -286369, 709862, 766324, -600383, 211125, 525973]
3038E25973q68115J187151j425321K269975J46396m57171p18347J95009J74440
3029A029990J0995J146593k261153M99594K87911J174986l61271m774R02568l87384
3019B038055j420208K54703Q92665Q98307j732770r63755J202305r67919j588723
3010a387340N01834J065116M30513K34081j186796m61117O72403J561664k018063
3001e87705n03551K413995l13598J35120k54214p36929k04122N25965j998549
2992a523588J04374J266222m82342L49612n12872P62944O73842J156761l599289
2983a804336m1871j360520J673261P61218j481765R61825P40271n21253J59457
2974i13713R73727j667814m82671J662872M4850n13908j00091r6127p77558J053743
$$ y = [525973, -342142, 845009, -580312, 1689663, 1836059, 1378888, 660541, 855550, 1029990, 1040985, 2187578, -73575, 426019, 713930, 1888916, 1527645, 1522871, 2425439, 2038055, 617847, 872550, 1765215, 2663522, 930752, -33003, 1169302, 201383, -1387340, -885506, 179610, 610123, 844204, -342592, -803709, -131306, 1430358, -587705, -1091256, 1322739, 1009141, 1144261, 890047, 153118, -51004, 474961, -1523588, -1419214, -152992, -635334, -285722, -798594, -35650, 638192, 1794953, -1804336, -1846207, -3206727, -1533466, -772248, -2254013, -1292188, -551917, -1073170, -913713, 60014, -1607800, -2090471, -427599, -382749, -896657, -996748, -1092875, -1870433, -816690]
2964h16690J083824j245162P60042r72566N65382l94401J191312j242761l32443
2955a403463L08317q43873L45300p40855J59616L412971p14371p60497j70076
2946d06931N88681m95304m55578Q4251l52884J156879o27551p36683R13357k49093
2936e80856O2277r1783j053229P43060p34982K83564p47866k229538R06608Q11967
2926b630778J002712N27371J521484o17385M41493L08312k075193M48548J741629
2917F68193k080058N27218j499142K89675N56218J207577l30491p4827P53163
2908A7526K8349m76093j050000M10580J172163k31064j540522M4756p72538M15897
2898a980946J200613m54898J150655R59307k167356j480674k20064K731474Q29249
$$ y = [-816690, 267134, -978028, -217986, -1190552, -625170, -1019571, 171741, -1071020, -1403463, -1095146, -1939019, -1593719, -2334574, -2174958, 1238013, 523642, -236855, -406931, 181750, -313554, -769132, -684881, -1037765, 119114, -508437, -1245120, -331763, -580856, -518579, -610362, -1663591, -920531, -1655513, -1371949, -2119815, -4349353, -3442745, -2630778, -1628066, -1100695, 420789, -196596, 244897, 553209, -1521984, -1073436, 668193, -1411865, -884647, -2383789, -2094114, -1537896, -330319, -660810, -735637, 17526, 45875, -430218, -1480218, -1069638, 102525, -128539, -1669061, -1624305, -2396843, -1980946, -780333, -1235231, -84576, 874731, -1292625, -2773299, -2993363, -261889, 567360]
2889E67360m64283n06317Q63607n07613J421154k008950J09175j069336L71055
2880a224148Q91573Q27187j188232J594494r31622o94757j1631j650287L75449
2871b011974J111J035543l81379O12522L64782o86108j089430Q12080n186o9842
2861a417881L5175Q56500j078523m22227j64354o65582m03387J318870N94947
2852a346462L04416J08915P04849r75643o59938P63849r19324J20328J527318
2843c71692n86019J097893Q52867j076884o29211j178686J27868L65327j11342
2834a509879j50792K116283p75332k100366P65418J77056k2121J48253l73587
2825a725067j511775Q44792J443640P61856J52314N94201q17816o93447j457463
$$ y = [567360, 103077, -403240, 460367, -47246, 1373908, -635042, -525867, -1595203, -1224148, -332575, 494612, -693620, 900874, -30748, -725505, -737136, -2387423, -2011974, -2010863, -975320, -1356699, -744177, -379395, -1065503, -2154933, -1342853, -1348039, -1417881, -1382706, -526206, -1604729, -2026956, -2191310, -2856892, -3260279, -1941409, -1346462, -1042046, -933131, -228282, -1203925, -1863863, -1100014, -2019338, -1899010, -371692, -957711, 140182, 993049, -83835, -713046, -1891732, -1763864, -1398537, -1509879, -1660671, 455612, -319720, -2420086, -1654668, -1477612, -1499733, -1351480, -1725067, -3236842, -2392050, -948410, -186554, -34240, 559961, -257855, -951302, -2408765]
2816b408765P54439R68798j089193N22839O53627P48675p9178o46816q5411N34434
2806a26551j376441R58308j070534q48m25636J697387J33767p50517P03287R96098
2796G38320q20522j364141L29298N58825j336969k67609M94415J590869J708182
2787A630668j742022p9524m10927l11962m88528m22135P25458N84785O29431J224911
2777A340155o95223j349411M73552q0597J122231j920899p66067Q35158k96259
2768a337360M91191O13894L906r23368n76662Q51433J734304o29218m68511j467302
2758a707693k02659J473999q02203p4659J447501K61089m12132r99646n7754m1218
2748a115375N03239M66706j431779o24533p74085k12046J305233P99508J010913
$$ y = [-2408765, -1654326, -685528, -1774721, -1251882, -598255, 150420, 71242, -575574, -660985, -126551, -1502992, -544684, -1615218, -1616066, -2041702, -344315, -210548, -961065, -257778, 738320, -82202, -1446343, -1117045, -558220, -1895189, -2162798, -1668383, -77514, 1630668, -111354, -190878, -601805, -913767, -1402295, -1824430, -1098972, -514187, 115244, 1340155, 644932, -704479, -230927, -311524, 810707, -1110192, -1876259, -1041101, -1337360, -846169, -232275, -228369, -1151737, -1728399, -876966, 857338, 228120, -240391, -1707693, -1910352, -436353, -1238556, -1313215, 134286, 395375, -16757, -1016403, -1074157, -1115375, -612136, -145430, -1577209, -2201742, -2975827, -3187873, -1882640, -1083132, -72219]
2739g2219j19863P964J58982M84101j927781j786042R55016M35901L71200J851923
2729C59182j44292k630746p96795J446741p28145Q81372J547376p1413j587463
2720a724183P74941Q7997M99227J55889n61006O80411R26954j367061N50424K23538
2710B47131k230631J207790j34468q35349j544931K22743N06964J415282J824139
2701F78670M36727o73946j186281J1084n82364j581052Q06269O2318m94839J156645
2691a366769J205327o26475j0203o20151O48058J66837q07974l37847J082842
2682f66355J79869J70256J600630k186449n69057J76556J001979n33299o11215
2673a437085J847681m30723j246536L68089K137R6494J65628j12953Q09027j312460
$$ y = [-72219, -192082, -184118, -25136, 458965, -1468816, -3254858, -2299842, -1863941, -1492741, 359182, 214890, -2415856, -3212651, -1765910, -2494055, -1612683, -65307, -136720, -1724183, -949242, -861245, -362018, -206129, -767135, -86724, 840230, -526831, 23593, 247131, -1983500, -775710, -910178, -1745527, -3290458, -3067715, -2560751, -1145469, 678670, 1115397, 441451, -744830, -733746, -1316110, -2897162, -2090893, -2028575, -2523414, -1366769, -161442, -787917, -798120, -1418271, -770213, -603376, -1411350, -1749197, -666355, -486486, -316230, 1284400, -902049, -1471106, -1294550, -292571, -825870, -1437085, 410596, -20127, -1266663, -898574, -896437, -799943, -634315, -747268, 61759, -1250701]
2663a250701m22018J219412J37301o62493J212634R11926r89911j03145o82853
2654f29848N39792j539481o73639J267733m39545j509069J469172N79683j096887
2645b032089J06967J017613J063599L91230n33636l08953j62069M27952j338193
2636a367579J839653O53291j014484j067605o35706J293036j244695K98535J945350
2627F99796q10449o73581k93596j160194J440479l93039R14213m05938J554024
2618H71715m0110q47932j52014J045879N8605m19252q65710R7494j067263K59099
2608a059489J071411j225179p6811j45521R59256Q72537P00413j619123m11135
2599i33641o2530o29161j09806j232740J485822K39457Q17958M71073n97443M75802
$$ y = [-1250701, -1672719, -453307, -316006, -978499, 234135, 1146061, 156150, 53005, -629848, -90056, -1629537, -2303176, -1035443, -1474988, -2984057, -1514885, -935202, -2032089, -1925122, -907509, 156090, 547320, 13684, -295269, -457338, -29386, -1367579, 472074, 1125365, 110881, -956724, -1592430, -299394, -1544089, -1245554, 699796, -110653, -784234, -1077830, -2238024, -797545, -1190584, -276371, -682309, 871715, 831605, -16327, -168341, 877538, 936143, 516891, -348819, -251325, -1318588, -1059489, 11922, -1213257, -1290068, -1435589, -476333, 396204, 1096617, -522506, -933641, -996171, -1625332, -1735138, -2967878, -1482056, -1242599, -424641, 46432, -551011, -75209]
2589g5209k41029M34282L7103n53871j230606m03406K80564P74098J135774n8844
2579I8856l70884M9299L4892p01827n16005M58035Q65468k53988j863899J886991
2569c13062Q38955K05883p31242O14607m25348N40778M50160j537929p68731M75650
2559f50279R17493k44515K29824J199213r08521k273402J300087R1916n8557J460403
2549A063662m74812M11189J038000o35362j893154Q100L78445P18687K152194
2540B766949q14280M28345q30979k60023L21480m06819n31181P99082N88918o03406
2530A458086L14935R774J357477j646684K09777J252741k32369o04760k529685
2521d10708J264754P37341N5666L0747n37010K40196J869j91533Q1089K51115
$$ y = [-75209, -316238, 118044, 155147, -398724, -1629330, -2032736, -1752172, -978074, 157700, 98856, -272028, -222729, -187837, -889664, -1405669, -947634, -82166, -336154, -2200053, -313062, 525893, 731776, 534, 615141, 189793, 730571, 1180731, -357198, -1125929, -650279, 267214, 22699, 252523, 1451736, 543215, -1730187, -430100, -338184, -396741, 1063662, 588850, 1000039, 2038039, 1402677, -490477, -482377, -103932, 614755, 2766949, 1952669, 2381014, 1550035, 1290012, 1611492, 1204673, 673492, 1472574, 2061492, 1458086, 1773021, 1782795, 3140272, 1493588, 1703365, 2956106, 2723737, 2118977, -410708, 854046, 1591387, 1647053, 1677800, 1140790, 1380986, 1382855, 1191322, 1272411, 1523526]
2511A523526o38451j61489K30320K22669j09843j195252j6100j247109M52458
2502i39271J425624J165441O74717r52389n41429q69042o7265Q49071N46774j78662
2492A113569j200607O040P89437J180755N81213P27281j209345j973738o96694
2483f82089Q21485L23302m05431o0230K402881Q77410j439899q16153J397652
2474B418928J060296l066705Q8229M38955j050696N00229j76005J904597p67744
2465A350084j003408K90117p38657K093108J32687q13751P61063n97004p17892
2456G56347J434271L2660K13869j858294J108039l14739m3527n83295O49660J136617
2446B531608m11760j984115Q13020J016906k576108l3086L64945O39214R03008
$$ y = [1523526, 885075, 723586, 953906, 1176575, 1066732, -128520, -144620, -1391729, -939271, 486353, 1651794, 2326511, 1374122, 832693, -36349, -103614, 745457, 1292231, 1113569, -87038, -80998, 708439, 1889194, 2470407, 3197688, 1988343, 14605, -682089, 139396, 462698, 57267, -2963, 2399918, 3277328, 1837429, 1021276, 2418928, 3479224, 412519, 500748, 939703, -110993, 389236, 213231, 2117828, 1350084, 346676, 636793, -101864, 1991244, 2123931, 1310180, 2071243, 1474239, 756347, 2190618, 2223278, 2437147, 578853, 1686892, 1372153, 1328626, 745331, 1394991, 2531608, 2119848, 135733, 948753, 1965659, -610449, -643535, -278590, 360624, 1263632]
2437A263632J979251j247579o91029j453286J003504J009261j362775k49993J024642
2428A275628J376126k82226k68963j150909J9033k48138M65332k5430Q28873j901812
2418H7514m02997K99071j745371J549205J646399j121966J50243R85200O90988
2409B138286o99585k44611q4826j46865j142527O72918k99889J152817O83029
2400B028747k59193M99219k52817R80688l66181m79211L76089M04315K3477J158645
2390D113778j031859O3947N27603q35916m61079K0896K45238J514907m68960l98250
2380C290305J425387P9362n73182M70445p041n92026M67787L1556N31094L34198
2370E457885l74138J20446L78550j228452J237275J147635m43250p06379j439944
$$ y = [1263632, 3242883, 1995304, 1304275, -149011, 854493, 1863754, 500979, 250986, 1275628, 2651754, 2369528, 2100565, 949656, 968689, 720551, 1185883, 1160453, 1989326, 87514, -315483, -16412, -1761783, -212578, 1433821, 311855, 462098, 1447298, 2138286, 1438701, 1194090, 1109264, 962399, -180128, 492790, 192901, 1345718, 2028747, 1769554, 2268773, 2015956, 2996644, 2630463, 2151252, 2527341, 2931656, 2955133, 4113778, 3081919, 3145866, 3673469, 2837553, 2376474, 2397370, 2642608, 4157515, 3688555, 3290305, 4715692, 4795054, 4221872, 4692317, 4685276, 4093250, 4561037, 4592593, 5123687, 5457885, 5083747, 5204193, 5582743, 4354291, 5591566, 6739201, 6295951, 5589572, 4149628]
2361D149628J225097k09446N22337j41098o13956M73645Q83224J11601N31564
2352F932596L71694j003614N80297R96015m90803J78884k83177J76479J66241
2343G624612Q29602k39785l03023O69303P0193N75515J96460N1001K273660n92679
2333A1154859k127038P14832J034575L13231R46467n86461J056721Q34035j332575
2324A2008646J507817J187808J196237J77569j955920J098708K40502J258293
2316A6719660M66307J72534l352910r79405K154680L022730J474576J310896J207514
2307B2196582o42248K280409K15864M53548M53122J193771M21899J504075J978935
2298C0055957j101686J53729J805779P11378K00204K412693J588156N44042J021161
$$ y = [4149628, 5374725, 5165279, 5687616, 5546518, 4932562, 5406207, 6289431, 6401032, 6932596, 7304290, 6300676, 6880973, 7876988, 7386185, 7565069, 7281892, 7458371, 7624612, 8454214, 8214429, 7911406, 8580709, 8650902, 9226417, 9422877, 9473878, 11747538, 11154859, 9027821, 9742653, 10777228, 11090459, 12036926, 11450465, 12507186, 13341221, 12008646, 13516463, 14704271, 15900508, 16078077, 14122157, 15220865, 15461367, 16719660, 17185967, 17358501, 14005591, 13026186, 15180866, 18203596, 19678172, 20989068, 22196582, 21554334, 23834743, 24050607, 24504155, 24957277, 26151048, 26572947, 28077022, 30055957, 28954271, 29108000, 30913779, 31625157, 31825361, 34238054, 35826210, 36370252, 37391413]
2289C7391413K343473K162959O41758K853100J359299K273875K669405J517159
2281E3212441K660994K764755O89407K186765L773152K319460M853872N774395
2273G8235241M674359M006956M394988P090705O073487P095708J0178802J1479410
2265A33229656J2592897J2937958J7927661J9375982J8729502K1352307J8400658
2258B54546621J2112068q67409j0878186j9181306k5976675k3316910k2619082
2251A63819121j7042317j5122288j3671587j0194847q818848q456259p976977
2244H2535998l716409o499047o115068n651909l237421k668910m439569k516085
2236D7691580l511684k552254k633095l384433j050719n76971j561943l187712
$$ y = [37391413, 39734886, 41897845, 42539603, 45392703, 46752002, 49025877, 51695282, 53212441, 55873435, 58638190, 59327597, 61514362, 65287514, 67606974, 72460846, 78235241, 82909600, 86916556, 91311544, 98402249, 104475736, 111571444, 121750246, 133229656, 145822553, 158760511, 176688172, 196064154, 214793656, 236145963, 254546621, 266658689, 265791280, 254913094, 235731788, 209755113, 186438203, 163819121, 146776804, 131654516, 117982929, 107788082, 98969234, 90512975, 82535998, 78819589, 72320542, 66205474, 60553565, 57316144, 54647234, 50207665, 47691580, 44179896, 41627642, 38994547, 35610114, 34559395, 33982424, 32420481, 29232769]
2228B9232769k925369j458543J59149n48192p68391j981832j593410k389303n8904
2219A7667974l51147k09435l91918n04481j180881r12059M19425R79427j024207
2210A4492698j376632j092566K41401p27164N85664j659758k84789L46437j873454
2201H651837L27189j99243j227644m8352J438277q45j71456J38231L83689l094017
2191F197666p06659J45183j408738N80672J203405o40921Q68559n17189k599838
2182C122140m33036J650205M56912j548235J231336K193105l47855k783757R85520
2173D526335r62371m50448L84499m17521n55948M65435j4997l25764Q22514R85206
2163D456940K05266q94925n37759j750281n41422k48610m9284K50513J129883
$$ y = [29232769, 26307400, 24848857, 25008006, 24459814, 23691423, 21709591, 20116181, 17726878, 17667974, 17316827, 17107392, 16715474, 16210993, 15030112, 14118053, 14537478, 15516905, 14492698, 13116066, 12023500, 12264901, 11537737, 12123401, 10463643, 10178854, 10525291, 8651837, 8979026, 8779783, 7552139, 7503787, 8942064, 8941219, 8769763, 8907994, 9291683, 6197666, 5491007, 5636190, 4227452, 4808124, 6011529, 5370608, 6239167, 5721978, 3122140, 2689104, 4339309, 4796221, 3247986, 4479322, 6672427, 6324572, 3540815, 4526335, 3563964, 3113516, 3498015, 3080494, 2524546, 2989981, 2974984, 2649220, 3471734, 4456940, 4662206, 3767281, 3229522, 1479241, 937819, 689209, 639925, 890438, 2020321]
2154B020321j570247O36472N09144J005744Q98598k238734m14808J333405q63624
2145A316271L35508j3782J97464k90024J268595k87536j197586j184719j18610
2136B5581M66449P5157J145905J566163j420080K00094q86941M24626j89458j25670
2126A281826M13337l98563P1032j902713L2242J192980J418377J644797j778601
2117A974714N60753j757538p90922p10936q96878K502756J285231m93642q51360
2108H22178n38058J076123k70455j392056o26196j301078J226176M82452O99854
2099A78940j116346M44947J324333j252913r13918L33791K226769R81893j544974
2090F62522J686464j151115R7597J97142j341134Q93739k7574N24846j340308
$$ y = [2020321, 450074, 1086546, 1595690, 2601434, 3500032, 1261298, 846490, 2179895, 1316271, 1651779, 1637997, 1835461, 1545437, 2814032, 2526496, 1328910, 144191, 25581, 492030, 567187, 1713092, 3279255, 1859175, 2059269, 1172328, 1596954, 1407496, 1281826, 1695163, 1296600, 1367632, -535081, -502839, 690141, 2108518, 3753315, 1974714, 2535467, 777929, -12993, -723929, -1620807, 881949, 2167180, 1673538, 822178, 284120, 1360243, 1089788, -302268, -928464, -2229542, -1003366, -520914, 178940, -937406, -492459, 831874, -421039, -1334957, -1001166, 1225603, 2207496, 662522, 2348986, 1197871, 1295468, 1492610, 151476, 1045215, 1017641, 1542487, 202179]
2081B02179j386766J688054J528955o76262K72328q66228j62860j667853J124980
2072E6527P45854j971751m01042k16744K77617J915385p50639r92998J151279
2063a86512n03155N80212j061044J110081o62561r6369m84315l48162K10105J727148
2053B85428q4721j48135k24404q67861j960595K240060N88228l33672P30569j937631
2043a712734j344957P61069K012913K34027j172273p71453J348846J232796o98412
2034a10178j219797J419401k51715O9087n77775l18736k40582q28996P01244P56198
2024f01849m6876r00132J007793j825784M13103J500293R43974R01894m21887
2015I70529l27400j325544N6456L1424j030666q87694O26163K99912N22875P84812
$$ y = [202179, -1184587, 503467, 2032422, 1356160, 1628488, 762260, 599400, -1068453, 56527, 802381, -1169370, -1570412, -1787156, -1509539, 405846, -344793, -1337791, -186512, -689667, -109455, -1170499, -60418, -722979, -819348, -1303663, -1651825, -1441720, 285428, 200707, 52572, -171832, -1039693, -3000288, -760228, -172000, -505672, 224897, -1712734, -3057691, -2296622, -283709, -49682, -1221955, -1993408, -644562, 588234, -110178, -1329975, 89426, -162289, -93202, -670977, -989713, -1230295, -2059291, -1358047, -601849, -648725, -1548857, -541064, -2366848, -1953745, -453452, 490522, 1392416, 970529, 643129, -682415, -625959, -594535, -1625201, -2512895, -1886732, -1586820, -1063945, -279133]
2005b79133m9507J503766j547139j198393J510588Q5056L22649J80078J042280
1996A570245L82837j337342m61009O36295Q1154Q44417K36952r43927J80532j32699
1986A057455k36985j390596O01276o92557J459837L67844m74005l94953k97982
1977f66R6089j180958m102o53659k02146R04613J26307J273513p6180j322657
1967a039846l66820K09189k72965P53554J99560Q58705K36743q67684R59579O67656
1957A337671O7506r43154j08965j994156k70973j149184J309883N08278J125950
1948a17144k7970R46356l79307k147860L08816N29106L14089N05941J193057r96971
1938A28113j687831O57262n53913J723670r78441r04957k93037Q05237K385306
$$ y = [-279133, -328640, 1175126, -372013, -1570406, -59818, 25238, 347887, 527965, 1570245, 1953082, 615740, 154731, 791026, 872180, 1716597, 1953549, 1009622, 1190154, 1057455, 820470, -570126, 31150, -661407, 798430, 1166274, 692269, 297316, -666, 95423, -1085535, -1089637, -1743296, -1945442, -1040829, -914522, 358991, 282811, -1039846, -1406666, -1197477, -1470442, -716888, -517328, 341377, 578120, -289564, 670015, 1337671, 1405177, 462023, 353058, -1641098, -1912071, -3061255, -1751372, -1243094, -117144, -145114, 801242, 421935, -1725925, -1417109, -888003, -573914, -67973, 1125084, 128113, -1559718, -902456, -1456369, 267301, -711140, -1616097, -1909134, -1103897, 1281409]
1929A281409j094225J047192j038743Q3793p31859m93182l17103j075783N92806
1920a745695P6248N29315q90850J274029j11656k47996J45495J733965k15226
1911E47629m75970J7680j965887L9768p7974j387343n5115K006923J727052L32622
1901G09385k039601N96037M8072J042309j018930q16699K305100q70645j636535
1892a681507R44917J690431J66740r88678P36693q8445k311902k41646M87540
1883a285857o41993j387949J352149k6882K49834o11014J863562M67200J73421
1874A52471q1016j733535M61088J107509K7791j898016P18398J442992k924721
1865b727039K134007J833799j048077J65711j264069p02301R26951m65729n89516
$$ y = [1281409, 187184, 1234376, 195633, 279426, -452433, -945615, -1262718, -2338501, -1745695, -1669447, -1140132, -2030982, -756953, -868609, -1116605, -971110, 762855, 547629, 71659, 89339, -1876548, -1836780, -1914754, -3302097, -3357212, -1350289, 376763, 709385, -1330216, -734179, -686107, 356202, -662728, -1479427, 825673, -44972, -1681507, -736590, 953841, 1120581, 131903, 868596, 780151, -1531751, -1773397, -1285857, -1927850, -3315799, -1963650, -1990532, -1740698, -2351712, -488150, -20950, 152471, 71455, -1662080, -1200992, -93483, -65692, -1963708, -1245310, 197682, -2727039, -593032, 1240767, 192690, 358401, -905668, -1607969, -681018, -1146747, -1736263]
1856a736263J233102o11379m56085k45404j93721n4089K22144J23625j154719
1847b872789J204887J088930k465726l1085J706454J435045j095961j441472O62136
1838a809581N18124k60508j162742J941467N53910o89031j2155k79704l12359
1829a512579j917150J073477m41949J486496L42324r764n92297m19843l59146
1820b350431j35080J140872J537898j448608R44834m9256o80321M20541O32586
1811A3035M7885k35355j348695J296940K5533k22731J491788j552209O94218J23537
1801C33946j588133J018568Q2569j768947M46599M90089j461075J024736m96418
1792a918066j986299J205835J626147K175629o69438j689040J104439J701854
$$ y = [-1736263, -503161, -1114540, -1570625, -1816029, -2009750, -2063839, -1841695, -1718070, -2872789, -1667902, -578972, -3044698, -3075783, -1369329, 65716, -1030245, -2471717, -1809581, -1291457, -1551965, -2714707, -773240, -219330, -908361, -920516, -1200220, -1512579, -3429729, -2356252, -2798201, -1311705, -969381, -979145, -1571442, -1991285, -2350431, -2485511, -1344639, 193259, -1255349, -310515, -359771, -1040092, -619551, 13035, 60920, -174435, -1523130, -226190, -200657, -423388, 1068400, -483809, 210409, 333946, -1254187, -235619, -153050, -1921997, -1475398, -985309, -2446384, -1421648, -1918066, -3904365, -2698530, -1072383, 1103246, 433808, -1255232, -150793, 1551061]
1784A551061J045855k665760m18585m69206j543257M92433j81918J047228J466762
$$ y = [1551061, 2596916, -68844, -487429, -956635, -2499892, -2007459, -2189377, -1142149, 324613]
$$ [...]
##END NTUPLES=NMR SPECTRUM
##END=
