##TITLE=1H_CA-9219-2
 CDCl3
 8 sc, 
 27.12.2023
##JCAMPDX= 6.0         $$ Bruker NMR JCAMP-DX V2.0
##DATA TYPE= NMR SPECTRUM
##DATA CLASS= NTUPLES
##ORIGIN= UXNMR, Bruker Analytische Messtechnik GmbH
##OWNER= root
$$ XWIN-NMR		Version 3.5
$$ Wed Dec 27 14:19:46 2023 Russian Standard Time (UT+4h)  she@DPX200
##.OBSERVE FREQUENCY= 200.1313
##.OBSERVE NUCLEUS= ^1H
##.ACQUISITION MODE= SIMULTANEOUS
##.ACQUISITION SCHEME= undefined
##.AVERAGES= 8
##.DIGITISER RES= 18
##SPECTROMETER/DATA SYSTEM= spect
##.PULSE SEQUENCE= zg30
##.SOLVENT NAME= CDCl3
##.SHIFT REFERENCE= (INTERNAL, CDCl3, 0, 15.6037)
##AUDIT TRAIL= $$ (NUMBER, WHEN, WHO, WHERE, WHAT)
$$ ##TITLE= Audit trail, XWIN-NMR		Version 3.5
$$ ##JCAMPDX= 5.01
$$ ##ORIGIN= Bruker BioSpin GmbH
$$ ##OWNER= she
$$ F:/spectra/data/she/nmr/H-F/1/pdata/1/auditp.txt
$$ ##AUDIT TRAIL=  $$ (NUMBER, WHEN, WHO, WHERE, WHAT)
(   1,<2023-12-27 14:18:23.93 +0400>,<she>,<DPX200>,
      <created by zg, POWCHK disabled, PULCHK disabled
       configuration hash MD5:
       00 E9 B6 7A A2 85 ED C7 34 08 36 98 17 FE 4E 26
       data hash MD5: 16K
       EE 68 10 84 22 A2 3E 24 25 08 5D 92 98 9B 1A B2>)
(   2,<2023-12-27 14:18:26.29 +0400>,<she>,<DPX200>,
      <Start of raw data processing
       efp BC_mod = 2 LB = 0.24 FT_mod = 6 PKNL = 1 PHC0 = -24750.03 PHC1 = 8.852731 SI = 16K 
       data hash MD5: 16K
       47 4D AC 20 6F B9 DE 0E 7F 3F 3E BD 25 D4 53 8A>)
(   3,<2023-12-27 14:18:52.26 +0400>,<she>,<DPX200>,
      <pk PHC0 = 159.1414 PHC1 = -2.2 
       data hash MD5: 16K
       0C 6B 92 7B 17 F0 BD 34 EA 7D F7 1B A1 47 33 A9>)
(   4,<2023-12-27 14:18:55.51 +0400>,<she>,<DPX200>,
      <abs ABSG = 5 
       data hash MD5: 16K
       99 0A 85 2A 3D 9F AE 0F 8A BF 21 17 A4 E7 E4 CA>)
$$ ##END=
$$ 
$$ hash MD5
$$ AF E1 DB 84 60 D7 EB E5 0A D5 FA 48 71 B4 57 C8
##$RELAX= 
##$RELAX= 
##$RELAX= 
##$RELAX= 
##$RELAX= 
##$RELAX= 
$$ Bruker specific parameters
$$ --------------------------
##$DU= <F:/spectra>
##$EXPNO= 1
##$NAME= <H-F>
##$PROCNO= 1
##$TYPE= <nmr>
##$USER= <she>
##$AMP= (0..31)
100 100 100 100 100 100 100 100 100 100 100 100 100 100 100 100 100 100 
100 100 100 100 100 100 100 100 100 100 100 100 100 100 
##$AQSEQ= 0
##$AQ_mod= 1
##$AUNM= <au_zg>
##$AUTOPOS= <>
##$BF1= 200.13
##$BF2= 200.13
##$BF3= 200.13
##$BF4= 200.13
##$BF5= 200.13
##$BF6= 200.13
##$BF7= 200.13
##$BF8= 200.13
##$BYTORDA= 1
##$CFDGTYP= 0
##$CFRGTYP= 5
##$CHEMSTR= <none>
##$CNST= (0..31)
1 1 145 1 1 1 1 1 1 1 1 1 1 1 1 1 1 1 1 1 1 1 1 1 1 1 1 1 1 1 1 1 
##$CPDPRG= <>
##$CPDPRG1= <>
##$CPDPRG2= <>
##$CPDPRG3= <>
##$CPDPRG4= <mlev>
##$CPDPRG5= <mlev>
##$CPDPRG6= <mlev>
##$CPDPRG7= <mlev>
##$CPDPRG8= <mlev>
##$CPDPRGB= <>
##$CPDPRGT= <>
##$D= (0..31)
0 1.2 0 0 0 0 0 0 0 0.06 0 0.03 0 0 0 0 0.0002 0 0 0 0 0 0 0 0 0 0 0 0 
0 0 0 
##$DATE= 1703672303
##$DBL= (0..7)
120 120 120 120 120 120 120 120 
##$DBP= (0..7)
150 150 150 150 150 150 150 150 
##$DBP07= 0
##$DBPNAM0= <>
##$DBPNAM1= <>
##$DBPNAM2= <>
##$DBPNAM3= <>
##$DBPNAM4= <>
$$ [...]
##$SUBNAM3= <"">
##$SUBNAM4= <"">
##$SUBNAM5= <"">
##$SUBNAM6= <"">
##$SUBNAM7= <"">
##$SUBNAM8= <"">
##$SUBNAM9= <"">
##$SW= 18.0517328524113
##$SWIBOX= (0..15)
0 0 2 0 0 0 0 0 0 0 0 0 0 0 0 0 
##$SW_h= 3612.71676300578
##$TD= 16384
##$TD0= 1
##$TE= 0
##$TE2= 300
##$TE3= 300
##$TEG= 300
##$TL= (0..7)
0 120 120 120 120 120 120 120 
##$TP= (0..7)
150 150 150 150 150 150 150 150 
##$TP07= 0
##$TPNAME0= <>
##$TPNAME1= <>
##$TPNAME2= <>
##$TPNAME3= <>
##$TPNAME4= <>
##$TPNAME5= <>
##$TPNAME6= <>
##$TPNAME7= <>
##$TPOAL= (0..7)
0.5 0.5 0.5 0.5 0.5 0.5 0.5 0.5 
##$TPOFFS= (0..7)
0 0 0 0 0 0 0 0 
##$TUNHIN= 0
##$TUNHOUT= 0
##$TUNXOUT= 0
##$USERA1= <user>
##$USERA2= <user>
##$USERA3= <user>
##$USERA4= <user>
##$USERA5= <user>
##$V9= 5
##$VALIST= <valist>
##$VCLIST= <CCCCCCCCCCCCCCC>
##$VD= 0
##$VDLIST= <DDDDDDDDDDDDDDD>
##$VPLIST= <PPPPPPPPPPPPPPP>
##$VTLIST= <TTTTTTTTTTTTTTT>
##$WBST= 1024
##$WBSW= 4
##$XGAIN= (0..3)
0 0 0 0 
##$XL= 0
##$YL= 0
##$YMAX_a= 81781
##$YMIN_a= -124645
##$ZGOPTNS= <>
##$ZL1= 120
##$ZL2= 120
##$ZL3= 120
##$ZL4= 120
##$ABSF1= 15.48907
##$ABSF2= -2.562779
##$ABSG= 5
##$ABSL= 3
##$ALPHA= 0
##$AQORDER= 0
##$ASSFAC= 0
##$ASSFACI= 0
##$ASSFACX= 0
##$ASSWID= 0
##$AUNMP= <proc_1d>
##$AZFE= 0.1
##$AZFW= 0.1
##$BCFW= 0
##$BC_mod= 2
##$BYTORDP= 0
##$COROFFS= 0
##$CY= -3
##$DATMOD= 1
##$DC= 0
##$DFILT= <>
##$DTYPP= 0
##$F1P= 0
##$F2P= 0
##$FCOR= 1
##$FTSIZE= 16384
##$FT_mod= 6
##$GAMMA= 0
##$GB= 0
##$INTBC= 1
##$INTSCL= 3.70164e-10
##$ISEN= 128
##$LB= 0.24
##$LEV0= 0
##$LPBIN= 0
##$MAXI= 10000
##$MC2= 0
##$MEAN= 0
##$ME_mod= 0
##$MI= 1.114404
##$NCOEF= 0
##$NC_proc= -9
##$NLEV= 6
##$NOISF1= 3.799351
##$NOISF2= 2.8
##$NSP= 0
##$NTH_PI= 0
##$NZP= 0
##$OFFSET= 15.60366
##$PC= 1
##$PHC0= -24590.89
##$PHC1= 6.652731
##$PH_mod= 1
##$PKNL= yes
##$PPARMOD= 0
##$PSCAL= 0
##$PSIGN= 0
##$REVERSE= no
##$SF= 200.129983598859
##$SI= 16384
##$SIGF1= 3
##$SIGF2= 2
##$SINO= 5.538805
##$SIOLD= 16384
##$SREGLST= <1H.CDCl3>
##$SSB= 0
##$STSI= 16384
##$STSR= 0
##$SW_p= 3612.71676300578
##$SYMM= 0
##$S_DEV= 0
##$TDeff= 16384
##$TDoff= 0
##$TI= <>
##$TILT= no
##$TM1= 0
##$TM2= 0
##$TOPLEV= 0
##$USERP1= <user>
##$USERP2= <user>
##$USERP3= <user>
##$USERP4= <user>
##$USERP5= <user>
##$WDW= 1
##$XDIM= 16384
##$YMAX_p= 563327315
##$YMIN_p= -2523593
$$ End of Bruker specific parameters
$$ ---------------------------------
##NTUPLES= NMR SPECTRUM
##VAR_NAME=  FREQUENCY,     SPECTRUM/REAL,   SPECTRUM/IMAG
##SYMBOL=    X,             R,               I
##VAR_TYPE=  INDEPENDENT,   DEPENDENT,       DEPENDENT
##VAR_FORM=  AFFN,          ASDF,            ASDF
##VAR_DIM=   16384,         16384,           16384
##UNITS=     HZ,            ARBITRARY UNITS, ARBITRARY UNITS
##FACTOR=    0.220516191357247, 1,           1
##FIRST=     3122.76014579841, 0,            0
##LAST=      -489.95661720737, 0,            0
##MIN=       -489.95661720737, -2523593,     0
##MAX=       3122.76014579841, 563327315,    0
$$ Real data points
##PAGE= N=1
##DATA TABLE= (X++(R..R)), XYDATA
$$ [...]
13996 -298732 -437849 10189 431321 -506697 -451682 -71559 -501782 -145570 -28634 39652
13986 39652 -149517 56779 -432388 134334 57594 -1113867 -659030 -146127 286497 433803
13976 433803 565929 44032 -63744 75047 -572417 -851228 -304847 282199 113746 -616966
13966 -616966 -243268 -101316 521340 805920 684996 525063 951013 621728 571485 171077
13956 171077 -25348 -718363 -414391 -22703 -522755 109327 -105446 -14691 -55326 -539405
13946 -539405 -540592 -751916 -356302 109286 345738 -860406 -925516 -575474 -160646 -156242
13936 -156242 -234965 -474425 -899073 -865568 -280289 -526271 -291823 472849 1089186 759154
13926 759154 -102843 182160 1203937 714969 282540 -49632 433031 33654 389307
13917 389307 178360 -689782 -1270074 -1082052 -353544 -970431 -837534 -1697243 -1369518 -750863
13907 -750863 -35946 -189635 422209 512223 -295568 -875579 -65931 -635846 -1309940 -197628
13897 -197628 -141018 -852414 -55292 -1240070 -1450342 -640489 -99974 101981 -604963 -750662
13887 -750662 -687753 29984 -662283 -1079174 -593855 -213067 9948 -221178 -862 45259
13877 45259 -470508 102564 -466665 -788067 -654873 -472769 -288620 774723 805827 -146676
13867 -146676 -399918 -319181 -1217346 -504034 -761 -993957 -295052 250038 60017 -555829
13857 -555829 284077 -51020 400239 269357 -525367 -303160 208519 1194923 1342507 -84024
13847 -84024 -421724 -997959 124751 -705535 -517464 301332 -136107 258219 -391990 -544379
13837 -544379 -854502 -1600504 -1772270 -1006256 -184255 -157505 -575300 -612439 -510455 -157580
13827 -157580 741516 192169 120659 352091 476153 -622093 -985844 -326920 -169226 411485
13817 411485 -161838 -172938 187236 203222 137473 239567 780529 -255587 -1542706 -1166635
13807 -1166635 -1131362 -945684 -342759 56583 83740 -487051 -24574 310792 94561 97179
13797 97179 126151 376761 206768 594090 140292 193551 268690 315991 57663 346316
13787 346316 82411 81429 313302 -66413 701665 -139731 -233151 188660 156078 -100443
13777 -100443 -41846 -252120 -788024 -403166 -659616 -1322660 -1014516 -835856 -1481607 -228908
13767 -228908 128192 222432 -152407 -68423 336959 268983 77571 4079 516640 710325
13757 710325 524163 70006 -224252 89585 -228981 48870 -73445 703193 211509 250798
13747 250798 914387 547988 -666030 151273 512788 -196951 -1043676 -1306323 -838117
13738 -838117 -688358 -240573 -539874 -133092 432 -197617 151514 71425 282137 545222
13728 545222 427092 -656638 -973311 152363 38181 -774905 -377567 143360 124961
13719 124961 136977 177984 11459 -145817 208050 180823 602785 293919 -282942 -457389
13709 -457389 73354 -370745 -262251 -23848 -199384 -539723 130263 387814 548925 223594
13699 223594 227776 -411058 -1261164 -61611 171931 -298050 35172 708320 1320340 674995
13689 674995 310651 340328 196573 96817 -103769 -510813 -1122155 -690715 -252933 -240268
13679 -240268 193138 -323766 485043 -135120 -364793 -381335 -69233 -145778 -529845 -667612
13669 -667612 -1053277 -993374 -725048 -659909 -602681 -561637 -72838 290954 303368 -80266
13659 -80266 -249052 -51949 336228 959688 300237 -677230 -1181850 -859685 -335112 902874
13649 902874 998079 637441 -139504 -586864 -881157 -768830 -564922 -576038 -322667 -307544
13639 -307544 -419837 514447 -252704 83878 43663 -656842 -608099 364564 187086 494634
13629 494634 -256593 -542977 -885312 -484455 -3568 -494558 331216 505272 -82610 -389625
13619 -389625 150478 407857 563188 -74433 62909 -708821 -319690 -245094 296663 42589
13609 42589 -407939 -573278 -89366 -337068 -773351 -792249 -438331 823656 401780 -72468
13599 -72468 192130 515030 -75174 -276113 -391583 -493135 699812 -166064 -393379 59506
13589 59506 70992 181940 -830168 -1191398 -912663 -546010 -80740 -436406 27513 466327
13579 466327 1947 -18305 -344191 -926796 -436893 -464046 -473722 357700 778965 263024
13569 263024 -589555 -696663 -134629 -181212 -603238 -86339 258425 1035676 622414 125290
13559 125290 -303766 -85775 746574 494908 801783 684768 749252 324791 -111726 -1074201
13549 -1074201 -669043 488496 397092 1005224 748765 187132 -864017 -510910 -577428
13540 -577428 -370749 -978038 -278299 76638 81989 491980 607150 876757 548341 -287004
13530 -287004 -111280 242022 -203235 -432887 -399803 -25250 -417208 -218448 580633 402094
13520 402094 313492 -262380 -115460 -96036 -92377 312739 76163 -56310 -68205 -547694
13510 -547694 -526363 25092 -237780 456941 183926 -452031 255062 511075 353870 -330257
13500 -330257 -560907 -194424 -255050 474600 -430223 -583628 -981476 75214 325180 -908576
13490 -908576 -566015 673305 -281746 -578739 -241147 -321163 -319287 -618172 -8534 208993
13480 208993 -153258 -804985 78869 -152443 -946969 -401079 672621 120828 -360892
13471 -360892 -553224 -309730 -505881 -24875 627470 110876 -922128 -973352 -1091981 -261865
13461 -261865 543662 908978 906251 416814 852697 208085 567716 1102356 867746 808026
13451 808026 718902 45968 -86762 -1115655 -897058 -433957 -741172 -457032 290388 113372
13441 113372 -45897 -42290 454834 1111252 928138 337203 462797 527480 476820 101769
13431 101769 -512381 -1089779 -1263629 -1546859 -1311573 -491136 -558790 -171419 -367289 -49697
13421 -49697 -200957 -756445 -632161 -20521 152995 -349985 24960 55919 -183680 324897
13411 324897 -19447 65141 -271891 -527349 -818611 -809299 -519524 -812669 -1015007 -587538
13401 -587538 -341748 -184024 -161566 224320 529756 -738168 -1378508 -836251 -570842 -269181
13391 -269181 575064 -70993 -574214 -679953 -651213 -716394 -511080 -476569 780164 725652
13381 725652 -246181 -406175 -792467 -349901 -381320 714411 -157483 -1186472 420360
13372 420360 798061 -140835 94301 296797 -45840 -21430 -1052291 -491450 -686516 -893854
13362 -893854 -674422 -261514 -268750 -526794 -198447 -777610 -1001989 -1321519 -776329 -1056814
13352 -1056814 -1160189 -842921 -266940 -269489 73104 280384 6241 294912 -246303 -850070
13342 -850070 -877143 -166756 153726 -530034 -280524 -347363 -972252 -599822 125266 158748
13332 158748 -682700 -206817 -667302 -1419007 -1103165 -1364145 -1606594 -1695380 -609915 -760630
13322 -760630 -1211005 -791684 -248633 867785 813897 312032 857151 -456278 -47149
13313 -47149 429844 -151513 -367419 -502152 -336783 478052 -76641 -1193935 -1195906 -1206600
13303 -1206600 -155900 33027 207519 812584 383278 -201104 507201 183374 -374059
13294 -374059 -782302 -721438 -667697 -407461 -264387 -573277 -606532 17180 1138652 525071
13284 525071 -482603 -710357 -404403 -527878 -473731 -487089 -424755 -412184 -189720 664396
13274 664396 1048263 663048 145467 674673 1561753 1153992 478769 599901 -82954 -122610
13264 -122610 -1213540 -640349 -181955 249954 906481 301183 149363 115314 566668 824192
13254 824192 516454 -313224 -186051 344756 597875 812191 395744 -80008 186299 227684
13244 227684 -482532 -425321 601928 563340 222758 -153998 106992 384361 700740 380212
13234 380212 -157154 -172781 -145410 67084 -627360 -548301 -484257 -908641 -280754 -181439
13224 -181439 -423992 38452 900716 176273 -619872 -908740 -1051284 -997 1449844
13215 1449844 134121 -14105 510238 -751154 -576144 -101673 182243 -741715 -829647
13206 -829647 -608760 -21387 -102513 -106566 206084 -113653 -361132 -201432 211162 475934
13196 475934 -194342 500566 404094 487629 1030482 666357 380582 -22774 -377449 7892
13186 7892 -540776 -765779 -257450 -1080049 -296226 244424 -306465 -163999 -556407 -910129
13176 -910129 -883921 -1015147 -102813 150967 85834 217552 -201934 649558 189445 -60472
13166 -60472 71209 -46062 -548272 -1114957 -1073337 -1199913 -533002 -847104 -85883 -234928
13156 -234928 -289752 -749098 198911 536338 47956 -978961 -628400 209293 -154782 -358672
13146 -358672 -259377 781140 303859 323768 43752 119798 990207 815627 1293963 634858
13136 634858 -599056 -101791 249542 449763 -7856 -542604 -387376 -641078 -105058
13127 -105058 83538 209371 397939 -294392 -301269 -83671 -736370 -766578 -944848 -80565
13117 -80565 529787 -95067 -207092 -162670 370193 -242711 501399 257816 -152954 216303
13107 216303 732290 657517 58979 -92154 -129314 421805 -39450 -261784 644771 391414
13097 391414 -255937 -174629 -81706 785976 877586 1526754 1223503 950116 887233 636221
13087 636221 781485 924022 1041928 639621 254611 -362415 -321283 -218621 -170551 73041
13077 73041 -848957 -275932 -154083 -212138 -400168 84542 1158114 486876 -443520 -1167134
13067 -1167134 -168150 402375 103767 -184030 35680 -201621 168347 270475 1048861
13058 1048861 780463 -20917 -210911 126825 -365916 -649585 -224971 -43606 -312453
13049 -312453 98155 -6655 -499904 -205898 266978 599659 165824 189733 388387 19976
13039 19976 218332 107139 -166758 -112805 -91143 -397594 -631411 -272358 552160 712784
13029 712784 317680 -293049 -1063669 -775641 -976789 -1203236 -262983 -237872 -23927 159408
13019 159408 41112 285328 -289628 126498 318316 136498 291262 321984 -286200 328765
13009 328765 377264 455462 48152 185016 915314 1330567 79979 195571 779035 12785
12999 12785 -337459 -354572 -428681 -671263 170594 357253 509564 420512 -218954 -393653
12989 -393653 276361 499926 630227 935670 923244 193961 -247830 -207806 -102247 -613411
12979 -613411 -552809 -43123 -559172 -703961 -482216 -404395 -603925 -51117 -585140 -214835
12969 -214835 225291 -128263 -4031 431971 -16125 -476247 -394040 -846428 -857591 -436944
12959 -436944 7820 -361658 -604142 -658410 122232 197062 804437 540901 -648177 -878633
12949 -878633 -1329063 -506762 -156876 -604799 -1039128 -499217 336948 -274560 -218070 -474054
12939 -474054 -225564 -52987 295074 306173 -370083 -48858 -179538 -76240 -838113 -822360
12929 -822360 -291569 -227765 152759 -466490 -856050 128809 321751 111657 -109424 325642
12919 325642 572352 -22225 577177 1061782 692765 1104008 942538 282248 201918 -32209
12909 -32209 155868 62433 457170 585314 59569 262094 880996 452593 -508184 -971739
12899 -971739 -508690 -4678 -250319 -445175 -150938 719 -54459 -77922 911073 666141
12889 666141 320745 908036 923906 -279318 -780758 -482891 112801 -148778 -105632 275081
12879 275081 807469 36313 548771 353580 -662115 80642 -902586 -690575 26679
12870 26679 -651755 -802914 94720 355040 56375 360147 49543 165888 313470 630630
12860 630630 416821 -68620 -436359 -1113594 -427730 -281510 219490 104369 -6506 -303259
12850 -303259 -74211 524951 -255703 -262564 -183775 -1015024 -684600 -390150 -204041 -208145
12840 -208145 144387 344989 500762 138589 -354934 -767287 -175911 322066 -371194 140106
12830 140106 76370 -490797 935815 733957 397470 515610 564296 56719 -309145 -493274
12820 -493274 140575 163414 -162542 -220888 -816323 -628629 -262324 16655 -675068 -1194891
12810 -1194891 -165197 -109052 -743617 -486697 -760168 -564316 -135447 621615 662999 -84952
12800 -84952 408544 100 277670 264131 -68089 231651 841854 584582 310860 344072
12790 344072 108715 25639 -381472 -479045 32863 453008 -521785 -613703 -480057 50175
12780 50175 526339 473246 -240343 52461 -293213 463155 -114757 -873308 -465337 -367016
12770 -367016 -183963 -169738 80984 310885 369861 -450444 -200505 236374 566589 657426
12760 657426 700617 -361552 -1421140 -1611151 -1220430 -534159 -149474 -132951 -791338 -154354
12750 -154354 -332695 -124383 -73667 -307396 -607191 -366592 -243873 256084 610603 813384
12740 813384 347372 -430207 282076 506334 105736 -426626 -686301 27287 791756 -399535
12730 -399535 188235 934121 220360 306446 -1037703 -1805855 -1228707 -539467 -4114 563022
12720 563022 -409399 -154613 -65957 -101302 210023 929017 1232920 -400186 232192 273245
12710 273245 -495338 -855711 -320540 -107254 591070 561752 50391 427629 245898 -245885
12700 -245885 -33982 -312530 -64785 -454788 -1036406 -1089684 -961207 -913822 -742214 -922965
12690 -922965 -372907 -277005 -61567 57349 -660227 -793989 -1061551 -33598 56834 830710
12680 830710 1259479 1479003 551588 1267621 1699697 1154175 543558 272620 356386 573676
12670 573676 677757 430942 1505860 1656562 544063 -91632 487083 294510 -622740
12661 -622740 44928 469862 81233 -84409 -167121 -702864 -960313 -52105 193632 -206599
12651 -206599 -199608 -435829 -1068584 -796215 -602539 -313924 -69744 144985 -18400 24019
12641 24019 87560 436428 -974087 82934 362616 9431 -258753 32787 92232 -150651
12631 -150651 -25137 659190 596346 419829 -47326 292661 1142085 705670 134535 -110681
12621 -110681 271324 -631466 -646014 -1216096 -1065629 -1126055 -512869 -373902 355415 302910
12611 302910 -246775 443840 -209868 -154893 298313 701881 368182 491060 272367 482717
12601 482717 352989 -146611 -128498 307843 -251065 -872579 -433186 469511 956737 276196
12591 276196 -37856 -341537 371944 -262050 -353539 -536976 69387 -131422 -78946 -509253
12581 -509253 -568828 -378143 -529623 210085 -347702 236885 -5734 -246903 -300872 458810
12571 458810 498648 -63226 -192050 -107759 228061 493256 915826 79628 119984 251230
12561 251230 -353936 259008 -17911 -120543 -298255 -489703 -686379 -737611 146910 312512
12551 312512 205402 -493662 -828145 -1226623 -409824 346208 -66417 -394408 -396827 -678619
12541 -678619 -571714 -758168 -218390 310269 948064 220837 213449 52049 -851377 -478299
12531 -478299 -854439 -425574 -4829 333310 61677 88863 -32203 -233407 -387888 -724270
12521 -724270 -213619 -244721 154131 450615 381607 -256905 -222963 224522 -497333 -773854
12511 -773854 -727315 -483096 -26757 -79025 -260124 -134814 -103989 -228827 633124 345638
12501 345638 -685133 -765308 -241945 224074 -42815 -72859 213652 -109242 448511 202875
12491 202875 242444 -176190 -329682 -110005 318553 831093 844035 25816 64826 -170451
12481 -170451 -61570 -193660 33885 170394 -433519 220548 230687 281801 272980 -416313
12471 -416313 -918099 176606 -93919 379830 763473 570596 -442847 -560642 -475565
12462 -475565 678752 221627 -270086 -960924 -649996 -868125 -61935 756463 414216
12453 414216 73821 748398 626246 -171740 -70761 -474324 -1071361 -1104873 -459181 97254
12443 97254 -338257 -797305 275816 -24746 827983 338857 -299530 -22948 -526301 -174315
12433 -174315 -357979 -154616 724774 1087703 255546 -410288 -72663 108024 209028 180672
12423 180672 -441077 -613780 -171794 503011 330141 -64078 118831 -253943 -242900 101109
12413 101109 20446 331263 396772 55114 930899 1157125 613639 -168102 272085 1394317
12403 1394317 1162480 246247 -432012 52326 231726 130661 9434 -906384 -797437
12394 -797437 201489 44577 -178316 -746876 -796970 73341 30148 -483880 -384129 66256
12384 66256 310570 885762 794571 654656 199326 391389 -299738 390426 511074 -221707
12374 -221707 -38045 -112453 469696 940549 591636 844051 389117 4568 579506 209384
12364 209384 315057 878931 1644980 969608 896569 641356 109952 668054 1259251 833349
12354 833349 -281097 82977 -79497 -555850 181658 -205529 -493767 250350 22443
12345 22443 -36598 383051 -104647 78496 309095 -38525 528143 736922 358692 -165939
12335 -165939 -27967 -117333 -76780 -165927 -320828 -288384 -669864 13046 -234797 46347
12325 46347 135688 -387080 -195199 -52697 461005 778301 310905 -403035 439899 971465
12315 971465 234618 -867533 -179821 -377915 324344 -250866 -292258 -121322 327687 923636
12305 923636 847138 594986 378280 16962 259810 618143 148623 -522079 -336328 -382121
12295 -382121 -825393 -691023 230838 476440 348776 892928 1230883 1024465 -26162
12286 -26162 -56040 165900 661691 1033715 946154 231815 725837 1124677 1400128 935281
12276 935281 496991 212621 214282 32028 664984 96010 285423 48331 253942 314216
12266 314216 -50486 224288 279577 541316 -9419 178401 689692 -14869 -75804 432206
12256 432206 675245 91044 42555 545642 854745 178270 166515 -709862 -702407 -667301
12246 -667301 -4935 349818 117841 1370201 838187 783052 299853 532893 -21428 648885
12236 648885 885031 1071616 825184 -60559 11351 474117 476451 354720 429959 206910
12226 206910 -170501 377385 530486 297142 -118178 -858797 -296451 -31601 641571 542452
12216 542452 253028 545791 1019061 -220618 149585 1105268 542819 -356007 -395963 132550
12206 132550 106823 -839419 -1092530 -1106021 328212 -363734 -311306 565635 624346 380850
12196 380850 260983 -176077 -646860 -146514 -321113 -158965 -262742 -553345 -347604 476137
12186 476137 205141 11936 515854 797053 1114130 1332817 893349 1185404 1087200 1063013
12176 1063013 1937992 1863666 1334954 1439728 365834 -33204 -494493 -25820 571670
12167 571670 696046 -550920 -11495 539117 210225 559530 915481 1286794 730161
12158 730161 66875 458585 924946 1143374 391885 49869 600502 680350 268367 -20714
12148 -20714 650954 897324 707311 1088820 1239130 1753357 930583 550552 906885 878773
12138 878773 1146491 1419433 983196 916370 727298 574262 968942 1190479 1485181 1361478
12128 1361478 592917 1250173 1101824 1089896 1421944 835009 1597512 1547370 1110829 1199938
12118 1199938 323425 306726 1034537 890726 1521128 690979 1227959 1463070 702763 434747
12108 434747 522961 598640 1068815 840290 1371248 1224008 1079103 1481017 1038076 582089
12098 582089 380398 1056277 1798952 1190513 730530 227372 -29591 291624 205588 36594
12088 36594 506205 1830172 1249635 733288 1219725 1004276 1582165 1826936 1644864 1748069
12078 1748069 571980 859434 1341905 1455932 1027536 979074 777619 1143493 833227
12069 833227 232496 14236 -200530 531742 1005042 1263098 1824620 357278 723523
12060 723523 412693 -272045 193902 429058 645718 791626 460626 1218565 908931 698561
12050 698561 638805 162002 668879 1029394 1067541 617767 956481 924795 1665382 897207
12040 897207 847247 1050325 58662 -117160 498415 863267 2132249 1786822 2057951 1750052
12030 1750052 1561974 932102 1249787 1218419 468455 449897 1195701 350531 1145834 1767344
12020 1767344 2260727 2015044 1480653 1467426 449302 -422528 -205556 371233 703367
12011 703367 766186 833156 427197 1143862 1743906 2205424 1875944 687904 1614212 2016868
12001 2016868 2236672 2262365 2159436 1411076 1361357 1106534 1010629 2174242 2452072 1239896
11991 1239896 650920 698982 752006 1597732 1667781 1435254 1244246 1337193 1053288 1408361
11981 1408361 1982353 1746209 2002574 673413 539563 623342 816049 1319422 1820499
11972 1820499 1672739 1238956 2115998 2868473 2282918 2254820 1667375 1681827 2358411 2593335
11962 2593335 2120234 1817833 2235165 2156886 2506967 2633225 1821313 2155735 1710270 1845395
11952 1845395 1881270 2922065 2615773 2315805 2786986 2388975 2765720 2682757 2461603 3304152
11942 3304152 3326819 3256660 2591582 1357882 1412083 1863602 2471051 2486567 2364382 1970941
11932 1970941 1916358 2029624 2065280 2500246 3183519 4506857 3525589 2858353 3473132 3468262
11922 3468262 3007369 2803925 3092098 3568773 3235434 3398397 3208614 2437398 2498055 2894771
11912 2894771 3712428 3207053 3174466 3414214 3159601 2552500 2246638 3011483 3075354 2472829
11902 2472829 2951276 2741314 3324797 4233921 3423924 4219566 4188239 3597176 3760027 3662821
11892 3662821 4025176 3442232 3653669 3959213 3631319 3234365 4098177 4393081 4357712 4846377
11882 4846377 4664623 5084509 4974870 5044084 5010031 4749722 5335858 4199581 4038769 4862868
11872 4862868 4886127 5348248 6129902 6126743 6781206 6619240 5820829 6304071 6237422 5559474
11862 5559474 6379041 6692925 6321654 6591607 6117667 6050198 6717626 7000071 6811919 6444382
11852 6444382 6609540 7600370 7749072 7819046 8100591 8328787 7951566 7946240 7808235 7685988
11842 7685988 7909532 8482996 8697141 8969638 9522662 9700067 10080649 10773355 11076387
11833 11076387 10810097 11327091 11462081 11700052 12022947 12498788 12265275 12507869 12435645
11824 12435645 12699417 13882430 13535531 13037615 14663832 14752877 15417626 15673931 15941528
11815 15941528 16890150 17426347 18953863 18729439 18181817 19827708 20517209 21059558 22089887
11806 22089887 21976037 22406971 23247420 23227787 23229160 23665349 25043135 25295936 25894573 25050171
11796 25050171 25784074 26354653 25873337 25618121 24541134 23944580 24284280 24338941 24048283
11787 24048283 24238760 23740117 23434717 23181768 22192238 21478631 21274189 21341972 21095865
11778 21095865 21247513 21442120 20579535 20323643 19875082 20654509 20034999 19781072 20056721
11769 20056721 20674708 21280101 21495210 21157445 21442108 22748922 22954185 22418895 23664490
11760 23664490 24221570 23779559 24202774 24639016 24339134 25213202 24770433 25396555 26202850
11751 26202850 26439649 26857547 26942967 28457628 29492621 29940303 31694361 31615302 32231622
11742 32231622 33351187 34813704 35337023 35303769 36361698 37202242 38261714 39654070 41138357
11733 41138357 41755208 43593566 45124170 46563707 48443970 48948296 50487692 52551687
11725 52551687 54879744 56468060 57753808 59947265 62651819 64552365 66422430 68597693
11717 68597693 71471372 73867001 76191975 80024034 82414455 83463580 85109215 86519799
11709 86519799 88467884 90248785 90707209 91649186 92402660 92829646 92698078 92057918 90120283
11700 90120283 89100266 87689890 86013913 83638696 81047461 78927687 75206087 72718979
11692 72718979 70194768 67955899 65423388 62866815 60410157 58264111 56243733 53241735
11684 53241735 50970285 48920037 46577941 44626029 43062733 41392868 39332392 37795478
11676 37795478 36715226 34806256 33837977 32821743 32167640 30961303 29514235 27995671
11668 27995671 27289603 26374506 25216909 24794221 24435998 24339926 22918533 21108851 20613818
11659 20613818 19953660 20096052 18841141 18382144 19350775 19043002 18395131 17113438 15793762
11650 15793762 16158071 17037002 16539044 15514262 14981263 14105547 14080735 13472562 12398021
11641 12398021 11705560 12334247 12250537 12338162 12707257 12054388 11765273 11834987 11051701 10897192
11631 10897192 10402635 10404891 11043069 10630075 9912952 8906806 8842163 8956864 9206411 9614193
11621 9614193 8799851 8986391 9455053 9118293 8655696 8822251 8917767 8388918 7638333 7648525
11611 7648525 8630145 8654874 7939233 7700289 7748617 8045899 8276457 7679737 6779954 6553153
11601 6553153 6870030 7019409 6973980 7642813 7406762 8123748 7962606 7421809 7088863 6917468
11591 6917468 6773051 6967533 7159565 6830392 7426743 7195146 6757495 6519599 6502801 7071965
11581 7071965 7119699 6747503 6974685 7313612 7623183 7295735 7606468 6601019 6749812
11572 6749812 6776104 7013214 6644776 6361713 6499610 6700160 6783309 7718521 8172161 7989535
11562 7989535 7371921 7463234 7056461 7127316 7912379 8606295 8764491 8840534 8027655 7318805
11552 7318805 7419199 7451311 7833933 8157175 7555169 8081354 8689655 8944446 8794127 9596376
11542 9596376 9222606 9514667 8730266 8972110 9061871 9779203 10600099 10399019 10192689 10497845
11532 10497845 11173857 10327986 9440699 10566440 11164587 11287944 11448187 11121467 11528556
11523 11528556 10507837 10935196 12386516 12743109 12055982 12021428 12308297 12695890 12747645
11514 12747645 12910257 12826836 13422935 13148143 13333377 12875617 14194430 14265498 14347713 14465043
11504 14465043 13282464 13371840 14279409 15380548 16010422 16593812 17025449 16380835 17279128
11495 17279128 16743338 16950128 17299543 17504602 17430222 16973037 17167176 17649468 18491511
11486 18491511 19095397 19884219 20256252 19905742 20626761 21515257 21633069 21921175 21959283
11477 21959283 22793938 23779077 23446949 23330606 24479241 25066348 25218860 26172607 27068433
11468 27068433 27683522 27985090 28596829 29191221 30979560 31690309 32287594 33569359 34986234
11459 34986234 35706732 36761623 36618825 37074948 38903732 40357923 41237369 42416928 44176176
11450 44176176 44978167 46624069 48224080 49058159 50587537 51559553 52681901 54186354
11442 54186354 54433685 55101699 56121738 56552010 56186635 56212191 56849749 56712795 55386935
11433 55386935 55513921 54122546 52587124 51292705 50094749 49544165 49094682 47811117
11425 47811117 46056075 44151351 41432837 39958704 39372743 37767881 36383408 34967475
11417 34967475 33550695 32761122 32221338 30401703 29195201 27916275 26762763 26350898
11409 26350898 25791311 24571592 23143246 22180872 21306025 21051252 20703148 19736442 18816800
11400 18816800 18425203 18076236 16957360 16086967 15688677 15605308 15294957 14125647 14227522
11391 14227522 13657739 12915208 13482077 12772213 12507101 12448565 11951211 10952151 10534717
11382 10534717 11175129 11617302 11290201 11365432 10747926 10085182 10367151 10076335 9038121
11373 9038121 8367678 8404595 8626154 7892437 8124810 7633540 7362620 7849432 7218441 7702062
11363 7702062 7817332 7279377 7073095 5920159 6663207 6964365 6966423 7318991 7419760 7505910
11353 7505910 7648196 7226092 5890767 6333540 6580968 6474992 6186481 5645186 6061150
11344 6061150 6332520 5132860 5027258 5324371 5359616 5053517 5563875 5377098 5151876
11335 5151876 6369142 5926109 5240464 5117637 4675729 4889488 4263431 4595233 5298653
11326 5298653 6067497 5346205 4839417 4796581 5085177 5411273 4546255 4346223 4534950 4712365
11316 4712365 4666877 3891654 3551518 3457820 3207082 3923571 4692667 4048717 4030466 4372821
11306 4372821 4788188 4672958 4559333 4099172 4552542 5058281 4149416 4430947 4528080 4340299
11296 4340299 4259023 4911973 4709976 4448966 4269100 4105904 4705189 4006263 3867187 4414080
11286 4414080 3959916 3984199 4629555 4147471 3767619 4263981 4785881 5339188 4717188 3897432
11276 3897432 2873022 3495583 4320649 4596685 5067911 5491354 4916019 4825889 5039238
11267 5039238 5311421 4299837 3732060 4222972 4277535 4043812 4066424 4693676 4385001 4569108
11257 4569108 4625781 5296081 4889729 4527724 3776183 4675284 5655993 5017195 4223865 5563799
11247 5563799 5371969 4858206 5457648 5466233 5942158 6031166 5712152 5778375 4948478 5986283
11237 5986283 5868368 4727075 5995178 5606494 5314729 4912152 5085092 5838882 6527021
11228 6527021 6397997 6221261 6792028 7132729 7294556 7634311 6738796 7101569 7088118 6634772
11218 6634772 6504498 6648638 6866025 7652586 8262553 8352979 8331773 8567377 7798366 7746633
11208 7746633 8232268 8589729 9349353 9840986 9951433 10216562 10988848 10685384 10160760
11199 10160760 10651609 10289021 9769713 10253282 11197551 11603234 11652340 12177456 12361200
11190 12361200 12344481 12657612 12641939 13457008 14243791 14232491 14224379 13603357 14613998 15412893
11180 15412893 14718748 15160507 15963983 16055766 17494991 18715939 19118647 19818533 20136542
11171 20136542 20201042 21599972 21585973 22073579 22825391 23060068 23275103 24115248 24187851 25494886
11161 25494886 26724059 26858227 27449029 27193849 26898268 27671058 28455475 28753077 29666939
11152 29666939 29357296 28827214 28782796 29512552 29429538 29812953 29458470 28024598 26815734
11143 26815734 27713383 27788666 27932225 27189835 25313484 25203855 25652030 24635720 24210424
11134 24210424 23620172 22280838 20891803 19733799 19173157 19009305 19323133 18391239 17046224
11125 17046224 16706710 15923708 15128453 14665540 14239059 14166620 13390567 12628177 11458250
11116 11458250 11815486 12235647 11714048 10773979 10206684 9974899 10222620 10108982 9499811
11107 9499811 8723736 8549757 8457669 7952714 8640595 8190362 7335884 7453922 6773679 7200193
11097 7200193 7066233 6670602 7017123 6199275 6151778 6780595 6208278 6000392 5548891 5092203
11087 5092203 5208724 5449909 5835227 4648012 4306981 5428116 5234285 5485573 5027148
11078 5027148 4925104 4962404 4598239 3894275 4496311 4595556 3514300 3061389 2849325 3459736
11068 3459736 3289236 3360650 3543227 3259871 3733640 3443519 3367580 3936421 4024956 3959207
11058 3959207 3991561 3219697 2949047 3344671 3594549 3119424 2572072 2706906 2313953 2353308
11048 2353308 2932142 2850507 2974993 2698494 2270225 2096437 2206818 2092406 1787583 2125196
11038 2125196 2010628 2166568 2038887 2032595 1833891 1687088 2036664 2340168 2041421 2535726
11028 2535726 1837386 2111097 2619717 1832675 1557162 1765594 1878692 1994015 2042150 2695159
11018 2695159 2768507 1879175 1859772 1470361 1027623 952540 1560670 1548609 1843215 1798176
11008 1798176 1631351 2253908 1848740 1482722 2105548 1859844 421872 1364686 1470579
10999 1470579 1956175 1346483 1236406 1415399 1283856 1425784 1548946 1989728 830470
10990 830470 699426 975884 875441 266382 1030052 1518677 795832 733451 699539 1916282
10980 1916282 1637707 1126797 1643311 1106782 1308270 1529587 1611667 1929633 1418997 1250173
10970 1250173 1077779 1082492 1470319 1770479 882124 1076576 1076125 1188572 1214440 981826
10960 981826 1082534 1425241 1609358 1544235 1434825 941683 1138888 1193587 969196 566724
10950 566724 209688 926141 1082301 888099 1587567 1295577 1670885 529383 428047
10941 428047 412578 729574 278930 -357321 173681 878499 1365630 1775583 792213 400165
10931 400165 -55069 90491 874005 538575 521639 307607 1162140 1486273 1726326 1217647
10921 1217647 600907 889616 619781 981828 1388785 1308424 777544 1177974 1001755 87274
10911 87274 615879 992482 585525 430867 595897 38324 -140863 476054 983297 994447
10901 994447 588265 473449 96304 221326 353952 838986 811771 696248 435200 23396
10891 23396 -634984 -75273 714982 276816 253600 -402921 424153 1425149 354343 348955
10881 348955 659194 329528 482700 101664 -210796 444386 1051897 726995 30049 325536
10871 325536 -331405 294738 694234 504438 162382 -180272 481240 940017 269177 -98271
10861 -98271 149717 225989 544702 787506 -469768 612614 952275 -189554 393847
10852 393847 890328 197727 -114400 738645 1009975 1257221 1567744 1721697 863898 1732713
10842 1732713 1629217 590539 -533401 -1041 236221 760818 934074 1295381 1425280
10833 1425280 1149966 429293 1308263 1685695 1344820 1022199 1636504 797834 1114463
10824 1114463 1250312 1434309 1751034 2011205 1365632 1545755 1409442 700096 1112382
10815 1112382 1028072 1001243 1171468 807807 114468 -458 1304277 1593047 554963
10806 554963 885326 871634 742248 700006 406946 542389 691659 496149 -69546 419202
10796 419202 1872129 1416333 1274651 876882 -107869 59226 -12467 372219 256747 148554
10786 148554 748779 205060 676431 968263 778311 -171622 -406691 102092 204268 228833
10776 228833 1250220 529505 213561 131072 449799 298071 917042 1177232 1099892 308891
10766 308891 -179853 24589 803174 1224764 613826 184703 330033 504735 981385 1429828
10756 1429828 616077 -195765 63115 501156 954140 1115774 885528 751029 948223
10747 948223 355509 721101 687632 561286 -16829 -138644 7345 139935 286348 307383
10737 307383 68793 -1037856 -430733 465379 265860 444581 360579 436552 495498 973600
10727 973600 579701 207290 161601 -499685 -76817 432646 870748 1230092 389730 -70321
10717 -70321 494951 314823 -249516 -495187 308998 310953 -157773 250371 1644483 1258832
10707 1258832 919528 142120 -600607 239710 837905 218465 435859 -63586 283424
10698 283424 287533 555532 40532 -274059 -117600 -495773 138571 779119 407934 364415
10688 364415 433134 17405 1141271 1801919 817166 947057 1256788 629726 802809 114063
10678 114063 332814 810059 411072 159469 -8354 267402 656091 762279 1112290 1326853
10668 1326853 894464 784533 1476775 1293317 413161 136936 157214 971699 -85560
10659 -85560 -312800 265996 1002903 1102823 304295 328069 717459 136000 148268 -117598
10649 -117598 228200 455184 54760 -48878 341599 549329 -552611 -278100 -159446
10640 -159446 -75807 -246175 170942 343938 728874 22584 304761 826528 998968 856775
10630 856775 -287895 -1059872 -171655 768855 622545 598538 1108169 997160 773433 784485
10620 784485 473802 1093612 147088 -199648 125780 45178 259795 208721 -184956 -814396
10610 -814396 -208153 471409 262163 377709 747603 1109534 539147 424272 754618 138741
10600 138741 -13942 926618 269265 -499578 76250 657099 1066225 277926 -59774 -73082
10590 -73082 579558 1504678 970508 804000 700498 -219516 -697373 845808 692176 -49482
10580 -49482 -1010146 -575788 250697 25584 589934 -353985 -789428 -223728 459605 368514
10570 368514 72052 -215991 219623 -280070 -559031 -32554 360034 789774 418947 491250
10560 491250 500399 569192 598529 294422 -330686 -142345 625169 1149161 1095002 227934
10550 227934 203936 -36368 891936 551627 583506 -604013 -200223 388545 -251702 -235841
10540 -235841 -401712 86506 810780 896769 897755 398414 923456 1018795 907320 -113421
10530 -113421 -450842 -411386 -254562 -349666 -371408 637214 391276 672734 490748 393122
10520 393122 12333 -1846 -369486 61820 805689 1067722 -85039 79496 -34027 167885
10510 167885 -106943 483450 134907 800581 1442751 1067841 1333164 824826 383714 272266
10500 272266 -100745 -151506 327357 156279 -214167 9662 805865 855585 1061551 398447
10490 398447 -35487 1137616 456369 103291 700976 1114949 1181279 1772173 1514765 1847416
10480 1847416 1792708 755351 862723 473849 285710 842616 438249 52575 112004 768702
10470 768702 1126154 350480 428040 197179 297525 516953 1181476 769343 405028 903815
10460 903815 698019 61377 756823 1269246 784759 399834 1221815 159671 -61036
10451 -61036 412293 509797 -312156 -382379 -282121 -694154 139241 142465 92073 -208410 -442797
10440 -442797 -359108 -1453387 -146577 728969 198295 203666 -273562 630103 1074381 1526393
10430 1526393 1856606 1179593 799378 583946 -288396 815036 935301 1289615 971121
10421 971121 401678 1258232 860335 794442 308774 290163 450277 765757 1309250 620667
10411 620667 413115 801755 495070 352324 413960 482730 227181 594500 1207686 928871
10401 928871 -194545 -428831 788745 780865 948640 1122488 616504 766375 685964 337412
10391 337412 442254 1298623 1908238 1909343 1989227 2038690 2623141 2061496 1605809 1819541
10381 1819541 2201362 2217397 1705537 1266966 1235607 1445558 727274 436555 1674182 1368955
10371 1368955 1590644 1927892 1588770 1181853 861907 1189834 517103 1144885 570145
10362 570145 893172 1484886 2113571 1777646 264398 -226069 692255 1568594 1978110
10353 1978110 2078566 2905634 3577277 2184667 2174797 2288678 2763474 2701254 3186285 2817822
10343 2817822 1963160 2404575 2216304 1923549 2291512 2218544 2514661 2587500 2875452 2766679
10333 2766679 2656685 2018155 1209218 1469222 2147663 1712730 1312623 1568584 2195572
10324 2195572 1642502 770337 1804241 1475186 1449678 1638501 1949151 942137 549617
10315 549617 1235065 512929 459292 219576 1171157 1427203 1110661 1438645 1180173 1485081
10305 1485081 1129842 1360012 1430325 1031474 406639 1092685 1055844 798030 776617 957210
10295 957210 448906 336256 844836 1221465 1088607 831445 1731982 1239218 865892 1106530
10285 1106530 1281364 499314 513363 -163550 -129968 776508 1317896 1088418 981676 379209
10275 379209 126331 472527 52563 22893 -303360 -74531 642912 1055469 661868 815023
10265 815023 601651 1129950 1419175 1146807 763940 378584 -554313 157423 529981 385015
10255 385015 1981501 2093230 1594268 1818934 1365693 1108017 1442227 651112 765730
10246 765730 1281947 1005158 1069005 689435 1513051 1044516 1127985 1486902 -398499 -205755
10236 -205755 817363 1320869 2197086 1988762 1083398 1573096 2186986 1942894 2285514
10227 2285514 2119428 1467522 431868 -452320 425820 1671365 1859995 1123668 1124353 1138068
10217 1138068 1243279 1302930 1245716 2061746 1389762 347733 1747718 1238309 1523309
10208 1523309 1351450 1619673 1802997 2319208 1592365 250553 1330930 1824208 1505746
10199 1505746 1007602 978132 165029 240411 307956 657801 897468 729215 223733 415695
10189 415695 568081 868267 1030407 1026150 1124838 1482014 1637819 1439688 551867 60820
10179 60820 516161 1113108 1764871 995738 1118675 1555567 1155421 637449 11437 635960
10169 635960 1002482 1658173 1378941 897591 695171 1565369 2025252 828842 1411037
10160 1411037 1737181 1821958 2373177 2471884 2065345 2348684 1976948 1609451 1722411 1895219
10150 1895219 2513263 2937929 2066102 1571470 1058225 943686 1653265 1896780 1918192 2398483
10140 2398483 1666177 1062294 1502169 1197836 1403598 1592632 1296217 1455527 1281390
10131 1281390 707462 1320577 1951003 2030297 1770960 2049638 3026517 2175197 2399957 2394708
10121 2394708 2358948 2727812 2493204 2321411 2114859 1767499 2362246 2757899 2338219 2333787
10111 2333787 2549303 1858216 2091485 2591175 1428602 1037745 1863869 1686535 1055327
10102 1055327 1261215 871250 1225599 3013924 2322763 2111131 2127413 1623566 943714
10093 943714 1421585 1980590 2083425 2617297 1742422 1709940 2091756 2434595 2438692 2627115
10083 2627115 1998917 2370929 2064392 1734984 1402899 1750269 1874644 1693780 1674474 1585303
10073 1585303 2158132 2745213 2898074 1818889 1709233 1830721 1735101 1697653 1990582 2199734
10063 2199734 1130325 1446587 635844 216753 727981 2158335 1669050 1045915 1951375
10054 1951375 1662182 1171170 1802051 1463005 1113474 1538482 2458826 1987350 1369579
10045 1369579 955305 1056415 907740 841540 1481944 2060150 1818871 1958297 1544130 695917
10035 695917 504644 -257242 52508 894290 1734408 1921293 2184187 1854763 1902564 1145726
10025 1145726 -559287 -434718 1210080 1911924 1975225 1699315 1102289 1272813 1105169
10016 1105169 1496152 894336 240755 1139307 1364984 1532229 1190397 715683 1088864
10007 1088864 2911317 1770948 943596 1896330 1598540 1395964 1286591 1303778 1826200
9998 1826200 2098308 2089822 2277334 2336692 2544550 3237788 2919315 2088190 1711804 2148076
9988 2148076 2173594 2237937 2431844 2780829 2579419 1014863 1109034 2154740 2161724 2310791
9978 2310791 2354769 1829796 2304657 2543875 2406099 2795975 2646130 1755497 1907633 2522824
9968 2522824 3125677 3374679 2640245 3240225 2955318 2079337 2560789 3272461 2308209 2625249
9958 2625249 2651385 2720475 2564554 3336559 2862247 2722715 3942442 4434789 3795432 2864894
9948 2864894 2680984 3332459 4054786 4001302 4232846 4896051 4253344 4235234 4137430 4627529
9938 4627529 4845677 4520227 4683804 4154996 4035455 3738487 3848057 3649832 3497797 3667611
9928 3667611 3430361 3664083 3037924 2618334 3189369 3105338 2973979 2496686 2653736 3225443
9918 3225443 3355523 2753524 2812555 3690238 3986913 3843134 4277682 3978260 4206070 3986323
9908 3986323 4309248 3713104 3917450 4052640 4810416 5313447 4078885 4573978 3907724
9899 3907724 3126813 3903440 4039211 4445959 4310043 4173508 4096859 4171489 4291695 3900376
9889 3900376 4349800 5037444 4236612 3783193 3674006 3435869 3541336 3731680 3669346 4316597
9879 4316597 4176187 4545983 4260409 4683459 5206722 4426939 5272460 5755109 6024400 5807370
9869 5807370 4437471 4752732 5308412 5803036 6194187 5917262 5003707 4865198 5430188
9860 5430188 6403332 6157602 6702719 7695820 7725421 7973598 8751618 8259372 8011245 8769935
9850 8769935 8042387 6987729 6810314 7385310 6527464 6437500 6780238 5951641 5871624 5448644
9840 5448644 4878466 4794865 4820461 5847717 5519174 5161923 4577611 4064308 3566510 4392334
9830 4392334 4649428 4962831 5481356 5506326 5332814 5435392 5070074 5328954 4488868 4849683
9820 4849683 5574570 5585317 5693949 6370339 6210665 5740910 5661530 5290101 5439740 5548658
9810 5548658 6254105 5392812 4355950 4657970 5239135 4974298 4881055 5245338 4965165 5088265
9800 5088265 5539652 4772845 4887730 5090015 5479439 5187488 4955040 4881922 5508078 5617634
9790 5617634 6095424 6753264 5650991 5907271 5839223 5251259 5957607 5835192 5744321 5746220
9780 5746220 5633608 6154307 6371364 5968807 5826305 6528836 6707750 6328491 6439192 6355725
9770 6355725 7228523 6619578 7214232 7528474 6993529 7114669 6987693 7152963 7884447 8775879
9760 8775879 8338803 8802228 8591725 8232403 7871154 8324961 9015859 8421422 7809654 8379648
9750 8379648 8769894 9526782 9804432 10246817 9853471 9388858 9706454 9830801 9632658 10853592
9740 10853592 10225811 9425558 10081637 9926168 10522440 10715643 10491518 11130877 12015423
9731 12015423 11692454 11495454 11701740 11538396 11729515 11645467 11967614 11331920 11305591 11104988
9721 11104988 11467090 12875378 13055926 12477308 12410766 12535500 12644697 13746141 14677014
9712 14677014 14703611 13708067 13252250 14305613 15204789 15528747 15543616 15143352 15063611 15903854
9702 15903854 16175484 16054096 16239246 15961369 15513153 16717551 17747389 17517275 17837510
9693 17837510 18479213 18566635 18751217 19263461 19148981 19926845 20272632 21205422 21225898 21498250
9683 21498250 20888620 21282529 21424092 21705130 22289412 23206548 24475312 24545761 24535251 25169055
9673 25169055 26118511 26159711 26790028 27152446 28895366 29356208 29795869 30391491 29960398
9664 29960398 29797822 30237539 31147058 31968088 33801409 34636566 35499142 36434704 37717313
9655 37717313 38387914 39178675 40501998 40853845 42433371 43950081 45190636 46576135 47072985
9646 47072985 48873121 50828345 52053609 53321664 55517762 57638841 59443073 61058070
9638 61058070 63782282 65950047 67541158 70608629 73538780 77410964 82024509 86724252
9630 86724252 92510635 100119904 107573390 116658130 125329406 132670265 141100364 148082160
9622 148082160 152307964 154768657 156398115 157234089 157395162 157795178 158636482 158657110 157223097
9613 157223097 153622692 148358219 141933266 134708579 127261091 121338031 115097742 111022521
9605 111022521 108687228 106795526 105800104 105048508 104997670 105541896 105899104 106454876 108201195
9596 108201195 110452576 112996653 115495534 116823011 119505212 123685414 127400822 130748625
9588 130748625 135544708 141126912 147617485 154624250 162469280 172764401 184743977 198665063
9580 198665063 214795213 234723071 256882151 279651181 305104284 329514832 350668724
9573 350668724 366075475 376155687 381287351 381903461 380755052 380139619 379596810 378996468
9565 378996468 375935243 367064207 353157830 334793525 311695785 286461621 264089249
9558 264089249 244418958 228772777 217103361 209771975 204331479 202102001 200677963 198552443
9550 198552443 195647349 192438851 189654009 185242977 179716243 173275552 166727494 160064051
9542 160064051 151194790 143120534 135397958 128863494 121621193 115370678 110532932 107525525
9534 107525525 104567947 102628742 101814332 101626243 100846212 101578630 102241621 104481623 107917114
9525 107917114 112357885 115847483 120041394 125104412 129336679 133912622 138210937 142272663
9517 142272663 147497856 151337245 154124140 155746168 154555782 151941513 147088189 141907256
9509 141907256 136965371 131193380 124212300 119068625 115527699 112845495 110427923 110966498
9501 110966498 112733956 114204630 115847228 117964314 120177353 120386262 119750286 118926597
9493 118926597 116182880 112613754 107598475 102330109 96784829 91258792 84960004 80554594
9485 80554594 76183534 72293914 69626045 66120199 63685306 61533907 59477842 59003612
9477 59003612 58472693 57512099 57079557 57902690 58539965 59680621 59841584 61970352 65590275
9468 65590275 69295278 73672101 78394626 82716981 87037180 89547386 92461754 94523353
9460 94523353 94840838 94392077 92910632 89413630 85496417 79815059 73422372 68687600
9452 68687600 63564593 58041485 52235227 47826817 44483402 41793445 38852316 35856683
9444 35856683 34375760 33636930 32400709 31336701 29789401 29327427 27992596 25913804
9436 25913804 24996290 23739496 23358999 22394766 22023137 21367179 20896650 20000758 19278027
9427 19278027 18461459 18112145 17716194 16789466 16977707 16529595 16287949 16396521 16206391
9418 16206391 15528463 15411387 15682797 15015315 15431349 15429441 15444300 16121247 16160025 16097446
9408 16097446 16017429 17490943 17610928 17419171 16819006 17063524 17272652 16640299 15453644
9399 15453644 15091921 14587380 13413153 12522567 12693193 12731242 12707684 12115242 12062717 11579463
9389 11579463 11427856 11947304 12135366 11196400 10709035 10664341 10850038 10551362 10152463 10477997
9379 10477997 10296413 10131892 10624358 10535395 9691301 9817628 11139528 10828163 10454370
9370 10454370 9981567 10939587 11503300 10638914 10357144 10496692 10728680 11212147 11416958
9361 11416958 10342738 10280105 9783564 10501117 11457716 11243783 10847044 10564752 9618672
9352 9618672 9256135 9500068 10319169 9609545 10021674 10064706 9446203 9781180 9441781 9515255
9342 9515255 9534738 9554657 9730688 8640454 8028693 8318789 8355597 8998021 9275640 9140469
9332 9140469 9901859 9651124 9311425 9298341 9758534 9526957 9128753 8995594 8901024 8854000
9322 8854000 8616443 8083902 8470313 8791890 9493764 9919746 9850884 9393281 9384716 9747844
9312 9747844 9196567 10179181 10732846 10532534 10239948 10277699 9914248 10235654 10319960 10226060
9302 10226060 10218301 11576626 11520623 11831858 10658260 10961351 11908475 12271242 12275200 11363440
9292 11363440 12422181 10916029 10973233 11905863 11315071 11195702 11091435 11143498 10708884
9283 10708884 10593985 10849930 10617995 10695139 10618530 10936345 11510568 11449226 11975306 12095008
9273 12095008 12391490 12654714 13442379 13689312 14553207 14344551 14707823 15149225 15000246
9264 15000246 14765760 15097228 14355876 13748686 14433602 14351704 14246914 14002373 14889367 14751206
9254 14751206 14284608 14318593 14147710 13647967 14185934 13541791 14748414 15458654 15358000
9245 15358000 15329084 15626291 15382910 15608548 16330624 16678863 16846494 16801410 17370050 17838081
9235 17838081 18048047 18442617 18374225 18633482 18132679 17779482 18343095 19351135 19354986 20216417
9225 20216417 20208914 20523686 21877383 20941329 20475942 20552845 20839084 21403955 20987636 21065226
9215 21065226 22343138 22335586 21734331 22091941 21406276 20505274 20046196 19849790 20615091 20259673
9205 20259673 20438205 20260766 20128556 19981066 21108286 21183903 21835664 22477357 22933220
9196 22933220 24278246 24070874 24468188 25294946 25351196 26981056 27948070 29532275 31968619
9187 31968619 32869920 35475689 37761721 41033303 43864724 44213502 44882301 43913774 43055042
9178 43055042 42621886 42740750 43505981 44085982 43497233 41069855 38972478 35696919 32919378
9169 32919378 31267367 30302122 27529122 26511058 25640613 24750017 24399681 24846960 24184874
9160 24184874 23201500 23783490 23479257 22297635 22368113 22804626 22796274 22579491 22388711 22611817
9150 22611817 23132471 23142190 23161839 23500295 23490253 24390971 24358697 24079192 23865528 24622331
9140 24622331 24776055 25006686 24785184 24680934 25559250 25420675 25996175 26257125 26080783
9131 26080783 26430786 26085300 26137858 27536812 27090972 27019758 27825745 27772202 29413630 30118636
9121 30118636 29147904 29983782 30786476 30226663 31674752 31360942 31904583 33159670 33783395
9112 33783395 34400965 35238636 35557989 36195450 37100059 38267872 39184219 39514351 39560696
9103 39560696 39745738 40932393 42057852 41905880 42395456 41973581 42467584 42940070 43176389
9094 43176389 43778458 44330542 45430164 45495950 46390775 47053071 48265669 50301742 51572598
9085 51572598 52077765 53197068 53703832 54428718 55383617 56054205 58267396 58776538 58720749
9076 58720749 59531405 61694004 63292582 64169512 64821995 66263725 68724353 70275692 70794880
9067 70794880 72624601 73591807 75131136 75947818 76471830 77588017 78873181 79839890 80918466
9058 80918466 82974632 84531345 87208966 88695323 91454586 93072715 95593960 96537660
9050 96537660 98955110 101273613 102828604 104388819 106674506 109667503 111636321 113571561
9042 113571561 117228537 120520374 124751282 129037042 133903858 138569978 143844790 150598192
9034 150598192 158829583 168770535 178754872 190546260 204090548 219380438 234630154
9027 234630154 248194173 257819973 264546174 267853118 269132510 270462388 275140886 281724636
9019 281724636 290308441 297143222 300881023 301639149 298839489 294849894 291970770 289610879
9011 289610879 288483197 290167969 291424403 290987741 290041382 288835630 287849042 287341318 288901430
9002 288901430 291224706 295014928 297930764 300724358 303252846 305497200 308728508 313237451
8994 313237451 321179340 331298664 344237725 360382716 381904747 405533546 427324588
8987 427324588 442506896 452998405 459986560 465249915 473657772 490538268 512693191
8980 512693191 535455377 552492977 561638574 563327315 557098523 546840944 535680345
8973 535680345 524996883 515826196 504997039 492580363 476013383 454708940 430736939
8966 430736939 405396546 383623428 365110095 351942781 341591248 331219828 320624342
8959 320624342 309357037 298049880 286192770 273579402 262810547 255314484 248341927
8952 248341927 241536093 236537787 231162329 227151420 225675474 225175833 224482100 223503066
8944 223503066 222427109 221821477 220255131 218656677 216557885 214103839 211054185 208696073
8936 208696073 208192377 207512180 209383849 214822931 221594274 230705999 241327715 253709466
8928 253709466 267738391 277232532 280541786 278160135 272213246 262444293 250745086 239637880
8920 239637880 231357853 223588385 215881996 210182698 206661512 205262425 204039042 204925075
8912 204925075 207368634 210627768 216856711 224385048 232711875 242794987 255707674 271265343
8904 271265343 289260738 311946406 338627947 367428862 399001239 430632465 458475017
8897 458475017 480414523 488786977 485753578 468710198 438331018 401301774 361801955
8890 361801955 324222170 291553781 264245903 241495320 223783819 207898669 195123248
8883 195123248 184267019 173901993 164227955 157145412 151769477 146142295 142774623 140842393
8875 140842393 137675352 135754637 135778713 135251782 135739377 137539795 140422106 143371559 147951762
8866 147951762 154186375 163265240 173842950 186043042 199600049 214878084 231075112
8859 231075112 244927142 255705095 260022844 257942238 248297254 231635277 210257255
8852 210257255 188211848 167901581 148860962 133550444 121861403 112967629 105032609
8845 105032609 98458009 92742203 87613264 81972399 77527045 74258773 71528309 69072334
8837 69072334 66394606 64027740 62933937 61418983 60092353 57872096 56506215 55610831
8829 55610831 53496283 52617962 52379221 51883403 51547041 50537562 49237719 49001330 48538719
8820 48538719 48622142 48532910 47893425 47285862 47085425 47572342 47826325 48532148 48556535 48508640
8810 48508640 47928006 48503260 49413334 49629814 50032983 49867083 50594755 51943913 52269513
8801 52269513 53143431 54899651 54811674 55426068 56601995 58462103 59975899 61618426 63613094
8792 63613094 67526369 71059592 74990799 79328620 84323249 90293599 95868047 99487545
8784 99487545 104188070 107558404 110763398 112697964 114856425 115960803 116459380 115722194
8776 115722194 113007819 110928643 107512507 102827878 97278435 91214080 86603985 82538336
8768 82538336 79668227 77586957 76890146 76942058 76949181 78008102 80154533 82331846 85342265
8759 85342265 89052896 93337471 97481574 101921376 106959708 112506402 118955074 125282482
8751 125282482 132502880 137735863 141428363 142983969 143484472 142024578 139749676 137912936
8743 137912936 134619992 129640853 124439605 118349647 110258925 101847578 94101694 86731045
8735 86731045 79985146 73464410 68758990 65409522 63088306 60293734 58736194 57889738
8727 57889738 57892401 58266845 59541818 61085982 62525910 64132422 65736817 67889658 68705402
8718 68705402 68540787 69773171 71692007 73181351 73671588 72716422 71022597 67445701 63891558
8709 63891558 60509969 56943802 53199732 48618584 43396090 39095296 36287381 33223878
8701 33223878 30467958 29621308 27788584 26471295 25521570 23973097 22779157 22665418 22305974
8692 22305974 21814569 22197857 21386681 20964090 20562959 20629650 20718513 20022365 18908259 18671597
8682 18671597 18708385 18230948 17212026 16978043 16189273 15398974 14584859 13972746 13294709
8673 13294709 13223370 12788092 13008534 12298842 12269102 12153515 12149818 11951864 12376629 12960670
8663 12960670 12799204 12744862 11982727 12934910 13364891 12816762 12455720 12959346 13338799 13142772
8653 13142772 14215291 15002236 15780306 16654540 16239968 16423258 16077916 15540996 14940257
8644 14940257 13707243 12702674 11949239 12324258 11569174 10868429 10884505 10975404 10410441
8635 10410441 9918795 10365970 10124285 9373741 9100591 9133948 9227091 9299504 8986128 9166969
8625 9166969 8478693 9218171 8343901 7657164 8441619 8476247 8403427 9246243 9794938 9254204
8615 9254204 9778737 10394600 9956407 8911628 8474143 9042580 8946316 8547196 7612177 8246690
8605 8246690 8141332 7551602 7430864 8444228 7621516 6904421 7211667 7026369 7280125
8596 7280125 6504969 5929503 5047210 5503502 6327544 6000299 5244708 4519200 5289221 5261668
8586 5261668 5023487 5499338 6684038 6246470 5872162 4792137 4275785 4761149 4019464
8577 4019464 5164410 5436995 4813170 4349033 3883069 3485135 3278038 3574354 3674986
8568 3674986 4059298 4469215 4302111 3661577 2955442 3505355 3711151 4226203 3928406 3699525
8558 3699525 3953025 4288143 4161388 3614714 2973694 3266158 3622005 3805851 3582133 4098235
8548 4098235 4103545 2921927 2574451 2764988 2336335 2081909 2924685 3248542 3742315 4005296
8538 4005296 4279794 3592516 4020191 3886517 3253362 3357288 3903114 4030344 4523564 5334174
8528 5334174 4496371 4112436 4299756 3974079 2773706 3060514 2588293 2575960 3051760 2333783
8518 2333783 2183072 2388368 2733088 2267850 2487092 3080801 3319686 3462961 2663034 3038782
8508 3038782 2879046 2235432 1861111 1925763 2147886 1840556 1899022 2527628 2745105 2126972
8498 2126972 2344913 3134700 2400802 1396494 1866884 1940544 3031007 3238058 3680138
8489 3680138 3857116 3791705 3259781 3087720 2488353 2350923 2443788 2516032 2310260 1910645
8479 1910645 2189726 2238695 2978210 2908440 2605054 2355922 2717890 2522983 2698796 2048101
8469 2048101 1632510 2097829 1123682 403547 1406316 1845746 1791634 1924737 1598075 1703571
8459 1703571 1533461 1163392 1886210 2644876 1871378 1531983 1456033 1597781 1359935 1351669
8449 1351669 1786897 1016225 1574795 2625857 2896775 2656157 1875373 1909426 1686578 1223706
8439 1223706 1575715 1614850 1564672 1742109 2289695 1706461 940348 1302750 1196049 774165
8429 774165 1067139 1135494 2297454 2035416 986182 586725 1816569 1543670 1284219
8420 1284219 1036639 1102125 1225775 1617511 2384095 2919975 3362079 1899076 1484390 1632186
8410 1632186 1378647 1161312 915184 934709 1018974 444907 417720 881208 1199590 1014136
8400 1014136 1368244 1666675 1314543 1546961 1133512 463637 409107 840159 849814 1415444
8390 1415444 1945022 1442746 451236 607121 786238 1448139 1799100 1139388 558646 762634
8380 762634 975341 1051247 588256 572621 1101627 1908217 1424256 905963 926324 158114
8370 158114 1432338 1902785 1366455 516775 1156579 1457147 1403517 995604 1334347 1477544
8360 1477544 1035137 1344053 1777864 1564957 1753474 549755 466709 754554 1168195 1185613
8350 1185613 1661139 1119340 618284 103479 -181003 22713 462471 -4408 -660518 66337
8340 66337 22625 -239664 8908 490076 980161 1072498 373146 793989 801410 298998 312389
8329 312389 91454 -774219 -1038958 -401077 9680 342653 173353 173372 -165309 -580172
8319 -580172 -49568 445306 -453011 76775 481465 315842 270414 384889 -6330 -274221
8309 -274221 766082 1172086 996201 786907 497449 -191324 -983714 -811987 625512
8300 625512 147959 -623438 38540 -617966 -862864 -469543 -241367 402165 -503344 -50360
8290 -50360 50743 27211 253452 -239911 -317321 61499 1040529 386746 -86436 327252
8280 327252 252394 613759 563333 484175 311785 93694 -314957 -5979 -10800 59811 -136390
8269 -136390 -37883 -221479 79427 69966 -407213 -443216 -81819 -76333 89591 -58813 -357403
8258 -357403 -20855 -211437 -184480 -381384 -1161655 -626176 -104854 164250 -773388 -124332
8248 -124332 -70702 -542631 -2024538 -1812236 -864574 -949384 -191420 -471467 -1068357 -769087
8238 -769087 -627645 74207 765535 464821 308536 18708 -60383 422821 87800 466116
8228 466116 360318 -832462 -231669 -107188 694881 4918 67470 -376209 -350147 -385472
8218 -385472 -195351 -694244 -1140993 -754861 -68930 850949 715506 -332418 -528327 -476442
8208 -476442 -411808 -490026 -48213 75860 2822 1029726 877799 -182733 167660 384353
8198 384353 321903 765994 1256344 471013 -198676 1289615 2237312 810078 402294 -42164
8188 -42164 -200612 -623987 -1122121 112932 48581 14140 -841066 -282199 119885 366172
8178 366172 296662 426507 287420 182149 -548618 -36218 -210428 -1034904 -1184167 -1240136
8168 -1240136 -1170627 -978279 44897 360779 8042 -179131 -310367 -772540 -1007869 -257884
8158 -257884 -214066 -196448 333068 109671 -192541 -669382 -633728 -545848 -517217 -1065844 -1514781
8147 -1514781 -336881 212918 115154 -69465 176129 357551 10407 514918 46867 -1024907
8137 -1024907 -1189911 402134 572154 -274003 -126232 -122136 -66534 694984 33202 147016
8127 147016 -31558 148258 517451 -106765 -95330 -309153 -291172 93724 177927 -360000
8117 -360000 -673025 -368506 -104980 -463966 -707257 -541681 -647553 -408320 145759 779360
8107 779360 171841 323152 -703748 -1409977 -872475 -282047 -372414 -1292532 -1994610 -539259
8097 -539259 56143 124249 504161 466060 -108383 -142376 -608691 -560522 -723066 -825635
8087 -825635 -301681 -384793 -835401 -768104 941626 1418494 758376 874011 1018492 95173
8077 95173 -201671 -58053 224801 515874 374197 697265 325573 350820 123737 -249742
8067 -249742 72539 -120917 -787385 -1056958 -767183 -1125880 -1527923 -677612 111223 -672643
8057 -672643 -418972 -1035234 -1108501 -1055782 -411089 -143743 352193 272363 287891 87404
8047 87404 -721106 -924315 -983489 -1883011 -1066235 -1108545 -440506 -393791 663418 543811
8037 543811 101749 -750586 -1391594 -1018183 -675608 -606219 -831611 -1535331 -1220510 -812847
8027 -812847 -178441 -8748 -469150 -357047 -96246 208857 -218924 113749 521046 245203
8017 245203 229970 360523 -675025 -416644 -446576 -209983 -280105 -1239017 -1810061 -1673941
8007 -1673941 -1534313 -282448 -312243 -1251167 -964545 -1186375 -1853674 -1631325 -1900591 -736929
7997 -736929 -302303 -375401 -1082050 -1674493 -979841 -1064573 -1250079 -963636 -356714 -474410
7987 -474410 -271307 -165781 -43824 -61496 -686921 -356786 -384671 -625065 -383335 -572490
7977 -572490 -384390 -637327 -132927 85438 -651210 -37993 -133838 -212639 525742 611809
7967 611809 -101030 153645 -100397 -48722 -1045223 -600872 488288 582583 329480 -149068
7957 -149068 250992 145316 -915087 -171685 -687385 -942192 -309483 -840889 -757961 -82369
7947 -82369 268586 -340715 -833458 603 -395443 -207960 -43082 -315942 -757070 -727397
7937 -727397 -493882 -1296066 -1051397 -936862 -249481 325772 16086 146800 -232076 -1091586
7927 -1091586 -626627 -709868 -759102 68350 545284 505160 82390 -403785 110554 -742449
7917 -742449 -756728 -679033 -361463 -141030 -169384 99445 -615118 -958536 -1042930 -1155315
7907 -1155315 -1046566 -1679101 -1228009 -648923 -784666 -217462 453885 -538831 -1275562 -119834
7897 -119834 2204 -289311 -149172 768085 181450 138601 1014183 751607 -81978 -398383
7887 -398383 -44577 -912743 -888499 -464163 292672 619731 -464348 54067 635476 -454032
7877 -454032 -138413 127064 -127587 239998 174912 241129 -135882 162074 -374571 -1146254
7867 -1146254 -254312 59188 100425 8082 10086 -615049 -856852 -1447628 -815730 -583901
7857 -583901 -455523 -329101 -322499 -503777 -884051 -912222 -186415 -576259 -1210568 -795526
7847 -795526 -1384814 -958905 -922385 -566987 -659838 -1402418 -948215 -368967 541434 39155
7837 39155 -121518 -398200 -954839 -542746 -1184550 -1201976 -1572917 -1967952 -1039903 -255016
7827 -255016 -503053 -423679 403756 575579 -217083 -188013 -1038239 -358399 120279 -454817
7817 -454817 -116322 -635697 -780973 255385 473041 -115246 -291959 280547 -225394 -547262
7807 -547262 -877241 -515370 -1201591 -1651718 -746807 -728415 -1097517 938817 2237853 55314
7797 55314 328106 748245 511578 -18560 -336895 -453930 -219963 -552304 -1029171 -940954
7787 -940954 -801031 -948767 -648116 -668726 -313403 -867551 -1420003 -779743 -522376 -899944
7777 -899944 -518968 -201274 -644779 -808451 -761884 -103099 -337419 -884864 -784497 -593761
7767 -593761 -326282 -245048 -336401 155147 356878 194135 -534484 -157447 256787 -133381
7757 -133381 -258462 -326116 -433911 -351874 -381055 -205917 -289646 -236685 89559 66145 -599466
7746 -599466 -732805 -853506 132767 859446 616449 145356 -85179 50290 156305 -658153
7736 -658153 -1151132 -1454600 -1282664 -1257167 -92875 281848 -458489 -466229 -173854 134607
7726 134607 163419 1015131 -72498 -831869 -982079 -1329709 -1229721 -1325594 -1121958 -896797
7716 -896797 -1340339 -876447 -753579 -141910 -173907 28911 -147628 -443783 -299211 12540
7706 12540 -427361 33401 6326 -70484 -513247 -1169281 -392849 -550828 -674253 -606793
7696 -606793 -780953 -1182881 -733023 452350 112801 639838 630477 219958 68158 -454931
7686 -454931 -589191 -808712 -602939 -275772 -332029 52380 -779746 -1530185 -1373209 -1865226
7676 -1865226 -670918 -608268 -509200 -460991 -251228 -65763 -673246 101422 -357443 -714645
7666 -714645 -700309 -290021 -73363 21604 -91806 -864048 -379441 -122692 -242976 -330151
7656 -330151 -510262 -674346 89465 -63443 -226467 -193044 -497294 -814906 -611475 -72674
7646 -72674 -106560 154347 437843 -754987 -386091 46714 -699743 -902952 397791 271790
7636 271790 542832 -50102 250068 490861 350192 -21701 -22395 -367762 -378678 -258892
7626 -258892 -798655 -1027063 -820703 66787 -961136 -1351548 -640147 -194754 534062 81679
7616 81679 -1045111 -1049707 -1624476 -1423671 -899704 -618424 -237295 961297 370535 598949
7606 598949 66093 -481186 402514 640357 1373010 1602269 -4269 -249663 18704 -318911
7596 -318911 -698678 -1947 -189868 -854105 -325970 114518 -472126 -1095156 -989946 -632781
7586 -632781 76257 262775 622720 -76704 -815027 -163348 -447193 61391 314346 -73975
7576 -73975 -597580 -204332 332688 -565154 -962036 -719715 -739598 38699 244612 210446
7566 210446 -57045 143437 595345 360051 361183 -269058 -453971 85218 471864 -709060
7556 -709060 -916217 -503852 178713 91307 -134610 -491527 -771509 -272374 -1077385 -1367758
7546 -1367758 -1163274 -1549825 -1642878 -1658873 -1132859 -841866 -1007125 -243666 161336 -281479
7536 -281479 619031 851354 709531 524397 622769 444135 -102643 -693842 -535708 -251509
7526 -251509 -237885 -329928 -330206 -849903 -1185946 -711036 -263073 -54169 -268171 -358407 -912908
7515 -912908 -133159 416852 52968 -358236 -519277 490222 138886 -538218 -715746 -764648
7505 -764648 -603608 -432653 -537986 -727045 -603564 -740009 -471690 -979751 -960663 -1083311
7495 -1083311 -890166 -633324 -349912 481039 -139071 -742381 79510 606623 812836 -16023
7485 -16023 -284030 -408368 -226349 -168808 -100992 396065 -609590 1780 345436 -636538
7475 -636538 -336726 -86078 -550901 -354181 -452862 -1175522 -685389 -602033 -633749 -382969
7465 -382969 -752609 -979256 -353031 281367 267125 221089 -186498 -373484 90775 -678983
7455 -678983 -575255 -688024 -351256 116998 -32389 -232236 -243186 -431753 -128378 419011
7445 419011 -189394 -575680 -146547 210123 332428 182310 175809 606007 848698 134658
7435 134658 -426742 326262 -16151 -373244 -972286 -159095 -552743 -53743 -177428 -1103792
7425 -1103792 -770821 -671191 -1157430 -710993 -78678 -148317 -276599 -389298 -1828793 -1322668
7415 -1322668 -845507 -1255670 -954285 -481829 -160807 293931 405048 -231531 -461925 -1278575
7405 -1278575 -931354 -687019 -1164856 -533550 87827 -496412 -1066285 -936705 -433207 -420872
7395 -420872 -208170 -419297 -595927 -259450 -515019 -730819 -243062 -491900 -263573 291560
7385 291560 264738 184640 -518706 -752241 -654349 -384343 -528043 -1309877 -1040761 302388
7375 302388 -12539 -616304 -392933 -310427 376359 453274 548797 488315 -464037 -894247
7365 -894247 -762521 -827382 -701204 -666257 -763271 -1059989 -493242 -582378 -562916 -1196928 -826378
7354 -826378 -662096 -1268118 -1157239 -808759 -199748 658520 665142 -591915 -620857 -31636
7344 -31636 -228825 -97084 -177971 -668044 -1406935 -830063 -1005130 -1448484 -972024 -525826
7334 -525826 -500340 -526683 100432 -100920 -196825 -670275 -489300 -126691 -638191 -510945
7324 -510945 -100267 -335646 -579753 -715779 -417568 -152612 -814555 -131410 1000086 699902
7314 699902 627728 192029 -19184 -382065 -166261 -332920 -601592 -960567 -623453 155751
7304 155751 93399 -36456 273381 726360 382584 -228480 -537393 -104816 -710358 -822462
7294 -822462 -575398 -886427 -1248954 -998701 -371502 281287 47525 -690379 -943794 326755
7284 326755 396051 -247517 -456931 -812435 -562488 -619853 -807135 -714497 -1143372 -1141326 -682911
7273 -682911 -917536 -600583 -183924 -368743 114762 256646 374105 750841 380991 164043
7263 164043 -214770 -779786 -559442 -148400 -245272 111942 157736 486794 -374693 -537783
7253 -537783 -521901 -35364 686884 1740447 2145102 269995 314502 336163 -672549 -175244
7243 -175244 124167 -474711 -576631 90758 -39898 -51827 -373147 -226651 -593393 81021
7233 81021 96137 178984 67401 -124562 -168309 -729265 -51242 313999 -48152 -19190 205405
7222 205405 205637 366602 -740513 -1300360 -1555612 -954534 -245276 -637980 -785425 -662406
7212 -662406 -374735 421277 77537 -421180 -873849 -608907 -466700 -608284 -510537 -534758
7202 -534758 141555 -243273 -105669 297141 -53034 -842213 -290253 -90362 -547232 -422620
7192 -422620 -233908 372295 620037 865193 256888 339150 -383738 -619350 -132738 -196614
7182 -196614 -682296 -391593 -222140 -70234 351912 -121109 -489000 167680 252124 -533732
7172 -533732 -74865 307808 753616 475885 438196 820843 408223 -1034222 -1264018 -860004
7162 -860004 -548015 -689556 29291 759419 -427406 -1132936 -1704230 -1541595 -644511 -935221
7152 -935221 -605189 -79072 -585861 -1027348 -880875 -1255128 -1049534 -928852 -623599 289830
7142 289830 298774 -617230 -1088133 -171979 -196695 -115542 -777986 -24607 435887 -787455
7132 -787455 -586459 -632794 -992045 -882917 -1177378 -1042074 -1052009 -981337 -844424 -278416
7122 -278416 -1321672 -1452529 -1269159 -731799 -1016199 -818613 -1651115 -796089 522712
7113 522712 294450 447698 -8946 -552095 -641526 -1079310 -1221548 -1396197 -1407161 65164
7103 65164 -97953 46871 373446 -76922 -210585 31387 -89189 244137 767929 -50923
7093 -50923 -372182 634865 252758 253447 -232932 -982477 -293114 -419990 -982261 -634602
7083 -634602 -1260531 -1571738 -1331856 -770906 282074 728356 200864 -150048 -295089 -385521
7073 -385521 -529226 -995169 -539500 -148027 -700637 -206708 552483 362679 -399591 -865318
7063 -865318 -970301 -426638 -1027774 -778511 -437031 -313257 -747127 -429765 -823636 -760373
7053 -760373 -884389 -1151833 -1377687 -1338935 -310810 39363 36067 314777 434828 223695
7043 223695 510652 520339 38117 -213629 -858642 -479405 -54055 -546674 -421556 -566135
7033 -566135 -333806 -571658 -827282 -302582 91799 393586 -730809 -915260 -566005 -619291
7023 -619291 -1145237 -767080 -428501 -880253 167218 -419413 -761116 -914992 -412479 331625
7013 331625 563669 -100408 203879 148542 -231217 -208821 -692571 -926663 -607643 98075
7003 98075 -99325 -181132 -278012 -323555 -300412 -931593 -715746 -51963 -390975 -652079 -479763
6992 -479763 -505989 143447 -72506 -299857 -876064 -411854 -809333 -533748 -148772 -227452
6982 -227452 -112564 -248352 -455113 -963482 -599174 -212899 -648330 -1082556 -546626 -620555
6972 -620555 -189551 -1154690 -1367234 -859568 -427513 -354174 -1013349 -1026656 -1289260 -672854
6962 -672854 -671637 -417119 -624134 -1193395 -255148 -176395 -454982 -654293 -669258 26636
6952 26636 -373507 -484396 -294412 308110 52550 -546119 -225853 -153206 223846 -364681
6942 -364681 -913458 -344621 628524 -258520 -219159 -103625 233924 -159154 -343504 -35385
6932 -35385 -625167 -505558 -128495 343597 -3276 435250 33600 -574109 -827329 -663422
6922 -663422 -591444 -1069576 -1143964 -674719 -1396823 -546498 -306040 -82925 -420741 -557194
6912 -557194 -60689 -777836 -1157895 -762955 -430722 -600586 -229692 -550446 -75390 125920
6902 125920 99775 -9600 -909901 -386067 209164 -492878 -1382889 -1339434 -916249 -1274689
6892 -1274689 -1163456 -434752 -294723 -1385172 -1253090 -1165623 -726812 -647489 -433219 -522229
6882 -522229 -684955 -210118 -487337 -978328 -472964 -944444 -253362 66579 -238308 -326381
6872 -326381 -725065 -1191742 -947734 -487129 -475345 106631 695215 475274 -455425 372919
6862 372919 519447 -650868 -1623516 -1101749 121381 752339 -20190 -519036 -398879
6853 -398879 -546502 -70418 -826199 -1118629 -715950 -167316 -425400 -678132 -985734 -1617142
6843 -1617142 -721092 348406 -100825 668674 727097 -14623 453053 -105412 73863 237137
6833 237137 543337 677911 -129745 -622429 -684611 -801012 -438403 -469618 -62709 -571529
6823 -571529 -449692 -446028 -484950 -322236 -1525431 -835379 -694261 -456680 -567740 -216362
6813 -216362 33332 -876156 -1100763 -1222041 -654458 -224236 -1076464 -829118 -80443 -686036
6803 -686036 -823190 -573438 -277503 -368288 -80014 -8593 -786764 -614918 -20292 -527053
6793 -527053 311032 260332 -288017 -1419635 -1013881 -158092 -281112 -813251 -1502924 -1275548
6783 -1275548 -1448520 -518439 -319050 -135682 32652 517811 823675 -65268 -245735 -463369
6773 -463369 -175187 -87974 -202018 100600 -69425 -7604 984813 663163 1068658 1033646
6763 1033646 75492 -222904 -971899 -323627 -245596 -507335 -1008228 -453408 -359160 -824470
6753 -824470 498252 723437 830226 -555855 -1355000 -188940 -866214 -521262 241137
6744 241137 -338730 -732016 -1073850 -214169 265671 -392659 5622 -184532 -274230 434641
6734 434641 678191 358142 226106 173395 -492310 -102275 179024 -639841 -661316 -295242
6724 -295242 -1027387 -922582 -938907 -162200 129671 -113244 11226 -193795 -244481 -1154539
6714 -1154539 -538099 167893 -344151 -331850 338343 -170073 -193820 -533657 -123090 -568825
6704 -568825 -1073603 -1556531 -823267 236269 -318592 -700203 -851240 -611406 -1313913 -900711
6694 -900711 -537951 -663488 -833911 -379371 -491280 -1125590 -685162 -1524 -303121 -203689
6684 -203689 102547 -741021 -714298 -671352 -63951 93381 -354689 -92389 172879 428949
6674 428949 103422 8995 -8349 -318520 -1049697 -961079 -933646 -664962 412306 497330
6664 497330 224699 -342176 -937783 -1126908 -746792 -107705 -52002 501791 22768 -576492
6654 -576492 -1439931 -646511 -744162 -310913 921631 769202 230496 -724122 -398268 -725548
6644 -725548 -595556 -151917 5685 -297638 -955844 -499153 -533604 -47040 814288 573806
6634 573806 756491 -886762 -213500 -537059 -937960 -331366 111785 -490282 -397749 -371494
6624 -371494 -611700 -479170 -122503 180040 -402157 -136339 -79467 -228944 320369 305734
6614 305734 -531775 -735914 -962038 -1116250 -291406 311734 -368252 -186095 625418 423201
6604 423201 120395 -619234 -653136 -572147 -562190 -126109 -213609 -771122 -924226 -410472 -800402
6593 -800402 -470825 -591703 -700933 -483777 14716 -229024 -884987 -896774 -1377013 -838885
6583 -838885 46062 -195082 -505879 -762219 -828389 -910021 -881446 -555073 121687 -320465
6573 -320465 -329341 -1020182 -345515 -59799 574254 -80687 -421985 588326 695246 -498725
6563 -498725 -779107 -423486 -163367 229157 -75416 -145138 189952 351833 128891 74559
6553 74559 -510998 -331737 -162231 506663 490261 303414 425762 -582132 -1069538 -724060
6543 -724060 -180266 -931018 -865495 624210 375788 -581100 -773761 -535290 -1055755 -1437636
6533 -1437636 -1198635 -832629 -1007283 -816908 -851795 -427440 300051 846568 482280 116574
6523 116574 -272293 269348 212502 -1062306 -787975 -502531 -437309 -342708 -244602 133171
6513 133171 59917 444041 144085 -503624 -472049 -418702 -328287 -116850 -356886 -757644
6503 -757644 -632084 -939095 -912662 -756803 -561847 -1292110 -1227155 -395031 -504855 -616785
6493 -616785 -429694 -251744 -1417973 -1665429 -1506130 -1635553 -683511 -283702 -487516 125596
6483 125596 209198 200827 74157 391443 -49254 -265784 -442355 -632981 -1118253 -1619278
6473 -1619278 -1808493 -972723 -416871 -1507691 -1287059 -735246 -158583 -1004462 -628500
6464 -628500 -585792 -562254 -819225 -712878 -424375 -763757 -593690 -137559 -49593 -16298
6454 -16298 -529118 260896 -56126 -41287 630684 -44421 -434960 -1214953 -170516 -153923
6444 -153923 -68727 -807346 -1243092 -639673 84269 -30084 183525 426223 563428 -259700
6434 -259700 -945244 -157755 365826 -885503 -324996 -587651 -1001068 -895319 -508659 -841702
6424 -841702 -1207163 -935128 286084 467817 -556835 -92793 -138157 -92892 228195 7977
6414 7977 -555791 -31937 617499 -527545 -203794 56149 54703 255130 -99600 -241576
6404 -241576 -171799 -1116195 -1229962 -349243 -556542 370075 -235154 -813718 -987529 -75652
6394 -75652 -131034 -8153 -270267 147072 -167685 247510 -55680 -1230143 -358158 337553
6384 337553 83101 -450660 -823444 -978387 -1419296 -543245 -399426 -360289 -13195 796816
6374 796816 439595 776119 -312028 -46674 24100 178397 117487 -189438 -797807 -423048
6364 -423048 -590059 -441263 206239 321720 -215324 -533679 -991450 -1030513 -767479 -925578
6354 -925578 -123461 -242797 -564164 214721 390615 -342696 -451313 -730262 434710 304598
6344 304598 422226 -314724 -495257 -299954 1084459 935775 512782 -147647 -115375 123847
6334 123847 96202 190663 -212001 -804606 -641127 -1134373 -266149 -303603 -787760 -212514
6324 -212514 -185499 -774529 -428076 -1053772 -960305 -681493 -800140 -879580 48300 -37282
6314 -37282 -362261 -1323655 -669570 -69285 -132917 -120327 367116 373699 -554977 -122021 -340107
6303 -340107 -914705 -148675 554205 78923 455578 24822 264805 281936 360470 -372733
6293 -372733 -997112 -667572 -148149 -442439 -901923 -605344 -242073 -405653 -560002 -975092
6283 -975092 -425551 -200410 -282473 -107439 280534 1030921 371402 744099 198451 -252252
6273 -252252 294848 -882134 -331643 -652821 -681646 184076 209021 -22025 -250192 -179585
6263 -179585 184331 -397704 -595231 38698 24406 -308383 -377840 -468199 -142124 -111679
6253 -111679 -299012 -278323 -328229 -326909 -40798 -94126 57740 -16166 100994 -403158 -1063767
6242 -1063767 -1006817 -1172511 -788927 -259171 -284665 778896 656784 236968 -599316 -789606
6232 -789606 -47124 -22126 43283 715889 571216 280212 1091118 1045191 826228 319477
6222 319477 429295 70802 680209 551290 -201024 -856940 -1422996 -481119 -104611 -697592
6212 -697592 -884147 -463051 -369397 -1047349 -392531 444579 -53824 -169558 -12293 296680
6202 296680 709003 626325 379351 -516988 -937771 -945615 -904919 -543450 -202853 -470636
6192 -470636 360446 325761 -418098 495035 351982 661331 966675 -240228 -661657 -540781
6182 -540781 -248417 -308653 -438914 153083 103387 -949168 -845942 -846360 -351491 -594768
6172 -594768 -493775 -712981 -844665 -131790 -153391 -533903 -1023440 -554938 -804937 -743
6162 -743 -168481 -261584 -579382 32788 397734 379315 -483525 89030 616249 228727 900185
6151 900185 265538 -195835 412845 -190244 -793911 -134538 -214950 -89162 741345 646650
6141 646650 258607 123988 -62317 -185815 -1088220 -803968 -731803 450026 726421 -382798
6131 -382798 -56937 667978 -98413 113256 451760 -81179 544295 638806 290958 -192459
6121 -192459 377514 331087 344441 842961 622136 965024 633181 751430 521161 462805
6111 462805 759475 244899 56624 209088 -608765 87645 146802 271184 -79097 396722
6101 396722 655654 968570 -26389 -458954 167145 135176 630903 285915 721835 -104296
6091 -104296 182401 -396427 -1248993 312398 304663 -67535 -245861 10704 -99184 -85921
6081 -85921 342460 -553811 -954694 -849457 -308425 -251476 -160441 -448202 11341 -496045
6071 -496045 690220 961242 219966 -46600 594422 428112 496455 -30650 617397 1053023
6061 1053023 728805 29499 686721 534401 389437 323019 -51578 195063 172457 100971
6051 100971 -102435 268675 -5559 354997 394042 235068 -272296 -70265 261720 134774
6041 134774 -366769 125516 99344 -665515 -189821 663895 564588 584602 -7253 906804
6031 906804 535987 655624 273100 177102 615510 860799 374871 67170 249089 209880
6021 209880 -200601 -56144 -489740 689104 1216943 855610 134949 343318 -9224 -800298
6011 -800298 -322577 -579387 290743 799916 671315 -18393 210271 327209 220293 360059
6001 360059 208835 321153 280238 46960 -305061 70946 -98645 -713119 96513 -178751
5991 -178751 -4095 -583250 -586679 223717 361222 898172 625797 1310922 915067 -234322
5981 -234322 -144914 -220310 418704 -549290 384118 909484 406060 316957 920875 1184234
5971 1184234 893005 528012 431575 560248 -20627 -132839 217994 665544 236746 40859
5961 40859 15461 41349 338003 827544 959783 101631 -378475 105198 636244 362075
5951 362075 329359 166698 -449784 -186506 57570 92391 -86361 423602 1038900 777081
5941 777081 753021 441023 -29801 500316 292370 274500 1206260 910700 1173593 857885
5931 857885 486668 199720 381513 -456913 -8113 116427 306638 507634 417959 565588
5921 565588 1115769 1287791 700153 1361276 816962 -180802 -258650 316730 -160252 -905425
5911 -905425 -542157 494690 763602 -69792 43570 -356417 -493037 233018 516369 769852
5901 769852 862577 361581 390485 935262 12424 -557988 844743 757742 174488 730314
5891 730314 530842 222524 308989 1361985 -625753 -236958 377749 -143818 30970 798270
5881 798270 1243425 1055224 539383 815896 422696 1254922 506233 1310085 1104750 337012
5871 337012 243045 390838 1115321 1335308 633207 290306 617052 515525 509289 735984
5861 735984 1265202 512020 707636 436585 510320 730992 433366 381797 949280 983198
5851 983198 1232688 1066888 849767 1171744 1493061 632405 740171 499031 233402 428584
5841 428584 963576 780916 1286291 504079 91046 683177 383011 -231167 -71129 -219735
5831 -219735 206544 609120 376576 -30603 -236588 -391989 -53463 763024 279508 244935
5821 244935 67098 202422 120858 -235184 425035 248262 128005 -171602 -105015 375445
5811 375445 -404632 -428118 -203600 228879 89325 124837 635410 539914 533681 978518 832861
5800 832861 510350 812953 880686 831776 -35615 -118528 1158890 1366265 664699 271666
5790 271666 18791 941865 1004550 647196 73951 70714 503499 -452128 429891 747987
5780 747987 610335 738649 892875 465032 310696 1431660 1230521 1416562 2442233
5771 2442233 2062840 2019686 2758426 2038691 1926443 2272555 2845203 3043111 2968149 3434911
5761 3434911 3281372 3465049 3691175 4473670 4836653 4607182 5232314 5331872 6234437 6423775
5751 6423775 6351605 6633667 5329887 5461148 5750651 5100351 4604961 4053473 3058723 2574769
5741 2574769 2985353 3056120 1845598 1307933 1909208 1491917 619868 1450077 1402353 1593088
5731 1593088 1640535 838517 1576756 1077131 447643 528270 753050 211920 457181 511360
5721 511360 659389 1513726 2070717 1325643 778308 1259369 912361 537821 283421 270957
5711 270957 96949 466622 55124 -131871 -28070 376851 1189918 740112 -143507 -13489
5701 -13489 356251 619080 998940 611454 224118 512142 502719 368875 -300582 236672
5691 236672 6094 743212 1333438 441854 96228 710763 177724 327594 -291924 -709250
5681 -709250 -763878 368160 288683 -320811 103918 -282507 -513499 -836302 4274 56402
5671 56402 -658827 -1447227 -160333 273017 165489 -132971 -580997 -345404 431283 377722
5661 377722 1150366 245502 450398 1059004 197141 -591067 369983 428013 688138 887777
5651 887777 836576 888775 485648 177906 1111188 628085 11875 369429 222707 -160167
5641 -160167 120244 408338 -230214 155 -159152 832060 1133069 1211273 1027402 405043
5631 405043 494419 1081021 897531 8124 -571262 -1224873 -769338 323713 180898 273490
5621 273490 19741 -341950 -595454 -164040 140405 1255002 784220 325182 72936 -268202
5611 -268202 639530 906521 138753 -402717 -36043 236556 460391 549694 61797 1101625
5601 1101625 697068 -448376 65109 54819 -340880 -81995 338254 713218 550750 689155
5591 689155 944917 852105 1003808 414567 -292311 -35878 88874 -72637 499401 204071
5581 204071 712659 604471 837890 -94834 -202997 663860 243984 65533 119146 350746
5571 350746 229514 -177208 -336445 -493542 152284 1236866 993213 -226610 -712668
5562 -712668 460033 62661 -119450 -338145 -410205 408075 571808 310266 -241694 -163202
5552 -163202 -6457 482777 396222 -208144 -221980 60096 13462 -84421 981947 1316933
5542 1316933 570167 758198 346752 98004 -63057 -580175 -887919 -607554 106908 16173
5532 16173 112001 985779 1004860 1098088 1260244 286822 -71352 -264991 264328 450156
5522 450156 323969 247289 561195 407057 33263 100441 -257077 -323254 1399101 1077677
5512 1077677 397943 160004 -346195 -93617 -689445 15938 564503 907845 789442 1577199
5502 1577199 1732031 587191 -41785 -330812 470690 802983 736828 948600 625266 561525
5492 561525 540157 339242 569084 202985 346071 1361157 360363 316967 636935 725380
5482 725380 748830 691239 953602 638010 849589 508726 -340673 -178474 -54947 284116
5472 284116 331409 562868 739837 69184 59498 -656932 -378221 -202374 36277 816652
5462 816652 879845 1239797 1024453 1130214 699748 1449179 697936 1030301 460586 -528145
5452 -528145 -5652 -362637 237028 454974 -4311 281356 1245715 1255696 887958 339020
5442 339020 333245 331568 207599 76918 533140 630681 419954 744894 712461 777543 1553405
5431 1553405 1135676 638850 -275102 -71324 332862 733455 689816 1401717 1332189 189921
5421 189921 85132 130947 728276 505604 -7450 356020 341069 264663 187674 266008 1262072
5410 1262072 2142037 1391918 596867 223002 307332 581529 181997 706350 421355 351438
5400 351438 130695 157749 284040 189158 951205 550772 120961 57281 108473 204122 128413
5389 128413 573695 1164352 1116498 1090147 794996 659060 -316226 -772592 202670 -28183
5379 -28183 -635988 -111424 -533145 -717283 -889198 -610670 339497 719852 325165 433022
5369 433022 -144017 -98072 769347 1022330 482926 751721 1129739 810275 625018 798161
5359 798161 709856 -508520 113012 295203 -70112 -479142 296877 -35802 -329739 299243
5349 299243 960872 -117215 -266429 345652 345347 -300802 -637495 -68361 1165937 2008920
5339 2008920 1549343 977337 287155 600616 603265 1318992 1445550 1105836 1130503 673589
5329 673589 726169 475739 1012217 1628242 1043453 602266 1332823 1058124 699590 984486
5319 984486 382191 168026 26654 134420 508668 1117926 1148982 538642 -70138 754514
5309 754514 676530 -37967 340527 904607 252069 278268 173651 -620117 261081 101658
5299 101658 -494700 -436825 410539 171201 -167456 79979 827684 1121202 866313 367910
5289 367910 642926 1200667 873379 160270 -52039 -205361 -90563 -153829 727615 435203
5279 435203 263640 -43364 -24008 129236 1046514 1582903 1126896 1310261 1170147 316172
5269 316172 380265 124394 -568702 476373 255846 -95830 131626 108268 -133269 358058
5259 358058 26412 516988 585046 810388 344223 491109 1252729 -372706 -433849 -492794
5249 -492794 25791 691757 851755 430651 23320 223118 41049 244431 556981 1076086
5239 1076086 1174587 996898 554237 238842 -77781 341337 32257 751960 600241 1014798
5229 1014798 433294 -158030 -726804 -585461 -210410 17018 -221355 -118193 563292 234662
5219 234662 451055 344684 484378 412819 -396448 -127980 -109795 -459131 170603 -194091
5209 -194091 -1123468 -675265 -239631 -205053 -75959 30210 154594 -3718 -288925 356897
5199 356897 296156 450073 236670 719838 930099 702700 200226 285387 554642 548195
5189 548195 676436 160801 575053 -83545 60430 1134171 947873 55153 209804 -309796
5179 -309796 -655633 492207 11731 -378947 377388 -142632 -464702 235090 260033 278373
5169 278373 -82302 -502795 350743 713450 960780 540998 986810 974490 495621 228744
5159 228744 250424 394942 341914 -225458 -275766 32292 9496 555954 451726 572270
5149 572270 274853 461950 825794 851985 597245 -188580 563163 759206 186834 75301
5139 75301 1238632 1408760 543339 17622 597593 324612 260311 254076 637667 461826
5129 461826 797948 701374 63883 261857 702379 1085902 586168 451001 569800 416065
5119 416065 980647 1213444 645882 59815 443240 1284558 1100284 1396064 1416111 1545030
5109 1545030 976738 468976 737744 588923 761671 530921 775297 1216822 1378132 542625
5099 542625 -50230 643205 -89252 -608807 207799 -288397 41431 489145 738582 718281
5089 718281 530891 630249 1842395 1533343 664900 1024622 1330611 730294 1356523 1364987
5079 1364987 1850686 2060516 1144533 587176 29441 537857 1202925 285002 227403 1475628
5069 1475628 1512384 1423455 1345245 853309 996053 700900 549942 696432 457928 819883
5059 819883 15083 456533 176607 31547 -44073 1107069 1186667 1520664 1766214 1430241
5049 1430241 917729 879314 797666 564084 702988 1282467 851807 1101290 1158365 1309572
5039 1309572 1354015 1249494 893342 1511666 1710360 1454094 1528044 851088 977352 426845
5029 426845 228215 1728589 1683658 1493125 1455473 2003577 1664897 1170377 1194309 763566
5019 763566 850624 1798712 1555590 1001634 911884 1716262 1540044 1529611 2563493 2872260
5009 2872260 2712481 2689983 1931757 1386200 1028775 1324114 1652572 909022 957115 1789283
4999 1789283 1419707 2107735 2604459 2175881 2300515 1934012 2717997 2499326 1994551 1663544
4989 1663544 1724298 1561872 1558722 2850668 3367322 2834339 2648000 2324991 1518773 2331083
4979 2331083 2827862 2274274 3041927 2351957 3163691 2655748 2383014 2487390 2277279 2314556
4969 2314556 2617047 2494487 2507436 2603714 3063477 2648578 2084420 1774709 1574194 1852634
4959 1852634 2753142 2704613 2163702 2467513 3674654 2991287 2759410 3238802 2583672 2938356
4949 2938356 4129470 4068045 3713781 2877398 2735169 2832672 2710634 3140725 3104610 3866276
4939 3866276 4014271 4074918 3670141 3436239 4289040 3920024 4712511 3857876 3381095 3446005
4929 3446005 3650273 3431439 3875880 4057519 3835092 4014468 3620047 2850968 3300267 3488747
4919 3488747 3659455 3588340 3204234 3286681 4495526 5200763 4550645 4816849 4289890 4385165
4909 4385165 4615117 5648418 5534580 5092657 5120959 5413532 4995186 5053767 5370143 4876941
4899 4876941 4587135 5351497 5244579 5484895 5645527 5246084 5360040 5475568 5697926 5662100
4889 5662100 5691304 6385620 6231384 6897808 6962467 6846456 7004086 6552848 6498693 7111318
4879 7111318 6751378 7823519 7484630 7462583 7360272 7039241 7134036 7772073 7967133 8491373
4869 8491373 7948968 8398958 8982034 8439770 8901587 9273722 9338956 9169784 9373754 9780341
4859 9780341 10410708 10135227 10027356 10020250 10095082 10854719 10677676 10944714 11733076 11463918
4849 11463918 11953422 12248125 12949035 13435047 13370814 13147115 12826120 12532543 13314613 13818766
4839 13818766 14200774 15020175 15010608 15004154 15669818 15626948 16389587 16605590 17578461 17672735
4829 17672735 17915488 18332498 18540383 19552675 19493773 19978755 20075634 20562680 21371115 21384067
4819 21384067 21207633 21334806 22000513 23427521 23531888 23369096 24321294 25715407 26292343
4810 26292343 26008010 26496069 26888903 28023468 28577776 28823220 30226626 30781630 31210395
4801 31210395 32874086 33923954 35013033 35239809 36418945 37856061 39399222 40831741
4793 40831741 40874978 41815815 43950550 45147604 46000741 48257541 49965145 51476921 53582310
4784 53582310 55200678 56764372 60198219 61456210 63639235 66830944 68618836 70405019
4776 70405019 74736964 78261594 82194229 86445143 90538027 95309333 99797620 105548244
4768 105548244 111620099 118908722 125780595 133296591 141811630 151514831 161638216 172075714
4760 172075714 183093031 193423465 204123978 213488833 220267906 224808417 225203842 223853927
4752 223853927 218866862 210596380 200866758 189549130 177652110 165325644 152484031
4745 152484031 140096667 129358481 118736754 110168464 102528063 94715747 88119709 82574374
4737 82574374 76600268 71278910 67644770 63363640 59186986 54982676 51612959 49335677
4729 49335677 47009107 44338003 42273553 40579821 39568669 37691087 35748839 33730329
4721 33730329 32467136 31258700 30051041 29275584 28329472 27583012 26120061 25731254 25028081
4712 25028081 23972384 23088613 22135597 21625606 20812582 20464554 20112831 19085519 17770436
4703 17770436 17236685 17259973 16925736 16392813 16129896 15288050 14801715 13974572 12839257
4694 12839257 12478737 12090541 11803426 12359522 11799366 11323629 11199247 10497399 10021081
4685 10021081 10178861 10597246 9958309 9503301 9322315 9047993 8616348 8743068 9017204
4676 9017204 8593582 8479755 9182906 8676855 8819689 8650659 8005718 8025391 8415210 8519693
4666 8519693 7701685 7045729 6874083 7286241 6740766 6219031 6739466 6447433 6428184 7282852
4656 7282852 7129670 7017788 7196645 6730394 6033815 5173353 5174448 5279978 4503459 4894114
4646 4894114 5347507 5487526 5926024 6250288 5289718 5101124 5180239 5243761 5599951 5996627
4636 5996627 6618243 5814923 5911346 5502067 5740890 5496153 4832537 5194140 4892713 4886568
4626 4886568 4907123 5105501 5464770 4716159 5103122 5293729 5498536 5844755 5632343 5824964
4616 5824964 5689638 5008775 5475510 5412785 5063940 5453534 6114892 6221976 6295420 5634849
4606 5634849 5757846 5805383 6380276 6660525 5872562 5355321 4886435 5325688 4862406 5385150
4596 5385150 5825867 5725765 5988107 5586739 4855370 4706227 5655472 5987653 6690808 5627720
4586 5627720 5480517 5743620 5104147 4843504 6209488 6764526 5963591 6426444 6645064
4577 6645064 6597231 6130199 6317123 6785692 7265255 8161821 9242436 10080396 11226761
4568 11226761 11697954 11951654 11604535 11979837 12022189 12707899 13551065 14296289 14626652 14914269
4558 14914269 14982307 16382815 17351361 16718855 16408997 16274507 17009095 17696948 18132037
4549 18132037 18138766 17146407 16498931 16365023 15267045 15775039 15493549 15077815 14771843 13714984
4539 13714984 13295159 11600602 10685186 9863301 9733948 10346438 9801986 8864268 8687731
4530 8687731 7589592 7203127 7215971 6937944 6414347 5016009 3477279 4114680 4096686
4521 4096686 4898459 4784371 3904847 4023606 4091143 3625494 4275931 4678556 4511758 4592017
4511 4592017 4050542 3737671 3138979 3654182 3336942 3008088 2948576 3318389 2708079 2420199
4501 2420199 2510762 2869127 2998671 2927355 3146400 2673760 2679643 2750983 3347529 2566454
4491 2566454 1531112 2381544 2566904 2537017 2139936 1696654 1369663 1658079 1665694 836616
4481 836616 626851 670726 -324472 408469 891693 17890 115112 1234484 1488494 658035
4471 658035 1002271 686837 165849 -133585 225561 587500 1158186 1626455 1467676 1045497
4461 1045497 1156098 826192 817143 1282375 986290 589597 990270 1205085 742995 687646
4451 687646 301778 973246 1193233 449899 73633 333179 521684 748805 873448 900649
4441 900649 514015 847599 963301 1550045 1416262 909402 854189 209580 -171942 108146
4431 108146 2153 -100716 221935 -94162 -188912 89114 478863 1071534 864251 1036414
4421 1036414 782214 263334 261897 352222 1192909 1571635 1182886 1119438 1243668 1579309
4411 1579309 1356338 554281 283257 825192 1365141 900331 453524 1238597 1180779 1089774
4401 1089774 560857 221327 330864 120383 -435869 -837321 235076 641949 1239140
4392 1239140 1103672 412125 290964 664143 1065614 892223 833236 1187273 403769 -87604
4382 -87604 311092 702933 755832 684464 197702 494388 511370 35015 481315 183006
4372 183006 291014 1349195 651056 -273489 -578520 -567274 -373000 -460694 -585637 -644719
4362 -644719 -96995 383121 -221075 -1068054 -879841 -1151847 -688674 63873 337606 42494
4352 42494 -196405 772389 501312 578908 750312 700429 943880 752423 639564 421517
4342 421517 503086 -31384 203890 70952 -411970 -419587 -31787 752585 693304 477093
4332 477093 -312640 -692804 18368 385203 -77081 -140299 15317 -14586 305257 528113
4322 528113 261426 -109538 -56586 247403 269583 1267 -512098 -60829 123241 41596
4312 41596 -655938 -889111 -1070430 -99707 -19256 188133 993280 639790 -194077 -681561
4302 -681561 -343911 730654 721209 137260 -653004 -1035968 -519260 -626204 -681530 -750810
4292 -750810 357736 275469 -456179 506008 355258 -18250 560332 485862 758643 243940
4282 243940 51957 617462 536919 -368583 -583970 -1459021 -516733 -663149 -389458 369997
4272 369997 245563 550093 1176215 801802 -767650 -116224 463864 220275 509549 385872
4262 385872 -86941 -268442 166668 457607 -217212 -117628 -216364 -26184 613237 675208
4252 675208 641787 51640 -77542 -427489 150804 -156861 -26891 524063 122443 604767
4242 604767 315396 332858 223880 195200 471915 689975 1032495 241679 -111316 705122
4232 705122 1214089 886280 -54582 44791 301027 591781 607206 313053 48095 134822
4222 134822 923666 1768265 1925443 1446417 430678 74668 154269 480759 663003 1260114
4212 1260114 266059 203864 882828 587592 876010 1476913 1503954 1166987 1131679 715888
4202 715888 826206 1175023 1175650 905871 623319 -335796 -469423 303899 519841 794754
4192 794754 632482 916317 198345 -491296 836540 777402 165925 917364 1478187 1505267
4182 1505267 1005367 1042503 1110059 683605 110328 624793 502089 45146 33891 304706
4172 304706 1087666 784816 566097 457007 52256 -262118 -13403 590989 402238 95830
4162 95830 367673 195756 398394 1065007 1591741 962454 1194086 657782 834452 1304698
4152 1304698 1047662 335725 862014 1045801 483735 -287777 549250 810347 631148 419442
4142 419442 455078 365325 -520846 -609709 615867 390989 707483 990997 -87435 207750
4132 207750 1341926 913409 403719 697675 213449 447224 632388 -230438 -339429 424107
4122 424107 336218 498257 -369768 640615 393082 70663 388347 845924 314967 -70149
4112 -70149 -253052 -69394 -289796 616519 1315191 1202311 771656 975634 640549 1342055
4102 1342055 1044517 307433 1647725 2120504 1368025 604292 1113174 506921 415314 477062
4092 477062 637232 599317 611448 1073060 987778 409776 357659 335216 135757 847323 666601
4081 666601 996027 671098 253741 723105 943252 420139 38271 958206 589270 143959
4071 143959 -62140 1372963 1334977 653391 992749 1387437 438758 694268 1018966 619772
4061 619772 626275 533277 557181 11270 261665 142328 -855308 -239685 792602 367817
4051 367817 568499 1083167 1353979 -1833 711591 1438495 561096 280559 -227636 79954
4041 79954 64337 403211 595797 861525 703821 390893 409237 341266 522601 165558
4031 165558 883541 550613 740125 189760 685678 942507 268724 719206 324503 531626
4021 531626 391819 1105468 945424 1021544 943384 1599396 1587667 706775 473772 445477
4011 445477 -134048 -207071 53510 484488 1488994 1775715 1517311 707220 805959 615201
4001 615201 345402 396604 753684 303525 1559355 2050525 1101505 948841 1155790 1691119
3991 1691119 681975 1483866 1423395 -152387 -628565 827752 730071 349807 680630
3982 680630 662537 884170 620093 1021842 640041 879470 620968 547293 391858 1068232
3972 1068232 1174733 719253 537929 494633 1221560 748399 185252 1217726 1561828 914933
3962 914933 766633 1579938 1543048 1400249 866171 293429 529971 836630 1378346 1474507
3952 1474507 755648 1290016 1894964 1877884 1747292 815111 809723 173282 562467 883184
3942 883184 2047958 2121483 1842575 1556508 1471463 1569084 1442364 389284 1234132 1473718
3932 1473718 1870616 1566016 972998 1951394 1824822 1383608 1300721 1791926 1853278 1432891
3922 1432891 1871408 1422652 1375588 1460433 681249 1693319 1832293 2299665 2362738 1917334
3912 1917334 1309214 798555 1332699 2372705 2760157 2560942 2150565 1977578 1074843
3903 1074843 1983915 1733247 1533470 1689389 1604951 2075673 1995410 1328082 1559610 2187787
3893 2187787 2048648 1815800 2739454 2716436 2256540 1713660 1671459 2244891 2191720 1740778
3883 1740778 870216 489115 480612 619393 1048783 1422688 1214618 994827 1453206 1426145
3873 1426145 1109905 1441633 1721337 1044973 735221 958788 780950 1117964 848651 708844
3863 708844 878184 242448 33654 1222699 1429810 732173 408955 943545 1376325 128565
3853 128565 552426 734858 773098 1305262 880350 911137 534676 592033 916171 421429
3843 421429 403879 765726 573701 379009 400903 915512 -293323 -1024079 -224973 53393
3833 53393 -278941 292056 441145 41306 739731 372399 480255 1444512 148323 -643140
3823 -643140 46600 260974 59327 342055 226862 469798 172041 841682 291947 677596
3813 677596 808942 369097 746530 506255 25773 141787 -114698 96039 56381 -385027
$$ [...]
##END NTUPLES=NMR SPECTRUM
##END=
