##TITLE=1H_CA-9219-1
 CDCl3
 8 sc, 
 27.12.2023
##JCAMPDX= 6.0         $$ Bruker NMR JCAMP-DX V2.0
##DATA TYPE= NMR SPECTRUM
##DATA CLASS= NTUPLES
##ORIGIN= UXNMR, Bruker Analytische Messtechnik GmbH
##OWNER= root
$$ XWIN-NMR		Version 3.5
$$ Wed Dec 27 14:27:49 2023 Russian Standard Time (UT+4h)  she@DPX200
##.OBSERVE FREQUENCY= 200.1313
##.OBSERVE NUCLEUS= ^1H
##.ACQUISITION MODE= SIMULTANEOUS
##.ACQUISITION SCHEME= undefined
##.AVERAGES= 8
##.DIGITISER RES= 18
##SPECTROMETER/DATA SYSTEM= spect
##.PULSE SEQUENCE= zg30
##.SOLVENT NAME= CDCl3
##.SHIFT REFERENCE= (INTERNAL, CDCl3, 0, 15.5982)
##AUDIT TRAIL= $$ (NUMBER, WHEN, WHO, WHERE, WHAT)
$$ ##TITLE= Audit trail, XWIN-NMR		Version 3.5
$$ ##JCAMPDX= 5.01
$$ ##ORIGIN= Bruker BioSpin GmbH
$$ ##OWNER= she
$$ F:/spectra/data/she/nmr/H-F/1/pdata/1/auditp.txt
$$ ##AUDIT TRAIL=  $$ (NUMBER, WHEN, WHO, WHERE, WHAT)
(   1,<2023-12-27 14:26:41.31 +0400>,<she>,<DPX200>,
      <created by zg, POWCHK disabled, PULCHK disabled
       configuration hash MD5:
       00 E9 B6 7A A2 85 ED C7 34 08 36 98 17 FE 4E 26
       data hash MD5: 16K
       2C 88 5E 83 93 3C 33 44 1D A6 42 C1 7F 1D B1 73>)
(   2,<2023-12-27 14:26:46.93 +0400>,<she>,<DPX200>,
      <Start of raw data processing
       efp BC_mod = 2 LB = 0.24 FT_mod = 6 PKNL = 1 PHC0 = -24590.89 PHC1 = 6.652731 SI = 16K 
       data hash MD5: 16K
       D9 08 F8 7C 74 AF F5 B2 07 1F 28 80 CD E8 BE 91>)
(   3,<2023-12-27 14:27:04.25 +0400>,<she>,<DPX200>,
      <pk PHC0 = -1.945152 PHC1 = 4.4 
       data hash MD5: 16K
       9D 34 F0 21 D8 38 54 80 A3 E8 20 0E 62 15 30 52>)
(   4,<2023-12-27 14:27:07.67 +0400>,<she>,<DPX200>,
      <abs ABSG = 5 
       data hash MD5: 16K
       0C 4F 47 78 27 D1 59 56 D3 B4 CE 30 77 C0 D4 D3>)
$$ ##END=
$$ 
$$ hash MD5
$$ 62 8A F8 5F 40 E6 8D 70 DA 9F A0 46 C9 FB 27 6D
##$RELAX= 
##$RELAX= 
##$RELAX= 
##$RELAX= 
##$RELAX= 
##$RELAX= 
$$ Bruker specific parameters
$$ --------------------------
##$DU= <F:/spectra>
##$EXPNO= 1
##$NAME= <H-F>
##$PROCNO= 1
##$TYPE= <nmr>
##$USER= <she>
##$AMP= (0..31)
100 100 100 100 100 100 100 100 100 100 100 100 100 100 100 100 100 100 
100 100 100 100 100 100 100 100 100 100 100 100 100 100 
##$AQSEQ= 0
##$AQ_mod= 1
##$AUNM= <au_zg>
##$AUTOPOS= <>
##$BF1= 200.13
##$BF2= 200.13
##$BF3= 200.13
##$BF4= 200.13
##$BF5= 200.13
##$BF6= 200.13
##$BF7= 200.13
##$BF8= 200.13
##$BYTORDA= 1
##$CFDGTYP= 0
##$CFRGTYP= 5
##$CHEMSTR= <none>
##$CNST= (0..31)
1 1 145 1 1 1 1 1 1 1 1 1 1 1 1 1 1 1 1 1 1 1 1 1 1 1 1 1 1 1 1 1 
##$CPDPRG= <>
##$CPDPRG1= <>
##$CPDPRG2= <>
##$CPDPRG3= <>
##$CPDPRG4= <mlev>
##$CPDPRG5= <mlev>
##$CPDPRG6= <mlev>
##$CPDPRG7= <mlev>
##$CPDPRG8= <mlev>
##$CPDPRGB= <>
##$CPDPRGT= <>
##$D= (0..31)
0 1.2 0 0 0 0 0 0 0 0.06 0 0.03 0 0 0 0 0.0002 0 0 0 0 0 0 0 0 0 0 0 0 
0 0 0 
##$DATE= 1703672800
##$DBL= (0..7)
120 120 120 120 120 120 120 120 
##$DBP= (0..7)
150 150 150 150 150 150 150 150 
##$DBP07= 0
##$DBPNAM0= <>
##$DBPNAM1= <>
##$DBPNAM2= <>
##$DBPNAM3= <>
##$DBPNAM4= <>
$$ [...]
##$SUBNAM3= <"">
##$SUBNAM4= <"">
##$SUBNAM5= <"">
##$SUBNAM6= <"">
##$SUBNAM7= <"">
##$SUBNAM8= <"">
##$SUBNAM9= <"">
##$SW= 18.0517328524113
##$SWIBOX= (0..15)
0 0 2 0 0 0 0 0 0 0 0 0 0 0 0 0 
##$SW_h= 3612.71676300578
##$TD= 16384
##$TD0= 1
##$TE= 0
##$TE2= 300
##$TE3= 300
##$TEG= 300
##$TL= (0..7)
0 120 120 120 120 120 120 120 
##$TP= (0..7)
150 150 150 150 150 150 150 150 
##$TP07= 0
##$TPNAME0= <>
##$TPNAME1= <>
##$TPNAME2= <>
##$TPNAME3= <>
##$TPNAME4= <>
##$TPNAME5= <>
##$TPNAME6= <>
##$TPNAME7= <>
##$TPOAL= (0..7)
0.5 0.5 0.5 0.5 0.5 0.5 0.5 0.5 
##$TPOFFS= (0..7)
0 0 0 0 0 0 0 0 
##$TUNHIN= 0
##$TUNHOUT= 0
##$TUNXOUT= 0
##$USERA1= <user>
##$USERA2= <user>
##$USERA3= <user>
##$USERA4= <user>
##$USERA5= <user>
##$V9= 5
##$VALIST= <valist>
##$VCLIST= <CCCCCCCCCCCCCCC>
##$VD= 0
##$VDLIST= <DDDDDDDDDDDDDDD>
##$VPLIST= <PPPPPPPPPPPPPPP>
##$VTLIST= <TTTTTTTTTTTTTTT>
##$WBST= 1024
##$WBSW= 4
##$XGAIN= (0..3)
0 0 0 0 
##$XL= 0
##$YL= 0
##$YMAX_a= 107303
##$YMIN_a= -169512
##$ZGOPTNS= <>
##$ZL1= 120
##$ZL2= 120
##$ZL3= 120
##$ZL4= 120
##$ABSF1= 15.60366
##$ABSF2= -2.448192
##$ABSG= 5
##$ABSL= 3
##$ALPHA= 0
##$AQORDER= 0
##$ASSFAC= 0
##$ASSFACI= 0
##$ASSFACX= 0
##$ASSWID= 0
##$AUNMP= <proc_1d>
##$AZFE= 0.1
##$AZFW= 0.1
##$BCFW= 0
##$BC_mod= 2
##$BYTORDP= 0
##$COROFFS= 0
##$CY= -3
##$DATMOD= 1
##$DC= 0
##$DFILT= <>
##$DTYPP= 0
##$F1P= 0
##$F2P= 0
##$FCOR= 1
##$FTSIZE= 16384
##$FT_mod= 6
##$GAMMA= 0
##$GB= 0
##$INTBC= 1
##$INTSCL= 3.70164e-10
##$ISEN= 128
##$LB= 0.24
##$LEV0= 0
##$LPBIN= 0
##$MAXI= 10000
##$MC2= 0
##$MEAN= 0
##$ME_mod= 0
##$MI= 1.114404
##$NCOEF= 0
##$NC_proc= -8
##$NLEV= 6
##$NOISF1= 3.799351
##$NOISF2= 2.8
##$NSP= 0
##$NTH_PI= 0
##$NZP= 0
##$OFFSET= 15.59815
##$PC= 1
##$PHC0= -24592.84
##$PHC1= 11.05273
##$PH_mod= 1
##$PKNL= yes
##$PPARMOD= 0
##$PSCAL= 0
##$PSIGN= 0
##$REVERSE= no
##$SF= 200.129984701826
##$SI= 16384
##$SIGF1= 3
##$SIGF2= 2
##$SINO= 5.538805
##$SIOLD= 16384
##$SREGLST= <1H.CDCl3>
##$SSB= 0
##$STSI= 16384
##$STSR= 0
##$SW_p= 3612.71676300578
##$SYMM= 0
##$S_DEV= 0
##$TDeff= 16384
##$TDoff= 0
##$TI= <>
##$TILT= no
##$TM1= 0
##$TM2= 0
##$TOPLEV= 0
##$USERP1= <user>
##$USERP2= <user>
##$USERP3= <user>
##$USERP4= <user>
##$USERP5= <user>
##$WDW= 1
##$XDIM= 16384
##$YMAX_p= 495880631
##$YMIN_p= -4481189
$$ End of Bruker specific parameters
$$ ---------------------------------
##NTUPLES= NMR SPECTRUM
##VAR_NAME=  FREQUENCY,     SPECTRUM/REAL,   SPECTRUM/IMAG
##SYMBOL=    X,             R,               I
##VAR_TYPE=  INDEPENDENT,   DEPENDENT,       DEPENDENT
##VAR_FORM=  AFFN,          ASDF,            ASDF
##VAR_DIM=   16384,         16384,           16384
##UNITS=     HZ,            ARBITRARY UNITS, ARBITRARY UNITS
##FACTOR=    0.220516191357247, 1,           1
##FIRST=     3121.65757156889, 0,            0
##LAST=      -491.059191436889, 0,           0
##MIN=       -491.059191436889, -4481189,    0
##MAX=       3121.65757156889, 495880631,    0
$$ Real data points
##PAGE= N=1
##DATA TABLE= (X++(R..R)), XYDATA
$$ [...]
11803A312755p9398l99315K4915k36258L1755L66833K75398k68705j58316K6218
11793H95882K62281j11836J71942m89209J6638Q0410L01107q916K87302K59287
11783A664888J9686m50714j98691L97040j50267K19946K91651k91573J58650J70351
11773A830967j69615n1881j22660N8084M7734j153j72740M04421o2442k5348r3375
11762A641992J73808Q4349K65449J13466l1281j29586O32864J76581k64206k72492
11752B390944J12724j6720J74650M8046r1787K73155M68384M5309j62710j52559
11742C089436R7790N0905K57974J87562O4839J13355k91228O05417m75475R685
11732C710260O55099M87745J02765L53051r566l32951K58918Q3269J11907N30865
$$ y = [1312755, 1233357, 834042, 858957, 622699, 654454, 1021287, 1296685, 1027980, 869664, 895882, 1158163, 1046327, 1218269, 729060, 745698, 826108, 1127215, 1118299, 1405601, 1664888, 1684574, 1233860, 1035169, 1432209, 1281942, 1501888, 1793539, 1501966, 1660616, 1830967, 1661352, 1609471, 1486811, 1544895, 1592629, 1591476, 1418736, 1823157, 1760715, 1735367, 1641992, 1815800, 1900149, 2165598, 2279064, 2247783, 2118197, 2751061, 2927642, 2663436, 2390944, 2503668, 2486948, 2661598, 2709644, 2617857, 2891012, 3359396, 3404705, 3241995, 3089436, 3187226, 3238131, 3496105, 3683667, 3748506, 3861861, 3570633, 4176050, 3700575, 3710260, 4365359, 4853104, 4955869, 5308920, 5299354, 4966403, 5225321, 5308590, 5420497, 5951362]
11722E951362R5627j41553P315N27041M19738R7586N36353k57055L23028K93255
11712G852697J19148O48468L49750j55126l35318K32691K73116M6414k81952R5003
11702H844891O6965L3146p5884j35754m38201k92564m58193k51892L3789n46404
11692F779899n02355j53244M0657j54630m84877K17561l06210l00276k10274k90631
11682D635620j26958k26435K07841l63164o30476j76376O02546j46228l76439
11673C399931K2169n0821M29167m27649j38638Q4394q3131k60315j83295m38828
11663B352984k88159L13000J82316J25952K47189j88202m69174j57361p3783j06125
11653A938637m31868J0584K610J36328k90082L52980K23425m351J27060p4596
$$ y = [5951362, 6046989, 5905436, 5912751, 6439792, 6859530, 6957116, 7493469, 7236414, 7559442, 7852697, 7971845, 8620313, 8970063, 8814937, 8479619, 8712310, 8985426, 9031840, 8749888, 8844891, 8911856, 8945002, 8869118, 8733364, 8295163, 8002599, 7544406, 7292514, 7326303, 6779899, 6277544, 6124300, 6164957, 6010327, 5525450, 5743011, 5436801, 5136525, 4926251, 4635620, 4508662, 4282227, 4490068, 4126904, 3496428, 3320052, 3922598, 3776370, 3399931, 3422100, 3371279, 3800446, 3372797, 3234159, 3318553, 3235422, 2975107, 2791812, 2352984, 2064825, 2377825, 2560141, 2686093, 2933282, 2745080, 2275906, 2118545, 2044762, 1938637, 1506769, 1517353, 1519963, 1656291, 1366209, 1719189, 1942614, 1938263, 2065323, 1990727]
11643A990727k49703J81374k21908r3517O4448N6010k10752l4025J51972L29675
11633A964301O8003n94138m0328l63849K02589j66495J48673R0207N6520j08167
11623A257316p7748L34665p3671n3520K0622r3208K61802l5998n47364j55629
11613H37267J0473M53261j12555K9533q6087L42719k01013k19485M10857q8747
11603A376223o0042j57375J4884L2050n795j7472K27275J18560l08149M3051J4493
11592A277703r2528j77564L29995j1570o1434L7824k99343K81630K10617k52071
11582A243259o4844L26180L20461k22241o6290K35807m63795l78907K80884j83246
11572A027268J51294M65735j8555m22788J32176o9498p803J98664J35097j77883
$$ y = [1990727, 1741024, 1922398, 1700490, 1606973, 1671421, 1727431, 1516679, 1482654, 1634626, 1964301, 2032304, 1438166, 1397838, 1033989, 1236578, 1070083, 1218756, 1308963, 1365483, 1257316, 1179568, 1514233, 1440562, 1387042, 1407664, 1314456, 1576258, 1540260, 992896, 837267, 847740, 1301001, 1188446, 1217979, 1131892, 1474611, 1273598, 1054113, 1464970, 1376223, 1316181, 1158806, 1173690, 1205740, 1199945, 1182473, 1409748, 1528308, 1220159, 1263210, 1277703, 1185175, 1007611, 1337606, 1326036, 1264602, 1302426, 1003083, 1284713, 1495330, 1243259, 1178415, 1504595, 1825056, 1602815, 1536525, 1772332, 1308537, 929630, 1210514, 1027268, 1178562, 1644297, 1625742, 1202954, 1335130, 1265632, 1257829, 1456493, 1591590, 1413707]
11562A413707j03072K00351O598j24229J14792L81880j72525n3921m52553k20575
11552I90453O75866L90453l61659r46K16259l65839M6730M51749q1424l21269
11542A640373K46833K20204o83299K79123K491J82188J4943j89099L84967K98505
11532B397229O8825P4597J70709l1100q34637m3935L39797j9877K41185K39512
11522B602305j61180R6231m0728K13326K06418m56384N75576m89964L04818L51614
11512C202032m3276K27984m77880K51207L54173j9405l68392N86832N9488L907
11502C776670m2900L46759l1667P1530L1304M9541k81596P2222J44970K96658
11492D433491M80138n5674N1394K12718p5737K34416m4153o7842J17796L84408
$$ y = [1413707, 1310635, 1510986, 1517584, 1393355, 1508147, 1890027, 1717502, 1663581, 1211028, 990453, 1666319, 2056772, 1695113, 1694167, 1910426, 1544587, 1591317, 2043066, 1961642, 1640373, 1887206, 2107410, 1424111, 1703234, 1705725, 1887913, 1902856, 1713757, 2098724, 2397229, 2466054, 2540651, 2711360, 2680260, 1845623, 1801688, 2141485, 2121608, 2362793, 2602305, 2441125, 2537356, 2496628, 2709954, 2916372, 2459988, 3035564, 2545600, 2850418, 3202032, 3158756, 3386740, 2908860, 3160067, 3514240, 3494835, 3126443, 3713275, 3772763, 3776670, 3733770, 4080529, 4048862, 4120392, 4151696, 4201237, 3919641, 3991863, 4136833, 4433491, 4913629, 4857955, 4909349, 5122067, 5046330, 5280746, 5236593, 5168751, 5286547, 5670955]
11482E670955K73507k7572k4778M79809L10093J68305j06261O3376J09856P744
11472F925034L96264l8654N70494N06963L56540L5800j45841m66847P83219J059978
11462I982950J96783K70668O87556L33863L4524J69785P34172k8574l24258K43660
11452A2301129L28270M19519K01901m435O2175n90740L00351K98969j42947m21312
11442A2752880j72216l15959K38349m20346l95187o78832m06494j21406j63036
11433A0317753j20366P7132p66973l11065N631l31285l57131k22026k73734l64188
11423G653748k60362m4188J21840K79104m78205p17508j43940j74184q9816r2645
11413F053844l02914k15018R8229P1670k72334m57573m801R0713J11875j84490
$$ y = [5670955, 5944462, 5916890, 5892112, 6371921, 6682014, 6850319, 6744058, 6807434, 6917290, 6925034, 7321298, 7282644, 7853138, 8360101, 8716641, 8752441, 8606600, 8139753, 8922972, 9982950, 10179733, 10450401, 11137957, 11471820, 11506344, 11676129, 12410301, 12381727, 12057469, 12301129, 12629399, 13048918, 13250819, 13246384, 13308559, 12717819, 13018170, 13317139, 13174192, 12752880, 12580664, 12264705, 12503054, 12082708, 11687521, 11008689, 10602195, 10480789, 10317753, 10197387, 10274519, 9507546, 9196481, 9202112, 8870827, 8513696, 8291670, 8017936, 7653748, 7393386, 7349198, 7471038, 7750142, 7271937, 6554429, 6410489, 6236305, 6146489, 6053844, 5750930, 5535912, 5634141, 5705811, 5433477, 4975904, 4971103, 5061816, 5173691, 4989201]
11403D989201l20660k39634J84431J33563r8104k66162j6803j63275l72085L66323
11393D196795L21066j80205K07610Q0948n67497J61452Q7977m10973j84565p5358
11383C637250L67465j2614p29077J67167L36135l57299j01264j52443K89050J77092
11373C621462o9921n14682L03183K97848P5068J48121L3262l88924J0611J91827
11363C707855m48908k57495J91840j91025L57810m9060N4472J510N3224j03073
11353C317150n9079J45462J53538r0762J09807K9414r1551p6203Q0843J28371
11343C646990J83595k96931k1049k7127L6651K92243J75644m03098j72399O31193
11333D045712K0466n24628L2992L84555J23161j92646L1101k00155K78761m662
$$ y = [4989201, 4668541, 4428907, 4613338, 4746901, 4648797, 4382635, 4365832, 4202557, 3830472, 4196795, 4517861, 4337656, 4545266, 4626214, 4058717, 4220169, 4308146, 3897173, 3712608, 3637250, 4004715, 3992101, 3263024, 3430191, 3766326, 3409027, 3307763, 3155320, 3444370, 3621462, 3551541, 3036859, 3340042, 3637890, 3712958, 3861079, 3894341, 3505417, 3516028, 3707855, 3258947, 3001452, 3193292, 3002267, 3360077, 3311017, 3365489, 3366999, 3420223, 3317150, 3258071, 3403533, 3557071, 3466309, 3576116, 3605530, 3513979, 3437776, 3518619, 3646990, 3830585, 3533654, 3512605, 3485478, 3522129, 3814372, 3990016, 3586918, 3414519, 4045712, 4066178, 3541550, 3574542, 3959097, 4082258, 3889612, 3920713, 3720558, 3999319, 3994657]
11323C994657L2324J18208M5628J95728m06681k67363L74813K56495k61753J31036
11313D213092o0680M85780Q21360k96068l19960k87023j53871N64637l3621J10030
11303E043676j78646l4629J50641m1312N05775j62662o1010R479L35604J52608
11293E719524n5171O20338O9663j56375J84361k86240K41163J94303l39149J73042
11283F365459M19845K54627J7123n4126j07279P09409J71015M21814j34165k94716
11273G769006o9427J00742j87407L54613J91874l3904L08981Q13820j5305r5779
11263I137214K29471J72146M8236L83048Q1187j24038L97055J39497l9179K96371
11253A0721008L00023M95261M17227J96021l22982N39989L152J9011O33173N70577
$$ y = [3994657, 4026981, 4145189, 4190817, 4386545, 3979864, 3712501, 4087314, 4343809, 4082056, 4213092, 4152412, 4638192, 5459552, 5163484, 4843524, 4556501, 4402630, 4967267, 4933646, 5043676, 4865030, 4830401, 4981042, 4939730, 5445505, 5282843, 5221833, 5231312, 5566916, 5719524, 5664353, 6284691, 6354354, 6197979, 6382340, 6096100, 6337263, 6531566, 6192417, 6365459, 6785304, 7039931, 7057054, 7002928, 6895649, 7605058, 7776073, 8197887, 8063722, 7769006, 7699579, 7800321, 7612914, 7967527, 8159401, 8125497, 8434478, 9248298, 9232993, 9137214, 9366685, 9538831, 9587067, 9970115, 10051302, 9927264, 10324319, 10463816, 10424637, 10721008, 11021031, 11516292, 11933519, 12129540, 11806558, 12346547, 12349699, 12368710, 13001883, 13572460]
11243A3572460j40756p9069J34429K02963L36124R60559P8973M91304L49278O4816
11233A5971081M76895K90701P15101N49460R5223O8096P72368L49083P24692N70357
11223B0583057K45375J08443O40941R82048J98199N85588O44723R10568P21978
11214B5620920N69465R52731K33482R39131P25751N21661O35559R24325J083543
11205C2206568J082582N36701R27784J132767J325921P78084J201525J200765
11197D0392697J222348R46222J361830J441707J059497J765731J512277J101536
11189E0803845J565550J647768J565999J535788K052607J985582J883552J962430
11181F5003121J539305J430874J712638J643678J821519J648055R68487J303139
$$ y = [13572460, 13431704, 13352635, 13487064, 13690027, 14026151, 14986710, 15065683, 15556987, 15906265, 15971081, 16447976, 16738677, 17453778, 18003238, 18098461, 18166557, 18938925, 19288008, 20012700, 20583057, 20828432, 20936875, 21577816, 22559864, 22758063, 23343651, 23988374, 24898942, 25620920, 26190385, 27143116, 27376598, 28315729, 29041480, 29563141, 30198700, 31123025, 32206568, 33289150, 33825851, 34753635, 35886402, 37212323, 37990407, 39191932, 40392697, 41615045, 42561267, 43923097, 45364804, 46424301, 48190032, 49702309, 50803845, 52369395, 54017163, 55583162, 57118950, 59171557, 61157139, 63040691, 65003121, 66542426, 67973300, 69685938, 71329616, 73151135, 74799190, 75767677, 77070816]
11173G7070816J213495N56855N09637O52099L62682J44296K07093o37729q70303
11164G9208941r71664r77023j022013j643363j365029j492307j661522j728156
11156F8347864k105655j696347j830965k101866k211891k165420j951115j490064
11148E2794541j564262j400651j784894j881180j738894j752374j819678j319597
11140C9533011j395913j324787q12454j072928j089063j363565r34710j048118
11132C0491473j371250j245384p08301n77183r00702q41139o84655n92150n90157
11123B2980552l85706j001239p58024q49011n41878n64584o21004m16866j95256
11114A7646984m00010p84821m38039o40786J1598p0479m52268o15482m90239j92854
$$ y = [77070816, 78284311, 78841166, 79350803, 80002902, 80365584, 80509880, 80716973, 80079244, 79208941, 78237277, 77260254, 76238241, 74594878, 73229849, 71737542, 70076020, 68347864, 66242209, 64545862, 62714897, 60613031, 58401140, 56235720, 54284605, 52794541, 51230279, 49829628, 48044734, 46163554, 44424660, 42672286, 40852608, 39533011, 38137098, 36812311, 35999857, 34926929, 33837866, 32474301, 31539591, 30491473, 29120223, 27874839, 27166538, 26589355, 25688653, 24847514, 24162859, 23570709, 22980552, 22594846, 21593607, 20835583, 19986572, 19444694, 18880110, 18259106, 17842240, 17646984, 17246974, 16462153, 16024114, 15383328, 15394926, 15324447, 14872179, 14256697, 13766458, 13573604]
11104A3573604j34887l83050l77526j54383m70430n06838n30854J21847k23522
11095A0913961l87484k53228m77833j1164k95041J32658o83565o61847j40802
11086H135655J00332J65002k92202k13994j00036J52735j55690l28389K80665
11077G744078r9819m74466m65868L6913J08661q1428l87759j06286m40517l1192
11067E802317j95330J70067J50093j99874j95429j76376k8836N4620N2310L16703
11057E750265p4101l10930l91499m23124o1307J59597j27559K73155k57411k01164
11047D335922m94441l20722K08658n365k21793J16695L94664J67186j95034m36651
11037C549119m6433j69751N5881M92537J68044n4095J28885m43595n45868J26807
$$ y = [13573604, 13438717, 13055667, 12678141, 12523758, 12053328, 11546490, 11015636, 11137483, 10913961, 10526477, 10273249, 9795416, 9784252, 9489211, 9621869, 8938304, 8276457, 8135655, 8235987, 8400989, 8108787, 7894793, 7794757, 7947492, 7791802, 7463413, 7744078, 7644259, 7169793, 6703925, 6740838, 6849499, 6768071, 6380312, 6274026, 5833509, 5802317, 5606987, 5777054, 5927147, 5727273, 5531844, 5355468, 5326632, 5381252, 5433562, 5750265, 5676164, 5365234, 4973735, 4550611, 4489304, 4648901, 4521342, 4794497, 4537086, 4335922, 3841481, 3520759, 3729417, 3724052, 3502259, 3618954, 4013618, 4180804, 3985770, 3549119, 3502686, 3332935, 3388816, 3881353, 4049397, 3995302, 4124187, 3680592, 3134724, 3261531]
11027C261531M8581J17889j56065m13867J03910Q7509j88613j19446l40450k63348
11017B137631N57643r4608P1870K44296l94206k05415N19777K6270j71617p8050
11007B613591m54998j3208p6678k78833K76501O71155K45879m47257J89382K22396
10997B947930m08586l81144K19483P9130K7131k6708P4970n69322k55065Q5809
10987A793628M95379j90382L1661m11472r6895k41771J02791K34902P4192J42777
10977A934810n4714M8888m3202O2668j71207j88398j20279k8735K50744j79896
10967A510679J75629L8604Q8644m2748r0907j71713l6198j7174n1981K29400J29480
10956A761715J00058O2316l15902q8538J14047j96391J91099L352R1406j77858
$$ y = [3261531, 3310112, 3428001, 3271936, 2858069, 2961979, 3049488, 2860875, 2741429, 2400979, 2137631, 2695274, 2600666, 2672536, 2916832, 2522626, 2317211, 2836988, 2863258, 2691641, 2613591, 2158593, 2145385, 2068707, 1789874, 2066375, 2737530, 2983409, 2536152, 2725534, 2947930, 2539344, 2158200, 2377683, 2456813, 2483944, 2457236, 2532206, 1962884, 1707819, 1793628, 2289007, 2098625, 2130286, 1718814, 1621919, 1380148, 1482939, 1717841, 1792033, 1934810, 1880096, 1928984, 1885782, 1948450, 1777243, 1588845, 1468566, 1439831, 1690575, 1510679, 1686308, 1724912, 1813556, 1770808, 1679901, 1508188, 1471990, 1454816, 1402835, 1632235, 1761715, 1861773, 1924089, 1608187, 1519649, 1633696, 1437305, 1628404, 1631756, 1723162, 1545304]
10946A545304Q4612k02339M01591j96086R7161O7394K55830r3725m78735j07109
10936A373898J00990l95756k95079K01239n7125J43622J28648l76717J84668K45145
10926A253533L60705k41331N2844J81194k89309l2949L4743Q8171k92033r1608
10916A023960k17345K22221J33340L21107K62566m96090j76220K23731j44813
10907A152457n0178j04764j91323M07069J04287l65510j94105K29618l372j7928
10897I66251R1925j51593k93465R7823j22715o0165K28701L73218L7931j81325
10887I86586k72676l82311K34956K32060L37264k28270J15306k30042k81697L40608
10877H51784j43747l15449m5890J43098N68863k96654o60330L06984L04894j02964
$$ y = [1545304, 1629916, 1427577, 1829168, 1633082, 1730243, 1797637, 2053467, 1959742, 1481007, 1373898, 1474888, 1079132, 784053, 985292, 928167, 1071789, 1200437, 823720, 1008388, 1253533, 1614238, 1372907, 1425751, 1606945, 1317636, 1284687, 1319430, 1407601, 1115568, 1023960, 806615, 1028836, 1162176, 1483283, 1745849, 1249759, 1073539, 1297270, 1152457, 1102279, 997515, 806192, 1213261, 1317548, 952038, 757933, 987551, 984179, 966251, 1058176, 906583, 613118, 710941, 588226, 528061, 756762, 1129980, 1167911, 986586, 713910, 331599, 566555, 798615, 1135879, 907609, 1022915, 792873, 511176, 851784, 708037, 392588, 346698, 489796, 1058659, 762005, 101675, 408659, 713553, 610589]
10867F10589L99692K16865k72945k70186J11601K056k50163J7714r1420n5974
10857D17829R3975K94060J3041K83515N0883m90822j18922j1328r3533K71869
10847G10567M16409j91607l89234p238l1463M7370N52081K40172l88080m45777
10837E13200p6064k85196K84071K55696p7993j79136m93303M37544J73933j20208
10827D32544M6790l32799M66184k58681K605K22483P2073K24641l16258N18700
10817A078282m73825m66016K17583j5372J04270L13919j78249j22410O93386p3696
10807A077872o45420K23429K18120j10914p7391p0790J17726K13m87520L76706
10797F22031J25678k02070l84208K98614L1054j3311J563J26159l3972K51418
$$ y = [610589, 1010281, 1227146, 954201, 684015, 795616, 797672, 547509, 565223, 473803, 417829, 511804, 805864, 818905, 1102420, 1153303, 662481, 543559, 532231, 438698, 710567, 1126976, 935369, 546135, 538897, 507434, 554804, 1106885, 1347057, 958977, 513200, 437136, 151940, 436011, 691707, 613714, 434578, -58725, 378819, 552752, 432544, 479334, 146535, 612719, 354038, 356643, 579126, 651199, 875840, 559582, 1078282, 604457, 138441, 356024, 340652, 444922, 758841, 580592, 458182, 1151568, 1077872, 432452, 655881, 874001, 763087, 685696, 614906, 732632, 732845, 245325, 622031, 747709, 545639, 161431, 460045, 491099, 477788, 479351, 605510, 571538, 822956]
10787H22956k83037k98927K2925j10563o9349O596M59750M8761j15765k30357
10777B52990J63759l05703n1058K2705L89693j10569r9079J26307k01365M05103
10767E92783L05943j41694J34335k58644k39898M58858m45279k37936M04816j33999
10757D39285m48798L52016L48139R5118q3899m00701k17503K0704J04398k54497
10747d5738R5025J0488k33992K10922M38864o112M0917n0735l1346m0220k73313
10736A14760l20205L59932p9990N8394l430r700K0736L5092k64300M11466p2634
10725B50121k7817L37153o30695K61659N32650L0863m0876k88649l7816L87023
10715G73616N6540k97379j98318j44667L76731K49176o5599K45110k83329J06274
$$ y = [822956, 539919, 240992, 263917, 153354, 84005, 90601, 550351, 599112, 483347, 252990, 416749, 111046, 59988, 82693, 472386, 361817, 262738, 389045, 187680, 592783, 898726, 757032, 891367, 632723, 392825, 851683, 406404, 168468, 573284, 439285, -9513, 342503, 690642, 785760, 701861, 301160, 83657, 104361, 208759, -45738, 49287, 59775, -174217, 36705, 475569, 469457, 510374, 459639, 428293, 388073, 114760, -205445, 154487, 74497, 132891, 129461, 119761, 140497, 175589, -88711, 322755, 250121, 222304, 559457, -71238, 190421, 723071, 753934, 713058, 424409, 386593, 773616, 830156, 532777, 334459, 189792, 566523, 815699, 750100, 995210, 711881, 818155]
10705H18155q795m32011j9716M9690L6812k22954K7720m5565J02787l02140M01668
10694D05651R2070M135l8533K74624j24668l51603J85629M53411K5547J77472
10684A103735o93631o05745J23416M1058J69117o6388K46254j68075M14313l06900
10674B57154K86462j47193l36340k80976N62314L13554r635j79348K3389L24751
10664H14132l03771j0427k11853L43456R9582l57214L75548P0935j80741l23511
10654C16136o2981L4570J2935l62496K3430m806p0008M61978N22277p8344r4178
10643F98513k21871k33314j01306R4814N0826J14425L04718K76466l9003k74307
10633F69961p3385O7366r5595J64529o0733j9690l48690K5479J84423j77568j87462
$$ y = [818155, 809360, 377349, 357633, 407323, 444135, 221181, 248901, 203336, 306123, 3983, 405651, 497721, 501856, 463323, 737947, 613279, 261676, 447305, 900716, 926263, 1103735, 410104, -195641, -72225, -31167, 137950, 71562, 317816, 149741, 564054, 257154, 543616, 396423, 60083, -220893, 341421, 654975, 645340, 465992, 489381, 814132, 510361, 499934, 288081, 631537, 731119, 373905, 749453, 820388, 639647, 316136, 253155, 287725, 300660, -61836, -38406, -43212, -113220, 348758, 871035, 792691, 698513, 476642, 243328, 142022, 236836, 287662, 402087, 706805, 983271, 944268, 669961, 596576, 663942, 568347, 732876, 672143, 652453, 303763, 329242, 513665, 336097, 148635]
10622A48635M08876J5165K3426K12080R3367K35738j90610l90113l33484n4567
10612A68513J37905L50353K10127J7750j61089Q8048p43996J37735J59333j35907
10602B28772M53900j2950L0440L57993j00724N1536O9838l18711k33857k6428
10592D99809j73300j31744o3833J37293J19420J3788J26141K28553l18220M59501
10582H97408L646l83245J74735j20637K15573R9137o2414J03744J49230k67308
10572H09869k42397m32638K55657M68497K256L68265k74581m09741n8152L8427
10562E25462k2583M00934O9992m85914N6823j01553P338J84204j40010J92658
10552F87351J51210k69589M2913q7621K8906P1122K06894N2752r7549l3883o6731
$$ y = [148635, 557511, 572676, 596102, 808182, 901549, 1137287, 946677, 556564, 223080, 168513, 306418, 656771, 866898, 884648, 723559, 811607, 67611, 205346, 364679, 228772, 682672, 669722, 700162, 1058155, 957431, 1008967, 1078805, 760094, 526237, 499809, 326509, 194765, 130932, 268225, 387645, 401433, 527574, 756127, 437907, 897408, 901054, 517809, 692544, 571907, 787480, 886617, 824203, 927947, 1077177, 809869, 567472, 134834, 390491, 858988, 861244, 1229509, 954928, 545187, 487035, 525462, 502879, 903813, 973805, 487891, 544714, 443161, 450499, 634703, 494693, 687351, 838561, 568972, 611885, 524264, 553170, 624292, 831186, 883938, 786389, 752506, 685775]
10541F85775l00896K46515j91734J71891Q3476l38119M57733o2990j13972L06083
10531I43762J12684k38716l26723M0623J2988n6810N67662J67833k02215j44688
10521H76400L27542K42789J07670n41687l29416J97026J5661K62031K63222m13178
10511A008060j62513M44994O29604n41324k57520n7702M9323n02222N57642L53832
10501A522174j40963o2099L05730p70563L62751J4898J5834J02282j18638L40669
10491A572075K39027O24359P7028k24301n13233j17342R191L2861K04838L45418
10481B249921N6476Q5937j47229J05859j05384j62416L4239N80079l83939M4273
10471B357816q8116J25206k05374K5802R2820j9230o74219M32547J2392J33839
$$ y = [685775, 384879, 631394, 439660, 611551, 695027, 356908, 814641, 751651, 637679, 943762, 1056446, 817730, 491007, 531630, 544618, 487808, 1055470, 1223303, 1021088, 876400, 1203942, 1446731, 1554401, 1012714, 683298, 880324, 895985, 1158016, 1421238, 1008060, 845547, 1290541, 1920145, 1378821, 1121301, 1063599, 1112922, 610700, 1168342, 1522174, 1381211, 1319112, 1624842, 854279, 1217030, 1231928, 1247762, 1350044, 1231406, 1572075, 1811102, 2435461, 2512489, 2288188, 1774955, 1657613, 1666804, 1699665, 1904503, 2249921, 2306397, 2392334, 2245105, 2350964, 2245580, 2083164, 2117403, 2697482, 2313543, 2357816, 2269700, 2394906, 2189532, 2215334, 2308154, 2288924, 1614705, 2047252, 2059644, 2193483]
10461B193483k20146K59034k56112l96659L95807p1422J68003l02396K65580N48724
10451B583896k03466r2792l15097J32938M28136l76881R1156M9076L5381j967
10441B330380M67874J94078n22053k4601L45624L7481M9402m02426J4262Q67321
10431C357342k62432o2975P00203j24972j57663l5488M06466J03716O8286K13335
10421D205818j40542K13550K07081K72163m8581M22633J96150L25225L58740K16021
10411F228258O2855r862P52393L01148j24499L45997M60081K7883L44866M31284
10401H820404J69823r5222J36425p0433j48480K04841J1677n06703k5770K22429
10391H718991n35810l39885n64409k61980m6745l57011l5691l34832l53444j41359
$$ y = [2193483, 1973337, 2232371, 1976259, 1579600, 1975407, 1903985, 2071988, 1769592, 2035172, 2583896, 2380430, 2287638, 1972541, 2105479, 2533615, 2156734, 2247890, 2296966, 2332347, 2330380, 2798254, 2992332, 2470279, 2445678, 2791302, 2828783, 2878185, 2475759, 2490021, 3357342, 3094910, 3031935, 3732138, 3607166, 3449503, 3414015, 3820481, 3924197, 3992483, 4205818, 4065276, 4278826, 4485907, 4758070, 4709489, 5132122, 5328272, 5653497, 6012237, 6228258, 6291113, 6281251, 7033644, 7334792, 7210293, 7556290, 8016371, 8044254, 8389120, 8820404, 8990227, 8895005, 9031430, 8960997, 8812517, 9017358, 9029035, 8522332, 8496562, 8718991, 8183181, 7843296, 7278887, 7016907, 6970162, 6613151, 6577460, 6242628, 5889184, 5747825]
10381E747825n80388k80480j50753j71447k32693k69986j40517l0388k89713j34903
10371C466557k2213j71945O9441k37524l23690n0466K02876k4759m44300J50649
10361B614626R6541l06459M5618m84832K12919J68162j46294j86140K99883l80081
10351A933943l13007j49136J93113j81006K53862j60708J05699K34127k19647
10342A697240j18575j95937K28517m3189j53137J1981k44381J8470J76701j9387
10332A358303K77038k83436j36842J26664j15735k81202J58834J60129J85295
10323A449048k92621q1792k28870N4044J18890M9717J68982K4094N55691j16297
10313A700886k54028m43201K88128k88553k46001j31086p286n8462L56570q1461
$$ y = [5747825, 5167437, 4886957, 4736204, 4564757, 4332064, 4062078, 3921561, 3891173, 3601460, 3466557, 3444344, 3272399, 3341840, 3104316, 2780626, 2730160, 2933036, 2908277, 2463977, 2614626, 2711167, 2404708, 2450326, 1965494, 2178413, 2346575, 2200281, 2014141, 2314024, 1933943, 1620936, 1471800, 1664913, 1483907, 1737769, 1577061, 1682760, 1916887, 1697240, 1578665, 1382728, 1611245, 1568056, 1414919, 1426900, 1182519, 1200989, 1377690, 1358303, 1635341, 1351905, 1215063, 1341727, 1225992, 944790, 1103624, 1263753, 1449048, 1156427, 1074635, 845765, 899809, 1018699, 1068416, 1237398, 1261492, 1817183, 1700886, 1446858, 1003657, 1291785, 1003232, 757231, 626145, 618859, 560397, 916967, 835506]
10303H35506j33332J35723l8240L60386j07341K58353J34289j56072K4489j03992
10293A209769k28343m4856J66117N17747m46037j03596M4963Q0358j65142j31509
10283H99471l3300p8155n7233J26507O0350K63049K96418r7984m02191n3894M1393
10272I64431K42046k38574J03783M5590r1997j40045Q7019L53543k02848j31051
10262I91897j06456j33225o0011q1848P5984L84107q5339j25933l30864k5093
10252E03219N64930p6842k65942L21812J97852m42279o8503M71412j53992p7081
10242I74586J29532j2917j09419k40013r4570K85383K22437l03438j73881k30427
10232D47273K2397J17445j56522J78295j11128n2987K45058K89211j1315k84143
$$ y = [835506, 702174, 837897, 799657, 1160043, 1052702, 1311055, 1445344, 1289272, 1313761, 1209769, 981426, 936570, 1102687, 1620434, 1174397, 1070801, 1115764, 1196122, 1030980, 899471, 866171, 788016, 730783, 857290, 917640, 1180689, 1477107, 1379123, 976932, 923038, 964431, 1206477, 967903, 1071686, 1117276, 1025279, 885234, 972253, 1325796, 1122948, 991897, 885441, 752216, 692205, 610357, 686341, 1070448, 985109, 859176, 528312, 503219, 1068149, 991307, 725365, 1047177, 1245029, 802750, 734247, 1205659, 1051667, 974586, 1104118, 1091201, 981782, 741769, 647199, 932582, 1155019, 851581, 677700, 447273, 469670, 587115, 430593, 608888, 497760, 444773, 689831, 979042, 967727, 683584]
10222F83584n3305l42216N93842J62521l08940J45282M43819m39669m8028J51183
10212I88073k97810j54597K49284l98217L8999M23496J38258q0290m38935L07715
10202G75976J35606J40989j42087N5836l62268J18392J96872j33584k5128M93645
10192A254249J99460j97390k50271m43484N9742L25355j08142K67449L55833k79916
10182A182885j55107O920R1482j97714M21370J23538m46697K30721n4513J77944
10172A380829j32820K01484K06814k54248l73665K31866N46026L79526M80475
10163B666287m7029L50008l13873k06276L79281m03905n5050J60084k51403j54978
10153B123146O7646j82746m3287j17033p4360k0766k72287j98796l49176J27312
$$ y = [683584, 630279, 288063, 881905, 1044426, 735486, 880768, 1324587, 884918, 836890, 988073, 690263, 535666, 784950, 386733, 425732, 849228, 987486, 907196, 468261, 775976, 911582, 1052571, 910484, 966320, 604052, 722444, 919316, 785732, 760604, 1254249, 1453709, 1256319, 1006048, 562564, 622306, 947661, 839519, 1106968, 1462801, 1182885, 1027778, 1034698, 1126180, 928466, 1349836, 1473374, 1026677, 1257398, 1202885, 1380829, 1248009, 1449493, 1656307, 1402059, 1028394, 1260260, 1806286, 2185812, 2666287, 2619258, 2969266, 2655393, 2449117, 2828398, 2424493, 2369443, 2529527, 2278124, 2123146, 2190792, 2008046, 1964759, 1847726, 1773366, 1752600, 1480313, 1281517, 932341, 1059653]
10143A059653p08j06435N06986J90106o94234k56673K00370Q561K23955J96854
10133A328435K32315l61988r7289o40073j09149L71840O8353m98570j6930O31247
10123I08191J05288n065j06767j08860n4693L28666k24624J84120J39701j32759
10113A033198J50093j23805k41393m52433K57017m9343L1624M1163L46520M79179
10103A471820J32424j96698k04701l57755M9953L8164L8394J39960k73049k13322
10093F25190J07620L94609K04338m54512l05907q1969J75203L71172n4787M1472
10083A022429j38455L93597k9873M7095k81687l2782l4109L71661K9555j40661
10073A206770K03819j27685l85103k0370j1064j32249J25193j89670M8336k07556
$$ y = [1059653, 1058945, 952510, 1459496, 1649602, 955368, 698695, 899065, 907626, 1131581, 1328435, 1560750, 1198762, 1101473, 461400, 352251, 724091, 792444, 293874, 276944, 908191, 1013479, 1008414, 901647, 792787, 738094, 1066760, 842136, 1026256, 1165957, 1033198, 1183291, 1059486, 818093, 365660, 622677, 573334, 604958, 646121, 992641, 1471820, 1604244, 1407546, 1202845, 845090, 895043, 933207, 971601, 1111561, 838512, 625190, 732810, 1127419, 1331757, 877245, 571338, 489369, 664572, 1035744, 980957, 1022429, 883974, 1277571, 1247698, 1294793, 1013106, 980324, 946215, 1317876, 1347431, 1206770, 1410589, 1282904, 897801, 877431, 866367, 734118, 859311, 669641, 717977, 510421]
10063E10421J28917q6202l13070K73488L14543k26697j83213L20055K92207k87510
10053G42939n61935K69860J01435q4509K16459L42762l58137k09160M0134l0549
10043D69299l47948M14998K52737K81295j27367l71903M7956j43551L5443L23588
10033H34547L05166k58943m51488j81420L65379R6195n32281Q12703K39250m40830
10023G88278P0944K73328j64333l81198j34092L71092P0454m35411o7109N12852
10013I04805Q9924k49703Q2717M4959K52112M3025J25980k64283j84572q6909
10003G58055j14153J48627K46016l71301L91385P4711M0747j20457k42504L26211
9993A137337j95124L86416j56107k26374L22132j65694q4223j39402M04234k25969
$$ y = [510421, 639338, 553136, 240066, 513554, 828097, 601400, 418187, 738242, 1030449, 742939, 181004, 450864, 552299, 467790, 684249, 1027011, 668874, 459714, 499848, 469299, 121351, 536349, 789086, 1070381, 943014, 571111, 619067, 475516, 510959, 834547, 1139713, 880770, 429282, 247862, 613241, 709436, 177155, 989858, 1229108, 788278, 859222, 1132550, 968217, 587019, 452927, 824019, 894473, 459062, 391953, 904805, 994729, 745026, 827743, 872702, 1124814, 1167839, 1293819, 1029536, 844964, 758055, 643902, 792529, 1038545, 667244, 1058629, 1133340, 1174087, 1053630, 811126, 1137337, 942213, 1328629, 1172522, 946148, 1268280, 1102586, 1018363, 878961, 1283195, 1057226]
9983A057226j31747P0813M5674k15407J71379l9392P0236M5247j43028L14029
9973A245030L45702q9817j52044k58770k9615k48144k43150J16575k44720K34676
9963F75723k6116J7968L30296R1602l17844M8456Q468M16049N40963r9881j56060
9952A529624J31783n2344l87184J0163l08073K37439L90454j28938k1741k01935
9942A199248L33373K87135l07027j05205m9457K63438J1620l92702J8326N23572
9932A782321k33444J23310k82548n3691K53641j03916k96433J32750k26327j81159
9922I14504K87324j88936L70086J1058R03J01676L41800q6908K84727J63333l16548
9911A883019r138j82821M48527M99373n7801L8080k69312M86336l61088l04807
$$ y = [1057226, 925479, 996292, 1041966, 826559, 997938, 958546, 1028782, 1074029, 931001, 1245030, 1590732, 1500915, 1348871, 1090101, 1060486, 812342, 569192, 685767, 441047, 675723, 649607, 667575, 997871, 1089473, 771629, 820085, 828553, 1244602, 1785565, 1685684, 1529624, 1661407, 1609063, 1221879, 1232042, 923969, 1161408, 1551862, 1422924, 1401183, 1199248, 1532621, 1819756, 1512729, 1407524, 1358067, 1621505, 1633125, 1240423, 1258749, 1782321, 1548877, 1672187, 1389639, 1335948, 1589589, 1485673, 1189240, 1321990, 1095663, 914504, 1201828, 1012892, 1382978, 1394036, 1394939, 1496615, 1838415, 1751507, 2036234, 2199567, 1883019, 1873881, 1691060, 2139587, 2638960, 2581159, 2619239, 2349927, 2836263, 2475175, 2170368]
9901B170368J81011K53833o4598l56025k19385J94998L34969j31456J04412n2916
9891B415211j6279J68403k79347j53941N23618j0526k18080j18248K1512M68103
9881B800426K54084j68064J82693K48462J73036M5524J49161q4828j5184L81812
9871C967122L41221J07579n45781J12162L99049j0666J28694K70238L41667j5948
9861E095337j5226J68295O1624M89120N33688L23016O65511P38860P84944K59227
9851I104396O35821N23115j74779p63950n12727q03417j171715m08401n41424
9842E886919k51213n16378p53172m63949k7593L31734k63175o53507K61355m21686
9832C129335m32249j67356M0691L54814k94596j20909J00731J56677l26856l89229
$$ y = [2170368, 2351379, 2605212, 2540614, 2184589, 1965204, 2160202, 2495171, 2363715, 2468127, 2415211, 2398932, 2567335, 2287988, 2134047, 2657665, 2647139, 2429059, 2310811, 2332323, 2800426, 3054510, 2886446, 3069139, 3317601, 3490637, 3536161, 3685322, 3600494, 3585310, 3967122, 4308343, 4415922, 3870141, 3982303, 4381352, 4370686, 4499380, 4769618, 5111285, 5095337, 5080111, 5248406, 5310030, 5799150, 6332838, 6655854, 7321365, 8060225, 8845169, 9104396, 9740217, 10263332, 10088553, 9324603, 8811876, 8008459, 6836744, 6428343, 5886919, 5635706, 5119328, 4366156, 3902207, 3874614, 4206348, 3943173, 3289666, 3551021, 3129335, 2697086, 2529730, 2570421, 2925235, 2630639, 2509730, 2610461, 2767138, 2440282, 2051053]
9822B051053M36416J61084j60945o6246m58624L64544K58397J4098J54135m72133
9812B281779J91835P4374J90547k49870l99612j93339M40712L63378L5412j29942
9802B605274J3622k04033N2616K13078K17442l50421q5117J29708k81873m5474
9792B264822j9404K96708j29466j96210k13465L58528K69625j00511k07780Q875
9782B331722J75411K39755k32156q2139M5978q1904l92460j48384N27291L28821
9772B711935o213J17828k85506J4828J09893k1292n6325J54757r4459l122L03824
9761B946148K73470J60388J975M9081j13022o1591K28896L70589k51419r7170
9751C507345j87822L9442L4072o7622k19825p2545J49283J12416j41955j1478
$$ y = [2051053, 2487469, 2648553, 2487608, 2421362, 1962738, 2327282, 2585679, 2599777, 2753912, 2281779, 2473614, 2547988, 2738535, 2488665, 2089053, 1895714, 2336426, 2699804, 2735216, 2605274, 2618896, 2414863, 2467479, 2680557, 2897999, 2547578, 2462461, 2592169, 2310296, 2264822, 2245418, 2542126, 2412660, 2216450, 2002985, 2361513, 2631138, 2530627, 2322847, 2331722, 2507133, 2746888, 2514732, 2432593, 2478571, 2396667, 2004207, 1855823, 2383114, 2711935, 2705722, 2823550, 2538044, 2552872, 2662765, 2641473, 2585148, 2739905, 2645446, 2642324, 2946148, 3219618, 3380006, 3381981, 3431062, 3318040, 3256449, 3485345, 3855934, 3604515, 3507345, 3319523, 3358965, 3393037, 3325415, 3105590, 3033045, 3182328, 3294744, 3152789, 3141311]
9741C141311L04551j65129O60913j40945l93121j14903J47850K51780L30067j62941
9731C859433J40164j09943k30657R4981l5103M37645O7545n8090O1178J6737k56757
9720C987133k19337k85809J88393O79936J91782l36003K323j23116M9150K18086
9710D352538k68778K64655M36569N65800j49777l34302K96412K98263l56259j46571
9700D958550j3219O7698K85580j31786O42403M29602K41773l61138m2084J36812
9690F214191m1598J51486L37837O4902j4977R513p4892l33R4601L86674j4442
9679G112962J26834m5637L98020m23477N00945J70054L1119q2915j83565K51031
9669G855371L34493M52331K90731j40791M52074o9670J62185N22778K07370M64233
$$ y = [3141311, 3445862, 3280733, 3941646, 3800701, 3407580, 3292677, 3440527, 3692307, 4022374, 3859433, 3999597, 3889654, 3658997, 3753978, 3718875, 4156520, 4224065, 4165975, 4227153, 4243890, 3987133, 3767796, 3481987, 3670380, 4350316, 4542098, 4206095, 4208418, 4085302, 4134452, 4352538, 4083760, 4348415, 4784984, 5350784, 5201007, 4866705, 5163117, 5461380, 5105121, 4958550, 4945331, 5013029, 5298609, 5166823, 5809226, 6238828, 6480601, 6119463, 6077379, 6214191, 6172593, 6324079, 6661916, 6726818, 6711841, 6721354, 6646462, 6646129, 6740730, 7127404, 7112962, 7239796, 7194159, 7592179, 7168702, 7669647, 7839701, 7870820, 7787905, 7604340, 7855371, 8189864, 8642195, 8932926, 8792135, 9244209, 9174539, 9336724, 9859502, 10066872, 10531105]
9659A0531105k67796M41877K0427O66934L69559J48923N82302K76751j23690Q06819
9649A3453211M7415K13032N70312M13289J20808K84024K34119Q3485O69351P30880
9639A6819926P40725P56432N29609N94258J130123J493219J034779J581043J779362
9630B6459476J732226J849575K936682K411676K448175K438388J700794M45650
9622D2422642R3426k68535J66073l7961M42553J015484K10156k429j019459j989864
9612D1032086k227928k190748j988628j786879j128421l83637k74980o1457n235
9603C0984173K64111J27808J41688J66306Q67167M44040M85768J079528M42070
9594C5002659N84225J098264J128987R45447J005512J127917J225515K173523
$$ y = [10531105, 10263309, 10705186, 10725613, 11392547, 11762106, 11911029, 12493331, 12770082, 12646392, 13453211, 13500626, 13713658, 14283970, 14697259, 14818067, 15102091, 15336210, 15419695, 16089046, 16819926, 17560651, 18317083, 18846692, 19440950, 20571073, 22064292, 23099071, 24680114, 26459476, 28191702, 30041277, 32977959, 35389635, 37837810, 40276198, 41976992, 42422642, 42516068, 42247533, 42413606, 42375645, 42818198, 43833682, 44043838, 44041409, 43021950, 41032086, 38804158, 36613410, 34624782, 32837903, 31709482, 31325845, 31050865, 30989408, 30984173, 31248284, 31376092, 31517780, 31684086, 32551253, 32995293, 33481061, 34560589, 35002659, 35586884, 36685148, 37814135, 38759582, 39765094, 40893011, 42118526, 44292049]
9586D4292049J395079K057432K304575K189340K281275L018260L619582M094431
9578F5252023M272225L981046L869243K975381K547494J686890J303041J066506
9570H6953849J546347K521948K252168K595826K563752J943742Q45536R87698
9562A02210866J426404L177864M062891N845197P926593R899651J2808018J5220103
9554A62577587J7418413J7770159J7361206J6318382J3361824R511988N167733
9547B59487292M01287m160775q727505j2653257j5482356j6922450j7393036j7557435
9539A66991765j5602356j2645382j0173967p971808n416286l332858k830010j742773
9531A07276325o2594J68994J313214J759977K529038L479393M894958N529391
$$ y = [44292049, 45687128, 47744560, 50049135, 52238475, 54519750, 57538010, 61157592, 65252023, 69524248, 73505294, 77374537, 80349918, 82897412, 84584302, 85887343, 86953849, 88500196, 91022144, 93274312, 95870138, 98433890, 100377632, 101223168, 102210866, 103637270, 106815134, 110878025, 116723222, 124649815, 134549466, 147357484, 162577587, 179996000, 197766159, 215127365, 231445747, 244807571, 254319559, 259487292, 259888579, 255727804, 247000299, 234347042, 218864686, 201942236, 184549200, 166991765, 151389409, 138744027, 128570060, 120598252, 115181966, 111849108, 109019098, 107276325, 107213731, 107382725, 108695939, 110455916, 112984954, 116464347, 121359305, 126888696]
9523A26888696P551617R929414J2399892J4884764J7534909J8573876J8037500
9516B25800668J6777330J4332698J0292239M534204L09540m620056r062631j2868587
9508B45495405j6370916j8934819j9743147j9400067j7408662j4708926j0763212
9501A28165656o936508n233456l013002q23467K65152m4790j591294k307489l082065
9492A05398737l778557l640712l401023l425501l601893m707588o017663o101800
9484G0724000n468115n090387l512951l127202k925985k495121j498329k262014
9476D4343896k207859j576269j241394q91940o90706p42330m09295l49346J08054
9467C6342811N59447M03879M19407M74652J56636O08137P22935O4881q65072o31640
$$ y = [126888696, 134440313, 144369727, 156769619, 171654383, 189189292, 207763168, 225800668, 242577998, 256910696, 267202935, 271737139, 272046679, 267426623, 258363992, 245495405, 229124489, 210189670, 190446523, 171046456, 153637794, 138928868, 128165656, 121229148, 115995692, 112982690, 112159223, 112424375, 112379585, 110788291, 108480802, 105398737, 101620180, 97979468, 94578445, 91152944, 87551051, 82843463, 76825800, 70724000, 65255885, 60165498, 56652547, 53525345, 50599360, 48104239, 46605910, 44343896, 42136037, 40559768, 39318374, 38426434, 37735728, 36993398, 36584103, 36234757, 36342811, 36902258, 37306137, 37725544, 38200196, 38356832, 38964969, 39687904, 39752785, 38887713, 38256073]
9457C8256073q77505o75106j313044j513240j356331j208139j818526j741299
9449B7752883j345150j895574j528212j485903j710763j300617o92799k30841
9441A7563024r67137n98989n48913o20057k57934q96639n49354L46316l31336
9432A3138981l68669l96205j020978K5927n18357k30330J52805N970k18454j61362
9422A0409328m72577M5354n11819o44297P608L69320p25572l56338J59154j56615
9412H123546K90669l37416p17084j57061r5909j57456l68373K39857M12369L08630
9402G541772j01567k15833o897M078j93777o45193m64922N36805O34297k4551
9392G064212n08552J10275k01038j10349k00630l088q9750j61899L43251k34680
$$ y = [38256073, 37378568, 36703462, 35390418, 33877178, 32520847, 31312708, 29494182, 27752883, 26407733, 24512159, 22983947, 21498044, 19787281, 18486664, 17793865, 17563024, 16595887, 15996898, 15447985, 14827928, 14569994, 13673355, 13124001, 13470317, 13138981, 12770312, 12374107, 11353129, 11379056, 10860699, 10630369, 10783174, 10789144, 10570690, 10409328, 9936751, 9982105, 9470286, 8825989, 8833597, 9202917, 8477345, 8121007, 8280161, 8123546, 8414215, 8076799, 7359715, 7202654, 7106745, 6949289, 6580916, 6820773, 7233142, 7541772, 7440205, 7224372, 7217475, 7221553, 7027776, 6382583, 5917661, 6454466, 7088763, 7064212, 6555660, 6665935, 6464897, 6354548, 6153918, 6150830, 6061080, 5899181, 6242432, 6007752]
9382F007752j10203k3927m30445k15126L00930J5198m9631m24073J08269M06378
9372E585122j31675L30256l67551L13222M35266l14876J06190M48900j42869m9255
9362F212730L01610M2715p5292M92842k47787p6977K9532L76877j05715n80155
9352F370380j49889k38827K14253k61807P2673k57965P9852J45103l42289l40594
9342E290890L5352N01482K53876j92007K04930j28618K6375K44132j12348q3999
9332F040065M54792j73075K28611L28184K33954Q5661k1464L29752M33304q3916
9322G855868K03217M64311J4446M86173k60577K07774P41303M70503j86257q51705
9312I145056m39727m52545J3040p96582l18260J5373o2044J28735R0842K20803
$$ y = [6007752, 5897549, 5873622, 5443177, 5228051, 5528981, 5544179, 5494548, 5070475, 5178744, 5585122, 5453447, 5783703, 5416152, 5729374, 6164640, 5849764, 5955954, 6404854, 6261985, 6212730, 6514340, 6557055, 6481763, 6974605, 6726818, 6649841, 6679373, 7056250, 6950535, 6370380, 6220491, 5981664, 6195917, 5934110, 6006783, 5748818, 5828670, 5973773, 5631484, 5290890, 5326242, 5827724, 6081600, 5889593, 6094523, 5965905, 5992280, 6236412, 6124064, 6040065, 6494857, 6321782, 6550393, 6878577, 7112531, 7198192, 7176728, 7506480, 7939784, 7855868, 8059085, 8523396, 8537842, 9024015, 8763438, 8971212, 9712515, 10183018, 9996761, 9145056, 8705329, 8252784, 8265824, 7469242, 7150982, 7166355, 7104311, 7233046, 7323888, 7544691]
9302G544691M8064k41533N426m04392K91369L70961l5068N01730L30161j30322
9292H281087j34166L10386o6128L64816L38643q771j76779R092M62204L08872
9282I689256l98901k69129k05790J83095J04379j6334j03331N3350j50775l74394
9272H511426k591k61543J02406K90706k71615j23302L05628J07034M75128L60136
9262I493413J18004J79340J04136R8312O56842o62859L04291K00275j03099K25792
9252A0614447j10142L65973K99023Q042M50450M03222J16281J01261k0368J87534
9242A2415723L50172M98532L21649P99126M71262O23018R31548J430816P12540
9233A8554386J176882J372671K084432K879857L275827L987692M349334L141948
$$ y = [7544691, 7592755, 7351222, 7356648, 6952256, 7243625, 7614586, 7579518, 8081248, 8411409, 8281087, 8146921, 8457307, 8391179, 8755995, 9094638, 9085867, 8909088, 8918180, 9380384, 9689256, 9290355, 9021226, 8815436, 8998531, 9102910, 9086576, 8983245, 9036595, 8885820, 8511426, 8508835, 8247292, 8349698, 8640404, 8368789, 8245487, 8551115, 8658149, 9133277, 9493413, 9611417, 9790757, 9894893, 9993205, 10650047, 9987188, 10291479, 10491754, 10388655, 10614447, 10504305, 10870278, 11169301, 11177343, 11627793, 12031015, 12147296, 12248557, 12228189, 12415723, 12765895, 13264427, 13586076, 14385202, 14856464, 15479482, 16411030, 17841846, 18554386, 19731268, 21103939, 23188371, 26068228, 29344055, 33331747, 37681081, 40823029]
9225D0823029L48186k024279k283308j357864j99762J375248J602053J12030k706543
9216C5688790m568427m401078l708112k804438j967167j193924j553974m75123
9208A5016547l41107j126149m01602k04405j082681o28089n5992K24062o20687
9199A0779897m54583m6956k58954J51775J03270J07950L7595j10635p1592N3420
9189A0291187m5164O04426M71679K23026l3467l49279q26095L75004M97660j74496
9179A1034481O6562o40831k74521k43511q3725k66742l56294L96105k80604l42652
9169I008268j48270L13805o29918J03981K83818l27231Q283J36070O2946K46121
9159I057873q3056k45342M62121K7235l6578L48924J06036J90674K16036k9756
$$ y = [40823029, 41171215, 39146936, 36863628, 35505764, 35306002, 36681250, 38283303, 38395333, 35688790, 31120363, 26719285, 23011173, 20206735, 18239568, 17045644, 15491670, 15016547, 14675440, 13549291, 13147689, 12943284, 11860603, 11232514, 11176522, 11400584, 10779897, 10325314, 10278358, 10019404, 10171179, 10274449, 10382399, 10419994, 10309359, 10237767, 10291187, 10246023, 10850449, 11322128, 11545154, 11511687, 11162408, 10336313, 10711317, 11208977, 11034481, 11101043, 10460212, 10185691, 9942180, 9858455, 9591713, 9235419, 9631524, 9350920, 9008268, 8859998, 9173803, 8543885, 8647866, 8931684, 8604453, 8612736, 8748806, 8811752, 9057873, 8974817, 8729475, 9191596, 9218831, 9182253, 9531177, 9637213, 9827887, 10043923, 10014167]
9149A0014167L43293o5287j83704L32447J25902j98751K55412K65776k07480j05235
9139A0576540R1288l2080m1010o0909k03450n8911M36155L40306k53478l81336
9129A0413115j23621l62101J81798M02588L35428j84391m0586N38023J82966k21170
9119A1122049o1873J70559L54534L97577J68104J62382L13585N47574J45841J54252
9109A3474584M88538L13847L4047L02809M14885J32610l62113j62232K92935L29950
9099A5259860l56131j18010M04633l53370N37430N97327r0846L97178K26022O2967
9089A6567060J30164L72158l2488K85806L92660J89738N68622N39625N87808K87968
9079A9889121n1424N77289J3293N43087K03353P27283Q92504M01497K57433k98926
$$ y = [10014167, 10357460, 10292173, 10108469, 10440916, 10566818, 10368067, 10623479, 10889255, 10681775, 10576540, 10667828, 10635748, 10594738, 10533829, 10330379, 10271468, 10707623, 11047929, 10794451, 10413115, 10289494, 9927393, 10109191, 10511779, 10847207, 10662816, 10622230, 11160253, 11343219, 11122049, 11060176, 11230735, 11585269, 11982846, 12150950, 12313332, 12626917, 13174491, 13320332, 13474584, 13963122, 14276969, 14311016, 14613825, 15028710, 15161320, 14799207, 14636975, 14929910, 15259860, 14903729, 14785719, 15190352, 14836982, 15374412, 15971739, 15880893, 16278071, 16504093, 16567060, 16697224, 17069382, 17036894, 17322700, 17715360, 17905098, 18473720, 19013345, 19601153, 19889121, 19837697, 20414986, 20428279, 20971366, 21174719, 21902002, 22794506, 23196003, 23453436, 23154510]
9069B3154510j6883Q70693O22732J81050R9528N40249P16285P26874P37967N58530
9059B8191535L93839J147222P45335l28358R27336R79906P05805J019858R16309
9050C4698787Q26351J373214M46601O92913J277006P12282O21152J413631J116089
9041D3178026J428253J605003P14195J178234J418366J215475K051079J822774
9033E4611405J944802K070325K420306K474201K992804L061025L107216K355752
9025G5037836J968535J523933K196252J947680K222067L213890L544396L680774
9017I5335363L563787L335612L763239N046609N973421P863328Q994427R585017
9009A43460803Q801560P476046N475515M920568M817099N044987N400812M947377
$$ y = [23154510, 23137627, 24008320, 24631052, 24812102, 24911630, 25451879, 26168164, 26895038, 27633005, 28191535, 28585374, 29732596, 30477931, 30149573, 31076909, 32056815, 32762620, 33782478, 34698787, 35525138, 36898352, 37344953, 38037866, 39314872, 40027154, 40648306, 42061937, 43178026, 44606279, 46211282, 46925477, 48103711, 49522077, 50737552, 52788631, 54611405, 56556207, 58626532, 61046838, 63521039, 66513843, 69574868, 72682084, 75037836, 77006371, 78530304, 80726556, 82674236, 84896303, 88110193, 91654589, 95335363, 98899150, 102234762, 105998001, 111044610, 117018031, 124881359, 133875786, 143460803, 152262363, 159738409, 165213924, 170134492, 174951591, 179996578, 185397390, 190344767]
9001A90344767M077212J322604j068837k771330m864669o470854o227188n429268
8993A68912437l303170j787204J36087J326459L158649L676162L574347L408352
8985A79102119L387565N027815P168213Q805638J0067634J2485367J3415461J4966699
8977B54426511J7213429K1041362K5894967L1904590L4398914L2438476K6046741
8970D43364990J9399291J4812759J0324131N374508K317954K86998l235534o661870
8962D85983227q189092j1382850j5730248j6950091j4263885j3143976j5623205
8955C90699880j8165577j5967959j2584555j1642502j4985000k1530534k4253872
8948B71569881k2499740j8484038j4672538j1047547p731263n785389m436476
$$ y = [190344767, 194421979, 195744583, 194675746, 191904416, 187039747, 180568893, 174341705, 168912437, 165609267, 163822063, 163958150, 165284609, 168443258, 172119420, 175693767, 179102119, 182489684, 187517499, 194685712, 203491350, 213558984, 226044351, 239459812, 254426511, 271639940, 292681302, 318576269, 350480859, 384879773, 417318249, 443364990, 462764281, 477577040, 487901171, 493275679, 495593633, 495880631, 492645097, 485983227, 477794135, 466411285, 450681037, 433730946, 419467061, 406323085, 390699880, 372534303, 356566344, 343981789, 332339287, 317354287, 295823753, 271569881, 249070141, 230586103, 215913565, 204866018, 197134755, 191349366, 186912890]
8941A86912890l944018k554694p07081M30736M24142J676511L374666N662383
8933A91275535Q603863J1498917J4887805J9377519K3917176K5907515K3151438
8926C18619768J3365075m93482r892237j0861757r078804j2027697k0171857k5399613
8918B44059396k4676675k1493198j6896065j3449658j1499509j0947021r516787
8911A35580483p916553o813370n164028m224064l101075k586060k201145k408901
8903A01165287j372481q43448k60053K27579N03402Q49267K405857L883730N147948
8894A11707088O660894R232764J0818981J1402359R940376N315311O80742r0237
8886A65668278o52369k533051o490500j2041940j4637068j4849255j2589844j0342632
$$ y = [186912890, 182968872, 180414178, 179707097, 180137833, 180561975, 182238486, 185613152, 191275535, 199879398, 211378315, 226266120, 245643639, 269560815, 295468330, 318619768, 331984843, 331491361, 321599124, 310737367, 301658563, 289630866, 269459009, 244059396, 219382721, 197889523, 180993458, 167543800, 156044291, 145097270, 135580483, 127663930, 120850560, 115686532, 111462468, 108361393, 105775333, 103574188, 101165287, 99792806, 98949358, 98689305, 98916884, 99420286, 100269553, 102675410, 106559140, 111707088, 118367982, 127600746, 138419727, 149822086, 159762462, 165077773, 165758515, 165668278, 165015909, 162482858, 155992358, 143950418, 129313350, 114464095, 101874251, 91531619]
8878I1531619q506211o357574n216255l862546l067832k817507k631281k566860
8870E6505553k085242j345184j671385j496834j282891j205853j116297o07691
8862D5694176o96588p54499P368l14894J00710M99604L56149Q55815J186602J696712
8852D8631155J825154K603364K042013J260096J364365J62483o80240j083002
8844E6125388j561431k945795k870992k967133k885193j770919j244947j606409
8836C8272569j247879o61639l14798l70592n53203J63710M3623L26249j52765
8827C5505275J64125P26438K44727o0338n58334K39904J72717M5437j5500L31146
8817C6795597L35782O52515M81392N41981P61291P96934O03560J82406L26509
$$ y = [91531619, 83025408, 76667834, 71451579, 67589033, 64521201, 61703694, 59072413, 56505553, 54420311, 53075127, 51403742, 49906908, 48624017, 47418164, 46301867, 45694176, 44997588, 44243089, 44250457, 43935563, 44036273, 44535877, 44892026, 45747841, 46934443, 48631155, 50456309, 53059673, 55101686, 56361782, 57726147, 57888630, 57208390, 56125388, 54563957, 51618162, 48747170, 45780037, 42894844, 41123925, 39878978, 38272569, 37024690, 36363051, 36048253, 35677661, 35124458, 35288168, 35331791, 35658040, 35505275, 35669400, 36395838, 36640565, 36580227, 36021893, 36261797, 36434514, 36479951, 36464451, 36795597, 37131379, 37783894, 38265286, 38807267, 39568558, 40365492, 40969052, 41151458, 41477967]
8808D1477967N62975J142114P69888J040131J222959R92568J264367J494301J519656
8799E1486926J760078J412450J792160K370941K649179K553795L340102L705141
8791G1070772L765969M417728N558948O392297P541059J0090323J0971701J2592284
8783A32401081J4321197J4793362J1731769M280187j974605m258979k457615J426759
8775A70263156M043479L071322l500012j1623349j5303369j4075019j1305766
8768A21570442p902215n651025l785294k196699j242450J28270Q64534J768977
8760A03554540K712260L537055N200236O256975O906830Q653088J1273129J3382698
8752A61476811J5172697J5021589J2018272R054485Q176475R934409J0323831
$$ y = [41477967, 42040942, 43183056, 43952944, 44993075, 46216034, 47208602, 48472969, 49967270, 51486926, 53247004, 54659454, 56451614, 58822555, 61471734, 64025529, 67365631, 71070772, 74836741, 79254469, 84813417, 91205714, 98746773, 108837096, 119808797, 132401081, 146722278, 161515640, 173247409, 177527596, 175552991, 171294012, 168836397, 170263156, 174306635, 177377957, 173877945, 162254596, 146951227, 132876208, 121570442, 113668227, 108017202, 104231908, 102035209, 100792759, 100921029, 101785563, 103554540, 106266800, 109803855, 115004091, 121261066, 128167896, 136820984, 148094113, 161476811, 176649508, 191671097, 203689369, 212743854, 220920329, 230854738, 241178569]
8745B41178569O057101q37058q611548j2661549j1460686q597884p488746j0756667
8737A86821532j6681732j8833040j7383580j4175174j0681804q436520o466609
8730I4163073m317942l246253k572577j642335q92381o98587K71249J131773K392327
8721H4588347L205778L731898M910332O304791P347765P211813M185834k88928
8713A21197630l330565l336526k166936q26581o79296m014014q335336j1699148
8705H6809228j1174701r826583p422103n868735m489180l762515l000426k498778
8697C8766207k677780j848350k113156j582712j259656j291187j096177j129500
8689B5767689j330493j155991r15512r93473p80790n35435l73460n18056k90106
$$ y = [241178569, 247235670, 246398612, 237787064, 225125515, 213664829, 205066945, 197578199, 186821532, 170139800, 151306760, 133923180, 119748006, 109066202, 100629682, 94163073, 89845131, 86598878, 84026301, 82383966, 81491585, 80792998, 81064247, 82196020, 84588347, 87794125, 91526023, 96436355, 102741146, 110088911, 117300724, 121486558, 121197630, 117867065, 114530539, 112363603, 111537022, 110857726, 106843712, 98508376, 86809228, 75634527, 65807944, 58385841, 52517106, 48027926, 44265411, 41264985, 38766207, 36088427, 34240077, 32126921, 30544209, 29284553, 27993366, 26897189, 25767689, 24437196, 23281205, 22365693, 21372220, 20591430, 20055995, 19682535, 19164479, 18874373]
8680A8874373j105487r09701p21503n32636n16868m61873k64516n59803k59077
8671A3542909J84066n70143k75368j76342k04701l83137k88124m32828l99874
8662A0996458r0650k74951m99062l36401k74283J36170k20312N8018k75482n01516
8652H717989K4242n59512k69202j06542m18400k2881O95588M9032m74442m61811
8642G174061J52013m8144j70265k82411j76681K38920q5902N92783N6784l58411
8632G092747P6921N0540j35769o20716k36310n4067k22033n1795k12544k33523
8622E453451j9127J2722L17061n66696n6717j26535K1166J47389n41811l71612
8612D269291M20846R3781L9397j65724l02775O30491O6693m65442p5421L8608
$$ y = [18874373, 17768886, 16859185, 16137682, 15605046, 15088178, 14626305, 14361789, 13801986, 13542909, 13726975, 13156832, 12881464, 12705122, 12500421, 12117284, 11829160, 11396332, 10996458, 10905808, 10630857, 10131795, 9795394, 9521111, 9657281, 9436969, 9494987, 9219505, 8717989, 8742231, 8182719, 7913517, 7806975, 7388575, 7365694, 8061282, 8110314, 7635872, 7174061, 7326074, 7277930, 7107665, 6825254, 6648573, 6887493, 6801591, 7394374, 7451158, 7092747, 7169668, 7220208, 7084439, 6463723, 6227413, 6173346, 5951313, 5899518, 5686974, 5453451, 5434324, 5447046, 5764107, 5197411, 5140694, 5014159, 5035325, 5182714, 4640903, 4269291, 4690137, 4783918, 4823315, 4657591, 4354816, 4985307, 5052000, 4586558, 4511137, 4549745]
8602D549745m1452K82627K8748M78436L89505j83109M0111J09732l34433n22568
8592D797342j00031k83367m24285J44968j64536q1417j14021J52792r2100l61888
8582C473457J14374j57914J27036l77461L53144j86794k77967M89780Q4999n59482
8572C083172K4642M60944J95147q3681l32451j93966K21545O4934j95204J07211
8562C352293K66600k43263k34153M2136r9499k22681o80809L59814k27191L0121
8552B343368K53986k47286Q057q1768J64009k06967R3540n2034k60161j36700
8542A878044q8290l39559P25877L15543l47056j81665K62327J07059J74767l50141
8532B156906l21785k8622j0232K56677P4908L89239N5096j54209O5541j72839
$$ y = [4549745, 4508293, 4790920, 4819668, 5298104, 5687609, 5504500, 5544611, 5654343, 5319910, 4797342, 4697311, 4413944, 3989659, 4134627, 3970091, 3888674, 3774653, 3927445, 3835345, 3473457, 3587831, 3429917, 3556953, 3179492, 3532636, 3345842, 3067875, 3557655, 3642654, 3083172, 3107814, 3568758, 3763905, 3680224, 3347773, 3153807, 3375352, 3440286, 3245082, 3352293, 3618893, 3375630, 3141477, 3183613, 3084114, 2861433, 2180624, 2540438, 2313247, 2343368, 2597354, 2350068, 2358125, 2276357, 2440366, 2233399, 2326939, 2274905, 2014744, 1878044, 1789754, 1450195, 2176072, 2491615, 2144559, 1962894, 2225221, 2332280, 2507047, 2156906, 1835121, 1806499, 1796267, 2052944, 2127852, 2517091, 2572187, 2417978, 2483519, 2310680]
8522B310680l79379j80372J27238K7693l09064j14089J49995p6913l6316K03349
8512A722822K00493m61471o36547O8520M34497K19820j58800j99330m54091M28169
8502A164082K16718J49542j13859k1798l56298k10050L60596J35093j29736K79
8492A194569K02017K28172m4915K50951n20852k10946M35100m9551l952k7931
8482A452662Q3346n7543N4760l1871j44093J27473j7620o0107k91442j51266j11093
8471H53206K3032k77540j91349L35943M97727l86166l66891n26669J45986L23477
8461D30756Q7055L70906M59687q0066k10492J86375j45088J7745J12728K16563
8451A446169k87477j6043J63570k62459j20403K60326K14027O8435Q9600j93954
$$ y = [2310680, 1931301, 1750929, 1878167, 1905860, 1596796, 1482707, 1632702, 1555789, 1519473, 1722822, 1923315, 1461844, 825297, 893817, 1328314, 1548134, 1389334, 1190004, 735913, 1164082, 1380800, 1530342, 1416483, 1394685, 1038387, 828337, 1188933, 1324026, 1194290, 1194569, 1396586, 1624758, 1579843, 1830794, 1309942, 1098996, 1534096, 1484545, 1480593, 1452662, 1536008, 1478465, 1533225, 1501354, 1357261, 1484734, 1467114, 1407007, 1115565, 964299, 853206, 876238, 598698, 407349, 743292, 1241019, 854853, 487962, -38707, 107279, 430756, 517811, 888717, 1348404, 1268338, 1057846, 1244221, 1099133, 1116878, 1229606, 1446169, 1158692, 1142649, 1306219, 1043760, 923357, 1183683, 1397710, 1466145, 1555745, 1361791]
8441A361791j80303m23156l0574M6195j74518K94446M2472J7192k63400j42444
8431E47701l6238L51537j07029k62823N19521k63502J51505L02351n9311M32832
8421A576544J98246L7973q1784l30700l5192k80002K9446J93414l79699L07238
8411A235484K52814K82051j20934k72711l88721l2522k6999j06775L88773m00902
8401H09558q2488L53725m70366M68987L2078M47360J2405P0443J44493p2955j21610
8390A591630j55663q7862J92560Q03341o24646m92424K40693l0962L09359M9328
8380A795354r9671l79536j88714J29319p9763r8847J61393J28672l13373j85644
8370H69190M5511m80745L3056L6590J38535K7430l83640o3451J45549K83800l7226
$$ y = [1361791, 1181488, 758332, 727758, 773953, 599435, 893881, 936353, 953545, 690145, 547701, 511463, 863000, 755971, 493148, 1012669, 749167, 900672, 1203023, 1143712, 1576544, 1774790, 1812763, 1730979, 1400279, 1365087, 1085085, 1114531, 1307945, 928246, 1235484, 1488298, 1770349, 1649415, 1376704, 987983, 955461, 928462, 821687, 1210460, 809558, 727070, 1080795, 610429, 1079416, 1111494, 1558854, 1571259, 1641702, 1786195, 1713240, 1591630, 1435967, 1348105, 1540665, 2344006, 1719360, 1226936, 1467629, 1436667, 1746026, 1795354, 1695683, 1316147, 1127433, 1256752, 1176989, 1078142, 1239535, 1368207, 1054834, 869190, 914701, 433956, 467012, 503602, 642137, 669567, 285927, 222476, 368025, 651825, 614599]
8359F14599J13343k94523k12079j7860M14767K8401N2877j47550J79198k94568
8349D36605K1940k163J40369K52665J38065k23321l12062P6387j54718K89147
8339F62914p2844m3691J02555l19308o3239k26123j99351K1030K40858K01884
8329C04685m1709l9557k80922p4117P9566K440P8015n1293R8912L36981j83433
8318B29568l18444o06568L95600J45858M46432J89725m29165Q6473q9148m3910
8308F421l3391r1742L62241K2060j2614k17358m27529M38128J24228m60924q0804
8297c71284K41475L81219J66136k78571j91008j90307L07947m9060O96r8688k51174
8286c32619p0850J38559O4259M2596m7782l36812J2756K87995M2031j13169m1705
$$ y = [614599, 727942, 433419, 221340, 203480, 618247, 646648, 699525, 551975, 731173, 436605, 458545, 456382, 596751, 849416, 987481, 764160, 452098, 528485, 373767, 662914, 590070, 546379, 648934, 329626, 266387, 40264, -159087, -138057, 102801, 304685, 262976, 223419, -57503, -131620, -52054, -49614, 28401, -22892, 76020, 413001, 229568, -88876, -695444, -299844, -153986, 292446, 482171, 53006, 139479, 50331, 6421, -26970, -118712, 243529, 265589, 252975, 35617, -391912, 46216, 170444, -290480, -371284, -129809, 251410, 417546, 138975, -52033, -242340, 65607, 16547, 17243, -81445, -332619, -403469, -264910, -200651, -158055, -205837, -542649, -529893, -241898, -199867, -313036, -354741]
8275c54741r1074R6452j15927l06281M91589L15547l62009J54080o8176J8640
8265b21900j06265J56810L4174J66255k53338O6246L34938l29833k50160l42849
8255g45922J42424J07099K65068o621J54004m6985k33532k43194M79589J46522
8245A8452m51476J17903K50842r730k94193l43359J38228m184J06205R8051N48297
8234A75036o2216R3067k96367N7593k89126o8552L50175J60902J74916l68108
8224g2680k3109m6382J34306L2594l76305K82664k48637K37791k52867j71139
8214e03764K56200k97578K60294k8556M1140j01283K04487j11340j32031j57722
8204e70153M34454m75506L9429o79390o2262J97140M25783k58366m9211j061731
$$ y = [-354741, -445815, -349363, -465290, -771571, -279982, 35565, -326444, -172364, -240540, -221900, -328165, -171355, -137181, 29074, -224264, -158018, 176920, -152913, -403073, -745922, -603498, -496399, -231331, -237952, -83948, -130933, -364465, -607659, -128070, 18452, -433024, -315121, -64279, -74009, -368202, -711561, -573333, -577517, -471312, -373261, 175036, 112820, 205887, -90480, -32887, -322013, -390565, -40390, 120512, 295428, -72680, -95789, -142171, -7865, 24729, -351576, -68912, -317549, -79758, -332625, -503764, -247564, -545142, -284848, -313404, -272264, -373547, -169060, -280400, -412431, -570153, -135699, -611205, -571776, -1251166, -1313428, -1116288, -690505, -948871, -998082, -2059813]
8194b059813L26179k747555M234797M351309k355351K1509j057156P9000n90808
8185B02111O36625k79203j48255k85879J60330k95741J65317k12148R998j60077
8175b06922Q676K03543K53384k81142q8751J06902o5119k74014l6339P9864j35545
8164d35463N4599Q4167J42751J58816l58520J61999j00775j02497K08201j36455
8154c23177J36604j40562K00731l12862k03309K69397M63765k01029J47164j32605
8144i5883n7709k0802M6030K08400k2518J99520j19320j3621L75420O029K53364
8133G58910j93064n41515j18770J83508K94193k79316q1682l71n5847J31291j89022
8122i1685N061k06455L8002J06860k25876m07926R7395L04118M13485j99879k25277
$$ y = [-2059813, -1733634, -4481189, -246392, 4104917, 1749566, 1771075, 713919, 792919, 202111, 838736, 559533, 411278, 125399, 285729, -10012, 155305, -56843, -46845, -206922, -198246, 5297, 258681, -22461, -111212, -4310, -69429, -343443, -379782, -299918, -435463, -380864, -296697, -153946, 4870, -353650, -191651, -292426, -394923, -186722, -323177, -186573, -327135, -126404, -439266, -642575, -373178, 90587, -110442, 36722, -95883, -153592, -174394, -128364, 80036, 57518, 257038, 137718, 124097, 499517, 505546, 758910, 565846, 24331, -94439, 89069, 383262, 103946, 22264, 21893, -33954, 97337, -91685, -86624, -293079, -255077, -148217, -374093, -782019, -684624, -380506, 32979, -166900, -392177]
8111c92177J63790Q024l6127L79076O0465o8331l37735m65467k61103L63689L83002
8100b02894J72324K51059p3850K3922n10113k69914L91942J60120j36414j7631
8090b11449Q3485m5066K65853j8480K84552k48128l37459j38858P0338J14487
8080a80725k98310p927k88484R2525N62225k30286l14013K90669J25946n8212
8070c06592l51096M43178J25198j83287P6113j30742L32412K13469k16986P0372
8060G2039j21630J20820n7354M4014j40130r5048P2103j131k12421J14657P3874
8049a30207j8615M07271K09284n39746M8250M8455L89403j91487k54643k5501
8039e7536o42494K85776N6875K48084j41774K96964j36492j65187J02130j77150
$$ y = [-392177, -228387, -220363, -256490, 122586, 183051, 114720, -223015, -688482, -949585, -585896, -202894, -30570, 220489, 146639, 170561, -339552, -609466, -217524, -57404, -193818, -211449, -127964, -173030, 92823, 74343, 358895, 110767, -226692, -365550, -295212, -180725, -479035, -486962, -775446, -682921, -120696, -350982, -664995, -374326, -248380, -306592, -657688, -214510, -89312, -272599, -196486, -327228, 5184, 218653, 1667, 72039, -49591, 71229, 13875, 57889, -82241, -177289, -105186, -106317, -318738, -204081, -130207, -148822, 258449, 467733, -72013, -23763, 24692, 414095, 222608, -32035, -57536, -700030, -414254, -357379, -109295, -251069, 45895, -90597, -255784, -153654, -330804]
8029c30804L8304R5597K7074Q1415j9702l33342J64642J84876N2272o35420N37834
8018a37254K38735p3992j44448q5107O7487L2996R4285L26326k55900l23297k19792
8007d79961J16187J96829M01980j50450j11357l5036j20121O9056k16229Q5191
7997b43911o7347K56880k77641k56717O20898M7540R412l7035k01915l8890k76792
7986d65518q5319j98122J37978K64047k6830j5839L48417K27926k24023j25442
7976a62725L73765k92271K04103O6541l42474R7182J32426m26145k44855J13582
7966d80871L84955k04545k28051L85846j12731M9009J39290Q14125n73944j45059
7956B8024j64853m68625K24038L07402L0194j66587P6700m3968J93725j63550
$$ y = [-330804, -292500, -196903, -169829, -88414, -108116, -441458, -276816, -91940, -39668, -675088, -137254, 101481, 27489, -116959, -202066, -134579, -101583, -7298, 319028, 63128, -260169, -479961, -363774, -166945, 235035, 84585, -26772, -61808, -181929, -112873, -329102, -243911, -311258, -54378, -332019, -588736, 32162, 79702, 89114, 52079, -149836, -188726, -465518, -550837, -748959, -610981, -346934, -373764, -389603, -41186, 186740, -37283, -162725, 211040, -81231, 122872, 189413, -153061, -55879, 76547, -349598, -594453, -480871, -95916, -300461, -528512, -142666, -255397, -206388, -67098, 747027, 173083, 28024, -136829, -605454, -381416, -74014, -43820, -210407, -133707, -177675, 16050, -147500]
7946a47500J03287k10996J18344L8816J12736j24481J70891r4128k61341l4067
7936c28439J17004j48935k95511k87250M36966L09J7416L71129K57077k07986
7926f8220J29208K86853J0471m20963J23563M2838p6985m64866j79760M60885
7916a56976K21616J24052j48615j49163q04j49915l47380k21820k89099M42166
7906f75938J96230o820K84201k35927J29185L00272K66414l86425J09228k12605
7896b32185n0962J55813J488j54370k24731Q0112K8103K44873J83028j10603j12620
7885a92054j3456l31800J9357K88319J1341J17169K50336k56491J0411Q9993j01200
7874a08075j92897J27825P3628J71784l28405j69984N29868O5969k70498R6491
$$ y = [-147500, -44213, -255209, -136865, -98049, 14687, -109794, 61097, -33031, -294372, -328439, -211435, -360370, -655881, -943131, -506165, -505856, -488440, -117311, 139766, -68220, 60988, 347841, 358312, -62651, 60912, 103750, 26765, -438101, -617861, -156976, 64640, 188692, 40077, -109086, -109890, -259805, -607185, -829005, -1118104, -675938, -479708, -486528, -202327, -438254, -309069, -8797, 257617, -128808, -19580, -232185, -283147, -127334, -125846, -280216, -504947, -424835, -396732, -151859, 31169, -79434, -192054, -205510, -537310, -517953, -229634, -218293, -101124, 149212, -107279, -96868, -6875, -108075, -300972, -173147, -99519, 72265, -256140, -426124, 103744, 169713, -100785, -4294]
7864d294j01672k01330j69915j28553o7809M12983J28223j07991l25673L79165
7854a86866q9648L5222l89108k3222O9548J92939l3019M911M7487k3324l8596
7843d33676L59890J81662J21955k70429k24959K10150J13735l1897o9744m7927
7833i1240j83166q0293k09366K20903k64365q2023J59984l0100M09531j61459
7823c11594q3889K71177l01792K80355K19676n18525j96327l02327K22975N5784
7813f64487N18550j17920k26398L86416r2262q9371k9542l04260l4563J77825
7803d76012K19597k11904J3175o14834k66613J565054l27122k16J68119K9909
7793I9153m30909l65958N14466L96837l95728j68583J69412J19598k23472k51544
$$ y = [-4294, -105966, -307296, -477211, -605764, -673573, -260590, -132367, -240358, -566031, -186866, -276514, -241292, -630400, -653622, -584074, -391135, -424154, -419243, -371756, -395080, -433676, -73786, 107876, 229831, -40598, -265557, -55407, 58328, 26431, -43313, -91240, -274406, -354699, -564065, -343162, -607527, -689550, -529566, -559666, -150135, -311594, -395483, -124306, -426098, -145743, 73933, -444592, -640919, -943246, -720271, -664487, -145937, -263857, -490255, -103839, -196101, -285472, -315014, -619274, -653837, -476012, -256415, -468319, -455144, -1069978, -1336591, 228463, -98659, -98875, 69244, 99153, -331756, -697714, -183248, 213589, -182139, -350722, -181310, -61712, -285184, -536728]
7783e36728J46961r7227J19135K24544R5952l55861Q7559K5288L78257J26832
7773B14712R5898L6949j43260K38822k07852k58723J36873j79995l08645K5585
7763c49636j56398M00916n5458j93693J1736L04300Q2033p6863k55826J89933
7753i8956J57540n51436j00392R5252K4377L52978L7018L32750n36301K20960
7743f6210l65152j73809K68894k33277M8173O7374J50703j08024j65657J86363
7733c90622M03465M16223m24867j88349K20295j42905k71379M6834k12794N09323
7723c4776k7833L03817p7184j82845Q416n68376L5959L88996K18956M64036l68067
7712A61099k70290K17741k27086J60076m78222l0963J79926K84576R4711K96202
$$ y = [-536728, -389767, -486994, -367859, -143315, -47363, -403224, -315665, -290377, 87880, 214712, 310610, 347559, 204299, 443121, 235269, -23454, 113419, -66576, -375221, -349636, -506034, -105118, -160576, -354269, -342533, -38233, 43800, -33063, -288889, -98956, 58584, -492852, -593244, -497992, -473615, -120637, -83619, 249131, -287170, -66210, -431362, -605171, -336277, -569554, -521381, -454007, -303304, -411328, -576985, -390622, 12843, 429066, 4199, -184150, 36145, -106760, -378139, -331305, -544099, -34776, -62609, 241208, 164024, -18821, -10405, -578781, -542822, -153826, 65130, 529166, 161099, -109191, 108550, -118536, 41540, -436682, -467645, -287719, -3143, 91568, 387770]
7702C87770m85194k99294l54991P4362L61672l641o8425J91957k3665P7119j35507
7691b77837L92437k96065l17543J97622M17531k8014k85172K84129K52157J01024
7681D40269J4450J19604l86532l29752k16256K62527n8248j74995J60634J88136
7671A9837Q5276m10509j16779k50546K15449K05806k8734R3651J80211Q1079O3079
7660A37820l6568n96811j70838J71869J72613l04704J80731K85999j64298J05335
7650b18852n4772j54573n0793M9733R2645J14505p0736o0792M4424l26289N4773
7639e80727J58242m9606l6013M86021N40011n90320j23205M1753J3043j95019
7629c35820L597J27410j89394K27830p199L33323k80460j14250P8873o96670J05152
$$ y = [387770, -97424, -396718, -751709, -677347, -315675, -319316, -387741, -195784, -219449, -142330, -277837, 114600, -181465, -499008, -301386, 116145, 88131, -197041, 87088, 339245, 440269, 454719, 574323, 187791, -141961, -358217, -95690, -153938, -328933, -168299, 19837, 105113, -305396, -422175, -672721, -457272, -251466, -280200, -186549, -6338, 74741, 137820, 101252, -495559, -666397, -494528, -321915, -626619, -445888, -159889, -324187, -218852, -273624, -428197, -478990, -429257, -336612, -222107, -292843, -353635, -309211, -635500, -580727, -422485, -472091, -508104, -22083, 517928, -72392, -195597, -153844, -140801, -335820, -332223, -204813, -394207, -166377, -173576, 159747, -120713, -234963, -156090, -852760, -747608]
7618g47608J85225J43906J56543L42070k55298k3965k94370j79974K54497K67821
7608a51153J19192K39564k32483l9786J04233N4639L030J38994j32978j69692
7598f6440J19531K02797k74603J33728N9029l07496k10603K4295K33388L52965
7588B66591R8984l90949m6176j20813N52975n4827j97036p0049M98695l81012
7578A56383l05180J25228k92616r6646K16805O4081k5429k9293j73667k25890
7568e86224J75262M17020J0314m15170K16620L77993K89856n15107J70970J97493
7558C39027n63026r5624P7079j86210m8503J93195k61054K17409J61473L3527
7548a32707n2057j28298K69651j06864j30109J06158L24853l10603l31814J90548
$$ y = [-747608, -562383, -418477, -261934, 80136, -175162, -199127, -493497, -673471, -418974, -151153, -31961, 207603, -24880, -64666, 39567, 94206, 97236, 236230, 103252, -66440, 53091, 255888, -18715, 115013, 174042, -133454, -344057, -319762, -86374, 266591, 365575, -25374, -71550, -192363, 360612, 305785, 108749, 38700, 537395, 156383, -148797, -23569, -316185, -412831, -196026, -131945, -157374, -186667, -360334, -586224, -410962, 6058, 16372, -398798, -182178, 195815, 485671, -29436, 141534, 339027, -223999, -319623, -242544, -428754, -477257, -284062, -545116, -327707, -166234, -132707, -184764, -313062, -43411, -150275, -280384, -174226, 150627, -159976, -491790, -301242]
7538c01242o9172K56253l29376q5604O8284J25268L50797L08744m01266l86032
7528d63346K13770L09722M79186m88485n47147j62350K08520L82698o7577L06688
7518A71679L8920n32633j47288l77252L21186L27113l7100R7482p1564Q9201J43520
7507B3264k17024J85797l28911k8070L37500p8381k67433M22083n21370k04352
7497f76897O75998J69688l84527k65655J19733j94371J1556M45059j43037K01344
7487d1109L73103j45309l63119l55654m22678J66684N29649J16480j00715k93568
7477e36236J92905j22223K12153L67395p12256K65260J27346k35359L77371J64660
7467A01016m42209m10145N46125m4393L64296M5457o85901k73489L65159N0898
$$ y = [-301242, -370414, -114161, -443537, -529141, -460857, -335589, 15208, 323952, -77314, -463346, -249576, 60146, 539332, 50847, -496300, -658650, -450130, -67432, -135009, 171679, 210599, -322034, -469322, -846574, -525388, -198275, -235375, -137893, -209457, -120256, 23264, -193760, -7963, -336874, -364944, -27444, -105825, -373258, 48825, -472545, -676897, -899, 168789, -215738, -481393, -361660, -556031, -544475, -99416, -242453, -41109, 331994, 186685, -176434, -532088, -954766, -788082, -258433, -141953, -242668, -536236, -343331, -465554, -253401, 113994, -598262, -333002, -205656, -441015, -63644, 101016, -341193, -751338, -205213, -249606, 114690, 160147, -525754, -799243, -434084, -383186]
7457c83186R5791j49381J99005l68986K1271j67079O27957O13824j33871k18454
7447A36891r1341m5703k60167j52167J40943K25900J78213Q7199m18577l50568
7437e49377J15798O5839L5849O52663j66432p25693J49592R2424L80390P7313
7427A28366J54983n3846j77938J3400q6068J77208J96571j84027n7492o74138
7417e62981K53204k7828m515M38494k71825k2525j59003j68889N6990O69505K13522
7406D14149l11175l71340J76797L093J44892j68161L8016J10711m01154q8344
7396d52516J69648J85358l0177l8848K01310L7525j03840J6951o7123K14025J2533
7385A44846k72548l7707j90178j17603L02823Q5209j48548J03452j88678j68756
$$ y = [-383186, -287395, -436776, -237771, -606757, -585486, -752565, -124608, 489216, 355345, 136891, 45550, -153, -260320, -412487, -271544, -45644, 132569, 219768, -198809, -549377, -433579, -367740, -331891, 320772, 154340, -571353, -421761, -329337, 51053, 128366, 283349, 229503, 51565, 64965, -21103, 156105, 352676, 168649, 111157, -562981, -309777, -337605, -342120, 96374, -175451, -197976, -356979, -525868, -468878, 200627, 414149, 102974, -268366, -91569, -88476, 56416, -111745, -73729, 36982, -364172, -452516, -282868, -97510, -127687, -166535, 34775, 72300, -31540, -14589, -81712, 132313, 144846, -127702, -165409, -355587, -473190, -170367, -85158, -233706, -130254, -318932, -487688]
7375d87688N04390j54340R3606k25420M3094L02905j43089m63013M7320N49090
7365F6855l07977j12411k7243J10840k37490L40936K37431l30895J09910O9804
7355h0240R7465l98828o4933N50579k02036r9399l87517J77877J27084O17234
7345C37286j57013K66493j58565o9660r3790k54671k68448J41180J70250l8653
7335a25591k17787j93428K38060K58215k21827N188J72987J95848l89310k03739
7325d81384o4923j50816O53615J92401l51189j45378J53223M12027k12986j57075
7315a52485r3023k3724Q877L0930K47088j59046J48257k26839j32948l53106M22002
7304b84017L7457j44663K69332q3025L2115r6787l75729L03928j32114J50596
$$ y = [-487688, 16702, -137638, -44032, -269452, -226358, 76547, -66542, -529555, -482235, 66855, -241122, -353533, -380776, -269936, -507426, -166490, 70941, -259954, -150044, -80240, 17225, -381603, -446536, 104043, -97993, -197392, -584909, -407032, -279948, 337286, 180273, 446766, 288201, 218541, 124751, -129920, -398368, -257188, -86938, -125591, -343378, -536806, -298746, -40531, -262358, -257170, -84183, 111665, -277645, -481384, -546307, -697123, -43508, 148893, -202296, -347674, -194451, 217576, 4590, -152485, -245508, -269232, -260355, -229425, 17663, -141383, 6874, -219965, -352913, -706019, -284017, -246560, -391223, -121891, -204916, -172801, -269588, -645317, -341389, -473503, -322907]
7294c22907J35459j2532K77731m35348q525J74700k66618M23770J04567n1790
7284A8507k04433m25642o8146R1946Q5949K41997l36921J31688o130J56696j82977
7273d97466K95969j25242K13238K2566k14588L8043L45201J18824p29590J00813
7263d32232j830j13679K30959Q7186k8633k63956R2838K44161J62557K00831J28369
7252C06571m83860n49623M24917J43678q7623l96413k76689J68817M47036K53807
7242d9382L0541k34829M3425l6614l40943M03893M54712n34356q603J87236l68601
7231d53521j90826R8176L49058k04127M04193J00586j91516j0846k221n5879k82638
7220d39561K73454R3790k18596M29554K55492l08685p1602o08380M4906J07794
$$ y = [-322907, -187448, -199980, 77751, -357597, -366122, -191422, -458040, -34270, 70297, 18507, -185926, -611568, -679714, -587768, -501819, -259822, -596743, -465055, -471185, -314489, -497466, -201497, -326739, -113501, -90935, -305523, -267480, 77721, 196545, -533045, -432232, -434062, -547741, -316782, -229596, -258229, -522185, -429347, -185186, -22629, 178202, 306571, -177289, -726912, -301995, -158317, -245940, -642353, -919042, -750225, -303189, -49382, -18841, -253670, -210245, -246859, -587802, -183909, 270803, -263553, -272156, -84920, -453521, -644347, -546171, -197113, -401240, 2953, 103539, -87977, -98823, -101044, -156923, -439561, -166107, -72317, -290913, 138641, 394133, 85448, 13846, -594534, -549628, -441834]
7210d41834K17675q6476K95395q1170l9405K6017o8996j09848L14556j69776j26452
7199b70314L46771j6570K97631j22587l4032j3545m82212k73224J39231P1650
7189c57201J10689J0284R1146o8342J15462m18384l88713K01319P5444K96571
7179c31725l68273N94328K8505l45700p469r4909L07784J98648p5260l88641J27566
7168c55146K42457M0185j20761k55590R393J42185L51656j01583l53097J14132
7158b86169j38422k50629R7252K04397J06415K24270L18100p4157l74863j33396
7148c07202k027N7016K7319j1449L40904L67909o53308J4384L2685j26190P4205
7137a85754r6956m1664J32920J81795n4305o5107J38471j15636l8396j22505l2834
$$ y = [-441834, -224159, -310635, -15240, -96410, -135815, -109798, -178794, -288642, 25914, -143862, -270314, 76457, 59887, 357518, 234931, 200899, 187354, -294858, -568082, -428851, -357201, -246512, -236228, -145082, -213424, -97962, -516346, -905059, -703740, -628296, -331725, -699998, -105670, -77165, -422865, -430334, -525243, -217459, -18811, -94071, -482712, -355146, -112689, -72504, -193265, -448855, -439462, -297277, 54379, -47204, -400301, -286169, -424591, -675220, -577968, -373571, -267156, -42886, 275214, 201057, -173806, -307202, -309229, -252213, -224894, -236343, 104561, 472470, -180838, -166454, -133769, -259959, -185754, -282710, -324374, -191454, -9659, -63964, -129071, 9400, -106236, -144632, -267137, -299971]
7126b99971L30565r9496l00631M03339L69134n3404o37144J45783O7980K12380
7116A38535N34020m18717l26777K63859J35200m86569j14582M3848k8188O24505
7106C65134N4573l55752J63642l01147l56243J63718N1622J0096m10704k36425
7096h51486J31856K08528J70759j33472J37835Q7589j05640k00864j48169K09517
7086d93547J18140j2811J72680k23670k48562O07411M14244k27818k87197l65495
7076e46625J25226J74674J23810k19063N5487J85427K38756j44729k05366Q1613
7066a30790K01037J96915K38581M6245l78278M6630j58249L8677k68132J35430
7056c1934L39690l58643Q2272k42161l36818K50521J27261n429l92644K78346
$$ y = [-299971, 30594, -68902, -369533, 33806, 402940, 349536, -287608, -141825, -73845, 138535, 672555, 253838, -72939, 190920, 326120, -160449, -275031, -231183, -259371, 365134, 419707, 63955, 227597, -73550, -429793, -266075, -214453, -204357, -615061, -851486, -719630, -511102, -340343, -473815, -335980, -248391, -354031, -554895, -703064, -493547, -375407, -388218, -215538, -439208, -687770, -80359, 333885, 106067, -181130, -546625, -421399, -246725, -122915, -341978, -286491, -101064, 137692, -7037, -212403, -130790, 70247, 267162, 505743, 551988, 173710, 220340, 62091, 100768, -167364, -31934, 307756, -50887, 31385, -210776, -547594, -297073, -169812, -175241, -567885, -289539]
7046b89539Q3659q6036L51146J33121p217l73197J76740J27700k3089k12210j96266
7035c15188J97078J3927k81426k4363M48322L89099m17163l2598L03631n3834
7025B27485k88565K36862m1117M34046n55705m93088J46965J84424L06229l41612
7015a84076J38481R0886m53508K43540L04204J2445k44911m29361K72806J38298
7005a11196J27728j86365J65115L46173p653n3396K60493J61094k51261k55053
6995A95679k34523l09657J24649o7920j13473L82053k26818n96481J78577K31874
6985d36040J40274n1068N2273k3822K52783n413P0137k82904k61439L74334j71877
6974c42762M58619j5622o86980K31241J46455l49591L25669k69027N45757L22414
$$ y = [-289539, -205880, -291916, 59230, 192351, 185134, -188063, -11323, 116377, 93288, -118922, -315188, -118110, -104183, -385609, -409972, 38350, 427449, 10286, -22312, 281319, 227485, -61080, 175782, 134665, 568711, 13006, -480082, -333117, -148693, 157536, -184076, -45595, 45291, -408217, -164677, 139527, 151972, -92939, -522300, -249494, -111196, 16532, -169833, -4718, 341455, 333802, 280406, 540899, 701993, 450732, 195679, -38844, -348501, -223852, -291772, -405245, -23192, -250010, -846491, -667914, -436040, -295766, -346834, -294561, -318383, -65600, -71013, -876, -283780, -545219, -170885, -342762, 115857, 100235, -586745, -355504, -209049, -558640, -232971, -501998, 43759, 366173]
6964C66173l54234m9571J37729o4001R909L07849k14431l92489J29315J66425
6954D2674N03834m90298j50345M11449p23274J01805m2165o3377J12257j85989
6944d83429l21401K8572J10562L84903M981j55190j69096J36006L60848K51425
6934A48181p07559j65624J01416L19230K53851J42452j58048l07955L77870q418
6924d604j48784k29977M6450R2183j89962N24425j99844j58897K58638R700q5566
6913h6238K11175k63545k29187k17168P2281K7769j63215J45093K28360p6743
6903c51418n8669L66092k24139l95625N0831L62058L45130Q4602n03570l89162
6893g13870J88117J16038K26922L62141k79839k48771j39951L31847k02044J76868
$$ y = [366173, 11939, -37632, 100097, 36096, 46005, 353854, 139423, -253066, -123751, 42674, 546508, 56210, -94135, 317314, -405960, -304155, -346320, -409697, -297440, -483429, -804830, -776258, -665696, -280793, -275812, -431002, -600098, -464092, -103244, 148181, -559378, -725002, -623586, -304356, -50505, 91947, -66101, -374056, 3814, -4604, -153388, -383365, -336915, -244732, -434694, 89731, -110113, -269010, -10372, -672, -86238, 124937, -138608, -367795, -584963, -512682, -484913, -648128, -503035, -274675, -351418, -410087, -43995, -268134, -663759, -612928, -250870, 94260, 178862, -324708, -713870, -525753, -409715, -182793, 179348, -100491, -349262, -489213, -157366, -359410, -182542]
6883a82542L59720J51027k04205Q5122l44879j00703l25432m9268K78724N47551
6873B15115k6281k6757l40305j53205L63652q4039K7455r5831N7581m97467M01084
6862a58998K52243q9369m63195o4239L37118N0148R1463j59105k15013J68643
6852b50304R6183k37003J57643k26657k87465L4196J70977j81525J25518J747
6842e96690p8631M92920m3407L3264J33026r3119K60360L73165l59600j33216
6832a1928R492l58489l52915L2740M22996O5116L30283k64709k26403M22570j78453
6821a09700k04399o1321N5688K71760p1891l38059K29879K90728k16970k12007
6811c66292J18997m0137k11330J72774k85226K55252M86350k68057q7488l31436
$$ y = [-182542, 177178, 328205, 124000, 209122, -135757, -236460, -561892, -611160, -332436, 215115, 188834, 162077, -178228, -331433, 32219, -51820, -24365, -120196, -62615, -560082, -158998, 93245, 3876, -459319, -523558, -186440, -136292, -44829, -203934, -418947, -250304, -154121, -391124, -233481, -460138, -747603, -713407, -542430, -723955, -598437, -596690, -675321, -182401, -225808, -192544, -59518, -152637, 107723, 480888, 121288, -11928, -2436, -360925, -713840, -681100, -258104, -192988, 137295, -127414, -353817, 68753, -109700, -314099, -375420, -319732, -47972, -119863, -457922, -228043, 62685, -154285, -366292, -247295, -287432, -498762, -325988, -611214, -355962, 130388, -137669, -225157, -556593]
6801e56593J08101j82415K1583J47439J11725K08359m1660p6214j89440N0077
6791c99038J04522K04547k77479K97705J87807p5069j77591j08243K40543j44029
6781a46325o47231N20500N4996o33j66727L23781j02794K23603L44645j85468
6771B18347R1145o33458m4195J34656K71814O6028J65498k29655n2115j32769
6761a44704K82412j63229J38730J79509n40186k24852K54440J57828K32328o3355
6751A08921k2758k83463N6627k49363J90947j38139k9410N1664J69992R827q3867
6740b19022L919p3966r0585k40582K35559L33947m40568K23135M9473l64845j69461
6729g52996J42369P19826j14952m20627p4816n2398J30872J00281K00462M4947
$$ y = [-556593, -448492, -630907, -609324, -461885, -350160, -141801, -183461, -259675, -449115, -399038, -294516, -89969, -367448, -69743, 118064, 42995, -134596, -242839, -2296, -146325, -793556, -273056, -218060, -218693, -385420, -61639, -164433, 59170, 403815, 218347, 309492, -323966, -368161, -233505, 38309, 104337, 269835, 40180, -11935, -144704, 137708, -25521, 113209, 292718, -247468, -472320, -217880, -60052, 172276, 108921, 86163, -197300, -140673, -390036, -199089, -337228, -366638, -314974, -144982, -135155, -219022, -215103, -289069, -379654, -620236, -384677, -50730, -491298, -268163, -218690, -583535, -752996, -610627, 109199, -5753, -426380, -501196, -553594, -422722, -322441, -121979, -77032]
6719g7032j49516K57249m1235J54905j83019l6855l00532J99613n711k48319M55867
6708B5415N2989o26993M21122J39408l92401l49303L68362n30303K2984O40955
6698b27765M91015J52503p23214m08824K3950J2021L75699K37162p2659J87920
6688D7808J90154j77808j92340o23028K49601M7941n07755M98278J95343k73004
6678e44810M18098l1270l9955j87011j71791M77296J31693k52916o61107M16557
6668d45216N14015O0103n10916m90618K77915L85849q9115N51413J39669N3952
6658D47051k59328l13792j80973j9780j62505j0107K32298O6552m4046k1921k20096
6647d86647L1043J32806N6196m85826K18O00642k65070L8670l16955j26000Q07396
$$ y = [-77032, -226548, 30701, -10534, 144371, -38648, -75503, -376035, -176422, -182133, -430452, 25415, 78404, -548589, -127467, 11941, -380460, -729763, -361401, -891704, -868720, -227765, 263250, 415753, -307461, -716285, -692335, -680314, -304615, -67453, -140112, 47808, 237962, 60154, -132186, -755214, -505613, -457672, -965427, -467149, -271806, -544810, -126712, -157982, -197937, -384948, -556739, -79443, 52250, -200666, -861773, -445216, 68799, 128902, -382014, -872632, -594717, -208868, -297983, 253430, 393099, 447051, 187723, -126069, -307042, -326822, -489327, -499434, -267136, -200584, -244630, -266551, -486647, -455604, -322798, -266602, -752428, -752210, -151568, -416638, -377968, -694923, -820923, -13527]
6636a3527l84873j06580L49443k65708J3672J17720N4516j89705n1051R3263L2208
6625c50622M03038k73945j00523p1823j48396M37236J26440n8381K6451p6576
6615h7101k81693l29574J70217L37420j09624m8629K67727K02696m51362k1452
6605c51375K77606j16358j88421O6966j08414N0478J23312J27169l17193m94397
6595i30627N82577K76885K22934j13150k35900J55734J12480K70966k03237m9493
6585H9169o99339k42541L30758P5244K12445J46258k33874m4061J74134J43770
6575d8037p9006j89488l39282K64458P2404L2324o7172n03071M62905j4277j39864
6564e48106K44896K45678j46451l43009L97670J54908j24884l61363K52386r9699
$$ y = [-13527, -398400, -504980, -155537, -421245, -407573, -289853, -235337, -425042, -476093, -382830, -350622, 52416, -221529, -322052, -393875, -542271, -105035, 21405, -36976, -10525, -87101, -368794, -698368, -528151, -190731, -300355, -348984, -81257, 121439, -329923, -351375, -73769, -190127, -378548, -311582, -419996, -369518, -246206, -119037, -436230, -930627, -348050, -71165, 151769, 38619, -197281, -41547, 70933, 341899, 138662, 89169, -610170, -852711, -521953, -446709, -234264, -88006, -321880, -365941, -191807, -48037, -127043, -316531, -655813, -391355, -318951, -286627, -353799, -856870, -393965, -408242, -548106, -303210, -57532, -203983, -546992, -149322, 5586, -119298, -480661, -228275, -327974]
6554c27974r4226m1082j00034N68396j3683l55420j31747J14620L23511k99509
6544c57148J4688J08438J17511L6292k36677k66163L28572J7280K41807J55659
6534A60259l55928J48150N2783n84113P1896L01779j1710m58959J63310L34778
6524a77755n45120K18724L72496N02207q12250l37836K07429M45199K463k62900
6514c87343M4431K30381r1829L23476J83957m09611J00208L2493J18857L2722
6504A77742K46873K524k73011j0928l06366J86754k59382l94264L09886l2262
6494c52434l06145M94357L57355K60164q273l11341j27529k47582k76067K78334
6484b39161J60142P5089q6660M46366J0320m58237l96648j6477J04115K98884
$$ y = [-327974, -422200, -463282, -563316, 5080, -8603, -364023, -495770, -381150, -57639, -357148, -342460, -234022, -116511, -80219, -316896, -583059, -254487, -237207, 4600, 160259, -195669, -47519, 5264, -578849, -506953, -205174, -216884, -675843, -512533, -177755, -722875, -504151, -131655, 370552, -441698, -779534, -572105, -126906, -124443, -387343, -342912, -112531, -204360, 119116, 303073, -106538, -6330, 26163, 145020, 177742, 424615, 427139, 154128, 143200, -163166, 23588, -235794, -630058, -320172, -352434, -658579, -164222, 193133, 453297, 445024, 133683, 6154, -241428, -517495, -239161, -79019, -3930, -90590, 355776, 366096, -92141, -488789, -505266, -401151, -102267]
6474a02267j23885N31499K89614m43106J47120j25926l25744k78035J02019k42077
6464e70788k7541J41222k2853j94202J12257L74845p7330J24629M8088n1893N87
6453a42979J3448k91723k86038m4049L27438M6196p642P1056k93320L59987k16804
6442d64430j3621k46597K35063J2526L21409J13980M8025j7360j80248J56843
6432c4410K73607m09513K34126J97203R9152k25840R018K05806o8989l27359q7907
6421a35106M37822J687L7141k70905n4995l58967j95163j07974K14087J4047J02977
6410c15349J20528K10840K59184m08785K46658n84509j99417K14392j95283M40887
6400b10854k16614J49769M41980M12463m55946j87242P0214K09390k17998k86783
$$ y = [-102267, -226152, 305347, 594961, 151855, 298975, 173049, -152695, -430730, -328711, -570788, -598329, -457107, -479960, -674162, -561905, -187060, -264390, -139761, -91673, -143566, -142979, -129531, -421254, -707292, -751341, -423903, -377707, -385349, -314293, -607613, -247626, -464430, -478051, -724648, -489585, -477059, -155650, -41670, 6355, -11005, -191253, -34410, 239197, -170316, 63810, 261013, 360165, 134325, 143343, 349149, 280160, -47199, -135106, 302716, 304403, 341544, 70639, 15644, -343323, -538486, -646460, -432373, -418326, -315349, -194821, 16019, 275203, -133582, 113076, -471433, -670850, -456458, -651741, -210854, -427468, -277699, 164281, 576744, 120798, -66444, 3770, 213160, -4838, -291621]
6390b91621j77946n9242L97622J01183J47018j05607k90742q5509J8557K27703
6380a18584J74634p1428k46295J79086r486j41879K22466l8002O7765j19554k26340
6369c27617L9132J45266j45598o1329k14656J80230L76248R9337l97151j70578
6359d76716N0438K5037k4427L21455l59587K05114L16069k21865K74809k37859
6349a27532L484L77942l9230k21187j56782l23260k79237o689K93510m5714K76004
6338b48691j87251K2310n5840O3298N1402l25887K62765L7595J7484r1412r7386
6327e51613K69506k21375J59060K38102j84146J90355K01177N8893j02104q075
6317D9780j5545r9083k86564j135J20443j58939P3686J15385l41011O37703k10738
$$ y = [-291621, -469567, -528809, -131187, -30004, 117014, 11407, -279335, -364844, -346287, -118584, 56050, -15378, -261673, -82587, -92073, -233952, -11486, -49488, 18277, -101277, -327617, -288485, -143219, -288817, -350146, -564802, -384572, -8324, 91013, -306138, -476716, -426278, -401241, -425668, -104213, -463800, -258686, 57383, -164482, 110327, -127532, -124048, 253894, 214664, -6523, -163305, -486565, -765802, -772491, -478981, -524695, -248691, -435942, -413632, -469472, -406174, -354772, -680659, -417894, -380299, -362815, -454227, -551613, -282107, -503482, -344422, -106320, -290466, -100111, 101066, 159959, 57855, 49780, 34235, -64848, -351412, -352547, -232104, -391043, -317357, -201972, -542983, 94720, -116018]
6306a16018K24424k43109J0036M77892l98714j89102J3353Q9661J19666N6150
6296D4239m08731k02137K74778J20233k19415J3264K94873N3620l52054j2497
6286c93827L48439m6255j02369K12046l76763M03332o6750l34991J62644q6657
6276b81151N8379j0511j60839J29747O3949M03275j56000l9842j12667j16382
6266b22042L9324J53022Q2925k61598r2873k47761j05704K74843M26216K72318
6256C18670m99012j19397j55149L27951k02570L40114L5172J85551O0206k16723
6246G4813k23488k00999K51453j22773K10289J03352J00700j31463p0116j90557
6236a98789k37531j33957R6458M73891M52772m45429k68382J89512K78769n4888
$$ y = [-116018, 108406, -134703, -124667, 353225, -45489, -234591, -221238, -131577, -11911, 44239, -364492, -566629, -291851, -171618, -391033, -377769, -82896, -29276, -381330, -393827, -45388, -91643, -194012, 18034, -358729, 44603, -22147, -357138, -194494, -281151, -222772, -233283, -394122, -264375, -200426, 202849, 46849, 7007, -105660, -222042, -182718, -29696, 53229, -208369, -301242, -549003, -654707, -379864, 46352, 318670, -180342, -299739, -454888, -126937, -329507, 10607, 45779, 231330, 291536, 74813, -148675, -349674, -98221, -220994, -10705, 92647, 193347, 61884, -8232, -198789, -436320, -570277, -473819, 72, 452844, 7415, -260967, -71455, 207314, 152426]
6226A52426j21952J44193K54956j48663o9530m18507J95734j787J42639J4336
6216A43845k07791m75540j51588m433R0125L39807K20274j76479J38799j53368
6206b36349p7777K83943j70913J47277m07395J87955N63284k68651l02578J44496
6196a36708n7508L38035j72105j51810N1800K34569k16057J17553j36895M2042
6186h7084j17085p2355j30148Q3509K67264o9684J1280l68486K01788R2577N10258
6175C21834l20196p3657M3234l51750K83194m79498M59907K37226j64176J96384
6165A52502m24703j60296J48181L62383m33284r4299P6888P9682J60811K93320
6155A61185J23297l82032J37437J08873j41270M61488j01168j55980n79261k7925
$$ y = [152426, 30474, 174667, 429623, 280960, 211430, -207077, -11343, -13130, 129509, 143845, -63946, -539486, -691074, -695507, -605382, -265575, -45301, -221780, -82981, -236349, -314126, -30183, -201096, -53819, -461214, -273259, 290025, 21374, -281204, -136708, -194216, 143819, -28286, -180096, -128296, 106273, -109784, 7769, -129126, -87084, -204169, -276524, -406672, -323163, -55899, -125583, -114303, -482789, -281001, -188424, 321834, 1638, -72019, -28785, -380535, -97341, -576839, -116932, 120294, -43882, 152502, -272201, -432497, -284316, 78067, -355217, -449516, -372628, -292946, -132135, 161185, 284482, -97550, 39887, 148760, 7490, 468978, 367810, 211830, -367431, -395356]
6145c95356Q24252L20754l20832n79648K6971k62423J4109K73860L5239r6309
6135a59383o1709J5874J05109R7579n4011l18442J108M10804k76626J74523k58492
6124c23666q0616N52739j23342J5130K10455l39786l93512K31971J80838J42766
6114G2977L90594k99860k91549l1406L82856k95858j1754K38951j04927k18856
6104a68832K81041j60688j18477L36147J37636m94979N6508n37902j67868P86953
6094e0461N1371j2289j16683L8625K763j04104K3981j42760l14729M84148n636
6083a45774P3371J39495K02650j23288m30136k15926L74026k81635L0612N9578
6073c17027J58988J23755J84631N2500j94111N779J48923J21104P735r849J18080
$$ y = [-395356, 428896, 749650, 428818, -150830, -123859, -386282, -372173, -98313, -63074, -159383, -221092, -205218, -100109, -2530, -56541, -374983, -373875, 36929, -239697, -65174, -323666, -404282, 148457, 25115, 40245, 250700, -89086, -482598, -250627, -69789, 72977, 463571, 163711, -127838, -159244, 223612, -72246, -84000, 154951, 50024, -168832, 112209, -48479, -166956, 169191, 306827, -188152, -131644, -669546, -837414, -50461, 910, -11379, -128062, -89437, -86674, -190778, -166797, -309557, -624286, -140138, -145774, -72403, 67092, 269742, 146454, -283682, -499608, -125582, -407217, -376605, -317027, -158039, -34284, 150347, 202847, 8736, 14515, 163438, 284542, 292277, 282428, 400508]
6062D00508m22058l02014j57190k7554J61269J18053J33151m6964O1903J00678
6052A9782j66454j37132l7170j40460J68269J18516k7682K28855N9033k47156
6042a61599o7100N94620n26905r218K63053r4677l59650K35488L81458j24974
$$ y = [400508, -21550, -323564, -480754, -508308, -347039, -228986, -95835, -142799, -80896, 19782, -146672, -283804, -320974, -461434, -293165, -174649, -202331, 26524, 85557, -161599, -228699, 365921, -160984, -170202, 92851, -1826, -361476, -125988, 255470, 130496]
$$ [...]
##END NTUPLES=NMR SPECTRUM
##END=
