##TITLE=1H_CA-9218
 CDCl3+DMSO
 8 sc, 
 26.12.2023
##JCAMPDX= 6.0         $$ Bruker NMR JCAMP-DX V2.0
##DATA TYPE= NMR SPECTRUM
##DATA CLASS= NTUPLES
##ORIGIN= UXNMR, Bruker Analytische Messtechnik GmbH
##OWNER= root
$$ XWIN-NMR		Version 3.5
$$ Tue Dec 26 14:39:14 2023 Russian Standard Time (UT+4h)  she@DPX200
##.OBSERVE FREQUENCY= 200.1313
##.OBSERVE NUCLEUS= ^1H
##.ACQUISITION MODE= SIMULTANEOUS
##.ACQUISITION SCHEME= undefined
##.AVERAGES= 8
##.DIGITISER RES= 18
##SPECTROMETER/DATA SYSTEM= spect
##.PULSE SEQUENCE= zg30
##.SOLVENT NAME= CDCl3
##.SHIFT REFERENCE= (INTERNAL, CDCl3, 0, 15.5386)
##AUDIT TRAIL= $$ (NUMBER, WHEN, WHO, WHERE, WHAT)
$$ ##TITLE= Audit trail, XWIN-NMR		Version 3.5
$$ ##JCAMPDX= 5.01
$$ ##ORIGIN= Bruker BioSpin GmbH
$$ ##OWNER= she
$$ F:/spectra/data/she/nmr/H-F/1/pdata/1/auditp.txt
$$ ##AUDIT TRAIL=  $$ (NUMBER, WHEN, WHO, WHERE, WHAT)
(   1,<2023-12-26 14:37:59.06 +0400>,<she>,<DPX200>,
      <created by zg, POWCHK disabled, PULCHK disabled
       configuration hash MD5:
       00 E9 B6 7A A2 85 ED C7 34 08 36 98 17 FE 4E 26
       data hash MD5: 16K
       AD 34 C1 9F FA B9 F5 75 1C 80 23 C0 54 7C 7D 61>)
(   2,<2023-12-26 14:38:02.95 +0400>,<she>,<DPX200>,
      <Start of raw data processing
       efp BC_mod = 2 LB = 0.24 FT_mod = 6 PKNL = 1 PHC0 = -24591.36 PHC1 = 8.652729 SI = 16K 
       data hash MD5: 16K
       2A 1E 06 62 AF 4F 7C 9E D9 22 73 61 E5 EE 77 6C>)
(   3,<2023-12-26 14:38:20.29 +0400>,<she>,<DPX200>,
      <pk PHC0 = -1.171079 PHC1 = 0.4 
       data hash MD5: 16K
       03 EA 16 EB 7F E7 39 19 49 6A C8 35 57 53 DC 8F>)
(   4,<2023-12-26 14:38:23.85 +0400>,<she>,<DPX200>,
      <abs ABSG = 5 
       data hash MD5: 16K
       3E 46 FB 3F 19 07 A4 5C 63 45 F7 97 63 A8 6F E2>)
$$ ##END=
$$ 
$$ hash MD5
$$ 02 C7 E9 77 CC 25 C3 0C 42 56 F4 F0 82 0D 7E 30
##$RELAX= 
##$RELAX= 
##$RELAX= 
##$RELAX= 
##$RELAX= 
##$RELAX= 
$$ Bruker specific parameters
$$ --------------------------
##$DU= <F:/spectra>
##$EXPNO= 1
##$NAME= <H-F>
##$PROCNO= 1
##$TYPE= <nmr>
##$USER= <she>
##$AMP= (0..31)
100 100 100 100 100 100 100 100 100 100 100 100 100 100 100 100 100 100 
100 100 100 100 100 100 100 100 100 100 100 100 100 100 
##$AQSEQ= 0
##$AQ_mod= 1
##$AUNM= <au_zg>
##$AUTOPOS= <>
##$BF1= 200.13
##$BF2= 200.13
##$BF3= 200.13
##$BF4= 200.13
##$BF5= 200.13
##$BF6= 200.13
##$BF7= 200.13
##$BF8= 200.13
##$BYTORDA= 1
##$CFDGTYP= 0
##$CFRGTYP= 5
##$CHEMSTR= <none>
##$CNST= (0..31)
1 1 145 1 1 1 1 1 1 1 1 1 1 1 1 1 1 1 1 1 1 1 1 1 1 1 1 1 1 1 1 1 
##$CPDPRG= <>
##$CPDPRG1= <>
##$CPDPRG2= <>
##$CPDPRG3= <>
##$CPDPRG4= <mlev>
##$CPDPRG5= <mlev>
##$CPDPRG6= <mlev>
##$CPDPRG7= <mlev>
##$CPDPRG8= <mlev>
##$CPDPRGB= <>
##$CPDPRGT= <>
##$D= (0..31)
0 1.2 0 0 0 0 0 0 0 0.06 0 0.03 0 0 0 0 0.0002 0 0 0 0 0 0 0 0 0 0 0 0 
0 0 0 
##$DATE= 1703587078
##$DBL= (0..7)
120 120 120 120 120 120 120 120 
##$DBP= (0..7)
150 150 150 150 150 150 150 150 
##$DBP07= 0
##$DBPNAM0= <>
##$DBPNAM1= <>
##$DBPNAM2= <>
##$DBPNAM3= <>
##$DBPNAM4= <>
$$ [...]
##$SUBNAM3= <"">
##$SUBNAM4= <"">
##$SUBNAM5= <"">
##$SUBNAM6= <"">
##$SUBNAM7= <"">
##$SUBNAM8= <"">
##$SUBNAM9= <"">
##$SW= 18.0517328524113
##$SWIBOX= (0..15)
0 0 2 0 0 0 0 0 0 0 0 0 0 0 0 0 
##$SW_h= 3612.71676300578
##$TD= 16384
##$TD0= 1
##$TE= 0
##$TE2= 300
##$TE3= 300
##$TEG= 300
##$TL= (0..7)
0 120 120 120 120 120 120 120 
##$TP= (0..7)
150 150 150 150 150 150 150 150 
##$TP07= 0
##$TPNAME0= <>
##$TPNAME1= <>
##$TPNAME2= <>
##$TPNAME3= <>
##$TPNAME4= <>
##$TPNAME5= <>
##$TPNAME6= <>
##$TPNAME7= <>
##$TPOAL= (0..7)
0.5 0.5 0.5 0.5 0.5 0.5 0.5 0.5 
##$TPOFFS= (0..7)
0 0 0 0 0 0 0 0 
##$TUNHIN= 0
##$TUNHOUT= 0
##$TUNXOUT= 0
##$USERA1= <user>
##$USERA2= <user>
##$USERA3= <user>
##$USERA4= <user>
##$USERA5= <user>
##$V9= 5
##$VALIST= <valist>
##$VCLIST= <CCCCCCCCCCCCCCC>
##$VD= 0
##$VDLIST= <DDDDDDDDDDDDDDD>
##$VPLIST= <PPPPPPPPPPPPPPP>
##$VTLIST= <TTTTTTTTTTTTTTT>
##$WBST= 1024
##$WBSW= 4
##$XGAIN= (0..3)
0 0 0 0 
##$XL= 0
##$YL= 0
##$YMAX_a= 98822
##$YMIN_a= -110138
##$ZGOPTNS= <>
##$ZL1= 120
##$ZL2= 120
##$ZL3= 120
##$ZL4= 120
##$ABSF1= 15.43287
##$ABSF2= -2.618979
##$ABSG= 5
##$ABSL= 3
##$ALPHA= 0
##$AQORDER= 0
##$ASSFAC= 0
##$ASSFACI= 0
##$ASSFACX= 0
##$ASSWID= 0
##$AUNMP= <proc_1d>
##$AZFE= 0.1
##$AZFW= 0.1
##$BCFW= 0
##$BC_mod= 2
##$BYTORDP= 0
##$COROFFS= 0
##$CY= -3
##$DATMOD= 1
##$DC= 0
##$DFILT= <>
##$DTYPP= 0
##$F1P= 0
##$F2P= 0
##$FCOR= 1
##$FTSIZE= 16384
##$FT_mod= 6
##$GAMMA= 0
##$GB= 0
##$INTBC= 1
##$INTSCL= 3.70164e-10
##$ISEN= 128
##$LB= 0.24
##$LEV0= 0
##$LPBIN= 0
##$MAXI= 10000
##$MC2= 0
##$MEAN= 0
##$ME_mod= 0
##$MI= 1.114404
##$NCOEF= 0
##$NC_proc= -8
##$NLEV= 6
##$NOISF1= 3.799351
##$NOISF2= 2.8
##$NSP= 0
##$NTH_PI= 0
##$NZP= 0
##$OFFSET= 15.53865
##$PC= 1
##$PHC0= -24592.53
##$PHC1= 9.052729
##$PH_mod= 1
##$PKNL= yes
##$PPARMOD= 0
##$PSCAL= 0
##$PSIGN= 0
##$REVERSE= no
##$SF= 200.12999660761
##$SI= 16384
##$SIGF1= 3
##$SIGF2= 2
##$SINO= 5.538805
##$SIOLD= 16384
##$SREGLST= <1H.CDCl3>
##$SSB= 0
##$STSI= 16384
##$STSR= 0
##$SW_p= 3612.71676300578
##$SYMM= 0
##$S_DEV= 0
##$TDeff= 16384
##$TDoff= 0
##$TI= <>
##$TILT= no
##$TM1= 0
##$TM2= 0
##$TOPLEV= 0
##$USERP1= <user>
##$USERP2= <user>
##$USERP3= <user>
##$USERP4= <user>
##$USERP5= <user>
##$WDW= 1
##$XDIM= 16384
##$YMAX_p= 274549946
##$YMIN_p= -1176320
$$ End of Bruker specific parameters
$$ ---------------------------------
##NTUPLES= NMR SPECTRUM
##VAR_NAME=  FREQUENCY,     SPECTRUM/REAL,   SPECTRUM/IMAG
##SYMBOL=    X,             R,               I
##VAR_TYPE=  INDEPENDENT,   DEPENDENT,       DEPENDENT
##VAR_FORM=  AFFN,          ASDF,            ASDF
##VAR_DIM=   16384,         16384,           16384
##UNITS=     HZ,            ARBITRARY UNITS, ARBITRARY UNITS
##FACTOR=    0.220516191357247, 1,           1
##FIRST=     3109.74988353371, 0,            0
##LAST=      -502.966879472068, 0,           0
##MIN=       -502.966879472068, -1176320,    0
##MAX=       3109.74988353371, 274549946,    0
$$ Real data points
##PAGE= N=1
##DATA TABLE= (X++(R..R)), XYDATA
$$ [...]
11907B92721j86751j28830M19077k0277k00729M8987J27453J2215K7450q0897
11897C10419o30676L79472K77406k38030Q883J71641J1881j01296L05870o8521
11887D27049m46301o9614o0112J74174L88296k11133P5556m38738r4297P3173
11877a81947K71851l60695M21153L615L63348j12085k03073K32146L9718N4016
11867E28047j31482K10681l75934L21183K08714k37177k57963J83416K88492L4949
11857G72926j47620k08430o3404q8328j4628K29382j52420o1685L1404L25562
11847F22759L22467k63345j97289k14605m66630M47698n32268K12625L96521j31762
11837A96171K8284L5474J82454k82971q762k13936l47437M2369J34161N31765
$$ y = [292721, 105970, -22860, 396217, 375940, 175211, 224198, 351651, 363866, 391316, 310419, -320257, 59215, 336621, 98591, 107474, 279115, 290996, 189700, 495570, 427049, -19252, -88866, -148978, 25196, 413492, 202359, 277915, -160823, -255120, -181947, 89904, -270791, 150362, 153977, 517325, 405240, 202167, 434313, 474031, 528047, 396565, 607246, 231312, 552495, 761209, 524032, 266069, 449485, 737977, 772926, 625306, 416876, 353472, 265144, 250516, 479898, 327478, 265793, 297197, 622759, 945226, 681881, 484592, 269987, -196643, 251055, -281213, -68588, 327933, 196171, 224455, 259929, 442383, 159412, 150650, -63286, -410723, -368354, -234193, 297572]
11827B97572k48005L2247j8866j58242N8351j4506J0357m2554K90829n13297K30543
11816g5571L29191l17758k8481J18444L91739m6794j6444j80807n12606N60669
11806B21582k764k88658J09945M68109K11350k2909p38361j82108J56765k49960
11796c17009q0320k81617N09027N85059J10530K28660j97935n62442k57342M12208
11786A48819k06811l9693j52015O00689Q9737k96356j03024o8617M86753k49690
11776B09792m45550l7854J5682L45128J06870L64132L71472k26458n78390l2190
11766I2634K65525O18155k44315o20195M71378o00604J17684j45998P8711L83594
11756D16569m3493n29200L19246N00866Q3136l08373n97015K82243o218O1230
$$ y = [297572, 49567, 81814, 62948, -95294, -36943, -51449, -41092, -83646, 207183, -306114, -75571, 253620, -64138, -92619, 25825, 417564, 370770, 354326, 173519, -339087, 221582, 218818, -69840, 40105, 508214, 719564, 696655, -41706, -223814, -67049, -317009, -397329, -678946, -169919, 415140, 525670, 754330, 556395, -6047, -263389, 148819, -57992, -97685, -249700, 350989, 440726, 144370, 41346, -27271, 459482, 209792, -235758, -273612, -257930, 87198, 194068, 558200, 929672, 703214, 124824, 92634, 358159, 976314, 731999, 111804, 583182, -17422, 100262, -45736, 32975, 416569, 373076, -156124, 163122, 663988, 747124, 438751, -158264, 123979, 117761, 178991]
11746A78991L9073O0260N33513n3490k57945l45558L28483J90587q60507K0489
11736a66104M9845l58357O97648n1068l71844r883L76381J93190L8585N4402R9809
11725E52604J76239m40405P475L07434k82390l01872K18260k51297L30720r9138
11715B17630N9152K48624J83811L02009l3638k54295J19227m0688j88818p7220
11705E35794o176M74l55546L05274n5831o7960L78311j22097k80481n68748K4978
11694b12008P78389k20488J00511l06474k2323M3243k38665L91002J39508o6046
11684C86649J80051j61564j77938j71885l26026j74258L29541n2792J41474J65128
11674A38380k75384O8618L14074J23386l44445N1748K44851J79849j89245m16639
$$ y = [178991, 218064, 278324, 811837, 758347, 500402, 154844, 483327, 673914, -186593, -166104, -116259, -474616, 223032, 171964, -199880, -209763, 166618, 359808, 398393, 452795, 552604, 728843, 288438, 295913, 603347, 320957, 19085, 237345, -13952, 316768, 217630, 276782, 525406, 709217, 1011226, 977588, 723293, 842520, 801832, 613014, 535794, 529618, 530092, 174546, 479820, 423989, 356029, 734340, 612243, 331762, -236986, -212008, 566381, 345893, 446404, 139930, 117607, 160850, -77815, 313187, 452695, 386649, 566700, 405136, 227198, 55313, -270713, -444971, -115430, -168222, -26748, 138380, -137004, -68386, 245688, 369074, 24629, 76377, 321228, 501077, 311832, -104807]
11664a04807M95022o9388j36316K38622j42176j91026m11971K26581M76789p0170
11654C11160m63910M193P6476K54722P4516k30991N05112k33892m29146J47891
11644A6131l8338m8184K19045k25542J75178M60037Q0319m01385j47917N1098
11634A40442k01026k65511K2699M80573j55105K92137J8865m0230J93281k07502
11624B78623R5501k14049l33610J11300j05359J96880J70304J39747l0711J89168
11614D97794N2950k19017j01587N03655K31330k97722K52666o31497p06083K27792
11604a89719M35479K06350k16233M38382l05987m80720J4108N50555J52700k81506
11594C23409o5724M47123j23651q1003k55173M37665M5530p43293O42305P8538
$$ y = [-104807, 390215, 320827, 184511, 423133, 280957, 89931, -322040, -95459, 381330, 311160, -152750, -148557, -72081, 182641, 257157, 26166, 531278, 297386, -131760, 16131, -22207, -70391, 148654, -76888, 98290, 558327, 638646, 237261, 89344, 140442, -60584, -326095, -303396, 177177, 22072, 314209, 333074, 292844, 486125, 278623, 374124, 160075, -173535, -62235, -167594, 29286, 199590, 339337, 308626, 497794, 550744, 331727, 230140, 733795, 965125, 667403, 920069, 288572, -417511, -189719, 245760, 452110, 235877, 674259, 368272, -112448, -98340, 452215, 604915, 323409, 257685, 704808, 581157, 500154, 244981, 682646, 728176, -15117, 627188, 705726]
11584G05726j11519J77807N8335m11543m80456L04806R4283K79575o3610K86914
11574H40318L3627n29515L9606K44042K0428l69376j61580L86536J47471K8151
11564F79708J62749l3992K58714n6891l257k87141M288k56837K71399M2387k05039
11553E76088p3892K53766J23718k09497J64259j92828l58448k70570O07678r3435
11543E26839j00998M3368l40872K10363K90103L39991k87077J77232l26179j02748
11533D30022K68232J71499k63875J12358l02797m61956N32614M70979K8720k62316
11523G23480m05973M89386M1830m3850k25542j45830m09047P8593O96336j05731
11513F93652j39333l19978J83197j06558L79404J30940k185q492J65320n37386
$$ y = [705726, 594207, 772014, 830349, 418806, -61650, 243156, 337439, 617014, 553404, 840318, 873945, 344430, 384036, 628078, 648506, 279130, 117550, 504086, 651557, 679708, 842457, 808465, 1067179, 1010288, 1007031, 719890, 724178, 467341, 738740, 781127, 576088, 502196, 755962, 879680, 670183, 834442, 641614, 283166, 12596, 620274, 526839, 425841, 469209, 128337, 338700, 628803, 968794, 681717, 858949, 532770, 430022, 698254, 869753, 605878, 718236, 415439, -46517, 486097, 957076, 985796, 723480, 317507, 806893, 848723, 804873, 579331, 433501, 24454, 103047, 799383, 693652, 554319, 234341, 417538, 310980, 690384, 821324, 819139, 810647, 975967, 438581]
11503D38581l74850J9464M44173k17932Q578M42973p1066L60053l233Q4485m69046
11492F62180n85058N7730q5756M45836J33924K01251M6946M0563J53151P1547
11482A142314m98530l23098Q06038M96173J6121n63099K73038r3685N5283j70257
11472A140298k54114n5772M08311j1041k23730O797K69884l36437p7790L21384
11462A187790L534j71509o8243r9782K41910N14875m83482N39220L29065p30597
11452A262781L15776L2852l01963L77121j19898L57407k04329q7736J22659K22154
11442A976824L01157l47495m16938L71896l60225j58528M07188R6066L3273O78032
11432B581250l00823l42719J49680L32459L34636k10870m62656j64619M20366
$$ y = [438581, 63731, 83195, 527368, 309436, 318014, 760987, 689921, 1049974, 1046741, 1131226, 662180, 77122, 134852, 49096, 494932, 628856, 830107, 877053, 917616, 1070767, 1142314, 643784, 320686, 1126724, 1622897, 1639018, 1075919, 1348957, 1255272, 1310555, 1140298, 886184, 830412, 1238723, 1227682, 1003952, 1010749, 1280633, 944196, 866406, 1187790, 1191324, 1019815, 951572, 851790, 1093700, 1608575, 1125093, 1664313, 1993378, 1262781, 1578557, 1611409, 1309446, 1686567, 1566669, 1924076, 1719747, 1632011, 1754670, 1976824, 2277981, 1930486, 1513548, 1885444, 1525219, 1366691, 1773879, 1869945, 1903218, 2581250, 2280427, 1937708, 2087388, 2419847, 2754483, 2543613, 2080957, 1916338, 2336704]
11423B336704L24184J41538L71046m25775J65111L64940k4131K87743m54616j77383
11413B909361K16579J61028j89780J31971j7930M08647k92159N19768J50235l77030
11403C620690j77726M12861N83241N3951M02921n4322k36634L34168J91285l49940
11393D780495j33941M90148j79601O8050j12019J83704Q5985J14493K38704K8672
11383E564690j50022L08882k13135k70290L33795K35714J02057n86562O60283
11374E985412J89093N39942q14636j47491J95910L00227J38412L8550M01835m15532
11364F411722J06909J74381J91457k53144j03584L16207j19932J21876j13591
11355F732301n24053j39313K09339j54409l56069O10754J39902n69097k33617
$$ y = [2336704, 2660888, 2802426, 3173472, 2747697, 2912808, 3277748, 3253617, 3541360, 3086744, 2909361, 3125940, 3286968, 3097188, 3229159, 3211229, 3619876, 3327717, 3847485, 3997720, 3620690, 3442964, 3855825, 4439066, 4493017, 4895938, 4841616, 4604982, 4939150, 5130435, 4780495, 4646554, 5136702, 4957101, 5025151, 4913132, 5096836, 5182821, 5297314, 5536018, 5564690, 5414668, 5723550, 5510415, 5240125, 5573920, 5809634, 5911691, 5325129, 5985412, 6174505, 6714447, 5899811, 5752320, 5948230, 6248457, 6386869, 6425419, 6827254, 6411722, 6518631, 6693012, 6884469, 6631325, 6527741, 6843948, 6724016, 6845892, 6732301, 6208248, 6068935, 6278274, 6123865, 5767796, 6378550, 6518452, 5949355, 5715738]
11346E715738j8053k877p4336n32777j07115l5498k10084j21042J32650l84409
11336D362197j99357J4451j53914l06087m96881M26146l36769j06260R3506K1347
11326C318379O11890m78737l26602j86277k08898J26685J68701K5297J30885j66023
11316C015300m82942j24746j29199J21390K2338k16294n0609O19099O9470j78592
11306B665215l70647j4787L30748j17604r0721j22739o9677k23590J26416k29148
11296A883466k84410K16103K06646J58340n38108K29634J84066o90209k34258
11287A131270L80565k07278l05335K7607L88983L98955L61090l7136K7092L21472
11277B487285k57082k87695J60963j29429l29795J14135O67491K09047k92669
$$ y = [5715738, 5697685, 5694808, 5620472, 5087695, 4980580, 4945082, 4734998, 4613956, 4746606, 4362197, 4162840, 4177291, 4023377, 3717290, 3220409, 3646555, 3309786, 3203526, 3297032, 3318379, 3930269, 3451532, 3124930, 2938653, 2729755, 2856440, 3025141, 3050438, 3181323, 3015300, 2532358, 2407612, 2278413, 2399803, 2422141, 2205847, 2155238, 2774337, 2843807, 2665215, 2294568, 2279781, 2610529, 2492925, 2402204, 2279465, 2209788, 1986198, 2112614, 1883466, 1599056, 1815159, 2021805, 2180145, 1642037, 1871671, 2055737, 1365528, 1131270, 1511835, 1304557, 999222, 1026829, 1415812, 1814767, 2175857, 2138721, 2165813, 2487285, 2230203, 1942508, 2103471, 1974042, 1644247, 1758382, 2425873, 2634920, 2342251]
11268B342251k41979l48130P0628J68845j50283K46654m18192K011J19942M4514
11258A836261P9981j00302J50454o12471M381N33953L10020k86274k96914j20629
11248A498460N76878j42159j9187K57194k32126l17066m24085N7701M31892J38472
11238A825974O39705n33402l02925q9581p1954K43021L41403K18108o5361m08180
11228A796808o46637O07131K87507j84243K48679j2922l11204J99676j5614k93739
11218A675442K55351J82607k57671j06234M57625J29250j23824k86897j0304K007
11208A917352L43141J79279n5141M51837M691l55602l30542j75845L80754j36747
11198B223177J14247K52947j60119M00033J96268J25593k88327l18618j45600
$$ y = [2342251, 2100272, 1752142, 1822770, 1991615, 1841332, 2087986, 1669794, 1671805, 1791747, 1836261, 1916242, 1815940, 1966394, 1353923, 1358304, 1892257, 2202277, 1916003, 1619089, 1498460, 2075338, 1933179, 1913992, 2171186, 1939060, 1621994, 1197909, 1255610, 1687502, 1825974, 2465679, 1932277, 1629352, 1539771, 1467817, 1710838, 2052241, 2270349, 2204988, 1796808, 1150171, 1757302, 2044809, 1860566, 2109245, 2096323, 1785119, 1984795, 1969181, 1675442, 1930793, 2113400, 1855729, 1749495, 2207120, 2336370, 2212546, 1925649, 1915345, 1917352, 2260493, 2439772, 2384631, 2836468, 2841159, 2485557, 2155015, 1979170, 2359924, 2223177, 2337424, 2590371, 2430252, 2830285, 3026553, 3152146, 2863819, 2545201, 2399601]
11189B399601l0341K91039K20772L50517P3356k65065M2579L19742j70707k9383
11179C202110m10016j58800K81658J59308J31686l24129L70762p7356l35404K37731
11169C077550K80519M7725J35535L29759K56440j83050L8238m40153K16789O14817
11159D374169J13632k72145l36639K59768K11101m2413k90155J47629L04186L28811
11149D797944k89835j53987M49335p9349L22198k35307j24816o13J83405M421
11139D873396J84691L49985L5154J54270L7817P6703J00448K95071L10125j99510
11129F218150j74344M0207J90947K53350J04924K30156L32462L49436j47377R6966
11119G494877r1656L75525M1420j00823M45181N82601k09473m83579L30605O18413
$$ y = [2399601, 2369260, 2660299, 2881071, 3231588, 3304944, 3039879, 3082458, 3402200, 3231493, 3202110, 2792094, 2633294, 2914952, 3074260, 3205946, 2881817, 3252579, 3175223, 2839819, 3077550, 3358069, 3405794, 3541329, 3871088, 4127528, 3944478, 3982716, 3542563, 3759352, 4374169, 4487801, 4215656, 3879017, 4138785, 4349886, 4307473, 4017318, 4164947, 4469133, 4797944, 4508109, 4354122, 4803457, 4724108, 5046306, 4810999, 4686183, 4685570, 4868975, 4873396, 5058087, 5408072, 5443226, 5597496, 5635313, 5712016, 5812464, 6107535, 6417660, 6218150, 6043806, 6084013, 6274960, 6528310, 6633234, 6863390, 7195852, 7545288, 7397911, 7494877, 7403221, 7778746, 7820166, 7719343, 8164524, 8747125, 8537652, 8054073, 8384678, 9003091]
11109I003091K41483q2027P0444k5990L34795J54591M44237M41836M09878k25050
11099A0767288N7215N98662J98207m5844J84004K38776N05963K36453L91597M91586
11089A3623907L97935J20063M92309J74102O59577K47852j21144N82936P23596
11080A6901133L17118M3891M98402M49502J44864M02605M00872L13049K78635
11071A9750071M63432O10725O68724L97312N16820O32728Q04132K49665M91110
11062B4584719Q92697N36970O52556j76799N56798L88450O68659J001961N62358
11053B9668369L97995m6497O50349J033439r0643N57807M08457M46112n9564l60126
11043C2605698O13383M07465l28254m86722j46472M26147k90625k39518k30365
$$ y = [9003091, 9244574, 9162547, 9232991, 9207001, 9541796, 9696387, 10140624, 10582460, 10992338, 10767288, 10824503, 11423165, 11621372, 11575528, 11759532, 11998308, 12504271, 12740724, 13132321, 13623907, 14021842, 14141905, 14634214, 14808316, 15467893, 15715745, 15594601, 16177537, 16901133, 17218251, 17262142, 17760544, 18210046, 18354910, 18757515, 19158387, 19471436, 19750071, 20213503, 20824228, 21492952, 21890264, 22407084, 23039812, 23843944, 24093609, 24584719, 25477416, 26014386, 26666942, 26490143, 27046941, 27435391, 28104050, 29106011, 29668369, 30066364, 30019867, 30670216, 31703655, 31613012, 32170819, 32579276, 33025388, 32965824, 32605698, 33219081, 33626546, 33298292, 32811570, 32665098, 33091245, 32800620, 32561102, 32330737]
11034C2330737j12065n95408o16977n87846o08834o19915m98082n50628N4499
11025B8195481l51467p07157q60458k21363q16976j075429p28485l57356n71092
11016B2505698n47583m62462m90933n74301l55829m45963r71314q61175k22269
11007A7573869j79719q45953l27828l46475M6420l94157m18122p66028l44993
10998A3997014l82811l57849m93408m76722N3665m70720k53477l95285j98898
10989A1021509o05568N2366j9108k60338J75522m94119k61408m74971J49853l58228
10979H925510l02286q6320n40081k38507O8185l8936P01078n69435l07437Q5788
10969G697559o82167k82032N5683j45386R1829j21360k55603j92627m40319K80723
$$ y = [32330737, 32218672, 31623264, 31006287, 30418441, 29809607, 29189692, 28691610, 28140982, 28195481, 27844014, 27136857, 26276399, 26055036, 25238060, 24162631, 23434146, 23076790, 22505698, 21958115, 21495653, 21004720, 20430419, 20074590, 19628627, 18657313, 17796138, 17573869, 17394150, 16548197, 16220369, 15873894, 15920314, 15526157, 15108035, 14342007, 13997014, 13614203, 13256354, 12762946, 12286224, 12339889, 11869169, 11615692, 11220407, 11021509, 10415941, 10468307, 10449199, 10188861, 10364383, 9870264, 9608856, 9133885, 9283738, 8925510, 8623224, 8536904, 7996823, 7758316, 7826501, 7787565, 8488643, 7919208, 7611771, 7697559, 7015392, 6733360, 6789043, 6643657, 6735486, 6614126, 6358523, 6165896, 5725577, 6006300]
10959F006300k28441j69139o6583m49797k79019M7605N47280k09331m02644k62328
10949D533903p6557K67808J48088j21608j26020J46004m24779l77336L03288K19664
10939D492455L88593o43678p62847N56733k06111L6026J75531N9774k93441k76240
10929C526795K93208K19612k43422l26533N3102J35942j75368k43940L5598k02709
10919C072285K78227m16709L31489J24521m24341J32717M87870l29737m4069j509
10909C210744j14927k87180L13K34012J34801j96903r5343M61552k85274P0628
10899C132423k9834L1237Q0605l42155J79588r0372k64378j12987m44196K17368
10889B357299k94543N82358K31827K64927m27031m22693L27863J76356N0725o1316
$$ y = [6006300, 5777859, 5608720, 5542137, 5092340, 4813321, 4860926, 5408206, 5198875, 4796231, 4533903, 4457346, 4725154, 4873242, 4751634, 4625614, 4771618, 4346839, 3969503, 4272791, 4492455, 4881048, 4237370, 3474523, 4031256, 3825145, 3861171, 4036702, 4096476, 3803035, 3526795, 3820003, 4039615, 3796193, 3469660, 3522762, 3658704, 3483336, 3239396, 3274994, 3072285, 3350512, 2933803, 3265292, 3389813, 2965472, 3098189, 3586059, 3256322, 3212253, 3210744, 3095817, 2808637, 2808950, 3042962, 3177763, 2980860, 2885517, 3347069, 3061795, 3132423, 3102589, 3133826, 3214431, 2872276, 3051864, 2961492, 2697114, 2584127, 2139931, 2357299, 2062756, 2645114, 2876941, 3141868, 2714837, 2292144, 2620007, 2796363, 2847088, 2785772]
10879B785772R9253k29623k89840j17115N79223j39889K03722j45353j2542k6674
10869B706934o49677K6270J55207M5719k67671J89528K65458L51681l82686L53157
10859B793920k70598k59447P78341J59684J95129n1396k92353K23335N58826q2038
10849C753403L765j3355l87223l59108m98970J51646K1829J88040J87119o35813
10839B411333O5282K56240n2498L4818J57575L62580K18678k19532k47049j07583
10829B879844k8902J7736L84143k2630K52215m2172j12467l54890L39430J45085
10819C457392q701J87127K36401j22017m2800j07023R254J21194O1918p9727K00344
10808C913362j13112n9592K53786R2298O7427k49256J98414r1284j48587K58213
$$ y = [2785772, 2885025, 2655402, 2365562, 2248447, 2827670, 2687781, 2891503, 2746150, 2733608, 2706934, 2057257, 2083527, 2238734, 2284453, 2016782, 2206310, 2471768, 2823449, 2440763, 2793920, 2523322, 2263875, 3042216, 3201900, 3397029, 3345633, 3053280, 3276615, 3835441, 3753403, 3757168, 3743813, 3356590, 2997482, 2498512, 2650158, 2671987, 2860027, 3047146, 2411333, 2476615, 2732855, 2680357, 2715175, 2872750, 3235330, 3454008, 3234476, 2987427, 2879844, 2850942, 2868678, 3252821, 3230191, 3482406, 3440234, 3327767, 2972877, 3312307, 3457392, 3448691, 3635818, 3872219, 3750202, 3707402, 3600379, 3609633, 3730827, 3792745, 3713018, 3913362, 3800250, 3740658, 3994444, 4086742, 4154169, 3904913, 4103327, 4012043, 3863456, 4121669]
10798D121669j49776o06886J98967N01479O15302k34149l24363K9068N79094J27382
10788D857787L6769k44861N7565O05857j71024m87516K32365K58108k91406L8653
10778D892297M05883N8109m38647K97068J60333k15976K13384M55490K27841j83358
10768E872424J33415k07664J34245P0124M31473j83816J61070m4369K18749l78040
10758F207611J92236K18018L72782o8450Q059J37843R1825j90446j27627K91224
10748G133075K65243J37494j53804j44698k71073L02322p4355l0262L28298R0001
10738G582241L29959r2262k58779L23119j86324j90528R3620R999L77659p5003
10728G913701k37772j16418j65596L39615M304k04983m3638L38200m6498J26258
$$ y = [4121669, 3971893, 3365007, 3563974, 4065453, 4680755, 4446606, 4122243, 4151311, 4730405, 4857787, 4894556, 4649695, 4707260, 5313117, 5142093, 4654577, 4886942, 5145050, 4853644, 4892297, 5298180, 5356289, 4917642, 5214710, 5375043, 5159067, 5372451, 5827941, 6055782, 5872424, 6005839, 5798175, 5932420, 6002544, 6434017, 6250201, 6411271, 6366902, 6585651, 6207611, 6399847, 6617865, 6990647, 6922197, 6930256, 7068099, 7159924, 6969478, 6841851, 7133075, 7398318, 7535812, 7382008, 7237310, 6966237, 7268559, 7194204, 7163942, 7492240, 7582241, 7912200, 7819938, 7561159, 7884278, 7697954, 7507426, 7601046, 7611045, 7988704, 7913701, 7675929, 7559511, 7393915, 7733530, 7737834, 7532851, 7489213, 7827413, 7780915, 7907173]
10718G907173m92818L60855n27005q91707K38720M95744m23978m42772j93663
10709F030549L38306k24493k01849K93746J75096L09697J06265n82002l91543
10700E853772l97095J11758m07288K84487L43052j04590m1118l16812j04192l9313
10690E182661n48612p0522J22438r3900J29219j2059k23847k11526p9445K27899
10680D422306k16029J29093k2214j25788k45527k77942N75844j53251n84009j70976
10670C331507r498N79060j23451l23961k60305P5016K62148p905J26970r4556
10660C555025m66859J72279n0486j75650j52907j64693M39083k42053k88921o3635
10650B561183K20082m14253j08369J61469j94271m62441K02571M93183K38775
$$ y = [7907173, 7414355, 7775210, 7248205, 6356498, 6595218, 7090962, 6666984, 6224212, 6030549, 6368855, 6144362, 5942513, 6236259, 6411355, 6721052, 6827317, 6245315, 5853772, 5456677, 5568435, 5161147, 5445634, 5788686, 5684096, 5642978, 5326166, 5221974, 5182661, 4634049, 4563527, 4685965, 4592065, 4721284, 4709225, 4485378, 4273852, 4194407, 4422306, 4206277, 4335370, 4313156, 4187368, 3941841, 3663899, 4239743, 4086492, 3502483, 3331507, 3322009, 3901069, 3777618, 3453657, 3193352, 3268368, 3530516, 3522611, 3649581, 3555025, 3088166, 3260445, 3209959, 3034309, 2881402, 2716709, 3155792, 2913739, 2624818, 2561183, 2781265, 2367012, 2258643, 2420112, 2225841, 1763400, 1965971, 2459154, 2697929]
10641B697929J0598M7693j6883l1290O6488m75764l3725l71748k25850N64040
10631B231488L08063J04976m42117K09534l02410n0237l52549k25376J79281l0711
10621A629942J3921l2317j03247L83171J3205J02129o85466j00026N60524J89897
10611A971733J4067k31944r309j8968k73562m7218K65603N1085j1175j55318k59081
10600A295913J78851O02342j39307r3706k4515l18996P1795j39381J03501J90474
10590A726971K46046l89014K15001J292j74180J7748l5880j38102k14633K21857
10580A477106k89439k46673L80376j45320l13445J12146L43849J62330k21441
10571A259489l4389J58996K20786k54994l93963j41403K32226O65979k47708k77391
$$ y = [2697929, 2708527, 2756220, 2739337, 2708047, 2774535, 2298771, 2265046, 1893298, 1667448, 2231488, 2539551, 2644527, 2202410, 2411944, 2109534, 2059297, 1706748, 1481372, 1660653, 1629942, 1643863, 1611546, 1508299, 1891470, 1904675, 2006804, 1321338, 1221312, 1781836, 1971733, 1985800, 1753856, 1744547, 1725579, 1452017, 1404799, 1670402, 1721487, 1710312, 1554994, 1295913, 1474764, 2077106, 1937799, 1844093, 1819578, 1500582, 1572377, 1432996, 1536497, 1726971, 1973017, 1584003, 1799004, 1800296, 1626116, 1643864, 1607984, 1469882, 1255249, 1477106, 1187667, 940994, 1321370, 1176050, 862605, 974751, 1318600, 1480930, 1259489, 1225100, 1384096, 1604882, 1349888, 955925, 814522, 1046748, 1712727, 1465019, 1187628]
10561A187628J22189k59490j20827J54717l59020K04766K5099o6452j37043K38824
10551I90391J13037j53844J96303k99499K00710K84291m37851l44072N11298l38989
10541G21775J26199k4203J85623j2275j45977n3527L21040P3838j76366P28343
10531A744470K31887n51062m45063R9444P1811J87070m16157o1855N21356K89058
10521A670959j23298k95226l81473m90286j5308J15501O2253l09330L559M30402
10511F67753M50349l21126j25749n08661L2118K97339L54780n3067j03444n88080
10501A02212K48568K61970J37559k43648J8686J74858k73977k40441M94359L10271
10491I90417j86032j64603p23749M79285M66658l32859K81097N01950n70422m55596
$$ y = [1187628, 1309817, 1050327, 929500, 1084217, 725197, 929963, 955062, 888610, 751567, 990391, 1103428, 949584, 1145887, 846388, 1047098, 1331389, 893538, 549466, 1060764, 721775, 847974, 823771, 1009394, 997119, 851142, 797615, 1118655, 1192493, 1016127, 1744470, 1976357, 1425295, 980232, 1079676, 1151487, 1338557, 922400, 860545, 1381901, 1670959, 1547661, 1252435, 870962, 380676, 365368, 480869, 543122, 233792, 237351, 667753, 1118102, 796976, 671227, 162566, 194684, 492023, 846803, 793736, 690292, 102212, 350780, 612750, 750309, 506661, 525347, 700205, 426228, 185787, 680146, 990417, 804385, 639782, -83967, 395318, 861976, 529117, 810214, 1312164, 741742, 286146]
10481B86146Q3269J24430L69723l64424J71125M47024k54567k40790m52643O70877
10471H40170l61696q3609J73676m04318J17193L94901K29346Q070J27228q5270
10461I55691j07807k66685R7470k03299L47962j45580K24398L78713k41301j28012
10451I11550R6929K46614m62334q9380J25550j75909j21554J85169l91706J71614
10441D96543O5948L21213P8011o52980K23469m6978L089m25976J85304K0118j19983
10430A47778M96206L30080k79243k94708r8699J05575K56570J8480n9136k58360
10420C64543J37433j32648K5441J81030J07600m00008L42769J95403K18350k73671
10410G66242p436q2055K71909k88737J4l47537K3657J52271r0396L28075L42169
$$ y = [286146, 369415, 493845, 863568, 499144, 670269, 1117293, 862726, 621936, 169293, 840170, 478474, 394865, 568541, 164223, 281416, 676317, 905663, 913733, 1040961, 955691, 847884, 581199, 678669, 475370, 823332, 677752, 902150, 1280863, 1039562, 911550, 1008479, 1255093, 792759, 703379, 828929, 653020, 531466, 716635, 324929, 496543, 562491, 883704, 961715, 308735, 532204, 485226, 488315, 62339, 247643, 267761, 147778, 643984, 974064, 694821, 400113, 301414, 406989, 663559, 682039, 622903, 364543, 501976, 369328, 394769, 575799, 683399, 283391, 626160, 821563, 1039913, 766242, 758806, 676751, 948660, 659923, 659937, 312400, 336057, 488328, 397932, 726007, 1068176]
10399A068176J75177m49126K79944j46351l87165J17941k4641P3433J87879k39831
10389F55436j37597L09733O6146k550k88560k7630l11764J91261K20248j45793
10379E28930M29204J16771J59302k47080P0387K8426k55517m16702L59757P3804
10369H47282j32427N3874m11820K52508J80288j07504j89165j00203L69619L6750
10359G99202k68373J02958J77379Q2076k55750m4640J23483J35506J38459P5502
10349A065802j02754j93089p6936J77938R3719n48248Q3371M25198J2121L22817
10339A259939l80870j73973L26175l68544J44086J28250n8802j436Q3408l66065
10329E92168j99258j12612k68429o971L04689m6499K05724K05691J26379l25246
$$ y = [1068176, 1243353, 794227, 1074171, 927820, 540655, 658596, 633955, 707388, 895267, 655436, 517839, 827572, 893718, 891168, 602608, 574978, 263214, 454475, 674723, 528930, 958134, 1074905, 1234207, 987127, 1057514, 1085940, 830423, 413721, 773478, 847282, 714855, 768729, 356909, 609417, 789705, 682201, 493036, 392833, 762452, 799202, 530829, 633787, 811166, 893242, 637492, 592852, 716335, 851841, 990300, 1065802, 963048, 769959, 693023, 870961, 964680, 416432, 499803, 925001, 937122, 1259939, 879069, 705096, 1031271, 662727, 806813, 935063, 876261, 874825, 958233, 592168, 392910, 280298, 11869, 4898, 309587, 263088, 468812, 674503, 800882, 475636]
10319D75636K69118L97664k15447K85127k12112q9861R8859n616J27570J87447
10309A318385l02063p15099L66319M96017K71593l41178k8451L97156l61996n54335
10299E46348j53746j58848Q61607M57123l88442Q0868P37291n13853m16991M79480
10289A530837l96123J77045M12148K4691j68934j21690K42219j72044k86216J28075
10279A370008j09893J45436q6429M47914j2517m84858M18979k71361m10552M06410
10269A413137P128J88031K5467l07551K86613N58021n61875M5937L03413j17133
10259A841188o44816j34696O42652J08765J14859n20347J67440L73210M50064
10250B398319o1785J06929K93129K07967L16501K7898j3211O1006K05117J30902
$$ y = [475636, 744754, 1142418, 926971, 1212098, 999986, 910125, 1008984, 1003368, 1130938, 1318385, 1016322, 301223, 667542, 1163559, 1435152, 1093974, 1065523, 1462679, 1100683, 546348, 392602, 233754, 1095361, 1552484, 1164042, 1244910, 1982201, 1468348, 1051357, 1530837, 1134714, 1311759, 1723907, 1748598, 1579664, 1457974, 1700193, 1528149, 1241933, 1370008, 1260115, 1405551, 1319122, 1767036, 1754519, 1269661, 1688640, 1417279, 1006727, 1413137, 1420265, 1608296, 1633763, 1326212, 1612825, 2170846, 1608971, 1654908, 1958321, 1841188, 1196372, 1061676, 1704328, 1813093, 1927952, 1407605, 1575045, 1948255, 2398319, 2336534, 2443463, 2736592, 2944559, 3261060, 3288958, 3275747, 3336753, 3541870, 3672772]
10240C672772k35291k31027J72731R9610r5416k48054l73693k97311M3923k65685
10230B242559n61211m57709L17742N87673k08611m10000n8771M08803j68104K29188
10220A921559J45006n37791j59360r8172K92075k20341p2772N6178J79633k04212
10210A301803L5430l67120O23672K79257m80567J67908l21704l10815P95596J80429
10200A903889l57733M02269K6441j63358l11694l2281Q2573J65233K14793k290
10190A927842j1065Q5344l09326O23504j27238p14941J44757K10634J79479l04119
10180A704871j39873O31710k49295J4244K34602K36998o6594q2995R005R2308
10170B384981l0840m66490J96992L52091P23355R6473r4024k39003l78763K09609
$$ y = [3672772, 3437481, 3206454, 3379185, 3478795, 3383379, 3135325, 2761632, 2464321, 2508244, 2242559, 1681348, 1223639, 1541381, 2129054, 1920443, 1510443, 1451672, 1860475, 1692371, 1921559, 2066565, 1528774, 1369414, 1271242, 1563317, 1342976, 1270204, 1326382, 1506015, 1301803, 1337233, 970113, 1593785, 1873042, 1392475, 1560383, 1238679, 927864, 1723460, 1903889, 1546156, 1948425, 1974866, 1811508, 1499814, 1467533, 1550106, 1715339, 1930132, 1927842, 1916777, 2002121, 1692795, 2316299, 2189061, 1474120, 1618877, 1829511, 2008990, 1704871, 1564998, 2196708, 1947413, 1961657, 2196259, 2433257, 2366663, 2283668, 2292673, 2384981, 2354141, 1887651, 2084643, 2436734, 3160089, 3256562, 3162538, 2923535, 2544772, 2754381]
10160B754381N75364q8638J90109N177L4424n67903P2457M76558n3162M1897j13550
10149C327114l28105J7115q715l18663m60100K31708Q7251l2403j88717j21874
10139B204611r4870j43009j15663k8456r1314m14941N92391J80386l79792k76772
10129A432571J987n5423M52048P4282K34811k62048l48691M0453k58646P9868
10119A391212M9714k35297l68845j82133L54811J25621K83232m8607K7999m25573
10109I72134K11912L33496j20770n4357k65445L51857J80438n26408J6133J12741
10099A211731j07605k47307K70477M28767J1777P9090k09892J93780l89378L08639
10089A550079N011l49252M96067j96128l50023J10554N22882l08127M19259K21016
$$ y = [2754381, 3329745, 3241107, 3431216, 3436393, 3470817, 2902914, 2975371, 3451929, 3398767, 3440664, 3327114, 2999009, 3016124, 3007409, 2688746, 2228646, 2460354, 2547605, 2515202, 2326485, 2204611, 2109741, 1966732, 1851069, 1822613, 1731299, 1316358, 1908749, 2089135, 1709343, 1432571, 1434558, 1379135, 1831183, 1905465, 2140276, 1878228, 1529537, 1569990, 1311344, 1391212, 1440926, 1205629, 836784, 654651, 1009462, 1135083, 1418315, 1369708, 1397707, 972134, 1184046, 1517542, 1396772, 1342415, 1076970, 1428827, 1609265, 1082857, 1098990, 1211731, 1104126, 856819, 1127296, 1556063, 1567840, 1646930, 1437038, 1630818, 1241440, 1550079, 1555090, 1205838, 1701905, 1505777, 1155754, 1266308, 1789190, 1481063, 1900322, 2121338]
10079B121338k46092m52822l78360N62663J09998j35181J26344K99243j29454
10070A877677Q2212k42505j39958L90377m84931M05954L6542m23498j63055K96292
10060A635107M31K53047O9574p56400J46906N12404M9452m11589l71339K06505
10050A334098M84448o65520J23044j5223k3696K52946l387k00102J32374k81721
10040A137261p8158j86604N9803N2669J42995J4166O12440P1752n45696m22870
10030H57758j0164K76445J34891j67837m6333J93307M6366K04038k29859k30000
10020A028612K36730M466j9608M14486r7248K30240l89937j03828J65196k89329
10010A179780K17630j9477J19035j39631n30103L7913M40835K81717m84089j99729
$$ y = [2121338, 1875246, 1422424, 1044064, 1606727, 1716725, 1581544, 1707888, 2007131, 1877677, 1959889, 1717384, 1577426, 1967803, 1482872, 1888826, 1925368, 1501870, 1338815, 1635107, 1635538, 1888585, 1958159, 1201759, 1348665, 1861069, 1910521, 1498932, 1127593, 1334098, 1818546, 1153026, 1276070, 1260847, 1237151, 1490097, 1486710, 1286608, 1418982, 1137261, 1059103, 872499, 932302, 984971, 1127966, 1142132, 1754572, 1826324, 1280628, 857758, 847594, 1124039, 1258930, 1091093, 1044760, 1238067, 1284433, 1488471, 1258612, 1028612, 1265342, 1269808, 1250200, 1664686, 1567438, 1797678, 1407741, 1303913, 1469109, 1179780, 1397410, 1377933, 1496968, 1357337, 827234, 865147, 1305982, 1587699, 1103610, 903881]
10000I03881M2643l9527R4098K71811m22368j04232K31686Q1779k26216L87992
9990A221547M82359j40170k62441j1036M9020m52430L7213N75269k52713M4570
9980A291188K02037K59139m28543k18356N21542p305J25162j74764k43439j16783
9970A209878N26030J50633j47241N07767L07910k67726o24866n6866k1508o7204
9960A516807J3670Q9832L46357n16568L62472L3838j63346J61483K98615R508
9950B152668M9661Q6963k25405J15025n5250K26252K98877o38153k00316J357672
9940C167994l90056n74764L27570L64179l45052k02270J90229L17531K67852l02553
9930B820660l16989L04457L54251K06447L15472M32626L28540J2694K86489m93962
$$ y = [903881, 946524, 906997, 1001095, 1272906, 850538, 746306, 977992, 1059771, 833555, 1221547, 1703906, 1563736, 1301295, 1290259, 1339279, 886849, 924062, 1499331, 1246618, 1291188, 1493225, 1752364, 1323821, 1105465, 1627007, 1619702, 1744864, 1570100, 1326661, 1209878, 1735908, 1886541, 1739300, 2247067, 2554977, 2287251, 1662385, 1605519, 1584011, 1516807, 1530477, 1620309, 1966666, 1450098, 1812570, 1846408, 1683062, 1844545, 2143160, 2152668, 2202329, 2289292, 2063887, 2178912, 2123662, 2349914, 2648791, 2010638, 1810322, 3167994, 2777938, 2203174, 2530744, 2894923, 2549871, 2347601, 2537830, 2855361, 3123213, 2820660, 2503671, 2808128, 3162379, 3368826, 3684298, 4116924, 4445464, 4458158, 4744647, 4250685]
9920D250685j16533j30811k84727j78613q76593k50221K33215L4721k0722q1330
9910B579071L00240K98083k04752n33512J10194l50265K71160l3223j71813l45663
9900A919520j62838L85153J80922k35909p21456N46599O15954j00990Q8160k43017
9890B272098l50455N7331q271L66411k79762P1348N62917r9017o1898m31546l1799
9879B067357M97725k19186l32137k13534r815K22770M68712j61222K98550j74705
9869B444515l42668M02565l54753k53653K37127K80457K01440k67833m87293K09413
9859B069317k89090J18517K16836k09185J21689q2991L7132j53414M58224L87393
9849B674428j73696L144l62151M37127r7605l49058L53669J06427K69620J41142
$$ y = [4250685, 4134152, 4003341, 3718614, 3540001, 2663408, 2413187, 2646402, 2681123, 2660401, 2579071, 2879311, 3177394, 2972642, 2439130, 2549324, 2199059, 2470219, 2436996, 2265183, 1919520, 1756682, 2141835, 2322757, 2086848, 1365392, 1911991, 2527945, 2426955, 2515115, 2272098, 1921643, 1978974, 1970703, 2337114, 2057352, 2128700, 2691617, 2592600, 2530702, 2099156, 2067357, 2565082, 2345896, 2013759, 1800225, 1790410, 2013180, 2481892, 2320670, 2619220, 2444515, 2101847, 2504412, 2149659, 1896006, 2133133, 2413590, 2615030, 2347197, 1859904, 2069317, 1780227, 1898744, 2115580, 1906395, 2028084, 1945093, 1982225, 1828811, 2287035, 2674428, 2500732, 2503876, 2141725, 2578852, 2481247, 2132189, 2485858, 2592285, 2861905, 3003047]
9839C003047K15826j59013k75803j24099K19441P990k93092J67155k03189o784
9829B551479p5399R6041L29958n99827M79448N3353l0407K90870l1902K2883q8631
9818B997866l9108K57979k12368l0684J13915L96637n2323r48530N18511N37493
9808C539388o4077R9978J8248r0574J56563L01578k1937k1418j43304R6926k05297
9797C666074J08229k5033J5640N06184l25697k6938K04878K41927q6952R7368
9787D375680J6859L3218M1375j87132m5230N91784M81779j69474j29601L9098
9777E048356Q0387L80603k07880L19202O8398R2663n38486K35397P46363K93218
9767F518221J07082J89313K80836K48098N42624k67828p60292L87787M00872L40346
$$ y = [3003047, 3218873, 3059860, 2784057, 2659958, 2879399, 2887389, 2594297, 2761452, 2558263, 2551479, 2476080, 2572121, 2902079, 2302252, 2781700, 2835053, 2804646, 3095516, 3063614, 3086497, 2997866, 2958758, 3216737, 3004369, 2973685, 3087600, 3484237, 3431914, 2483384, 3001895, 3539388, 3475311, 3575289, 3593537, 3502963, 3659526, 3961104, 3939167, 3917749, 3774445, 3871371, 3666074, 3774303, 3749270, 3764910, 4271094, 3945397, 3918459, 4123337, 4365264, 4278312, 4375680, 4392539, 4425757, 4467132, 4280000, 4234770, 4826554, 5308333, 5138859, 5009258, 5048356, 5128743, 5509346, 5301466, 5620668, 5689066, 5781729, 5243243, 5478640, 6225003, 6518221, 6625303, 6814616, 7095452, 7343550, 7886174, 7618346, 6858054, 7245841, 7646713, 7987059]
9757G987059L36951l45063J55192Q8361L49782K13993J56800J88613J12139J26431
9747I370258J75393J28126L24909J72169O30517J32583J34875N0102L27136M52852
9737A1898920K43301N22088R8620L26856L40040N48521J90403N17253N98804Q07140
9727A6091946J844P22492N51355P16269P02394N13201O81982M84167J343287M84485
9717B2293422R95960M85694J495399Q30847P24515J469291J075203J220638K049518
9708C2640487J944149K271847K415700K843000K825635L842494L872838M706386
9700E7362536O139332N984874O498233O422706N769445M377930K469736R47951
9692I5972743j073912j122423k5588K34847K4158m25629k127817m039752n710969
$$ y = [7987059, 8324010, 7978947, 8134139, 8222500, 8572282, 8786275, 8943075, 9131688, 9243827, 9370258, 9545651, 9673777, 9998686, 10170855, 10801372, 10933955, 11068830, 11118932, 11446068, 11898920, 12142221, 12664309, 12762929, 13089785, 13429825, 13978346, 14168749, 14686002, 15284806, 16091946, 16093790, 16816282, 17367637, 18083906, 18786300, 19299501, 19981483, 20465650, 21808937, 22293422, 23289382, 23775076, 25270475, 26101322, 26825837, 28295128, 29370331, 30590969, 32640487, 34584636, 36856483, 39272183, 42115183, 44940818, 48783312, 52656150, 57362536, 63501868, 69486742, 75984975, 82407681, 88177126, 92555056, 95024792, 95972743, 94898831, 93776408, 93750820, 93985667, 94009825, 93584196, 91456379, 87416627, 81705658]
9683H1705658o690904p156584o625228n410573n238870m130049l196319k742935
9675D0514196l006892j963120r56256j273606j084975j039058j149196n03165
9667B9537928p60522l06860p43161j05734p02502l05123k60347m75991K5066K92221
9657B6194975m8095J86824R14933M64427L23182M4810M31511J089627J394571
9648C0996765J003012K011847J593067J467258J948389J966688K023336J862675
9640D4873037J227492O05477N67774M57004Q10824M40075J169192R44474J391350
9631E2486699J011977K10195N13731Q04184J056346J303950J106083R69789R77900
9622F0440854L44714o73878q48428r59110j899140j774383k310532k243132k120632
$$ y = [81705658, 75014754, 67858170, 61232942, 55822369, 50583499, 46453450, 43257131, 40514196, 37507304, 35544184, 34587928, 33314322, 32229347, 31190289, 30041093, 29537928, 28777406, 28470546, 27727385, 27621651, 26919149, 26614026, 26353679, 25877688, 25902754, 26194975, 26146880, 26333704, 27248637, 27713064, 28036246, 28081056, 28512567, 29602194, 30996765, 31999777, 34011624, 35604691, 37071949, 39020338, 40987026, 43010362, 44873037, 46100529, 46706006, 47273780, 47730784, 48541608, 48981683, 50150875, 51095349, 52486699, 53498676, 53708871, 54222602, 55026786, 56083132, 57387082, 58493165, 59462954, 60440854, 60785568, 60111690, 59263262, 58304152, 56405012, 54630629, 52320097, 50076965, 47956333]
9613D7956333k267452k000700j128503r16496r04064p14294J6033k14258k84248
9604C9542351M24540O803K10138Q28194Q46266J732070J325762J328987J749477
9595D7994588K132319K989831K546246L157967L428969L375388K517900J639528
9587F9782736J656224J087754O856l96116j290213p93420j011734r28335q49449
9578F7264303j095174j69765L30610N83020J925415L083954L210719L967449M840870
9569H3941401M550412M755438M058030L710066K944117J475544O17455o69909
9561A05382554j855424k325749k406186l173217l844905l743060l910127l137047
9553H0986839l421772l191283k854194k899472k298546k082886j982749j824623
$$ y = [47956333, 45688881, 43688181, 42559678, 41643182, 40739118, 40024824, 40040857, 39826599, 39542351, 39966891, 39973694, 40183832, 41012026, 41858292, 43590362, 44916124, 46245111, 47994588, 50126907, 53116738, 55662984, 58820951, 62249920, 65625308, 68143208, 69782736, 71438960, 72526714, 72533570, 72137454, 70847241, 70053821, 69042087, 68113752, 67264303, 66169129, 65999364, 66329974, 66912994, 68838409, 71922363, 75133082, 79100531, 83941401, 88491813, 93247251, 97305281, 101015347, 103959464, 105435008, 106052463, 105382554, 103527130, 101201381, 98795195, 95621978, 91777073, 88034013, 84123886, 80986839, 77565067, 74373784, 71519590, 68620118, 66321572, 64238686, 62255937, 60431314]
9545F0431314j204785j645245j034232k27138j33903K65332J153340J651433K341932
9536F1598048J801247K536775K620142K775676K253228J478222P33781o47063
9528G5150056j167043j458316l160168l769400m721255m278890m540153m559523
9520D7495308l881694l644812l322377l054322j783682k000001k037965j492934
9512B6277521j342825j278160j005815j083752j137664j131433r61925k34486
9504A8101461m48466j098635o79459k89770l70735o29312q40089m66008o70982
9495A2608005n32428l87364k59253K37332m25620q55266K6084l26268j77443k33262
9485I674517m52244k2576l62082j78544j77498p3746n13927j79730M69897k54040
$$ y = [60431314, 59226529, 57581284, 56547052, 56319914, 56186011, 56451343, 57604683, 59256116, 61598048, 63399295, 65936070, 68556212, 71331888, 73585116, 75063338, 75797119, 75150056, 73983013, 72524697, 69364529, 65595129, 60873874, 56594984, 52054831, 47495308, 43613614, 39968802, 36646425, 33592103, 31808421, 29808420, 27770455, 26277521, 24934696, 23656536, 22650721, 21566969, 20429305, 19297872, 18335947, 18101461, 17652995, 16554360, 15874901, 15585131, 15214396, 14585084, 13744995, 13278987, 12608005, 12075577, 11688213, 11428960, 11666292, 11240672, 10385406, 10411490, 10085222, 9907779, 9674517, 9222273, 9199697, 8837615, 8659071, 8481573, 8407827, 7893900, 7714170, 8184067, 7930027]
9475G930027q3028m15510l11244L4782j27429N30375L78478m83707k62894j94290
9465F995560L5254M47234n60049n79793k12579J32195j18864j96695k76838p0762
9455E594663M49286k8150l83674k14612j22854k79540m91891L85784K68194k95396
9445D881810J01308N6058J85896j8882J95500J71473k60254k40952m88023L9429
9435D623363M81119J06989J39315k50689j97887M2845l45066M65682k62002R1973
9425D895642J23982l46768K41599J24250k27258Q39624n16905k93527M96039j3041
9415E323637j97015K29169j55954J20325J42255J79256l47009j23807p3749k7064
9405E070044K09959k79170L53322M58598K38085m93635J03952L64244N12424J43339
$$ y = [7930027, 7846999, 7431489, 7120245, 7155027, 7027598, 7557973, 7936451, 7452744, 7189850, 6995560, 7030814, 7478048, 6917999, 6338206, 6125627, 6257822, 6138958, 5942263, 5665425, 5594663, 6043949, 6015799, 5632125, 5417513, 5294659, 5015119, 4523228, 4909012, 5177206, 4881810, 4983118, 5039176, 5225072, 5206190, 5401690, 5573163, 5312909, 5071957, 4583934, 4623363, 5104482, 5211471, 5350786, 5100097, 4902210, 4945055, 4599989, 5065671, 4803669, 4895642, 5019624, 4672856, 4914455, 5038705, 4811447, 5651071, 5134166, 4840639, 5336678, 5323637, 5126622, 5355791, 5199837, 5320162, 5462417, 5641673, 5294664, 5170857, 5097108, 5070044, 5280003, 5000833, 5354155, 5812753, 6050838, 5557203, 5661155, 6025399, 6537823, 6681162]
9395F681162J62028J20428K84037l26185q08611j37101K98070l70680n4137L2908
9385E881919j82966q7651m21658L03531K05470l29431K39216j11623l26204J66784
9375E337387l68367k04799J7981N61943J68757k45990K46466L58879k0540L3224
9365E884941K44253J61612J09809K41375O50332n11122O5325j25859j83682m20185
9355F116799N2710L67802j20544N3118o8709l02992k63516M4832n54803j71384
9345E153313L7668J54512l79956j08114J11256L98844L40723l7162L88460m8254
9335F011290J4594j23579J83968K35493j44660l6731K00195O2716j2627K90256
9325F680915k054k94003q6898k49644M69442L72859L07825r6039m7992p1487k73831
$$ y = [6681162, 6843190, 6963618, 7247655, 6921470, 6112859, 5975758, 6273828, 5903148, 5849011, 5881919, 5698953, 5611302, 5189644, 5493175, 5698645, 5369214, 5608430, 5496807, 5170603, 5337387, 4969020, 4764221, 4782202, 5344145, 5512902, 5266912, 5513378, 5872257, 5851717, 5884941, 6129194, 6290806, 6400615, 6641990, 7292322, 6781200, 6846525, 6720666, 6536984, 6116799, 6169509, 6537311, 6416767, 6469885, 6401176, 6098184, 5834668, 5879500, 5324697, 5153313, 5190981, 5345493, 4965537, 4857423, 4968679, 5367523, 5708246, 5671084, 6059544, 6011290, 6025884, 5902305, 6086273, 6321766, 6177106, 6140375, 6340570, 6403286, 6390659, 6680915, 6678861, 6384858, 6297960, 6048316, 6517758, 6890617, 7198442, 7102403, 7054411, 6982924, 6709093]
9314F709093K85802M46822L83740J35427P08661J57686N34712K67223N8604J42187
9304I829957K76581J015632O18648M27403j47880k94954o2210M67474q2272p2110
9294A1976269K03903j82575k33759l67297o68280o31879o72603n47812l68829
9285H507138o45914m18392k541k36144j80503n43711K66059n53426L86199K45852
9275F824617o87417j1318K52652l7915K03068J92695O9432K02343J46491K97452
9265G452100k67825N9789M37956K09818K10085J21572M36477O07352M1895M46505
9255I755724J79231K32284l50016k76030J72207j04835k79246n6886L19700n90032
9245I002101n17107n62938m88944J99897l63492j75175l21413O49280l20179m75426
$$ y = [6709093, 6994895, 7441717, 7825457, 7960884, 8669545, 8827231, 9361943, 9629166, 9687770, 9829957, 10106538, 11122170, 11740818, 12168221, 12020341, 11725387, 11663177, 12130651, 12048379, 11976269, 12180172, 11997597, 11763838, 11396541, 10728261, 10096382, 9423779, 8875967, 8507138, 7861224, 7442832, 7440291, 7204147, 7023644, 6479933, 6745992, 6192566, 6578765, 6824617, 6137200, 6125882, 6378534, 6340619, 6543687, 6736382, 6805814, 7008157, 7154648, 7452100, 7184275, 7244064, 7682020, 7891838, 8101923, 8223495, 8659972, 9267324, 9309219, 9755724, 9934955, 10167239, 9817223, 9541193, 9713400, 9608565, 9329319, 9272433, 9592133, 9002101, 8484994, 7922056, 7433112, 7633009, 7269517, 7094342, 6772929, 7422209, 7102030, 6626604]
9235F626604p2440J25177q866L8087M72858j36598R9228L27589l95695n4421j52509
9224F869014J95241q2648L05045J83507J26696o2264R2030j09269l67178j93171
9214F957003K11045J55754l44329M28524K28800j5728K52712m9338M9492j23846
9204G750089K6536m5486l82529L47092R1211K68294L34080N7446l3641J62209
9194H575301K15391l87999l38740M81821K74526L05244J38097j49399j35576K65908
9184I244574N33985J37695k11548L21848J61106K58185k32190j31481K71807R6724
9174A0450705l36649L02391L15643J21541R18634k59087m91874L31195K10183
9165A1562682K73197L15547p31572L03750R63481o6554K45021P51926J72032K74408
$$ y = [6626604, 6554164, 6679341, 6670475, 6708562, 7181420, 7044822, 7144050, 7471639, 7075944, 7021523, 6869014, 7064255, 6981607, 7286652, 7470159, 7596855, 7534591, 7626621, 7517352, 7150174, 6957003, 7168048, 7323802, 6979473, 7407997, 7636797, 7621069, 7873781, 7824443, 7873935, 7750089, 7776625, 7731139, 7348610, 7695702, 7786913, 8055207, 8389287, 8446733, 8413092, 8575301, 8790692, 8402693, 8063953, 8545774, 8820300, 9125544, 9263641, 9114242, 8978666, 9244574, 9778559, 9916254, 9704706, 10026554, 10187660, 10445845, 10213655, 10082174, 10353981, 10450705, 10114056, 10416447, 10732090, 10853631, 11772265, 11513178, 11021304, 11352499, 11562682, 11835879, 12151426, 11419854, 11723604, 12687085, 12620531, 12865552, 13617478, 13789510, 14063918]
9155A4063918K28009P35533j07223k19665O60942J64773J31678l75064P8713K02312
9145A5563926J85896q8936K30237j21669N35798M77930k7550M48271O37944P18685
9135A8560532k06324O91406k7337O32624O51694k03422O26332O34209J99550L40868
9125B1900132J210889N52238J98188N26683R44069M64422L55719M82881R25882
9116B7561103O18249N7288Q41957J45898M31145J064423P39374O55474R96365
9107C3111276N47191Q62498J045310Q08583J262371Q31629J893511J650515J735473
9098D3748357K081732K035098J746590J632598J259829J640605J208771J618382
9090E6971962J788698K289503K626110K792901K757473K056747K509275L027833
$$ y = [14063918, 14291927, 15027460, 14920237, 14700572, 15361514, 15526287, 15657965, 15282901, 15361614, 15563926, 15749822, 15660886, 15891123, 15769454, 16305252, 16783182, 16755632, 17203903, 17841847, 18560532, 18354208, 19045614, 19018277, 19650901, 20302595, 20099173, 20725505, 21359714, 21559264, 21900132, 23111021, 23663259, 23861447, 24388130, 25332199, 25796621, 26152340, 26635221, 27561103, 28179352, 28236640, 29078597, 29224495, 29655640, 30720063, 31459437, 32114911, 33111276, 33658467, 34520965, 35566275, 36374858, 37637229, 38468858, 40362369, 42012884, 43748357, 45830089, 47865187, 49611777, 51244375, 52504204, 54144809, 55353580, 56971962, 58760660, 61050163, 63676273, 66469174, 69226647, 71283394, 73792669, 76820502]
9082G6820502L154290L026511K037610J015833J085316J024774J540577K152754
9074I1858167K455460K423032J749475N67244o37528n92799J14619j51274N5229
9065I7841625P10258P32013J264433R62528L52166J174336J259730J980928J951293
9056A08229310J344737K587188L329311L423175M057379N071173N781900P042275
9048A40866448Q484105R607135J0359186J1601433J2505716J3786539J4659226
9041B21869788J3670857J1627680Q863170O904725M594408L930594K488629O00095
9033B74549946k632175n632207q106529q144746p843560p828283q596643r372269
9025B16393534j0158351j1809028j1241738j1126421j0817014r468834p574320
$$ y = [76820502, 79974792, 83001303, 85038913, 86054746, 87140062, 88164836, 89705413, 91858167, 94313627, 96736659, 98486134, 99053378, 98415850, 97823051, 97937670, 97786396, 97841625, 98551883, 99283896, 100548329, 101510857, 101863023, 103037359, 104297089, 106278017, 108229310, 109574047, 112161235, 115490546, 118913721, 122971100, 128042273, 133824173, 140866448, 149350553, 158957688, 169316874, 180918307, 193424023, 207210562, 221869788, 235540645, 247168325, 256031495, 262936220, 267530628, 271461222, 273949851, 274549946, 271917771, 266285564, 258179035, 250034289, 242190729, 234362446, 225765803, 216393534, 206235183, 194426155, 183184417, 172057996, 161240982, 151772148, 144197828]
9018A44197828n225222l568450k651815r77436l77624m77154j218378j566413
9010A28135336k067285k814732k692719l340114l647097m846358m709019l638044
9002A00379968k657106k163380j176704p73304j216387j582054j813283k124411
8994H6873339j836035k309069k726926l400919l470500l101282k753716k289333
8986F4985559k262830p76070j183351j184193o13540j47710K02880O34153L0817
8977E9685715R78582Q20550J99975J43673o09813L7698O47267K73966J8893L11421
8967F2507927M22035J176557J358677J409812K221546K637537K650639K580501
8959G6965231L339050M451297N365758O429359O763474P273236P323289O631708
$$ y = [144197828, 138972606, 135404156, 132752341, 131774905, 131397281, 130920127, 129701749, 128135336, 126068051, 123253319, 120560600, 117220486, 113573389, 108727031, 104018012, 100379968, 97722862, 95559482, 94382778, 93609474, 92393087, 90811033, 88997750, 86873339, 85037304, 82728235, 80001309, 76600390, 73129890, 70028608, 67274892, 64985559, 62722729, 61946659, 60763308, 59579115, 58965575, 58817865, 59020745, 59654898, 59685715, 60664297, 61484847, 61684822, 61828495, 61218682, 61256380, 61903647, 62177613, 62196506, 62507927, 62929962, 64106519, 65465196, 66875008, 69096554, 71734091, 74384730, 76965231, 80304281, 84755578, 90121336, 96550695, 103314169, 110587405, 117910694, 124542402]
8951A24542402M528637J467308k167827n285158p034766q171349q419568p925512
8943I1534167p482401o171116m776682l898178k719429j650128j314799p88985
8935F2732449L7336O10336J488825J208431K407076L346810L674121M537822M336395
8926H4379601K218733n84317l257905m972591m713725l754261k182376j086401
8918F6046758K67275J603409K341968K842701K941326L068864J834576L14008
8910H1260885j629356l300290m331302n366672n094447m855814m155681l734731
8902D8792592l495588k246964j863699j966812j435923j146992j057261p50282
8894C4829071o55304o24112o29732n95449j54208m54676m88748k78173k77546
$$ y = [124542402, 129071039, 130538347, 128370520, 123085362, 116050596, 107879247, 99459679, 91534167, 84051766, 77880650, 73103968, 69205790, 66486361, 64836233, 63521434, 62732449, 62769785, 63380121, 64868946, 66077377, 68484453, 71831263, 75505384, 80043206, 84379601, 86598334, 86014017, 82756112, 77783521, 73069796, 69315535, 67133159, 66046758, 66314033, 67917442, 70259410, 73102111, 76043437, 79112301, 80946877, 81260885, 79631529, 76331239, 71999937, 66633265, 61538818, 56683004, 52527323, 48792592, 45297004, 43050040, 41186341, 39219529, 37783606, 36636614, 35579353, 34829071, 34173767, 33549655, 32919923, 32324474, 32170266, 31715590, 31226842, 30948669, 30671123]
8885C0671123O1605Q6760m34052m03879j0709r231N8375N99585K58931R8091J174646
8874C2151245Q26319O97707P98799R06125J638935J110555J206934K512303K589928
8865D4438850K892690K989220L563452L492457L456058K440054R89554j68240
8857F4094095p4437r56205j138876J66550O23657P36306P35395J44442q19712
8848F3511215j901624k939846k826061k459398j877058j744275j81839J47035
8840D9728149N82297P64559J430576J759343J928089K284102J938807J166515
8832F1582437J768847K171125K361875L049072K920196K702212L113694K738424
8824H2407882P96609O9902j617021l160645l500329l168075k774698k098890j275015
$$ y = [30671123, 30732728, 30819488, 30385436, 29981557, 29970848, 29961617, 30019992, 30619577, 30878508, 30976599, 32151245, 32977564, 33675271, 34474070, 35380195, 37019130, 38129685, 39336619, 41848922, 44438850, 47331540, 50320760, 53884212, 57376669, 60832727, 63272781, 64262335, 64094095, 64019658, 63063453, 61924577, 62091127, 62714784, 63451090, 64186485, 64330927, 63511215, 61609591, 58669745, 55843684, 53384286, 51507228, 49762953, 49581114, 49728149, 50310446, 51075005, 52505581, 54264924, 56193013, 58477115, 60415922, 61582437, 63351284, 65522409, 67884284, 70933356, 73853552, 76555764, 79669458, 82407882, 83204491, 83274393, 81657372, 78496727, 74996398, 71828323, 69053625, 66954735, 65679720]
8815F5679720j630208k689439l692523l753323l683008l242839k868123k242638
8807D1877619j346894o86078m28952n25280K74823N46057J378435O92278K78732
8798D2060740J68992K36837j62150o45604m90722L59704k78966q83303m22681
8789C9942847l3658l4195j241473j768636k203985k721034k471778k620018k892783
8780B3955287k577566j754554j114189j088699p59446p72085p44380q88363m7327
8771A4208678n47521p10886m05428l97984r03792N2432j26068m2003j65713o36133
8761A0325582l09282k46688l23212l95001k95688n17737l51365M0607k04702n43471
8751G179043m61032o2863J84289n70132l18642j73511k4467K93587K03702j33395
$$ y = [65679720, 64049512, 61360073, 57667550, 53914227, 50231219, 46988380, 44120257, 41877619, 40530725, 39844647, 39415695, 38890415, 39165238, 39711295, 41089730, 41782008, 42060740, 42229732, 42466569, 42304419, 41658815, 41168093, 41527797, 41248831, 40365528, 39942847, 39909189, 39874994, 38633521, 36864885, 34660900, 31939866, 29468088, 26848070, 23955287, 21377721, 19623167, 18508978, 17420279, 16660833, 15888748, 15144368, 14256005, 14208678, 13661157, 12950271, 12544843, 12146859, 11243067, 11295499, 11169431, 11127428, 10961715, 10325582, 10016300, 9769612, 9446400, 9051399, 8755711, 8237974, 7886609, 7927216, 7722514, 7179043, 6718011, 6655148, 6839437, 6269305, 5950663, 5777152, 5752685, 6046272, 6249974, 6116579]
8741F116579n91083m01993J10877J62640p26647K30866R5374Q4382j66934n69538
8731D344523J62266M58376K95020L9987K57128l64301n78848J10948n1676j36909
8721D536514k1719l50833l57580k7316L00179m20138n79881K77585K87111m01389
8711C242533j34284n7814O31188p1573q3019k36078L91413J590n05708j98601
8701B979647M48285j09629l73179K3355n16200K16537L71658L53665L60856K06729
8691C961724M6291j66651m86543L61199j67432k55940k35277m29558j22109j37969
8681B367735P3487n14043k20101O09458N27657j53739m95459P8316J56422K18587
8671B648320L2609L72023j37474p95351K83423L8138l52793L10826o5127j20957
$$ y = [6116579, 5525496, 5123503, 5234380, 5397020, 4670373, 4901239, 4996613, 5080995, 4914061, 4344523, 4506789, 4965165, 5260185, 5300172, 5557300, 5192999, 4614151, 4725099, 4673423, 4536514, 4514795, 4163962, 3806382, 3779066, 4079245, 3659107, 3079226, 3356811, 3643922, 3242533, 3108249, 3050435, 3681623, 3610050, 3527031, 3290953, 3682366, 3683956, 3178248, 2979647, 3427932, 3318303, 2945124, 2968479, 2452279, 2668816, 3040474, 3394139, 3754995, 3961724, 4008015, 3841364, 3354821, 3716020, 3548588, 3292648, 3057371, 2627813, 2505704, 2367735, 2441222, 1927179, 1707078, 2316536, 2844193, 2690454, 2194995, 2273311, 2429733, 2648320, 2680929, 3052952, 2915478, 2120127, 2403550, 2441688, 2088895, 2399721, 2334594, 2213637]
8661B213637j31131L4610k32563J02839M10791r0812l03738R091l19591L5080
8651A728213K36393o2005J93915K934M2019K2548j60449l05499k53714R3684K67120
8640A805159l31316k59453l41332L93368N99216p9119J20008k83084k39627j29872
8630A253948j15652l67717O3077j94202R8670M2748j90809O11061J70792m91479
8620H80437l88254J66833k25106K45780l00700N25428J9570k97611k75998N43007
8610H93386M58068L93300m84159j62625k82475Q5114j4215J29820N15550j15616
8600A416148n27096k04949l1499M6355M3653l10742L6456K47338k66810M1910
8590D90764P86408j17557m91680O41145L9574K71367N45279p38736r1460o48871
$$ y = [2213637, 2082506, 2117116, 1884553, 1987392, 2398183, 2307371, 2003633, 2012724, 1693133, 1728213, 1964606, 1902601, 2096516, 2099450, 2141469, 2164017, 2003568, 1698069, 1444355, 1538039, 1805159, 1473843, 1214390, 873058, 1266426, 1865642, 1786523, 1906531, 1623447, 1383820, 1253948, 1138296, 770579, 833656, 639454, 738124, 780872, 590063, 1201124, 1371916, 880437, 492183, 659016, 433910, 679690, 378990, 904418, 923988, 626377, 350379, 893386, 1351454, 1744754, 1260595, 1097970, 815495, 900609, 886394, 1016214, 1531764, 1416148, 889052, 684103, 652604, 698959, 742612, 431870, 468326, 715664, 448854, 490764, 1277172, 1159615, 667935, 1309080, 1348654, 1620021, 2165300, 1426564, 1335104, 686233]
8580F86233N0859j66925K33713k34109Q9463j42120O6662K17466j8525J23646
8570I06363J33297r5324n51386J3073J50557n68920K81134L0164L86899L4816
8560G20673n48059j1060K26558O1004P9287J26140K0430k91315j45569L98320
8550F36409k4949r822P64260K66498o54672l77607k70642J13259L41734k13504
8540E70964m7290J35521j57327l91221P3487j25675J90438K00992L72015K88321
8530A110225l79205n8061O1934k8565j94017n4693L26854o5051n41580K56283
8520D34124K9619j50629J94128J90725J28781n07258j86334K41845N02789J99091
8510A076881k45136n56903L8496N53311j87789l69503n7982J7098n5287O4809
$$ y = [686233, 737092, 570167, 803880, 569771, 659234, 517114, 583776, 801242, 782717, 906363, 1039660, 944336, 392950, 406023, 556580, -12340, 268794, 298958, 685857, 720673, 172614, 161554, 388112, 449116, 528403, 654543, 674973, 383658, 238089, 636409, 611460, 601638, 1365898, 1632396, 977724, 600117, 329475, 442734, 784468, 570964, 523674, 659195, 501868, 110647, 184134, 58459, 248897, 449889, 821904, 1110225, 731020, 672959, 734893, 706328, 512311, 457618, 784472, 719421, 177841, 434124, 463743, 313114, 507242, 697967, 826748, 319490, 133156, 375001, 877790, 1076881, 831745, 274842, 313338, 866649, 678860, 309357, 251375, 268473, 213186, 277995]
8500B77995j63121J82133P8195r2250k39558K84443K11048r9917O4891k05179
8490B98680o8691O91990J24302N8908o91123O332J61060P7257n07262l25821K10111
8479C5743L00812L11937k26403j83820l71640J22768J17649k10891J74767L03084
8469C74006j01685L42653j607M3370l51559k4826L99678Q3492n6503l49816J98283
8458E55486N933j74452J08822m19172J92967j49813M5848K98992m7284k97231
8448A20096P4599O477j41489K55638K83085J74521n69053K16483L2743j86204
8438B66896Q6074r5366R9869l72971L07707L51934k73023K92212o5319n34598
8428F3415j70325K5191N4010K69272L03214j342J2058J58339l54355k80185O4770
$$ y = [277995, 114874, 297007, 375202, 282952, 43394, 327837, 538885, 438968, 503859, 298680, 229989, 921979, 1046281, 1105189, 414066, 420398, 581458, 658715, 151453, -174368, 35743, 336555, 648492, 422089, 238269, -133371, -10603, 107046, -103845, 70922, 374006, 272321, 614974, 613367, 656737, 305178, 280352, 680030, 763522, 707019, 357203, 555486, 561419, 386967, 495789, 76617, 269584, 119771, 165619, 464611, 417327, 120096, 194695, 201172, 59683, 315321, 598406, 772927, 203874, 420357, 453100, 266896, 352970, 257604, 357473, -15498, 292209, 644143, 371120, 663332, 598013, 63415, -106910, -81719, -27709, 241563, 544777, 543435, 555493, 713832, 359477, 79292, 144062]
8417A44062J80574o317j40156J7960K56584m11198Q4915J0415K32547m25380q452
8406f4446J46911R4201j24198m2249j35150Q8856K12003o13105J93546J89899
8396e3732J78847J82561n41467l79607J02567Q5909M6873L76244k07255j06496
8386c15556M16464J8034n08171k13540L93139j90214k53879K86862J02943j55641
8376d19559J03153j23371L37647l94668K42651K07340J7294J927J80664Q0550
8366B33628q3219o10636k38413l3204R32211K32223j75927N7676l41461R1973
8356F4851J21539m51522p4254N38472k46390J29134J1277L77868j46540j59451
8346A64984m18194q36j8398j80818M9782j02350O13413j02273l32536M4984J70569
$$ y = [144062, 324636, 318319, 178163, 196123, 452707, 41509, 126424, 136839, 369386, -55994, -64446, 82465, 176666, 52468, 10219, -124931, -36075, 175928, -437177, -243631, -53732, 125115, 307676, -233791, -613398, -510831, -424922, -378049, -1805, -209060, -315556, 100908, 118942, -389229, -602769, -209630, -399844, -653723, -366861, -263918, -419559, -316406, -439777, -102130, -496798, -254147, -46807, -29513, -27586, 153078, 233628, 150409, -460227, -698640, -731844, 200367, 432590, 256663, 314339, -27122, 64851, 186390, -265132, -339386, 199086, -47304, 81830, 93107, 470975, 324435, 164984, -253210, -254046, -272444, -453262, -403480, -505830, 107583, 5310, -327226, -282242, -111673]
8335a11673k55054L90093K43693k97219k05219R6822J83502k79879J31525k68242
8325c71651K58728L67638k93180k79962J22535J63127j9361M62756k19546m0926
8315A50158J20706J5843j20177n9531J74576n0341n52518l37619J72262K35283
8305b51358k8193N5834r8820K63286Q4169n28236O74164r5621m71582M07773J10481
8294A21897m51921k8986P05358k55324j82028J35468m65173M35123k64440k48778
8284d98804K1792R7848L52594k81358J91070N5969k75143K57090Q014o76379R2349
8273f54958J21755Q054L64606J80566R107l05970J52139j08377L57424J15310
8263B39656l70169L73j54515k71549M3459L56784K27697m16324J61187l20820
$$ y = [-111673, -366727, 23366, 267059, -30160, -235379, -138557, 44945, -234934, -103409, -371651, -112923, 254715, -38465, -318427, -195892, -32765, -52126, 410630, 191084, 150158, 270864, 286707, 166530, 106999, 281575, 231234, -321284, -658903, -486641, -251358, -279551, -223717, -322537, -59251, 24918, -503318, 170846, 75225, -396357, 11416, 121897, -330024, -359010, 346348, 91024, -91004, 44464, -420709, 14414, -250026, -498804, -477012, -379164, -26570, -307928, -116858, -60889, -336032, -78942, -70928, -747307, -654958, -533203, -525149, -160543, 20023, 29130, -276840, -124701, -233078, 124346, 239656, -130513, -130140, -284655, -556204, -512745, -155961, 71736, -344588, -183401, -504221]
8253e04221k1366K5612L02925L03541l78985L11849K1702m61111L36968j32633
8243a95719k33664j1045j4832K79241K15243l9369m90725M70028j89859J14282
8233i6419J01796k20384J15655j54306m1154k08372n4019N126k35869n8654L25774
8222e20826j25949N356K50763J7591K88420R2244Q2172k03488m9840K60351N22556
8211F19350n40196j54609L70829m90127m01800J94295R4077J53636m8686K29855
8201B6624j4195Q4809p0730N28295j85131n1712K24280j84077K97116j23728o07756
8190g6205m99803L71329n3148J34243r3933M1369L22436Q9276J40313j11658k76405
8179a2186J583j05102K1080j4982j6806p8192j37948j88151L24777J42317k95706
$$ y = [-504221, -525587, -499975, -197050, 106491, -272494, 39355, 61057, -400054, -63086, -195719, -429383, -440428, -455260, -176019, 39224, -145, -490870, -20842, -210701, -96419, 5377, -215007, -99352, -253658, -294812, -503184, -557203, -552077, -787946, -846600, -520826, -646775, -641419, -390656, -373065, -84645, 7599, 89771, -113717, -163557, 96794, 619350, 79154, -75455, 295374, -194753, -596553, -402258, -308181, -154545, -203231, 26624, 12429, 97238, 26508, 554803, 369672, 317960, 542240, 358163, 655279, 531551, -76205, -576008, -204679, -257827, -123584, -217517, -176148, 146288, 235564, 375877, 264219, -12186, -10603, -115705, -94625, -109607, -126413, -204605, -342553, -530704, -205927, -63610, -359316]
8168c59316K7377J55355J16608K04969N39911k32039l68337j75075j0964m3100
8158a44611k02368K12502l86463p0961J18581K1279l29319L70383J03468M41019
8148A33510p7743R0819K35543o05000K09817j01751l44767L45527l73946J83565
8138c04426P6951q5433Q7871L58393k98334j76751K11799j12072q2254J04887
8128b19369J07042j27643j8718l7366O06685p97325j21065M77286k44153Q3301
8118b91325J96979r7636J49970l16956L76624K22718l84560o1659L15108L0790
8108A40053k61070j24679k32769K23051O12633R4441j94701p31102K85971O725
8098a81447L4746J01863o5763L44007l93478j5473L69494L15970k98653l84785
$$ y = [-359316, -331939, -176584, -59976, 144993, 684904, 452865, 84528, -90547, -101511, -144611, -346979, -134477, -520940, -591901, -473320, -452041, -781360, -410977, -307509, 133510, 55767, 146586, 382129, -222871, -13054, -114805, -459572, -114045, -487991, -304426, -227475, -312908, -225037, 133356, -164978, -341729, -129930, -242002, -324256, -219369, -112327, -239970, -258688, -296054, 310631, -486694, -607759, -130473, -374626, -291325, -94346, -191982, -42012, -358968, 17656, 240374, -144186, -205845, 109263, 140053, -121017, -245696, -478465, -255414, 357219, 451660, 256959, -474143, -188172, -181447, -146701, -44838, -110601, 233406, -160072, -175545, 193949, 509919, 211266, -173519]
8088a73519K28498J09006j08215m13711L68533q3093m13819j95590K00835M28553
8078e2522m24751J65542k5696J35186J5987k38981J14347J65307L77372P7858
8068C09649J95231k07397m81317K54967j29008l99680k5777K53441l69808k24404
8058h24103K33189J91296k84731P5983P03134l56339J7315J80586p45533K25125
8048e84078K08603K2649O5778j3005j48269N97015K64833O0665l14183j04283
8038E5725J65948Q5477k69074k78001k06159j89258P08686j15974l05832m87580
8028h36042L57659M36999n5947M33595J4061l52478J96351m97799k43612L17127
8018b30086K39804n6207m58221L06686J41045j74326L40358O5506n15140m1812
$$ y = [-173519, 54979, 163985, 55770, -357941, 10592, -72501, -486320, -681910, -481075, -52522, -477273, -311731, -337427, -202241, -186254, -425235, -310888, -145581, 231791, 309649, 504880, 297483, -183834, 71133, -57875, -457555, -483332, -229891, -599699, -824103, -590914, -399618, -684349, -608366, 94768, -261571, -244256, -63670, -809203, -584078, -375475, -352826, -287048, -300053, -448322, 148693, 413526, 474191, 160008, 55725, 221673, 307150, 38076, -239925, -446084, -635342, 73344, -42630, -348462, -836042, -478383, -41384, -97331, 336264, 350325, -2153, 194198, -303601, -547213, -230086, 9718, -46489, -504710, -198024, -56979, -231305, 109053, 174559, -340581, -382393]
8008c82393L70087M6794l63218M1427N34614l19073m676k17008n9075J38484j02955
7997c16992j00279l10719N98308K16021k44051K31297j67024P07879l64433l70233
7987a20226m39810j77900L00518K03367N5232R3390j98573j39829J66759P450
7977b49622J67492R5193o6570O775J98069n1987l56098m52423L16768J79968m8826
7966b61261l48043n6660R3883M84215J07681L45175j23718j9488o1778m56181
7956b96175q7201k05211J54988k18899j43493M79571L82403k2510J05557K34073
7946C83103n55472O0062k87219K71668K23164o3544N7560O1090K20017n31969
7936a61540j92339K52759N614j13852J15501M61620m02115K2820q3511j6461P6186
$$ y = [-382393, -12306, 34488, -328730, -287303, 247311, -71762, -76438, -293446, -352521, -214037, -316992, -417271, -727990, -129682, 86339, -157712, 73585, -93439, 614440, 250007, -120226, -560036, -737936, -437418, -234051, -178819, -85429, -284002, -423831, -257072, -249622, -82130, 13063, -53507, -46732, 151337, 99350, -256748, -709171, -392403, -212435, -261261, -609304, -665964, -572081, -87866, 19815, 364990, 241272, 221784, 160006, -296175, -383376, -588587, -433599, -652498, -795991, -316420, 65983, 43473, 149030, 383103, -172369, -112307, -399526, -127858, 95306, 31762, 89322, 150412, 370429, -161540, -353879, -101120, -95506, -209358, -93857, 367763, -34352, -11532, -95043, -111504, -35318]
7925c5318k53626J2603L47281M4070N3100l11821j56706M9010Q256k76290j5901
7914e35342l76699R2434M5941n145M41784J9604l64828n0387N81332R7995Q4794
7903C1483j98479J01889m0062M7770J5655k17600j1493M1366n07206Q6118M67740
7892a82819L59754n7598k40957p619K32797j67767K00282l75638j66660O64065
7882B57840J72699n48498J20313P2563J25683l52755n82157J14087M44493l7336
7872b13068J1951Q3479l05911m24418K8862K66920M4040j59733L52874N36459
7862B21455o19481J55577K34689m02922J70683J68594Q6407o11493j37758j51436
7852h85685K13820M98382Q111q0252n33026K50828M94873J73752k18946l35410
$$ y = [-35318, -288944, -276341, 70940, 115010, 168110, -143711, -300417, -251407, -243151, -519441, -535342, -912041, -819607, -773666, -778811, -337027, -317423, -682251, -732638, -151306, -53311, 31483, -166996, -65107, -105169, -57399, -41744, -259344, -270837, -229471, -736677, -650559, -182819, 176935, 119337, -121620, -129239, 103558, -64209, 136073, -239565, -406225, 257840, 430539, -117959, 2354, 74917, 200600, -152155, -734312, -620225, -175732, -213068, -201117, -117638, -423549, -847967, -819105, -552185, -508145, -667878, -315004, 221455, -398026, -242449, -7760, -410682, -239999, -71405, 15002, -596491, -734249, -885685, -671865, -173483, -165372, -245624, -778650, -527822, -32949, 140803, -78143, -413553]
7842d13553k60748Q83357J16237m55716j77856P4833J47051n6784L78966p6075
7832A59712Q2222l71103k34071K6260j2090N77981r3491o7064j3447k1703k19717
7821a86511k98757M00714J41462j26066m93521j86208J5809O90150k02896n6594
7811c02418O84728j10694j80991k11426J14691q9805k28824L6970J07371J74841
7801e557m12281O75429N40808q43190L11892o7281k10501l90189L77118J21323
7791I7571j08195L3802N3777M1222l77648K80032j64263m9901N5726J00075K87261
7780B49459j37482j67449Q4147m19752L24022N69568k22394m38575J65840l20544
7770c13160L28559J39383j39662r6343k74169K73896K66265q2247k08975L79183
$$ y = [-413553, -674301, 209056, 325293, -130423, -308279, -233446, -86395, -143179, 235787, 159712, 241934, -129169, -363240, -336980, -349070, 228911, 135420, 68356, 54909, 33206, -186511, -485268, -84554, 56908, -69158, -562679, -748887, -733078, -42928, -245824, -302418, 382310, 271616, 90625, -120801, -6110, -95915, -324739, -287769, -180398, -5557, -417838, 257591, 798399, -44791, 267101, 199820, -10681, -400870, -23752, 97571, -10624, 23178, 76955, 118177, -259471, 20561, -143702, -193603, -137877, -37802, 249459, 111977, -55472, 28675, -391077, -67055, 502513, 280119, -158456, 7384, -313160, 15399, 154782, 15120, -81223, -355392, -81496, 184769, 102522, -106453, 272730]
7760B72730n99512j87786M0839O6300J25294L74513J88349l73375Q0245J66375
7750A53972l4275k07098l86081j46548R7621O6159J39009Q5344j9208k54271n5794
7739e61170M5179K20390K77326l7291p0066q1773r4826k26897J2749J89492M29703
7728A02816j31911l69452L24030J30146J88966m06790k36279L65716j6436R491
7718c9703o25177J78962l05152J13899K88954L1231n3647J32216K50630o2465
7708i0252o3006k6914O4204K12893k18373M9870l52612o6135L90072J04230K69016
7697B72993j21442l80076J410J02205m4173j34688l25222L32920K19052J84514
7687A07493P2670j40569r4935q2981M55622l44793p5881N41879J51555p67946
$$ y = [272730, -326782, -514568, -473729, -407429, -282135, 92378, 280727, -92648, -12403, 153972, 119697, -87401, -473482, -620030, -522409, -456250, -317241, -231897, -251105, -505376, -561170, -515991, -295601, -18275, -55566, -125632, -207405, -302231, -529128, -516379, -326887, 102816, -29095, -398547, -74517, 55629, 244595, -162195, -398474, -32758, -49194, -39703, -664880, -485918, -791070, -677171, -388217, -356986, -410633, -278417, -27787, -90252, -153258, -180172, -115968, 96925, -121448, -71578, -424190, -490325, -100253, 3977, 272993, 151551, -228525, -227115, -124910, -169083, -303771, -628993, -296073, -77021, 107493, 180163, 39594, -55341, -138322, 317300, -27493, -103374, 438505, 590060, -177886]
7677a77886k0691J69547M7305j02324n09201K33835M81937j87728o5280K4911
7667a05575j14798K21142L06071M41893m73485j83503K45945J79584j97580M0101
7657C59795m3312k25363l36208M50939J95366p1114l28133L46130j04361l08066
7647f4327j10744J24985k26118N1591M45280l59340J70127n55620j65566M60635
7637b29097L46766k241p545N353j12285J82295m3757K66337j84973k928j91079
7626B6846j3106L7480Q3667j60872q8153k93042R0047K59382L49272r226m08646
7615a26351m02623N06630L88341M1843l61231l06725j06460K68470L6259L329
7605e8518o8065L08666k86593k2866n6573Q3217J02930J40550n6731j65075L2545
$$ y = [-177886, -198577, -29030, 18275, -84049, -593250, -359415, 122522, -65206, -130486, -105575, -220373, 769, 306840, 748733, 275248, 91745, 337690, 517274, 319694, 359795, 316483, 91120, -245088, 205851, 401217, 330103, 1970, 348100, 243739, -64327, -175071, -50086, -276204, -224613, 220667, -138673, 31454, -524166, -689732, -229097, 117669, 115428, 107883, 113236, 951, 183246, 139489, 405826, 220853, 217925, 26846, 13740, 51220, 134887, -25985, -114138, -407180, -317133, -57751, 291521, 282295, -126351, -528974, -22344, 365997, 407840, 46609, -260116, -366576, -98106, -61847, -58518, -126583, 182083, -104510, -127376, -183949, -100732, 2198, 142748, 86017, -79058, -46513]
7594d6513n33333J33150M31881J78486j93066m59780J17505L7155L5152N54325
7584B54962l49006l1639k63171R7176j79967M82405Q0060K97073k77930r5801
7574A4162l77371k17775M44270m61096n7216N90227K18116j24573j55887j2060
7564a39203j88287L95270k12313O3959j15682L0110K63067K53227k36524j13954
7554c30j17619L08353k41633l60809L57947k34258m64438k83486N81804O87824
7544B33355j82494n8131J8356K60204o2511k55583j5457j06182O4534J74249l12864
7533b42524J6406n9024m60121L45033J42962j95046J67529J83703K13205l07458
7523a95335Q8422j05685l84624K53095L21013J61797J207J33559k10408o7930
$$ y = [-46513, -579846, -446696, -14815, 163671, -29395, -489175, -371670, -334515, -299363, 254962, -94044, -125683, -388854, -291678, -471645, 10760, 90820, 387893, 109963, 14162, -363209, -580984, -136714, -597810, -655026, -64799, 153317, 28744, -127143, -139203, -327490, 67780, -144533, -80574, -196256, -166146, 96921, 350148, 113624, -330, -117949, 190404, -51229, -412038, -54091, -288349, -752787, -1036273, -454469, 233355, 50861, -7270, 11086, 271290, 208779, -46804, -62261, -168443, -103909, 70340, -242524, -226118, -285142, -745263, -400230, -257268, -452314, -284785, -101082, 112123, -195335, -106913, -212598, -597222, -344127, -23114, 138683, 139890, 273449, 63041, -4889]
7513d889j02503J32727J22017J86139j83423o1936j43730j96189J69565K26144
7503A43922m5570p138k18227l3020k95008O34317n5035j60535K67604j33913l78588
7492b81191m4113N3059j92218L97619j89006o08155L19350l1092m4466M99522
7482a20691J45153j62190J88116n7274j52035K97111p7150L69103k59246o26175
7472d55278j98398P19945k85177k59393P40877m3078m26555j40685j31934L76268
7462a03408K21050l44014n66892k94303N18124M36204j25419k18627K40125K01117
7452c6043M18896l9283k23391n462n2654k21058k72831N5149J18246P0953J56574
7441c0904K6989J92814o3903k35690j370o6822L76536K23732j36898k08011m90082
$$ y = [-4889, -107392, 25335, 147352, 333491, 150068, 88132, -55598, -251787, -82222, 143922, 98352, 91214, -127013, -160033, -455041, 179276, 124241, -36294, 231310, 97397, -281191, -325304, -272245, -464463, -66844, -255850, -864005, -544655, -575747, -620213, -120691, 24462, -137728, 50388, -6886, -158921, 138190, 61040, 430143, 170897, -455278, -653676, 66269, -218908, -478301, 262576, 219498, -207057, -347742, -479676, -103408, 117642, -226372, -793264, -1087567, -569443, -133239, -258658, -477285, -237160, -36043, 382853, 343570, 120179, 114717, 62063, -158995, -431826, -376677, -258431, -187478, -30904, -3915, 188899, 124996, -110694, -112064, -178886, 197650, 421382, 284484, 76473, -413609]
7430d13609J47016J85572L60370j39254k58067L43073j35480n7948M9532j59359
7420g8154k59279Q3806k0995k61765R40654k92489J37724j20579m21208L61762
7410F9477j16652j5999k04715j68275N2887j08991K53839J9206k80166K95481
7400b03908L67637n49702Q8379Q5198J49602L2092j57932j07618j44871N7012
7390c84111J49657j0257l77148k5194J87178M44286o4736j27599m3899j4691J7623
7379b48891k23408k6865N64457J41236K30260j77623l53850J20315j5321o7507
7369e7197K65410k72916J98751l30655q7291K0085j26945p1095j89268r8450K30514
7358e19057J16650L47487l88015K2492L6949J18751L37311J82847K05984j08562
$$ y = [-413609, -266593, -81021, 279349, 140095, -117972, 225101, 89621, 31673, 81205, -78154, -337433, -253627, -274622, -536387, 404267, 111778, 249502, 128923, -292285, 69477, -47175, -63174, -267889, -436164, -383277, -492268, -238429, -219223, -499389, -203908, 163729, -385973, -297594, -212396, -62794, -30702, -188634, -296252, -441123, -384111, -234454, -244711, -621859, -647053, -459875, -15589, -80325, -207924, -251823, -266514, -248891, -472299, -499164, 65293, 206529, 436789, 259166, -94684, 25631, 10310, -57197, 208213, -64703, 134048, -196607, -283898, -263813, -390758, -461853, -651121, -749571, -519057, -402407, -54920, -442935, -420443, -383494, -264743, 72568, 255415, 461399, 352837]
7348C52837k66906j57709M84628j02784m26255J91851n21483k01645L32729k66201
7338e80938P52433j87849p1720r9333j74160k17280J86176N6974j99464L35823
7328a99338k62933J12110m2220j6541k56221J62446L73391Q2663j48111K03613
7318H859l1714j63397o5504M5551k80261j24536K24342M07276j25823k6607O30734
7307D98920k75184o13482l5305l05894k31445J63343r7654K27195N60578L94221
7297B85293O1483o6169l3332J59884M6263l24529j26564p9887J37417P17704q2422
7286F95141j29250p5975M4035n83427K74953l1311n36863K88675J2705J0744O73802
7275F43229o34237m49635O37639k64294j45658k15695m57903N28685j30687K78094
$$ y = [352837, 85931, -71778, 412850, 310066, -116189, 75662, -445821, -647466, -314737, -580938, 171495, -16354, -88074, -187407, -361567, -578847, -392671, -335697, -535161, -199338, -462271, -350161, -392381, -408922, -665143, -502697, -129306, -46643, -194754, 8859, -22855, -186252, -251756, -206205, -486466, -611002, -386660, 20616, -105207, -131814, 498920, 223736, -389746, -425051, -730945, -962390, -799047, -896701, -669506, -108928, 285293, 346776, 280607, 247275, 407159, 453422, 128893, 2329, -77558, 59859, 777563, 695141, 565891, 489916, 533951, -49476, 225477, 194166, -342697, -54022, -41317, -30573, 643229, 8992, -440643, 196996, -67298, -212956, -428651, -886554, -357869, -488556, -210462]
7265b10462K45732Q1130m32200o7123K61372j70161P1480N29895N4145j95081
7255A68727k39604Q0994K25631k87684l4100q4343j42739n07406N3981N07671
7245b58872k32921R1360K98903m19863L61227j32129k15727K39656J70245o1704
7235a59825K50516j90049l14746J74960k72382j64878O21107l50146k53390L5688
7225f23145K0684p8452j49250L16570q0466m46648j27916M75876N23790L1323
7215a37634r0933l0852J36313k13682O6219K65143q620P49919j37283j60069k05155
7204B33366m93426K49006P0287O5925j77725m38651K85386M29476J3199M5715
7194B82558l67895K4895L53095j64465m55033j47277J36860K4369K61539l41944
$$ y = [-210462, 35270, 116400, -315800, -382923, -121551, -291712, -220232, 309663, 363808, 168727, -70877, 10117, 235748, -51936, -86036, -170379, -313118, -820524, -766543, -258872, -491793, -400433, -101530, -521393, -160166, -292295, -508022, -268366, -98121, -159825, 90691, -99358, -414104, -239144, -511526, -676404, -55297, -405443, -658833, -623145, -602461, -680913, -830163, -513593, -594059, -1040707, -1168623, -692747, -168957, -137634, -228567, -259419, -123106, -336788, -270569, -5426, -14046, 735873, 598590, 438521, 233366, -260060, -11054, 59233, 125158, -52567, -491218, -205832, 223644, 236843, 282558, -85337, -60442, 292653, 128188, -326845, -474122, -337262, -312893, -51354, -393298]
7184c93298k840L49307K8923K09392m99041l34167J20760L64895K9332J24539
7174b198L4792k19458K21561P7115L4166J91187k29772L21581K81046j88500m6000
7163D75520j94198k88945J9115R9300l21402R4821j23434j43409K66700J30921
7153A4989R5733l18136j59412K6143K5053j1457J96280J56976M9469J16261n994
7142A85905m12319L7744j23572L13472K50249n13815k18956q5722K93843M03930
7132A30759K27865n34184K33296j44325o40416p3337L43269J10892J54000q7473
7122b79654K51200k22849j89812K37561o6902K46688j77833j17549m7797k99875
7112f66822M78396K01502k36235r2046M07099j23047m2580L81437k59008P3056
$$ y = [-393298, -396138, -46831, -17908, 191484, -307557, -641724, -520964, -156069, -126737, -2198, 32594, -186864, 34697, 111812, 145978, 337165, 107393, 428974, 710020, 521520, 475520, 281322, -7623, 11492, 110792, -210610, -115789, -239223, -382632, -115932, 14989, 110722, -207414, -366826, -340683, -315630, -327087, -130807, 26169, 75638, 191899, 185905, -226414, -188670, -312242, 1230, 251479, -262336, -481292, -567014, -273171, 130759, 358624, -175560, 57736, -86589, -727005, -800342, -457073, -346181, -192181, -279654, -28454, -251303, -441115, -203554, -270456, -23768, -201601, -319150, -366947, -666822, -188426, 13076, -223159, -315205, 91894, -31153, -73733, 307704, 48696, 121752]
7102A21752k7086k08716k39995L87600k53996m19269J99596K23982M02748k76558
7092h9942k25908O90872j99302l6384j6386J07149J93801m04213L42458l89354
7082b7209k14677k03625j26104J02125L29011L05608j23136j20470K73830k99663
7072a04310q1813K76563K58760L13539n08825J13126j34163l4262l70866k09213
7062d81464K97139J23912j1523K79599K78746p95025j32160K72718J51500j18568
7052a35126N1923k05739M6787K34779q4837k206r1690m42837j32533j82301J59781
7041g83999K47312J84616K83028j12004j28161N6974K70319p3030K76020k08033
7031A3042n12435P5060N28810M09356j19534m85076J31921L10584k00568j04073
$$ y = [121752, 94666, -114050, -354045, 33555, -220441, -639710, -440114, -216132, 186616, -89942, -315850, 375022, 175720, 139336, 122950, 230099, 423900, 19687, 362145, -27209, -241886, -445511, -571615, -469490, -140479, 165129, 41993, -78477, 195353, -104310, -186123, 90440, 349200, 662739, 153914, 267040, 132877, 98615, -272251, -481464, -184325, -60413, -71936, 207663, 486409, -308616, -440776, -168058, -16558, -135126, -83203, -288942, -242155, -7376, -92213, -94419, -186109, -628946, -761479, -943780, -783999, -536687, -352071, -69043, -181047, -309208, -252234, 18085, -54945, 221075, 13042, -499393, -424333, 104477, 513833, 394299, -90777, 41144, 351728, 151160, 47087]
7021D7087J17911R5523L07036n75698K640K01056k85442o1202n9065J53863M8255
7010h036k49846l27428J89852K91706M4644L39209P2878j79885k56107q2089J30666
6999c4436l15349r9860O17519n52643L84689J54180k09715M22589k69340l29211
6989b31577K7427m0417j2142L10593l39483k0826L6139o0745N07178l53076J73591
6978c338j27404l69132L66907M01801k41237L6459r3028l87600j7312K24467l13899
6967e23316k0482J40600j87061K20385Q43461j99076k89558M380r0802L9250k42330
6956c04549K60688k67672K60384q8965L6914l41026K64671L35555j84126l05788
6946c33914J87045J6460m2950j60080R9334M3228K86861R7778j76448J72714j81716
$$ y = [47087, 164998, 260521, 567557, -8141, -5501, 195555, -89887, -151089, -210154, -56291, -8036, -257882, -585310, -395458, -103752, -59108, 280101, 352979, 173094, -83013, -165102, -34436, -349785, -449645, 167874, -384769, -80, 154100, -55615, 366974, 97634, -231577, -204150, -244567, -256709, 53884, -285599, -306425, -270286, -331031, 176147, -176929, -3338, -130742, -499874, -132967, 268834, 27597, 64056, -28972, -416572, -433884, -209417, -523316, -543798, -403198, -590259, -369874, 473587, 274511, -15047, -10667, -101469, -62219, -304549, -43861, -311533, -51149, -140114, -103200, -444226, -179555, 156000, -28126, -333914, -146869, -130409, -173359, -333439, -234105, -190877, 95984, 193762, 17314, 190028, 8312]
6935H312p7311j64412R3187l05746k33801M19616K99795m52244j43990M20118
6925a36476l23424L46024L04244l70199m1537n2984j404K18847j52242l93511
6915f02662K25120K80163k70372L53241l27586N54198j51704l73887M25555J78546
6905B90612l38833j86854r4374L04395m01126J94312O69151l93905k79390n4957
6895b90969k3116l52861k57789N73189K21044k16580J04715K81390N7324k62942
6885a66595n7254j80074p161J32709l72495J35133O23821J91109J82161K31307
6875G12661p21520o16821N00325j6539K37918l67438L37016K15826k61009J24416
6865A44835l43840P283J23584K0451k40078k44270J11587K14885J77504p2407
$$ y = [8312, -68999, -233411, -140224, -445970, -679771, -260155, 39640, -412604, -556594, -136476, -459900, -113876, 190368, -179831, -221368, -274352, -275756, -56909, -209151, -602662, -377542, -97379, -367751, -14510, -342096, 212102, 60398, -313489, 112066, 290612, -48221, -235075, -329449, -25054, -426180, -231868, 437283, 43378, -236012, -290969, -314085, -666946, -924735, -351546, -130502, -347082, -242367, 39023, 96347, -166595, -223849, -403923, -411084, -278375, -650870, -515737, 108084, 299193, 481354, 712661, -8859, -625680, -125355, -141894, 96024, -271414, 65602, 281428, 20419, 144835, -199005, -191722, -68138, -47687, -287765, -532035, -420448, -205563, -28059, -100466]
6855a00466j17124M95967R7713m40325r1634l89189L73497L09856m61323K911
6845c20117L34999k91734K05258m29432M64255k17627m19119J69488J77828J70279
6835a55922j54001L37655N47352k78409j52250l87113Q2251j60242L1484L6561
6825b52634k51578J07669L53964j12762j56363K92133L89724m91024k21087K46973
6815i4985j6473J33345m96154J04225K4525Q3813K32494k43944M8532L1994L56527
6804A63899K76881k15392k58000n31790k20111J46578J9824j6529K21903P27395
6794C14658P2417j90166J61653M2809j65182k90903O8322L04470J81850k32796
6784B67132l42673M8408k68966J0631M7941p5908K93793N0288M03870p9619j09163
$$ y = [-100466, -217590, 278377, 376090, -64235, -155869, -545058, -171561, 138295, -323028, -320117, 14882, -276852, -71594, -501026, -36771, -254398, -673517, -504029, -326201, -155922, -309923, 27732, 575084, 296675, 144425, -242688, -160437, -320679, -289195, -252634, -504212, -396543, -42579, -155341, -311704, -19571, 370153, -120871, -341958, -94985, -111458, 21887, -474267, -370042, -345517, -261704, -29210, -273154, -224622, -192628, 163899, 440780, 225388, -32612, -564402, -784513, -637935, -618111, -634640, -412737, 314658, 387075, 196909, 358562, 401371, 236189, -54714, 13608, 318078, 499928, 267132, -75541, -27133, -296099, -285468, -237527, -313435, -19642, 30646, 434516, 354897, 245734]
6773B45734k92483p0805r4741O59729r452j581l24897m66735L01820L23523M179
6762B74291q5530Q9610O2906k69341j90474j57683K24909M08308k90351k76305
6752b09660k03884O88998J71605k20824m26257m56098L65828k67009K33979n7161
6742c80483K39849K25147l83296j3177K34228m4278J75159l02498m2396j55327
6732d47072K73027j10189J53952N49121r5683K19172k68379M1872n32334n61811
6722g78324K91645L9193K09169L4631J40043j80211p1438M68323j70503k09211
6712b26683J13384O450K49280K0823k40916K63024k42575m55830K47153Q5350
6702a80540k16960l9720O18854K52763J31510l97789l48099j59001n9224k07716
$$ y = [245734, -46749, -117554, -212295, 447434, 437982, 436401, 111504, -355231, -53411, 270112, 274291, 188761, 278371, 341277, 71936, -118538, -276221, -51312, 356996, 66645, -209660, -413544, 275454, 447059, 226235, -200022, -656120, -290292, -557301, -323322, -380483, -140634, 84513, -298783, -311960, -77732, -122010, 53149, -249349, -291745, -447072, -174045, -284234, -130282, 418839, 323156, 542328, 273949, 315821, -216513, -778324, -486679, -447486, -238317, -203686, -63643, -243854, -315292, 153031, -17472, -226683, -113299, -106849, 142431, 163254, -77662, 185362, -57213, -513043, -265890, -180540, -397500, -437220, 181634, 434397, 565907, 168118, -179981, -338982, -398206, -605922]
6692f05922L35063K76578K54267k56559o56311L09127j23962K40918k35834L95030
6682f7605O4739J83777j23324K76897R0101j74760J45884k62089j32395k37593
6672b36368M98526K30294j63326n76212l58627j43674N50856J0478l23978K91767
6662b20264n4955K02239R0399J1312P1837P3563m14417R3171N9163J07874l14246
6651b94324O30639j730p3462j79775j38120K43179L92420j03051m11977J72280
6641B36079N7088l91853j31443o2512Q6735M9152j42567j28225M28567j09224
6631a08203r4161L1220r36j1629o7067j82031L34343L52186j26133j88071p9221
6620a39703L42474o3806L74700n9598n3902m49643r8455P8693K7255M9451j79295
$$ y = [-605922, -270859, 5719, 259986, 3427, -652884, -343757, -467719, -226801, -462635, -67605, -2866, 180911, 57587, 334484, 424585, 249825, 395709, 133620, 1225, -236368, 262158, 492452, 329126, -247086, -605713, -749387, -198531, -188053, -512031, -220264, -275219, -72980, 17419, 28731, 100568, 174131, -240286, -147115, -87952, 19922, -294324, 336315, 334585, 261123, 81348, -56772, 186407, 578827, 475776, 63799, 236079, 293167, -98686, -230129, -292641, -205906, -156754, -299321, -427546, 1021, -108203, -202364, -171144, -172080, -183709, -250776, -432807, -98464, 253722, 127589, -60482, -139703, 202771, 138965, 513665, 454067, 400165, -49478, -147933, -69240, -41985, 7466, -171829]
6609a71829K65414l38261J82678P0091m06092L71426n5831O768K39817K4610n11699
6598c22908M5427J67701K61201j74192l13976K20356j9407k69400L20031j74091
6588b59258k13624O55172L47506j05079k30555q4207l69258j03094J74027J6344
6578a72026L33146l26889j5583k9449k10457M60977J12935m23181j90717k34495
6568f95739m432p8587k3644L46361M48305p6970J36289O7101n278J95705k26007
6557H3104p0568l68861K4761K24350n2245M8437L61391J07448k65012K16801J23401
6546D33007k88625o6132J19534j24923O61j647j90870m511L94966j32570N0990
6535A89880j86693j03949O6920l43871k1151K77835j66068N31250K66281n67358
$$ y = [-171829, 93585, -244676, -61998, 8093, -397999, -26573, -82404, -75636, 164181, 188791, -322908, -277481, -109780, 151421, -22771, -336747, -116391, -135798, -405198, -85167, -259258, -472882, 182290, 529796, 424717, 194162, 109955, -259303, -362397, -188370, -172026, 161120, -165769, -181352, -210801, -421258, 39719, 152654, -270527, -461244, -695739, -700171, -778758, -802402, -456041, -7736, -84706, 51583, 118684, 113406, 309111, 83104, 12536, -356325, -331564, -107214, -159459, -111022, 250369, 357817, 92805, 309606, 433007, 144382, 78250, 197784, 72861, 73522, 71875, -118995, -123506, 271460, 138890, 189880, 3187, -100762, -33842, -377713, -398864, -121029, -287097, 244153, 510434, -56924]
6525e6924J60048N71829l77232o10535M72891M4248P2565N0061l96351K5603K66962
6514B23165L1070k05064J57290M03149m87534m58319M0229K56215l50996l4444
6504d25239K75489L24421l64436L44329m4905m06917l8441J90609P4863p5652
6494a45879M56444m46942J17517J15548m32682m10338K92080O37596Q6396j68657
6484A01083j46622L08627n19593j06031K37J62771L8224j53452K03070j42652
6474b54338P7383q9543L33918R1317k1936k35286j33922j55562M2720j15920P9477
6463c81692K62680J5226P9539n67498l92452L01106J87339N97807J33359M09060
6453F44474L83192n46613j93134J73122k84250j47093k48878J9578k2114N20151
$$ y = [-56924, 103124, 674953, 297721, -312814, 160077, 204325, 276890, 326951, -69400, -43797, 223165, 254235, 49171, 206461, 609610, 122076, -336243, -296014, -39799, -390795, -425239, -149750, 174671, -189765, 154564, 109659, -297258, -335699, -145090, -70227, -145879, 310565, -136377, -18860, 96688, -335994, -746332, -454252, 183344, 269740, 101083, -45539, 263088, -256505, -362536, -362299, -199528, -161304, -314756, -111686, -254338, -176955, -266498, 67420, 158737, 136801, -98485, -232407, -387969, -345249, -461169, -381692, -119012, -103786, -24247, -591745, -984197, -683091, -495752, 102055, 235414, 644474, 1027666, 481053, 287919, 461041, 176791, 29698, -219180, -199602, -221716, 298435]
6443B98435L48271l99203J27946p45212m2933J60752L4213j76603R2092k41568
6433e43810L23504j63885K10229N07641n810l88159R3491K77060J70883N5832
6423E36976o17484k01651J47594K47980k04118K33977N005k19559k77468k25881
6413e74629J6598L35183J9058K65859j97347k17609M7070M54737j79643k84628
6403c15351k68205L3327N15534J33314m92411K25946N3263L23164J83970o22241
6393b29690J44537L48141M5020m51571k80921J82497J54267j43621m6677m8394
6383c26412j7046k36856K5543l8600K9941J29992M69416J0734K71449j24139Q8834
6372B82856N59426n97135o18315j00630L76222k06587L94788K79538l32397P7306
$$ y = [298435, 646706, 247503, 375449, -369763, -412696, -251944, -217731, -394334, -302242, -543810, -220306, -384191, -173962, 333679, 327869, -60290, 33201, 310261, 481144, 536976, -80508, -282159, -134565, 113415, -90703, 143274, 148279, -71280, -348748, -574629, -558031, -222848, -203790, 62069, -135278, -352887, -305817, 148920, -30723, -315351, -583556, -550229, -34695, 98619, -393792, -167846, -114583, 208581, 392551, -229690, -85153, 262988, 308008, -143563, -424484, -241987, -87720, -231341, -278018, -326412, -343458, -580314, -554771, -593371, -563430, -433438, 35978, 46712, 318161, 194022, 282856, 842282, 245147, -373168, -473798, -97576, -304163, 90625, 370163, 37766, 115072]
6362A15072N24909j99219l84590K57152n70524J44769J66368l72263l92859L09652
6352d01533M53452K28978o57700L75023n05511j92624N76027j90164k04209M48075
6342g0186L95544n8414k8050o2047J46090m96785Q1984Q917l05207k37785J36937
6331d89002L81402k4275K09377k19848K9665J33098M0477m00143K262P7560J24021
6320a35406o524j81204m83K87910K13795j36757j82900l00167M36484K36835J63010
6309C94593n53772L09022K83295m54310M37385l27160l91090K56666K33211R9568
6299B87408j68557J34892k19025O9086j96889M32522Q8619n90740l36979M34722
6289f4941p6569k72085J32535O5178j70940p490M8451K20537J04265j29481k8031
$$ y = [115072, 639981, 440762, 56172, 313324, -257200, -112431, 53937, -318326, -711185, -401533, 51919, 280897, -376803, -1780, -507291, -699915, -123888, -314052, -518261, -70186, 325358, 266944, 238894, 176847, 322937, -173848, -91864, -82947, -388154, -625939, -489002, -107600, -131875, 77502, -142346, -112681, 20417, 60894, -339249, -336987, -259427, -135406, -141930, -323134, -323617, -35707, 178088, 41331, -141569, -441736, -5252, 231583, 394593, -159179, 149843, 433138, -21172, 416213, 89053, -302037, -45371, 187840, 287408, 118851, 253743, 34718, 103804, -93085, 339437, 428056, -162684, -499663, -64941, -141510, -413595, -281060, -215882, -386822, -394312, -345861, -125324, -21059, -150540, -178571]
6278a78571L37039r2379J57968M2675q3744j53570L52997J83882l47908k29504
6268a1115k34223K13777J08870o0610l17878L4957M50548P3261k38971m31695
6258d13079o0176O44593J63967k3656N6096l35620j9879j56557J05476l54301
6248c93136M2083J1891M75832j98240R7630L61295j31664k0795l99750K30583
6238G5729r3002M67843N00096k38829m64529k07998J56328Q911m73543J23932
6228a45062J82202j39064j39715K02097k0698L95362k45298N7166p26020Q3017
6218d96013Q9912J00691K68135L1245j98962k0350r994j85046J54554J16613N44
6207a48671j40058o8013l9270J65204k67603M1553M28181m2920M077j31994o8210
$$ y = [-178571, 158468, 66089, 224057, 266732, 182988, 29418, 382415, 566297, 218389, -11115, -245338, -31561, 77309, 16699, -301179, -266222, 184326, 257587, 18616, -413079, -473255, 171338, 335305, 311649, 367745, 32125, 12246, -144311, -38835, -393136, -351053, -339162, 136670, -61570, 36060, 397355, 265691, 244896, -154854, 75729, -17273, 450570, 950666, 711837, 247308, 39310, 195638, 204549, -268994, -145062, 37140, -101924, -241639, -39542, -60240, 335122, 89824, 146990, -579030, -496013, -406101, -305410, -37275, -6030, -204992, -225342, -235336, -420382, -265828, -149215, -148671, -288729, -356742, -396012, -230808, -498411, -456858, -28677, -71597, -67520, -199514, -267724]
6196b67724K29780l36910N90522L59681k9808l48794o9307k55935o2763l5321
6186b26579m2069J78285K12454J2047l19550M67549l63988l70243j04060L9078
6176e17076M0422L19669L57894q6258k43609Q9750N8470l41503k75211j50443
6166g47895J20877K83510j23433N77029l47301k86547N28575r8515J9886J82181
6156A08367M7765l31724j50475L0205K12475p6275J30863P9038j15650m0121K88942
6145A83410n6862l23862J70503J38468j23570O6924k23748k71005Q6642J2875
6135c40225P39637k38690j57777k53369J31103q1755q5988K94032q9979J71997
6125H8986K9441j28639k42092O48043k24589k49190o08174K33188q2429n5014
$$ y = [-267724, -37944, -374854, 215668, 575349, 545541, 196747, 127440, -128495, -191258, -226579, -268648, -90363, 122091, 134138, -185412, 282137, -81851, -452094, -556154, -517076, -476654, -156985, 200909, 114651, -128958, -39208, 19262, -322241, -597452, -747895, -627018, -343508, -466941, 110088, -237213, -523760, 4815, -93700, -73814, 108367, 156132, -175592, -326067, -295862, -83387, -159662, -28799, 50239, -65411, -105532, 183410, 126548, -197314, -26811, 111657, -11913, 55011, -168737, -439742, -353100, -340225, 399412, 160722, 2945, -250424, -119321, -201076, -287064, 6968, -83011, 88986, 118427, -10212, -252304, 395739, 171150, -78040, -686214, -453026, -535455, -590469]
6115e90469K98068K21103M45516l5545L21270k59528l01837j66756J13014m11665
6105c66829P8652K6869L77454L25904M178K0071M1030m93219j85770N59686l39928
6094D8098K91658l6917k47816M06778k94333l28912o9484J96381M73634l61390
6084G7697K45326J03159P641n2605r3385M37515k27272k78803K26376k85199K78612
6073D39062J81454o2386j26479l38525K13157k79831l20759J50220K90254K17225
6063C63392j60296L37368j006041J10935K81860j81363K66622m956Q1314Q4403
$$ y = [-590469, -292401, -71298, 374218, 338673, 659943, 400415, 98578, -68178, 44836, -366829, -288177, -261308, 116146, 442050, 446228, 466299, 507329, 14110, -171660, 388026, 48098, 339756, 302839, 55023, 461801, 167468, -161444, -230928, -34547, 439087, 77697, 323023, 426182, 433823, 381218, 287833, 725348, 498076, 219273, 445649, 160450, 439062, 620516, 558130, 431651, 93126, 306283, 26452, -294307, -144087, 146167, 363392, 203096, 540464, -465577, -354642, -72782, -254145, 12477, 7521, 88835, 173238]
$$ [...]
##END NTUPLES=NMR SPECTRUM
##END=
