##TITLE=1H_CA-9217
 CDCl3
 8 sc, 
 26.12.2023
##JCAMPDX= 6.0         $$ Bruker NMR JCAMP-DX V2.0
##DATA TYPE= NMR SPECTRUM
##DATA CLASS= NTUPLES
##ORIGIN= UXNMR, Bruker Analytische Messtechnik GmbH
##OWNER= root
$$ XWIN-NMR		Version 3.5
$$ Tue Dec 26 14:32:58 2023 Russian Standard Time (UT+4h)  she@DPX200
##.OBSERVE FREQUENCY= 200.1313
##.OBSERVE NUCLEUS= ^1H
##.ACQUISITION MODE= SIMULTANEOUS
##.ACQUISITION SCHEME= undefined
##.AVERAGES= 8
##.DIGITISER RES= 18
##SPECTROMETER/DATA SYSTEM= spect
##.PULSE SEQUENCE= zg30
##.SOLVENT NAME= CDCl3
##.SHIFT REFERENCE= (INTERNAL, CDCl3, 0, 15.4329)
##AUDIT TRAIL= $$ (NUMBER, WHEN, WHO, WHERE, WHAT)
$$ ##TITLE= Audit trail, XWIN-NMR		Version 3.5
$$ ##JCAMPDX= 5.01
$$ ##ORIGIN= Bruker BioSpin GmbH
$$ ##OWNER= she
$$ F:/spectra/data/she/nmr/H-F/1/pdata/1/auditp.txt
$$ ##AUDIT TRAIL=  $$ (NUMBER, WHEN, WHO, WHERE, WHAT)
(   1,<2023-12-26 14:31:54.79 +0400>,<she>,<DPX200>,
      <created by zg, POWCHK disabled, PULCHK disabled
       configuration hash MD5:
       00 E9 B6 7A A2 85 ED C7 34 08 36 98 17 FE 4E 26
       data hash MD5: 16K
       62 C3 67 73 D5 BE C1 4E 3E 2F F7 A6 A9 02 B6 94>)
(   2,<2023-12-26 14:31:57.53 +0400>,<she>,<DPX200>,
      <Start of raw data processing
       efp BC_mod = 2 LB = 0.24 FT_mod = 6 PKNL = 1 PHC0 = -24591.77 PHC1 = 8.652729 SI = 16K 
       data hash MD5: 16K
       77 18 D1 DD 92 4F 21 02 52 FA CC AE 08 E8 AE 98>)
(   3,<2023-12-26 14:32:16.29 +0400>,<she>,<DPX200>,
      <pk PHC0 = 0.4075766 PHC1 = -4.470348e-08 
       data hash MD5: 16K
       16 25 D8 68 54 5B 85 C1 D4 CB 12 F6 4A 24 90 75>)
(   4,<2023-12-26 14:32:19.95 +0400>,<she>,<DPX200>,
      <abs ABSG = 5 
       data hash MD5: 16K
       FB 5D 96 90 C4 11 40 79 52 2B 19 AF A7 34 A3 44>)
$$ ##END=
$$ 
$$ hash MD5
$$ 49 A5 01 CC 1D C2 90 4C 78 44 13 4C BC CB F7 F0
##$RELAX= 
##$RELAX= 
##$RELAX= 
##$RELAX= 
##$RELAX= 
##$RELAX= 
$$ Bruker specific parameters
$$ --------------------------
##$DU= <F:/spectra>
##$EXPNO= 1
##$NAME= <H-F>
##$PROCNO= 1
##$TYPE= <nmr>
##$USER= <she>
##$AMP= (0..31)
100 100 100 100 100 100 100 100 100 100 100 100 100 100 100 100 100 100 
100 100 100 100 100 100 100 100 100 100 100 100 100 100 
##$AQSEQ= 0
##$AQ_mod= 1
##$AUNM= <au_zg>
##$AUTOPOS= <>
##$BF1= 200.13
##$BF2= 200.13
##$BF3= 200.13
##$BF4= 200.13
##$BF5= 200.13
##$BF6= 200.13
##$BF7= 200.13
##$BF8= 200.13
##$BYTORDA= 1
##$CFDGTYP= 0
##$CFRGTYP= 5
##$CHEMSTR= <none>
##$CNST= (0..31)
1 1 145 1 1 1 1 1 1 1 1 1 1 1 1 1 1 1 1 1 1 1 1 1 1 1 1 1 1 1 1 1 
##$CPDPRG= <>
##$CPDPRG1= <>
##$CPDPRG2= <>
##$CPDPRG3= <>
##$CPDPRG4= <mlev>
##$CPDPRG5= <mlev>
##$CPDPRG6= <mlev>
##$CPDPRG7= <mlev>
##$CPDPRG8= <mlev>
##$CPDPRGB= <>
##$CPDPRGT= <>
##$D= (0..31)
0 1.2 0 0 0 0 0 0 0 0.06 0 0.03 0 0 0 0 0.0002 0 0 0 0 0 0 0 0 0 0 0 0 
0 0 0 
##$DATE= 1703586714
##$DBL= (0..7)
120 120 120 120 120 120 120 120 
##$DBP= (0..7)
150 150 150 150 150 150 150 150 
##$DBP07= 0
##$DBPNAM0= <>
##$DBPNAM1= <>
##$DBPNAM2= <>
##$DBPNAM3= <>
##$DBPNAM4= <>
$$ [...]
##$SUBNAM3= <"">
##$SUBNAM4= <"">
##$SUBNAM5= <"">
##$SUBNAM6= <"">
##$SUBNAM7= <"">
##$SUBNAM8= <"">
##$SUBNAM9= <"">
##$SW= 18.0517328524113
##$SWIBOX= (0..15)
0 0 2 0 0 0 0 0 0 0 0 0 0 0 0 0 
##$SW_h= 3612.71676300578
##$TD= 16384
##$TD0= 1
##$TE= 0
##$TE2= 300
##$TE3= 300
##$TEG= 300
##$TL= (0..7)
0 120 120 120 120 120 120 120 
##$TP= (0..7)
150 150 150 150 150 150 150 150 
##$TP07= 0
##$TPNAME0= <>
##$TPNAME1= <>
##$TPNAME2= <>
##$TPNAME3= <>
##$TPNAME4= <>
##$TPNAME5= <>
##$TPNAME6= <>
##$TPNAME7= <>
##$TPOAL= (0..7)
0.5 0.5 0.5 0.5 0.5 0.5 0.5 0.5 
##$TPOFFS= (0..7)
0 0 0 0 0 0 0 0 
##$TUNHIN= 0
##$TUNHOUT= 0
##$TUNXOUT= 0
##$USERA1= <user>
##$USERA2= <user>
##$USERA3= <user>
##$USERA4= <user>
##$USERA5= <user>
##$V9= 5
##$VALIST= <valist>
##$VCLIST= <CCCCCCCCCCCCCCC>
##$VD= 0
##$VDLIST= <DDDDDDDDDDDDDDD>
##$VPLIST= <PPPPPPPPPPPPPPP>
##$VTLIST= <TTTTTTTTTTTTTTT>
##$WBST= 1024
##$WBSW= 4
##$XGAIN= (0..3)
0 0 0 0 
##$XL= 0
##$YL= 0
##$YMAX_a= 241607
##$YMIN_a= -233306
##$ZGOPTNS= <>
##$ZL1= 120
##$ZL2= 120
##$ZL3= 120
##$ZL4= 120
##$ABSF1= 15.4483
##$ABSF2= -2.603549
##$ABSG= 5
##$ABSL= 3
##$ALPHA= 0
##$AQORDER= 0
##$ASSFAC= 0
##$ASSFACI= 0
##$ASSFACX= 0
##$ASSWID= 0
##$AUNMP= <proc_1d>
##$AZFE= 0.1
##$AZFW= 0.1
##$BCFW= 0
##$BC_mod= 2
##$BYTORDP= 0
##$COROFFS= 0
##$CY= -3
##$DATMOD= 1
##$DC= 0
##$DFILT= <>
##$DTYPP= 0
##$F1P= 0
##$F2P= 0
##$FCOR= 1
##$FTSIZE= 16384
##$FT_mod= 6
##$GAMMA= 0
##$GB= 0
##$INTBC= 1
##$INTSCL= 3.70164e-10
##$ISEN= 128
##$LB= 0.24
##$LEV0= 0
##$LPBIN= 0
##$MAXI= 10000
##$MC2= 0
##$MEAN= 0
##$ME_mod= 0
##$MI= 1.114404
##$NCOEF= 0
##$NC_proc= -7
##$NLEV= 6
##$NOISF1= 3.799351
##$NOISF2= 2.8
##$NSP= 0
##$NTH_PI= 0
##$NZP= 0
##$OFFSET= 15.43288
##$PC= 1
##$PHC0= -24591.36
##$PHC1= 8.652729
##$PH_mod= 1
##$PKNL= yes
##$PPARMOD= 0
##$PSCAL= 0
##$PSIGN= 0
##$REVERSE= no
##$SF= 200.130017777111
##$SI= 16384
##$SIGF1= 3
##$SIGF2= 2
##$SINO= 5.538805
##$SIOLD= 16384
##$SREGLST= <1H.CDCl3>
##$SSB= 0
##$STSI= 16384
##$STSR= 0
##$SW_p= 3612.71676300578
##$SYMM= 0
##$S_DEV= 0
##$TDeff= 16384
##$TDoff= 0
##$TI= <>
##$TILT= no
##$TM1= 0
##$TM2= 0
##$TOPLEV= 0
##$USERP1= <user>
##$USERP2= <user>
##$USERP3= <user>
##$USERP4= <user>
##$USERP5= <user>
##$WDW= 1
##$XDIM= 16384
##$YMAX_p= 357723117
##$YMIN_p= -1553219
$$ End of Bruker specific parameters
$$ ---------------------------------
##NTUPLES= NMR SPECTRUM
##VAR_NAME=  FREQUENCY,     SPECTRUM/REAL,   SPECTRUM/IMAG
##SYMBOL=    X,             R,               I
##VAR_TYPE=  INDEPENDENT,   DEPENDENT,       DEPENDENT
##VAR_FORM=  AFFN,          ASDF,            ASDF
##VAR_DIM=   16384,         16384,           16384
##UNITS=     HZ,            ARBITRARY UNITS, ARBITRARY UNITS
##FACTOR=    0.220516191357247, 1,           1
##FIRST=     3088.5826291265, 0,             0
##LAST=      -524.134133879277, 0,           0
##MIN=       -524.134133879277, -1553219,    0
##MAX=       3088.5826291265, 357723117,     0
$$ Real data points
##PAGE= N=1
##DATA TABLE= (X++(R..R)), XYDATA
$$ [...]
7657b38472j46286J63428J1248k21356K06441J79544O1152N3515N4409J0173j89084
$$ -238472 -384758 -221330 -210082 -431438 -224997 -45453 15699 69214 123623 133796 -55288
7646e5288j3869m7028j49570L4745K22264l9709k08365N0815n4868K82055M8007
$$ -55288 -69157 -116185 -265755 -231010 -8746 -48455 -256820 -206005 -260873 21182 69189
7635F9189M4730j30149O3466L5195M0816j20033K68350l50055r8128K8065M1315
$$ 69189 113919 -16230 47236 82431 123247 3214 271564 -78491 -176619 -148554 -107239
7624a07239q0040P5372K86452J3507j58160r130o5284J9883j47173K21368j22193
$$ -107239 -187279 -111907 174545 188052 29892 20762 -44522 -24639 -171812 49556 -72637
7613g2637m4612K25133j84876j66476O424K04337P9197K7751O2422j9961l01396
$$ -72637 -117249 107884 -76992 -243468 -237044 -32707 46490 74241 136663 116702 -184694
7602a84694j12263O1568J33695r4888K35816r1914k0262J85080J77404k33016
$$ -184694 -296957 -235389 -101694 -196582 39234 -52680 -72942 112138 289542 56526
7592E6526l6059j22824J03380P3593j42457R4631k31620L1194M1784J42018K44430
$$ 56526 20467 -102357 1023 74616 -67841 26790 -204830 -173636 -131852 10166 254596
7581B54596k39649Q3344o6178q6590L006O1867k19636J78199J30062n5410k05634
$$ 254596 14947 98291 32113 -54477 -51471 10396 -209240 -31041 99021 43611 -162023
7570a62023O5398L1975j46047q0229M3324Q6895r1779J24044J45060M7404j99685
$$ -162023 -96625 -64650 -210697 -290926 -247602 -160707 -252486 -128442 16618 64022 -135663
7559a35663j49844O1820P0268Q0849N2149o3218J61572N4710j34526j5790n6178
$$ -135663 -285507 -223687 -153419 -72570 -20421 -83639 77933 132643 -1883 -17673 -73851
7548g3851j13133J35226J53333j72471j03358m5623Q5005J08102K9382N8888n5904
$$ -73851 -186984 -51758 101575 -70896 -174254 -219877 -134872 -26770 2612 61500 5596
7537E596k4219J20281k09116J3806K9638j44464M8498L0173J87088N0555J24099
$$ 5596 -18623 101658 -107458 -93652 -64014 -208478 -159980 -129807 57281 107836 231935
7526B31935k9846l01958Q3194J33916j22585j03487k8431K0707n9506j46335J35100
$$ 231935 202089 -99869 -16675 117241 -5344 -108831 -137262 -116555 -176061 -322396 -187296
7515a87296j37363L6879J92402q9392m320r7687J34786M9459o8857J03031J52259
$$ -187296 -324659 -287780 -95378 -184770 -189090 -286777 -151991 -102532 -171389 -68358 83901
7504H3901R7678P7244j29689j17727k762L6206j05813K9644J82832j75053Q9644
$$ 83901 181579 258823 129134 11407 8645 44851 -60962 -31318 151514 -23539 66105
7493F6105K44399m26308k74227J30168J11901K53590L39851k28502j33428O5428
$$ 66105 310504 -115804 -390031 -259863 -147962 105628 445479 216977 83549 148977
7483A48977j51760l77285J69094j8760P1882J39232J6432m5254k22951K8850R7326
$$ 148977 -2783 -380068 -210974 -229734 -157852 -18620 -2188 -47442 -270393 -241543 -144217
7472a44217o8745J13542J27322n0049M809N4950J6505o977Q3626r2555J4263j34406
$$ -144217 -212962 -99420 27902 -22147 -17338 37612 54117 47140 130766 38211 52474 -81932
7460h1932j71975j12555K24313q6633K5281K02171J47274J0454j64853r0291r9976
$$ -81932 -253907 -366462 -142149 -228782 -203501 -1330 145944 156398 -8455 -98746 -198722
7449a98722k65125K42967j04590J93547r5545j21811J70654M3270J96888n7579
$$ -198722 -463847 -220880 -325470 -131923 -227468 -349279 -178625 -135355 61533 3954
7439C954P4502j84599j49871J71708P0314o417J54345j28296j93557J27478J64245
$$ 3954 78456 -106143 -256014 -84306 -13992 -20409 133936 5640 -187917 -60439 103806
7428A03806p7846R7994j78465M9336j56378p9423J46993M8823n5952j16285J46276
$$ 103806 25960 123954 -54511 -5175 -161553 -240976 -93983 -45160 -101112 -217397 -71121
7417g1121J84186J02143j42980j11713M2798j10497R4454q650n7037r9603j20997
$$ -71121 113065 215208 72228 -39485 3313 -107184 -12730 -21380 -78417 -178020 -299017
7406b99017l4847J93713J53492j50832k21722K37347J48736j38398M6468P7176
$$ -299017 -333864 -140151 13341 -137491 -359213 -121866 26870 -111528 -65060 12116
7396A2116j3016M6263n1626J9160J799R9786k8567o5365P4680J27992N4130l16201
$$ 12116 -900 45363 -6263 12897 14696 114482 85915 20550 95230 223222 277352 -38849
7384c8849J2792j1911K19276N238j17651j24516n7766K93738K7010j18789n1694
$$ -38849 -26057 -37968 181308 186546 68895 -55621 -113387 180351 207361 88572 36878
7373C6878r7878J4416M4923j9100j40175l8772L22788q4067o3680j21718J2734
$$ 36878 -61000 -46584 -1661 -20761 -160936 -199708 123080 39013 -24667 -146385 -133651
7362a33651M0020R3108j92714n1428K37214k2145J0080J3387J29990j74400j12620
$$ -133651 -93631 -523 -193237 -244665 -7451 -29596 -19516 -6129 123861 -50539 -163159
7351a63159j02837k99989Q9244K73399Q8701Q3717o1320m0195l2887j9293N9419
$$ -163159 -265996 -565985 -476741 -203342 -114641 -30924 -92244 -132439 -165326 -184619 -125200
7340a25200K5383R1259K13485j15909J7920k09081m8590K9759J10880J37599j76809
$$ -125200 -99817 -8558 204927 89018 106938 -102143 -150733 -120974 -10094 127505 -49304
7329d9304m8957J45182k6126K44886q7846j18280m1010l9057K01394j27594m00689
$$ -49304 -98261 46921 20795 265681 177835 59555 18545 -20512 180882 53288 -347401
7318c47401J45901K20441j27014l9893k7095j50374o5974J9060K33263L44348
$$ -347401 -201500 18941 -108073 -147966 -175061 -325435 -391409 -372349 -139086 205262
7308B05262j65217k25053j10584N5923J51681p175K1392J37872k80375j58594
$$ 205262 40045 -185008 -295592 -239669 -87988 -95163 -73771 64101 -216274 -374868
7298c74868K60745M6898k02130P8368L85683q8858k08834j14259J17220K77106
$$ -374868 -114123 -67225 -269355 -190987 194696 105838 -102996 -217255 -100035 177071
7288A77071J63536l05493j04069J82870j27029n8247n1367m0790J96839m3560
$$ 177071 340607 35114 -68955 113915 -13114 -71361 -122728 -163518 33321 -10239
7278a0239R4538o4909j46049j80208Q8642L39543k24824K1180r4091k29163n7078
$$ -10239 84299 19390 -126659 -306867 -218225 121318 -103506 -82326 -176417 -405580 -462658
7267d62658K65910N3189J59488j40732k55715K40396k3396j57457J42241K47324
$$ -462658 -196748 -143559 15929 -124803 -380518 -140122 -163518 -320975 -178734 68590
7257F8590n843k11140J8185j93827J85326p4397L9502n7943L2103L54611p3851
$$ 68590 62747 -148393 -130208 -324035 -138709 -213106 -173604 -231547 -199444 155167 81316
7246H1316j78618j25078K52293R08j35301J19003j58908k1791K07019J42444j43301
$$ 81316 -97302 -222380 29913 30821 -104480 14523 -144385 -166176 40843 183287 39986
7235C9986m7436L4308j1232o4905j9828K06875k46309J17897R6982j71727k7654
$$ 39986 -7450 26858 15626 -49279 -69107 137768 -108541 9356 106338 -65389 -93043
7224i3043R317m6520M6353q9479r1805j32511J59415r570J05697J76463k89573
$$ -93043 -83726 -130246 -83893 -173372 -265177 -397688 -238273 -247843 -142146 34317 -255256
7213b55256J29093o5186j48601O7542J48057L1661l656J29582J45975l09737n3498
$$ -255256 -126163 -191349 -339950 -272408 -124351 -92690 -96346 33236 179211 -130526 -184024
7202a84024J33149o3180q3148Q9186j46294J55586L1283m3352J22063r0726M3113
$$ -184024 -50875 -114055 -197203 -108017 -254311 -98725 -67442 -110794 11269 -79457 -36344
7191c6344r4065J5285J08534k35228P3296O9582M2968j5405p9628K40432k55137
$$ -36344 -130409 -115124 -6590 -241818 -168522 -98940 -55972 -71377 -151005 89427 -165710
7180a65710k49227K72425K7400k22080K76934J88442l47357m5943J99755j12065
$$ -165710 -414937 -142512 -115112 -337192 -60258 128184 -219173 -265116 -65361 -177426
7170a77426J28091j10411K0807J59339N7337n3057j600j91163J6964j01986m1590
$$ -177426 -49335 -159746 -138939 20400 77737 24680 23080 -168083 -151119 -253105 -294695
7159b94695K08960R3524O8280l7525m6752k71189L0898N6526N0855K1662N7380
$$ -294695 -85735 7789 76069 38544 -8208 -279397 -248499 -191973 -141118 -119456 -62076
7148f2076J68200j17650M0100J46894k4145j30360j40000k32202j6027L1628J24359
$$ -62076 106124 -11526 28574 175468 151323 20963 -119037 -351239 -367266 -335638 -211279
7137b11279K90051J39626j54049M8310j97920O1584K4155k4573L17708j85213
$$ -211279 78772 218398 64349 112659 -85261 -23677 478 -24095 293613 108400
7127A08400j42582K16574R5277k60822L1719j52168l7691J31479K3233j24480
$$ 108400 -34182 182392 277669 16847 48566 -103602 -141293 -9814 13419 -111061
7117a11061n6279P5822R1346L1664K0543n8748J6963N3561j49218O372J17356
$$ -111061 -167340 -91518 -172 31492 52035 -6713 10250 63811 -85407 -79035 38321
7106C8321j36079J29716J79926n7955N4782l21728j11220K04716j47186j46130
$$ 38321 -97758 31958 211884 153929 208711 -113017 -224237 -19521 -166707 -312837
7096c12837N0442K3350J82623j47136O9419K38722R2186k60331M0637N9050K81129
$$ -312837 -262395 -239045 -56422 -203558 -134139 104583 196769 -63562 -22925 36125 317254
7085C17254j36100k60674n863j56974P9964K1722q2179J76926j8488J49822P1079
$$ 317254 181154 -79520 -85383 -242357 -162393 -140671 -222850 -45924 -64412 85410 156489
7074A56489k41178m1393k1958J6037J20624J69600j38872j34015j01134L90620
$$ 156489 -84689 -126082 -148040 -132003 -11379 158221 19349 -114666 -215800 174820
7064A74820j66957k8399J70162J5013o1090j12857j55121L33995q076j83863r4432
$$ 174820 7863 -20536 149626 164639 103549 -9308 -164429 169566 161490 -22373 -116805
7053a16805j2866K7936P733J73264q1548j12411Q1374j07116N7064J47121J619
$$ -116805 -129671 -101735 -94002 79262 -2286 -114697 -33323 -140439 -83375 63746 65365
7042F5365J28842J05395k14451p3644K05867k21580l08112n3890O1624J46262
$$ 65365 194207 299602 85151 11507 217374 -4206 -312318 -366208 -304584 -158322
7032a58322O5074J22853L0261r7205Q4614O8650M0785m7775j3821j23146q9275
$$ -158322 -93248 29605 59866 -37339 47275 115925 156710 108935 95114 -28032 -117307
7021a17307j25861k6165K19490N9198j09493j86372J6866J53757o5997J49359
$$ -117307 -243168 -269333 -49843 9355 -100138 -286510 -269644 -115887 -181884 -32525
7011c2525L9982k89948j03139K18925K23775J10171L1820p4757l6622j52173q1491
$$ -32525 7457 -282491 -385630 -166705 57070 167241 199061 124304 87682 -64491 -145982
7000a45982m8255j0927K7913J34768j30057j9258M1314R4247J27846l3515j68636
$$ -145982 -194237 -205164 -177251 -42483 -172540 -191798 -150484 -56237 71609 38094 -130542
6989a30542M0240J60015l90150j24618m7962K59735K90286L494P432P1920q5803
$$ -130542 -90302 69713 -320437 -445055 -493017 -233282 57004 60498 67930 139850 54047
6978E4047j65842L6856j153M6820J7765j48494M262J04760j7926p7693P5676j36488
$$ 54047 -111795 -74939 -76092 -29272 -11507 -160001 -155739 -50979 -68905 -146598 -70922 -207410
6966b07410l8906j42819N3737O730j4397J70218j41240J86429p5177K33496p3091
$$ -207410 -246316 -389135 -335398 -328668 -343065 -172847 -314087 -127658 -202835 30661 -42430
6955d2430l01236M0669l0966K76689k4146P236j05822K2396J04255o872L2260
$$ -42430 -343666 -302997 -333963 -57274 -81420 -74184 -180006 -157610 -53355 -60227 -27967
6944b7967K6949j02544P3502O1324L9999k86817K11386R1397j77186J5791j13819
$$ -27967 -1018 -103562 -30060 31264 71263 -215554 -4168 87229 -89957 -74166 -187985
6933a87985r8917J67638J76102l662q6626L1967J47709j18428k82697j19131J54758
$$ -187985 -286902 -119264 56838 53176 -33450 -1483 146226 27798 -254899 -374030 -219272
6922b19272P7664R9060r3894p9526P6465q7261J16150J06472J4951J27095k65301
$$ -219272 -141608 -42548 -136442 -215968 -139503 -226764 -110614 -4142 10809 137904 -127397
6911a27397j38652Q0645j5486j26981Q9125J56160j17602j77471R4114J98835
$$ -127397 -266049 -185404 -200890 -327871 -238746 -82586 -200188 -377659 -283545 -84710
6901h4710j18259R2724N6778k26587J08218O630J82391l4184R6037q8348N8496
$$ -84710 -202969 -110245 -53467 -280054 -171836 -165206 17185 -16999 79038 -9310 49186
6890D9186O0968j91477j16927j28884o3995N7486K53068J58279k72623j88112
$$ 49186 110154 -81323 -198250 -327134 -391129 -333643 -80575 77704 -194919 -383031
6880c83031j36928K05468K71200k8216o5888J43777j7657N3495j02669j4019m6239
$$ -383031 -519959 -314491 -43291 -71507 -137395 6382 -11275 42220 -60449 -74468 -120707
6869a20707q9326J62851j8820l1392k3249l14878K32664J60709j04107J56785
$$ -120707 -210033 -47182 -66002 -97394 -120643 -435521 -202857 -42148 -146255 10530
6859A0530l8081p5705q1964J39587j09801p637J12649J88055l09707k22818J60288
$$ 10530 -27551 -103256 -185220 -45633 -155434 -163071 -50422 137633 -172074 -394892 -234604
6848b34604N2168J50936l8163k20169l2205J437j0970j586K2842m9937K91790
$$ -234604 -182436 -31500 -69663 -289832 -322037 -320600 -331570 -333156 -310314 -360251 -68461
6837f8461J90767j16506k22226J93387q548q5921l1751l2684j11527N513J40169
$$ -68461 122306 5800 -216426 -23039 -31587 -117508 -149259 -181943 -293470 -287957 -147788
6826a47788R1947J11419P9231j4816j44242r386p1877j3333J2278P2153k92074
$$ -147788 -55841 55578 134809 119993 -24249 -33635 -105512 -118845 -106567 -34414 -326488
6815c26488J41915J50357o7839r996K13610j3324k6376R6661n5064j41766m8738
$$ -326488 -184573 -34216 -102055 -112051 101559 88235 61859 158520 103456 -38310 -87048
6804h7048j78492k38705J90106L8532J73433l4330j92582j23062j6444K61271
$$ -87048 -265540 -504245 -314139 -275607 -102174 -136504 -329086 -452148 -468592 -207321
6794b07321Q7452O7514O8813R9627l8292r8232K448k6172J43601k34366r8419
$$ -207321 -119869 -52355 16458 116085 77793 -20439 -17991 -44163 99438 -134928 -233347
6783b33347M9668M3013k3418J3499K5295K5685L6313j98724P0222J89128p4992
$$ -233347 -183679 -140666 -164084 -150585 -125290 -99605 -63292 -262016 -191794 -2666 -77658
6772g7658j7303O0034o3937k648K34769j96807q7878J87554K89k19881P4423M0196
$$ -77658 -94961 -34927 -98864 -101512 133257 -63550 -151428 36126 36415 -183466 -109043 -68847
6760f8847O1374K83209j55637k24373O4074j03707L45741k66591P952K35298m0341
$$ -68847 -7473 275736 120099 -104274 -40200 -143907 201834 -64757 -56805 178493 138152
6749A38152p9254l57075K07226K43250k39055J17489P3788j30886r535l2947J7776
$$ 138152 58898 -298177 -90951 152299 -86756 30733 104521 -26365 -35900 -68847 -51071
6738e1071j24866P0836j82652k82522J79648K38144k239n5205m7329N3366J11446
$$ -51071 -175937 -105101 -287753 -570275 -390627 -152483 -154722 -209927 -257256 -203890 -92444
6727i2444N9646m072L1160j20825j4262M2204j1615J90356L4514p2715M9828q5063
$$ -92444 -32798 -36870 -5710 -126535 -140797 -98593 -110208 80148 114662 41947 91775 6712
6715F712j46975M5623r0074o3618K20377k2075j94554J29250L2536j40900J13174
$$ 6712 -140263 -94640 -184714 -248332 -27955 -50030 -244584 -115334 -82798 -223698 -110524
6704a10524M2805N2516K5029r0364o6735J87593J7j0392O7400K18405j60782m8158
$$ -110524 -67719 -15203 9826 -80538 -147273 40320 40337 29945 97345 315750 154968 106810
6692A06810r3864K24929L3658k6886k30301n1439j81259K79099J44353J87058
$$ 106810 12946 237875 271533 244647 14346 -37093 -218352 60747 205100 392158
6682C92158j73283j74258J53313l64518j15014K37677J2785L296j6860R9982Q8674
$$ 392158 218875 44617 197930 -166588 -281602 -43925 -31140 -27844 -44704 55278 143952
6671A43952O3035J31431k61236j05179k0026M0057J778j15467N3268J39246j01994
$$ 143952 206987 338418 77182 -27997 -48023 -7966 -6188 -121655 -68387 70859 -31135
6660c1135O73K44532M6291P3149j65541k91849o8218J60534J69632j37605m5787
$$ -31135 -30462 214070 260361 333510 167969 -123880 -192098 -31564 138068 463 -45324
6649d5324P0689n3986j90142Q5109l1238J30857n7120o7433K00472J76784j84456
$$ -45324 25365 -28621 -218763 -133654 -164892 -34035 -91155 -158588 41884 218668 34212
6638C4212n1047n9277n3799M109j4587p3198P3834j2525J27053K4672j65202O9993
$$ 34212 -16835 -76112 -129911 -125802 -140389 -213587 -139753 -152278 -25225 -553 -165755 -95762
6626i5762J82400J97063m7778j99296J97403m7375L4363l16206j07029J31932
$$ -95762 86638 283701 235923 36627 234030 186655 221018 -95188 -202217 -70285
6616g0285j10089J1615k5479M856k12138R031J07746O5793Q3039j74611J99629
$$ -70285 -180374 -168759 -194238 -189382 -401520 -392489 -284743 -218950 -135911 -310522 -110893
6605a10893Q1854p4245j35059n1861Q8108K07195j37344O4408J0603K5776k95815
$$ -110893 -29039 -103284 -238343 -290204 -202096 5099 -132245 -67837 -57234 -31458 -327273
6594c27273k15730L72651O4765J79090M15685k69614m02453r4167K7613j67482
$$ -327273 -543003 -170352 -105587 73503 489188 219574 -182879 -277046 -249433 -416915
6584d16915J23714K01828k43215n7155n6425K92130K03392j10358j21932J99902
$$ -416915 -293201 -91373 -334588 -391743 -448168 -156038 47354 -63004 -184936 14966
6574A4966l9988J24040m2999k96738J15323J84090p0577j80668J37728J50914
$$ 14966 -25022 99018 56019 -240719 -125396 58694 -11883 -192551 -54823 96091
6564I6091k48868K49493j11348j07529P0767j82004K27448J11331N9579k25727
$$ 96091 -152777 96716 -14632 -122161 -51394 -233398 -5950 105381 164960 -60767
6554f0767j08462j26847j3536L7430K43562l2938m0510J04552m94Q2302L2806
$$ -60767 -169229 -296076 -309612 -272182 -28620 -61558 -102068 2484 1990 84292 117098
6543A17098j94418P0195J62657k66364Q5878m1347o1255P0232j8022M9621l726
$$ 117098 -77320 -7125 155532 -110832 -24954 -66301 -127556 -57324 -75346 -25725 -29451
6532b9451l2439j75042K43409K59107k49014Q0592r2580j03217l5121N8801R1476
$$ -29451 -61890 -236932 6477 265584 16570 97162 4582 -98635 -133756 -74955 16521
6521A6521K0764J05936k9096j00573k35517L2877L39647J8275j65656j31811J37131
$$ 16521 37285 143221 114125 13552 -221965 -189088 150559 168834 3178 -128633 8498
6510H498j32841J65861r3898Q0162l6666J31873J04675m42329J68869L29783p0405
$$ 8498 -124343 41518 -52380 27782 -8884 122989 227664 -214665 -45796 283987 213582
6499B13582j62318J0393j25446p1156K44554j9047j62280j56361K48424L4490
$$ 213582 51264 61657 -63789 -134945 109609 90562 -71718 -228079 20345 54835
6489E4835J04275j52623Q3167j32239n4821K31707M5059n0346m0166o9959Q2467
$$ 54835 159110 6487 89654 -42585 -97406 134301 179360 129014 88848 18889 101356
6478A01356M121j3725k532J48956L2203p480j90641N0555M460J87227k0692p4674
$$ 101356 105477 91752 89220 238176 270379 262899 72258 122813 127273 314500 293808 219134
6466B19134J29036k64439R8555M5476R9718k7800O942j60986j28270k9170L8961
$$ 219134 348170 83731 182286 227762 327480 299680 306622 145636 17366 -11804 27157
6455B7157r1889J86164K8993Q4110j82427q1337j76386Q3536R3122K28507R621
$$ 27157 -64732 121432 150425 234535 52108 -29229 -205615 -122079 -28957 199550 209171
6444B09171j51353l5538o3601K8535J88932j41367K0407J42978M782J83961O6750
$$ 209171 57818 22280 -41321 -12786 176146 34779 55186 198164 202946 386907 453657
6433D53657l21579j48094K2993j19987M1069p7863j6596J34379L6018K2009n2905
$$ 453657 132078 -16016 6977 -113010 -71941 -149804 -166400 -32021 3997 26006 -26899
6422b6899q3043K2390J81481J93680p5154k2063R5621j49367r2916J78425J08725
$$ -26899 -109942 -87552 93929 287609 212455 190392 286013 136646 43730 222155 330880
6411C30880j07476q3634j89746M4668J71033J72509k23161J53790K10866L1721
$$ 330880 223404 139770 -49976 -5308 165725 338234 115073 268863 479729 511450
6401E11450q7701k23884P7096N1415q7700J06729J79900n0951j98018J25397J2707
$$ 511450 423749 199865 276961 328376 240676 347405 527305 476354 278336 403733 416440
6390D16440j29991M3657o3702j22761q1696R1915O1480j16858j39446R0912R1992
$$ 416440 286449 330106 266404 143643 61947 153862 215342 98484 -40962 49950 141942
6379A41942j2825j19789K22954K1205p6152K54848j66205L0340j92727p8689q6321
$$ 141942 129117 9328 232282 253487 177335 432183 265978 296318 103591 24902 -61419
6368f1419O120J87762r7092K00745l7061m7144O9881K5798p4924n7807l5787J69683
$$ -61419 -55299 132463 35371 236116 199055 151911 221792 247590 172666 114859 79072 248755
6356B48755q5818O384q828N7128Q7008L9579O7621j72919o4904l5343r7571n4221
$$ 248755 162937 169321 160493 217621 304629 344208 411829 238910 174006 138663 41092 -13129
6344a3129P1383j99685k17250L72019J25249M700R7161J35001k54253J6j37126
$$ -13129 58254 -141431 -358681 13338 138587 143287 240448 375449 121196 121212 -15914
6333a5914o5450j04646N067J80829J17942j82292k70970J92859j9884J52402N175
$$ -15914 -81364 -186010 -180943 -114 117828 -64464 -335434 -142575 -162459 -10057 -4882
6322d882J2993K46758j99427J7559q1853N5210K07903j94669j33099L9424J67929
$$ -4882 8111 254869 55442 73001 -8852 46358 254261 59592 -73507 -34083 133846
6311A33846n1733K0834O4933m9999R219J49642K3312j11951J41378k1366k04678
$$ 133846 82113 102947 167880 117881 127100 276742 300054 188103 329481 308115 103437
6300A03437o8758Q1067O5091j38086L1900O8121j00233j41923M2082l1987R7962
$$ 103437 34679 115746 180837 42751 74651 142772 42539 -99384 -57302 -89289 8673
6289H673Q0271k1103k52060m9698J84996k24110K41072K03920j0390j47133o9343
$$ 8673 88944 67841 -184219 -233917 -48921 -273031 -31959 171961 161571 14438 -54905
6278e4905M6860J49393j77706r7217K23153K43026o0006j12775Q1198j06854Q6975
$$ -54905 -8045 141348 -36358 -133575 89578 332604 272598 159823 241021 134167 221142
6267B21142m3103l5914M3578L3619j73366K3758n7251R7969q4492r3584J1154
$$ 221142 178039 142125 185703 219322 45956 69714 12463 110432 25940 -67644 -56490
6256e6490K00241R0077J4331j85009P7115j19731J29136J14408j87502j29714
$$ -56490 143751 233828 248159 63150 140265 20534 149670 264078 76576 -53138
6246e3138j18988J58717J7201L3519o0742J10015M2798K0386j76731p2306K02123
$$ -53138 -172126 -13409 3792 37311 -23431 86584 129382 149768 -26963 -99269 102854
6235A02854P5142k60796J86533J9984p1722j27177J49645n2473L3193J10566p8137
$$ 102854 177996 -82800 103733 123717 51995 -75182 74463 21990 55183 165749 87612
6224H7612j40456j96461J30828K56649o8057J4704q3193o4992J10207M3806K00688
$$ 87612 -52844 -249305 -118477 138172 70115 84819 1626 -63366 46841 90647 291335
6213B91335n2523j59631Q0204Q861k84150o1519j11317K32726m7773o026J20279
$$ 291335 238812 79181 159385 168246 -115904 -177423 -288740 -56014 -103787 -109813 10466
6202A0466J74978O6766j02259q3471j36591M3636r2560o4130J85282j7777R5880
$$ 10466 185444 252210 149951 66480 -70111 -26475 -119035 -183165 2117 -15660 80220
6191H0220P9199j50345j27641N3373J71345k51465j47706j034K42226J76950j02398
$$ 80220 159419 9074 -118567 -65194 106151 -145314 -293020 -294054 -51828 125122 22724
6180B2724J49091R6374R4254j08566j59187p8141L8023j28483R6892J47528j50763
$$ 22724 171815 268189 362443 253877 94690 16549 54572 -73911 22981 170509 19746
6169A9746J24655m2399l0159J2410n6112o9849K21574k16715r1640n5440K0652
$$ 19746 144401 102002 71843 84253 28141 -41708 179866 -36849 -128489 -183929 -163277
6158a63277O5117j1078M38912J10003j12143O8013j50800k32333L36710j78535
$$ -163277 -98160 -109238 329674 439677 327534 395547 244747 12414 349124 170589
6148A70589j84684R2645l4178r7283J22589j65915M6253J29171m3129J60868p2481
$$ 170589 -14095 78550 44372 -52911 69678 -96237 -49984 79187 36058 196926 124445
6137A24445K3143K36910j88737p7305Q469q1606J48745j8923j06336P662L2015
$$ 124445 147588 384498 195761 118456 126925 45319 194064 175141 68805 76467 108482
6126A08482r4362r7559J60338L3459J24710o8353j27516J04735o6275J49512l5956
$$ 108482 14120 -83439 76899 110358 235068 166715 39199 143934 77659 227171 191215
6115A91215r0823q4848N5021O8422O7471P5157j27265j38553M20Q4032J20598
$$ 191215 100392 15544 70565 138987 206458 281615 154350 15797 16217 100249 220847
6104B20847k31890L21171r460k44613j28424j44913R6596J35313j93544r7829
$$ 220847 -11043 310128 300668 56055 -72369 -217282 -120686 14627 -178917 -276746
6094b76746K98409M0457O5836M794j52882j48532J06372J01013n7998q571N1585
$$ -276746 21663 62120 127956 132750 -20132 -168664 -62292 38721 -19277 -27848 23737
6083B3737J03920M06849k09465j43822j34458J16877j34620q1865N8792J45425
$$ 23737 127657 534506 325041 181219 46761 163638 29018 -52847 5945 151370
6073A51370J11040j84416j08335L77289q0968j77134j34979J1965J47552j7231
$$ 151370 262410 77994 -30341 346948 265980 88846 -46133 -34168 113384 96153
6063I6153m5837k144L6148j80075K27812k8697J4481Q700j23468l4052K08059
$$ 96153 50316 48172 84320 -95755 132057 103360 117841 126541 3073 -30979 177080
6052A77080j5382J3245J57387P4233n5088J18335j50204j71290n5981J30364j93961
$$ 177080 161698 174943 332330 406563 351475 469810 319606 148316 92335 222699 28738
6041B8738J79250q7079O5745m183q1341O3658j44016O7338L443O5609m5752Q8151
$$ 28738 207988 120909 186654 182471 101130 164788 20772 88110 91553 157162 111410 199561
6029A99561l0198m3836R1853j41570j85843l0313M4135J04828K17166j47362n7711
$$ 199561 169363 125527 217380 75810 -110033 -140346 -96211 8617 225783 78421 20710
6018B0710q8258O8657k55045j174J69344N5119J11867O3646K3220P858K05740
$$ 20710 -67548 1109 -253936 -255110 -85766 -30647 81220 144866 168086 175944 381684
6007C81684l795k89765l1956J17308Q9002J99381r5616m5325k48868j07837l6216
$$ 381684 377889 88124 56168 173476 262478 461859 366243 320918 72050 -35787 -72003
5996g2003R7123M21929r7812R5790j86086j70633j31267J24064J42906j5158M3649
$$ -72003 25120 447049 349237 445027 258941 88308 -42959 81105 224011 208853 252502
5985B52502p6372J37807n962L7704L0093N5032N4466j21749k46529R1477N0040
$$ 252502 176130 313937 307975 345679 375772 430804 485270 363521 116992 208469 258509
5974B58509k4111j23059J33688r2952l7470k8073J40593P1280j14478O4329p2622
$$ 258509 234398 111339 245027 152075 114605 86532 227125 298405 183927 248256 175634
5963A75634l929M4033j75361R9487J65999m5593K7230j68673k1247J76224O6264
$$ 175634 171705 215738 40377 139864 305863 260270 287500 118827 97580 273804 340068
5952C40068K33593k16109j10330j18454J48417K4932P839L5936J61985k17037
$$ 340068 573661 357552 247222 128768 277185 302117 309956 345892 507877 290840
5942B90840k47552p4387K15931l3281j20103J58688l4880m2321j0913j40880Q8108
$$ 290840 43288 -31099 184832 151551 31448 190136 155256 112935 102022 -38858 49250
5931D9250j10733J28860J76965j65104r6427q1298K42253M2861J24877J2782j62157
$$ 49250 -61483 67377 244342 79238 -17189 -98487 143766 186627 311504 324286 162129
5920A62129j99735K8J17525m5793J57765L7389p0498l23897m4833L39922J23120
$$ 162129 -37606 -37578 79947 34154 191919 229308 158810 -165087 -209920 130002 253122
5909B53122k32485J14920J7916m5000K00030L483j26056j67886K7268P8741M4966
$$ 253122 20637 135557 153473 108473 308503 311986 185930 18044 45312 124053 169019
5898A69019J29526J95133k58462j16985O3445J757m5791k0413j5901l6365K9034
$$ 169019 298545 493678 235216 118231 181676 183433 137642 117229 101328 64963 93997
5887I3997m1042j4283J20605j19508P5090J42558m1674j66789L7950R3043P76
$$ 93997 52955 38672 159277 39769 114859 257417 215743 48954 86904 179947 180723
5876A80723k23675o0902q433K26930J59988P5536k29601J22117P8936k6813k3827
$$ 180723 -42952 -103854 -112287 114643 274631 350167 120566 242683 321619 294806 270979
5865B70979l860M2539J51788n6673M725j66114r2506k6200K9369J34378o9598
$$ 270979 267119 309658 461446 404773 409498 243384 150878 124678 154047 288425 218827
5854B18827P8408j68498P2994R7564p8666k58666M948K85208J48057J3310j3100
$$ 218827 297235 128737 201731 299295 220629 -38037 -33089 252119 400176 413486 400386
5843D00386k7715K21638P9746j88327j56953n4095j2363L4597J30092k7747P2659
$$ 400386 372671 594309 674055 485728 328775 274680 262317 296914 427006 399259 471918
5832D71918j55996q2800m157P9010N7954N9394J17182j1935k30039l58396J72962
$$ 471918 315922 233122 228965 307975 365929 425323 542505 530570 300531 -57865 115097
5821A15097K0561Q8709K17028j810m6456n8859P1089j43731M4632J83107j02235
$$ 115097 135658 224367 441395 439585 393129 334270 405359 261628 306260 489367 387132
5810C87132j4491K51160j89832J2653k4668N0396N5388Q3561L6735O944N9241
$$ 387132 372641 623801 433969 446622 421954 472350 527738 611299 648034 654978 714219
5799G14219r7562P6586k7330r4548J71243j6267k05283K81067m9683j33907N1707
$$ 714219 616657 693243 665913 571365 742608 726341 521058 802125 752442 618535 670242
5788F70242l3493J13097O0816J56974L7298j13885k77598P2430K93570j18518
$$ 670242 636749 749846 810662 967636 1004934 891049 613451 685881 979451 860933
5778H60933P5495J98319k1720l63181M2383j36819m2970M3829N5082J05466R3630
$$ 860933 936428 1134747 1113027 749846 792229 655410 612440 656269 711351 816817 910447
5767I10447j12597N7235K17865K52287J1220j97969J75484j2470o3652R8714m3443
$$ 910447 797850 855085 1072950 1325237 1336457 1138488 1313972 1301502 1237850 1336564 1293121
5756A293121N1606j72832J5339N4345r252R1382k51549N5590J4383J01359o3976
$$ 1293121 1344727 1171895 1187234 1241579 1232327 1323709 1072160 1127750 1142133 1243492 1179516
5745A179516j33792R2949j69153L13053j50802L457N1267M4905j28428P0436L8634
$$ 1179516 1045724 1138673 969520 1282573 1131771 1135228 1186495 1231400 1102972 1173408 1212042
5734A212042R7752k1566k78129K9050K54204L160J21072p0908j77880m4349K56004
$$ 1212042 1309794 1288228 1010099 1039149 1293353 1296513 1417585 1346677 1168797 1124448 1380452
5723A380452J50733k06507m1689j60163p086k7079J19209j25073N5265k08789
$$ 1380452 1531185 1324678 1282989 1122826 1115740 1088661 1207870 1082797 1138062 929273
5713I29273j83633r2905P6011p1408J63218J56885j24875n3048k27304J0356J17596
$$ 929273 745640 652735 728746 657338 820556 977441 852566 799518 572214 582570 700166
5702G00166N8973q81Q5514r5284j23177m8663J55842M8822J80923M191n1297J30324
$$ 700166 759139 758258 843772 748488 625311 576648 732490 781312 962235 966426 915129 1045453
5690A045453k4254j9417m17116J25805J61892q4908N9097K3456L223k84262j83334
$$ 1045453 1021199 1001782 584666 710471 872363 787455 846552 870008 873231 588969 405635
5679D05635K472K8829J71385j26368J23907l63493o4128J28967K52018L73342
$$ 405635 408107 436936 608321 481953 605860 242367 178239 307206 559224 932566
5669I32566j47456k53752j18676k3353J70815m2967j0072j55183q9921J13564
$$ 932566 785110 531358 412682 389329 560144 517177 507105 351922 262001 375565
5659C75565m9880J26653j23086k0808J17929N2162j19625K62513j19048j31367
$$ 375565 325685 452338 329252 308444 426373 478535 358910 621423 502375 371008
5649C71008K30498K8759j98463j34298J53626Q9021j00157n1209R3269N3690j69195
$$ 371008 601506 630265 431802 297504 451130 540151 439994 388785 482054 535744 366549
5638C66549J0864o9724q2179J69546j67563J42924K9185L3858O3626j4656j92022
$$ 366549 377413 307689 225510 395056 227493 370417 399602 433460 497086 482430 290408
5627B90408p4289J21823Q863J08899N0606p0343j9918Q1790j62694L1884m1322
$$ 290408 216119 337942 346805 455704 506310 435967 416049 497839 335145 367029 325707
5616C25707J22416J03346J2606r3419j4274P4642r0023j06915L4426L3298J52371
$$ 325707 448123 551469 564075 470656 456382 531024 441001 334086 368512 401810 554181
5605E54181l8472j88352n3797J83678J47162l7135o0412j93455J65228o2468K36386
$$ 554181 515709 327357 273560 457238 604400 567265 506853 313398 478626 416158 652544
5594F52544l74239m8210l2539o5644J31994j01544Q4821J37892P4272l9568K8688
$$ 652544 278305 230095 197556 131912 263906 162362 247183 385075 459347 419779 448467
5583D48467p7727K00173J87118j64241m369j08850P2657M5671j88043j72744Q7272
$$ 448467 370740 570913 758031 593790 589421 480571 553228 598899 410856 238112 325384
5572C25384J17850j71518Q7000k8131Q8533r50P046M2175K06614n5765q0128j68252
$$ 325384 443234 271716 358716 330585 419118 418168 425214 467389 674003 618238 538110 369858
5560C69858K4058J93727p8018j93391j28536J65526Q1450P7935L0650j21656k28856
$$ 369858 393916 587643 509625 316234 187698 353224 434674 512609 543259 421603 192747
5549A92747m8284r287J16581J06919N3819J15755K21038J1484p1584j04741j01725
$$ 192747 144463 135176 251757 358676 412495 528250 749288 760772 689188 584447 482722
5538D82722p8714J7109J20085k0851q8018L1581J35317q3027J24508q1172K52271
$$ 482722 404008 421117 541202 520351 432333 463914 599231 516204 640712 559540 811811
5527H11811j58996N5214N9203l7333J00046n6889q2280j91498J29247k07837q2712
$$ 811811 652815 708029 767232 729899 829945 773056 690776 499278 628525 420688 337976
5516C37976J19545K7185o5753p9250J17702K13604l7180k12617p894M549r2497
$$ 337976 457521 484706 418953 339703 457405 671009 633829 421212 413318 417867 325370
5505C25370r7081K74137J02524k16399N1288m9989q5170K14966K6202k46870l7658
$$ 325370 228289 502426 604950 388551 439839 389850 304680 519646 545848 298978 261320
5494B61320j5139K28101O8756l2361L1013p8837o7441j6421K07169j47939j53095
$$ 261320 246181 474282 543038 510677 541690 462853 395412 378991 586160 438221 285126
5483B85126o2952J71244l7351o7285K49858l9551o5169k02842Q7778Q9019j25370
$$ 285126 222174 393418 356067 288782 538640 499089 433920 231078 318856 407875 282505
5472B82505N8495m76o1520P0007K14777n7409J58212l4763l5989q300j92914J61490
$$ 282505 341000 340524 279004 349011 563788 506379 664591 629828 593839 585539 392625 554115
5460E54115p5290j69505J65730k46093L33346N128q4148M7485M5754k74741N1867
$$ 554115 478825 309320 475050 228957 562303 567431 483283 530768 576522 301781 353648
5449C53648K11358k88911k19570J86552J44389L8089J84083m8052Q2470j58149
$$ 353648 565006 276095 56525 243077 387466 425555 609638 561586 644056 485907
5439D85907j20248J0093K50315j4131j54828P7520K75132r6049j35691k47365
$$ 485907 365659 375752 626067 611936 457108 534628 809760 713711 578020 330655
5429C30655Q0210l9332m7933O6340J13016K19888J2762J4526j8838k10151m7004
$$ 330655 410865 371533 323600 389940 502956 722844 735606 750132 731294 521143 474139
5418D74139j72605J2780J4822j4103r6055p4703K48597Q1924j10361O3786j79441
$$ 474139 301534 314314 329136 315033 218978 144275 392872 474796 364435 428221 248780
5407B48780K07961N1811J98675Q5718j35806p7534J60607r6987k00595K52777
$$ 248780 456741 508552 707227 792945 657139 579605 740212 643225 442630 695407
5397F95407j01360o1105k2472J39177k52252j66540K94339J62139m6185j31941
$$ 695407 594047 532942 510470 649647 397395 230855 525194 687333 641148 509207
5387E09207J66587j37k82096J50132r7668k08214O6043j2638J45926j21784K45440
$$ 509207 675794 675657 393561 543693 446025 237811 303854 291216 437142 315358 560798
5376E60798J68856P1538l65027k0004J77882M0677k39121l0799Q4750j89930J12942
$$ 560798 729654 801192 436165 416161 594043 634720 395599 364800 449550 259620 372562
5365C72562K1943o6809r7069M6903J90988j10996r190J28150L3441k82732j46358
$$ 372562 394505 327696 230627 277530 468518 357522 348332 476482 509923 227191 80833
5354H0833J53371j4278N4723j62347K92339P5373N6676q895J03158J10452k2227
$$ 80833 234204 219926 274649 112302 404641 480014 536690 527795 630953 741405 719178
5343G19178J46598N074j08972j60807j20413L5855k17966L21508o3n6738J05121
$$ 719178 865776 870850 761878 601071 480658 516513 298547 620055 619992 563254 668375
5332F68375J31542o0457k19295j24634j14256J35662P1045N6038R1965j04532
$$ 668375 799917 739460 520165 395531 281275 416937 487982 544020 635985 531453
5322E31453r9867j14762J80142Q6706M8765k75108p5217K71380L0204j84579k009
$$ 531453 431586 316824 496966 583672 632437 357329 282112 553492 583696 399117 397108
5311C97108K1814P2042J57959j5442j42799Q5145j18837M3962J0477J48864J4084
$$ 397108 418922 490964 648923 633481 490682 575827 456990 500952 511429 660293 674377
5300F74377J0334K58286j29503j67418J34613O1140j9450L2214l1631k58262J01941
$$ 674377 684711 942997 813494 646076 780689 841829 822379 854593 822962 564700 666641
5289F66641j04042L4585N750J52450k8055j29878R4964n9100o8379k14402J22507
$$ 666641 562599 597184 602934 755384 727329 597451 692415 633315 564936 350534 473041
5278D73041R0791o0597p5105j44625J19321J23107J71711N6230J0368L3424k31707
$$ 473041 563832 503235 428130 283505 402826 525933 697644 753874 764242 797666 565959
5267E65959p3076J5667P8797N2012R4836m6963J06406j29525J78362l9830L7278
$$ 565959 492883 508550 587347 639359 734195 687232 793638 664113 842475 802645 839923
5256H39923j14265J17654j01651N51J49199J40349l21278o0986p9531K35476j05280
$$ 839923 725658 843312 741661 742212 891411 1031760 710482 649496 569965 805441 700161
5245G00161J11355J32499k7354r6922n059l3864j59174k3661L16627n7730j61074
$$ 700161 811516 944015 916661 819739 814680 780816 621642 597981 914608 856878 695804
5234F95804J21017m3422K19145J01399j61909J8931o3165q6942q1599J08644J53316
$$ 695804 816821 773399 992544 1093943 932034 950965 887800 800858 719259 827903 981219
5223I81219j39939n1630J46258J47844j64531J07669J90703J6669l03767J16883
$$ 981219 841280 789650 935908 1083752 919221 1026890 1217593 1234262 930495 1047378
5213A047378J45553l15818j29256K03622n2425j34246k0967J58462M8844J60522
$$ 1047378 1192931 877113 747857 951479 899054 764808 743841 902303 951147 1111669
5203A111669n7838J14409j17536l58511K09775j45478q9434K43862K9735J12008
$$ 1111669 1053831 1168240 1050704 692193 901968 756490 667056 910918 940653 1052661
5193A052661k5596o9026K2268j05945k2565J80304l8271j1108J53583K2504o5297
$$ 1052661 1027065 958039 980307 874362 851797 1032101 993830 982722 1136305 1158809 1093512
5182A093512R94p1377j26883R712J59087P1626K86364j23589j6348j20771R933
$$ 1093512 1094506 1023129 896246 905958 1065045 1136671 1423035 1299446 1283098 1162327 1172260
5171A172260J64292j02461j8661q8282Q8133M3683J54271J67289j34215J09306
$$ 1172260 1336552 1234091 1215430 1127148 1215281 1258964 1413235 1580524 1446309 1555615
5161A555615l1010j52775p3285J02580L9456o5801O9677n1483j52813L847P6494
$$ 1555615 1524605 1371830 1298545 1401125 1440581 1374780 1444457 1392974 1240161 1244008 1320502
5150A320502M7454N4365J68012K6697P7842n1450k28784J91906K13765j71369
$$ 1320502 1367956 1422321 1590333 1617030 1694872 1643422 1414638 1606544 1820309 1648940
5140A648940q4966O1351O0080L6330J26627Q7633l2895p5662K03290N5135k41504
$$ 1648940 1563974 1625325 1685405 1721735 1848362 1935995 1903100 1827438 2030728 2085863 1844359
5129A844359j99802J17334N4649Q4378j39767K52221K90891k4612N7715O9789
$$ 1844359 1644557 1761891 1816540 1900918 1761151 2013372 2304263 2279651 2337366 2407155
5119B407155j73142K7170j933N5945O4196J06620k9378J18722J88026k69542L4840
$$ 2407155 2234013 2261183 2259250 2315195 2379391 2486011 2456633 2575355 2763381 2493839 2528679
5108B528679j16162K43281K54272J00147j51739J06319m9037Q165j71746J06852
$$ 2528679 2412517 2655798 2910070 3010217 2858478 2964797 2915760 2923925 2752179 2859031
5098B859031N9314J83757L8347n1409l9554K87643J64209p3294M9083j50781k6824
$$ 2859031 2918345 3102102 3140449 3089040 3049486 3337129 3501338 3428044 3477127 3326346 3299522
5087C299522Q3827J47940L9501N1832j8813l2478l1780K53258J51337j69948j0141
$$ 3299522 3383349 3531289 3570790 3622622 3603809 3571331 3539551 3792809 3944146 3774198 3764057
5076C764057p9350k96165k0063J49694J33323P7245j90181K2302L3326P6690j88161
$$ 3764057 3684707 3388542 3368479 3518173 3651496 3728741 3538560 3560862 3594188 3670878 3482717
5065C482717M720O7124j73983J10007J79439l7415r7322J09769L15965M313j36622
$$ 3482717 3487437 3554561 3380578 3490585 3670024 3632609 3535287 3645056 3961021 3965334 3828712
5054C828712m5868R2468m19292o047k88018j0820J44322j29828j02262L48802
$$ 3828712 3782844 3875312 3456020 3449973 3161955 3151135 3295457 3165629 3063367 3412169
5044C412169L78951j75324j0804l70950j5001P7742J44983K02999O6349n0424
$$ 3412169 3791120 3615796 3604992 3234042 3219041 3296783 3441766 3644765 3711114 3660690
5034C660690P4894j27397J53380J13190j05350K29876J8841k64795k4865O0353
$$ 3660690 3735584 3608187 3761567 3874757 3769407 3999283 4018124 3753329 3728464 3788817
5024C788817J14456M481N0380J98546p65j73727J55910Q090q9722N4190P3104
$$ 3788817 3903273 3907754 3958134 4156680 4155915 3982188 4138098 4146188 4056466 4110656 4183760
5013D183760J12743j16497o4475K2037o190L14505K35319N1447J83281J01323
$$ 4183760 4296503 4180006 4115531 4137568 4131378 4445883 4681202 4732649 4915930 5017253
5003E017253l82890J12077K08448j61572J56232j9390l8111J42642J23343l7071
$$ 5017253 4634363 4746440 4954888 4793316 4949548 4930158 4892047 5034689 5158032 5120961
4993E120961p1771M24755k12084J08104K2397Q6364P6540k4009K14178J07035
$$ 5120961 5049190 5473945 5261861 5369965 5392362 5478726 5555266 5531257 5745435 5852470
4983E852470J02621J94521N4116M1453l8197j24795K58015l3499M4708K46337
$$ 5852470 5955091 6149612 6203728 6245181 6206984 6082189 6340204 6306705 6351413 6597750
4973F597750J00381k36994O5960K51015j13047J96526L10476J73111K380M5508
$$ 6597750 6698131 6461137 6527097 6778112 6665065 6861591 7172067 7345178 7347558 7393066
4963G393066K66131J47192m8392K4109K00461L1658J64134K21072o6563K16316
$$ 7393066 7659197 7806389 7757997 7782106 7982567 8014225 8178359 8399431 8332868 8549184
4953H549184K03216Q3587K30775J13242L9846J57343m6959o0784L50664K30123
$$ 8549184 8752400 8835987 9066762 9180004 9219850 9377193 9330234 9269450 9620114 9850237
4943I850237J81016N2272n8329O7442K77036K84485J61601K98237J04028J47151
$$ 9850237 10031253 10083525 10025196 10092638 10369674 10654159 10815760 11113997 11218025 11365176
4933A1365176L73607J47846J03963o4630J53079K74078J05491K54314J31945M92985
$$ 11365176 11738783 11886629 11990592 11925962 12079041 12353119 12458610 12712924 12844869 13337854
4923A3337854K25288K25759L32567j14161J40380K06829L66752L13480L82257
$$ 13337854 13563142 13788901 14121468 14007307 14147687 14354516 14721268 15034748 15417005
4914A5417005L80885M66051L45743J46297L1033N90712K99069L93136K60643M54953
$$ 15417005 15797890 16263941 16609684 16755981 16787014 17377726 17676795 18069931 18330574 18785527
4904A8785527L67604K40431N66500L25968K46624L08312N71947M05708M72786
$$ 18785527 19153131 19393562 19960062 20286030 20532654 20840966 21412913 21818621 22291407
4895B2291407M66548L16894M17723M23749N57319M38284L83650N74907N27058
$$ 22291407 22757955 23074849 23492572 23916321 24473640 24911924 25295574 25870481 26397539
4886B6397539O28492O17534O65327P80152P12289R67678O90000O32592R20500
$$ 26397539 27026031 27643565 28308892 29089044 29801333 30769011 31459011 32091603 33012103
4877C3012103P13567Q75122P00044Q11129J038036J047201J011663O25052J019352
$$ 33012103 33725670 34600792 35300836 36111965 37150001 38197202 39208865 39833917 40853269
4868D0853269J290010R92296R19818J026648J093475Q95573J207365J158486R33015
$$ 40853269 42143279 43135575 44055393 45082041 46175516 47071089 48278454 49436940 50369955
4859E0369955J177870J302817J408663J548797J416764J775083J583022J377474
$$ 50369955 51547825 52850642 54259305 55808102 57224866 58999949 60582971 61960445
4851F1960445J671740J891578K269739K070488K133395K320283K705810K780089
$$ 61960445 63632185 65523763 67793502 69863990 71997385 74317668 77023478 79803567
4843G9803567K691147L096275L366733L563532L713533L754972M333693M519624
$$ 79803567 82494714 85590989 88957722 92521254 96234787 99989759 104323452 108843076
4835A08843076M612783N117685N181942N407233N320640N212584N096955M911212
$$ 108843076 113455859 118573544 123755486 129162719 134483359 139695943 144792898 149704110
4827A49704110M665410M146693L827047L557100L360556L123505K967444K764814
$$ 149704110 154369520 158516213 162343260 165900360 169260916 172384421 175351865 178116679
4819A78116679K651377K898592L089328L090837K856375L096437L285049L374991
$$ 178116679 180768056 183666648 186755976 189846813 192703188 195799625 199084674 202459665
4811B02459665L838484L969603M160344M388642M555011M828999M943278M761905
$$ 202459665 206298149 210267752 214428096 218816738 223371749 228200748 233144026 237905931
4803B37905931M566684L997489K967265J786623M54705j109825k462607l441235
$$ 237905931 242472615 246470104 249437369 251223992 251678697 250568872 248106265 244665030
4795B44665030m669411n072347n371377n311884n194811m710118m279888m327466
$$ 244665030 239995619 234923272 229551895 224240011 219045200 214335082 210055194 205727728
4787B05727728l835988l556617l499476l215068l350171l265862l054937k982401
$$ 205727728 201891740 198335123 194835647 191620579 188270408 185004546 181949609 178967208
4779A78967208l009868l140464l016739l378813l618183m026832m263130m474847
$$ 178967208 175957340 172816876 169800137 166421324 162803141 158776309 154513179 150038332
4771A50038332n209401n421180n629727n970216o208047o017754o022502n752107
$$ 150038332 144828931 139407751 133778024 127807808 121599761 115582007 109559505 103807398
4763A03807398n184959m960248m800276m340189l947022l308356l401502l149719
$$ 103807398 98622439 93662191 88861915 84521726 80574704 77266348 73864846 70715127
4755G0715127k776199k716455k221895k414713k158613j961719j917417j829720
$$ 70715127 67938928 65222473 63000578 60585865 58427252 56465533 54548116 52718396
4747E2718396j908659j629868j264208j253939j413192j375917j115613j276359
$$ 52718396 50809737 49179869 47915661 46661722 45248530 43872613 42757000 41480641
4739D1480641j027492q00640q84460q86611j165421o62046n11286p56852q31422
$$ 41480641 40453149 39652509 38768049 37881438 36716017 36053971 35542685 34785833 33954411
4730C3954411p83547p79383n34162n20699q12815o60615l84791l09297n35758
$$ 33954411 33170864 32391481 31857319 31336620 30523805 29863190 29478399 29169102 28633344
4721B8633344n55832n86360l05667l94960k82609l92455n86021l28543n17666
$$ 28633344 28077512 27491152 27185485 26790525 26507916 26115461 25529440 25200897 24683231
4712B4683231j03884m54099j80319K5756l28820j66667k13546J08542j18221j50463
$$ 24683231 24579347 24125248 23944929 23970685 23641865 23475198 23261652 23370194 23251973 23101510
4702B3101510k60541k37720k02303j17029j14671L3147j09667N2371o9225j30428
$$ 23101510 22840969 22603249 22400946 22283917 22169246 22202393 22092726 22145097 22075872 21945444
4692B1945444J38878O8024k0975J84679Q3496J30456K17528K39577J22710M0297
$$ 21945444 22084322 22152346 22131371 22316050 22399546 22530002 22747530 22987107 23109817 23150114
4682B3150114J07539j23857O0055j7630K77564N7046K07112L66555L17484K61009
$$ 23150114 23257653 23133796 23193851 23176221 23453785 23510831 23717943 24084498 24401982 24662991
4672B4662991M7098J07416L92760K35515K99833L08061j1434L01061K43937K87796
$$ 24662991 24710089 24817505 25210265 25445780 25745613 26053674 26042240 26343301 26587238 26875034
4662B6875034N97535J84125K31257L95754J60508N15285N29923M39623K39560
$$ 26875034 27472569 27656694 27887951 28283705 28444213 28959498 29489421 29929044 30168604
4653C0168604M46664M18204M70908O16444M54998M30980N31794P45741N71208
$$ 30168604 30615268 31033472 31504380 32120824 32575822 33006802 33538596 34284337 34855545
4644C4855545N11116P16657O74030Q04942P24299R62030R35299Q40238R00586
$$ 34855545 35366661 36083318 36757348 37562290 38286589 39248619 40183918 41024156 41924742
4635D1924742J064846J454600R97506J351927J651677J581319J505379J612107
$$ 41924742 42989588 44444188 45441694 46793621 48445298 50026617 51531996 53144103
4627E3144103K102550J614124J406306J703064J704681J810655J802426J577310
$$ 53144103 55246653 56860777 58267083 59970147 61674828 63485483 65287909 66865219
4619F6865219J812101J555530J578599J605184J914925J993289K000882K141836
$$ 66865219 68677320 70232850 71811449 73416633 75331558 77324847 79325729 81467565
4611H1467565K588954K713597K716140L483667L541458M097080M377209M936407
$$ 81467565 84056519 86770116 89486256 92969923 96511381 100608461 104985670 109922077
4603A09922077N932091O176289O884034P759649Q607125R562497J0827340J1824575
$$ 109922077 115854168 122030457 128914491 136674140 145281265 154843762 165671102 177495677
4595A77495677J3341956J4867186J6305849J7849689J9377796K0024527K0075994
$$ 177495677 190837633 205704819 222010668 239860357 259238153 279262680 299338674
4588B99338674J8933162J6889430J3009994P657730J894127m218963r880336j5009016
$$ 299338674 318271836 335161266 348171260 355828990 357723117 353504154 343623818 328614802
4580C28614802j8724207k1321238k2163290k1867657k0664702j8838194j6720352
$$ 328614802 309890595 288569357 266406067 244538410 223873708 205035514 188315162
4573A88315162j4939194j3051528j1442770j0542543r326774q507502p847217
$$ 188315162 173375968 160324440 148881670 138339127 129012353 120504851 112657634
4566A12657634o951132o563822o047239n730074m956221m582595m288595m055772
$$ 112657634 105706502 99142680 93095441 87365367 82409146 77826551 73537956 69482184
4558F9482184l723810l028545k892633k815666k549604k563806k183616j956799
$$ 69482184 65758374 62729829 59837196 57021530 54471926 51908120 49724504 47767705
4550D7767705j662019j678648j328421j536071j451058j496517j145631j193369
$$ 47767705 46105686 44427038 43098617 41562546 40111488 38614971 37469340 36275971
4542C6275971j038049j025523q66509r72577r13488o60636p16285p74754p00726
$$ 36275971 35237922 34212399 33345890 32373313 31459825 30799189 30082904 29308150 28607424
4533B8607424j118564q09253l95258p27193n15818n98661o44944n41868n33478
$$ 28607424 27488860 26679607 26284349 25557156 25041338 24442677 23797733 23255865 22722387
4524B2722387l44623k29272n42500l14236l43055m89682n69887l17282O5587n25070
$$ 22722387 22377764 22148492 21605992 21291756 20948701 20459019 19889132 19571850 19637437 19112367
4514A9112367l73388l01821l84518j41994l60444k98696j02223m72874l86500
$$ 19112367 18738979 18437158 18052640 17910646 17550202 17251506 17149283 16676409 16289909
4505A6289909k45645k72641m02856j37833k24764j79291k82513j16789p34n03238
$$ 16289909 16044264 15771623 15368767 15230934 15006170 14826879 14544366 14427577 14426843 13923605
4495A3923605j44149l13675l4859q7073k22792m53042K1369q5844k42605k74784
$$ 13923605 13779456 13465781 13430922 13343849 13121057 12668015 12689384 12603540 12360935 12086151
4485A2086151j4923j72284j65808j95343k70393O755k6915k96479k09530j37427
$$ 12086151 12071228 11898944 11733136 11537793 11267400 11274155 11247240 10950761 10741231 10603804
4475A0603804n3729k68637j8748k98686j95663j09073J81263l87654r7198Q4738
$$ 10603804 10550075 10281438 10262690 9964004 9768341 9659268 9840531 9452877 9355679 9440417
4465I440417k2850j09001l23385n833k90585p3353j82653k60630O2365j155j79668
$$ 9440417 9417567 9308566 8985181 8979348 8688763 8615410 8432757 8172127 8234492 8233337 8053669
4454H053669r6151M7513j99313j31438k8636o8455j08086j08193L7228J50737
$$ 8053669 7957518 8005031 7805718 7674280 7645644 7577189 7469103 7360910 7398138 7548875
4444G548875k88147q9645M8276K73248j58913o7594M6280l00481L7287k40543
$$ 7548875 7260728 7171083 7219359 7492607 7333694 7266100 7312380 7011899 7049186 6808643
4434F808643K79010j67812m9339J74559l9193k41792j82829P9576j29829j87057
$$ 6808643 7087653 6919841 6870502 7045061 7005868 6764076 6581247 6660823 6530994 6343937
4424F343937p0167N5894P1881J52771q9950J5653P0717n6388k03581K4919J39143
$$ 6343937 6273770 6329664 6401545 6554316 6464366 6480019 6550736 6494348 6290767 6315686 6454829
4413F454829M7622l7802o3309J93908k17665q9459k20030J25780L9516K4622j15586
$$ 6454829 6502451 6464649 6401340 6595248 6377583 6288124 6068094 6193874 6233390 6258012 6142426
4402F142426q6877k1066n7751j59726K76198K09359K2676j1438j22102J57532
$$ 6142426 6055549 6034483 5976732 5817006 6093204 6302563 6325239 6313801 6191699 6349231
4392F349231j80993J10734J2725J6060Q2514j19253j28877J13489J10123J05755
$$ 6349231 6168238 6278972 6291697 6307757 6390271 6271018 6142141 6255630 6365753 6471508
4382F471508k3308J2112J20497r5517r3708J08023j47328j55902j84899l7225
$$ 6471508 6448200 6460312 6580809 6485292 6391584 6499607 6352279 6196377 6011478 5974253
4372E974253J5415k08895P0458K57518J51318Q753L9578j90546j19912Q1076J12161
$$ 5974253 5989668 5780773 5851231 6108749 6260067 6268820 6308398 6117852 5997940 6079016 6191177
4361F191177j37131J00735j49785O9068o0351j39338p4536K15420M6430j78685
$$ 6191177 6054046 6154781 6004996 6074064 6013713 5874375 5799839 6015259 6061689 5883004
4351E883004J9115p0624k44749p5109J84073J20914k56350j42119k1644J93272
$$ 5883004 5902119 5831495 5586746 5511637 5695710 5816624 5560274 5418155 5396511 5589783
4341E589783L20538o1996l5244j89834K22874Q7805k89628Q2257l2016Q1041j31167
$$ 5589783 5910321 5848325 5813081 5623247 5846121 5933926 5644298 5726555 5694539 5775580 5644413
4330E644413M1903j07194J33682P9902m7144o2197L822K38482j9140p0834k10798
$$ 5644413 5686316 5579122 5712804 5792706 5745562 5683365 5687187 5925669 5906529 5835695 5624897
4319E624897P6623J67700j23275P6875K45287N1315k9814k66254Q1403J43942
$$ 5624897 5701520 5869220 5745945 5822820 6068107 6119422 6089608 5823354 5904757 6048699
4309F048699Q2358J15769K55427J87992J35643O5992L7187J65038K981J240J73293
$$ 6048699 6131057 6246826 6502253 6690245 6825888 6891880 6929067 7094105 7097086 7098326 7271619
4298G271619Q4172M9064J21832q885k57947k49768j88076J34406j22602M807m8574
$$ 7271619 7355791 7404855 7526687 7517802 7259855 7010087 6822011 6956417 6833815 6838622 6790048
4287F790048k53216r4011r4410J56928L0862k46822J11972j28872L2322r0426
$$ 6790048 6536832 6442821 6348411 6505339 6536201 6289379 6401351 6272479 6304801 6214375
4277F214375O778Q0431n4746J38394j19234J63521O9811M826j38508k5149J70388
$$ 6214375 6221153 6301584 6246838 6385232 6265998 6429519 6499330 6504156 6365648 6340499 6510887
4266F510887K77863J04958j9061N0364q4642J61205L5189N146K76141J7711q3142
$$ 6510887 6788750 6893708 6874647 6925011 6840369 7001574 7036763 7041909 7318050 7335761 7252619
4255G252619J02013j25971J12739M4943Q7748L49179K59577n5642j59001N0218
$$ 7252619 7354632 7228661 7341400 7386343 7474091 7823270 8082847 8027205 7868204 7918422
4245G918422N8704Q2729K21856j3904L4325J26245J68169q019J52996j42524j28666
$$ 7918422 7977126 8059855 8281711 8267807 8302132 8428377 8596546 8588527 8741523 8598999 8470333
4234H470333M44572J81075N1734J01185j28882K20820O3091J37723J64615P0327
$$ 8470333 8914905 9095980 9147714 9248899 9120017 9340837 9403928 9541651 9706266 9776593
4224I776593J50424J66102K35201M9445J4657K37645L15034j04278K06497R3443
$$ 9776593 9927017 10093119 10328320 10377765 10392422 10630067 10945101 10840823 11047320 11140763
4214A1140763N0134J75326K65788O3167N2400R5394J29447K04289L38737J29201
$$ 11140763 11190897 11366223 11632011 11695178 11747578 11842972 11972419 12176708 12515445 12644646
4204A2644646P1638L03200K38309M33452K8642L01556J35997J94153M04413J76844
$$ 12644646 12716284 13019484 13257793 13691245 13719887 14021443 14157440 14351593 14756006 14932850
4194A4932850J56389M62102L05351J93791K18608M32727N02788J68492O5115N08702
$$ 14932850 15089239 15551341 15856692 16050483 16269091 16701818 17204606 17373098 17438213 17946915
4184A7946915O06123K70381K39658K94857K59630M21693L72588K08464Q74617
$$ 17946915 18553038 18823419 19063077 19357934 19617564 20039257 20411845 20620309 21494926
4175B1494926M58686L04717L77521N72875M55532P02634N93130P02292P39446
$$ 21494926 21953612 22258329 22635850 23208725 23664257 24366891 24960021 25662313 26401759
4166B6401759O75239O80294Q02757O78167P11631N57675N41128R52540J019479
$$ 26401759 27076998 27757292 28560049 29238216 29949847 30507522 31048650 32001190 33020669
4157C3020669O44787P75450J033571J091170J204346Q19324Q54409J387870J004945
$$ 33020669 33665456 34440906 35474477 36565647 37769993 38589317 39443726 40831596 41836541
4148D1836541Q28921J014452J201076J348950J238161J211179R74707R80578J114503
$$ 41836541 42665462 43679914 44880990 46229940 47468101 48679280 49653987 50634565 51749068
4139E1749068R97597J243036J267272J285489J345351J090941J181622J203394
$$ 51749068 52746665 53989701 55256973 56542462 57887813 58978754 60160376 61363770
4131F1363770J271961J497118J420912J214130J919249J513670J569065K031413
$$ 61363770 62635731 64132849 65553761 66767891 68687140 70200810 71769875 73801288
4123G3801288J707140J989507J835688K011387K277316K145222K304398K316643
$$ 73801288 75508428 77497935 79333623 81345010 83622326 85767548 88071946 90388589
4115I0388589K150201K482213K854879K615020K632717K814014K937961K970315
$$ 90388589 92538790 95021003 97875882 100490902 103123619 105937633 108875594 111845909
4107A11845909K987358K802160K666776L043726K865743K985426L083066L110169
$$ 111845909 114833267 117635427 120302203 123345929 126211672 129197098 132280164 135390333
4099A35390333L323792L254930L439415L718134L752210L861906L817933L948402
$$ 135390333 138714125 141969055 145408470 149126604 152878814 156740720 160558653 164507055
4091A64507055M277448M012776M332970L996710L966536L630828L181491K864297
$$ 164507055 168784503 172797279 177130249 181126959 185093495 188724323 191905814 194770111
4083A94770111K329991J971146J741275J734063J653809J035595R39819J179436
$$ 194770111 197100102 199071248 200812523 202546586 204200395 205235990 206175809 207355245
4075B07355245J133388O81070M15662N54285j49229l30409r10496j060094j349191
$$ 207355245 208488633 209169703 209585365 210139650 209990421 209660012 208749516 207689422 206340231
4066B06340231j822573j961726k099064k448500k302119k564560k827229k827679
$$ 206340231 204517658 202555932 200456868 198008368 195706249 193141689 190314460 187486781
4058A87486781k963740l599826l888736l976713m286060m411706m596670m137695
$$ 187486781 184523041 180923215 177034479 173057766 168771706 164360000 159763330 155625635
4050A55625635m427985m732379m384395l965924m066613l820673l770097l440801
$$ 155625635 151197650 146465271 142080876 138114952 134048339 130227666 126457569 123016768
4042A23016768l628413l575038l453613l307237l207985k815465l132719l155271
$$ 123016768 119388355 115813317 112359704 109052467 105844482 103029017 99896298 96741027
4034I6741027k864129k926420k909575l113729k624092k547769k791446k609267
$$ 96741027 93876898 90950478 88040903 84927174 82303082 79755313 76963867 74354600
4026G4354600k212621k206979k307489k141330j955041j909366j875627j849526
$$ 74354600 72141979 69935000 67627511 65486181 63531140 61621774 59746147 57896621
4018E7896621j696399j764077j558395j420413j297207j393108j222508j274648
$$ 57896621 56200222 54436145 52877750 51457337 50160130 48767022 47544514 46269866
4010D6269866r26826j114768j333784j038441r10833r55754r16346q49504q67612
$$ 46269866 45343040 44228272 42894488 41856047 40945214 39989460 39073114 38223610 37355998
4001C7355998q58557j026364r00923j051678j128951r62255n00161p39390j021226
$$ 37355998 36497441 35471077 34570154 33518476 32389525 31427270 30927109 30187719 29166493
3992B9166493j068905r47340r18610p17679p39528r25456n99301o37684o13987
$$ 29166493 28097588 27150248 26231638 25513959 24774431 23848975 23249674 22611990 21998003
3983B1998003q86828o42164l83492n79166m66979n91501k66621m10213o70432
$$ 21998003 21111175 20469011 20085519 19506353 19039374 18447873 18181252 17771039 17100607
3974A7100607m87081m73184l27796k69480l94065l87083n22076m20994k90545
$$ 17100607 16613526 16140342 15812546 15543066 15149001 14761918 14239842 13818848 13528303
3965A3528303l07011k03929j84555j84807k94532k00968m38001l35982K40467
$$ 13528303 13221292 13017363 12832808 12648001 12353469 12152501 11714500 11378518 11618985
3956A1618985R505l63897l47174j9741j69591n3825j90959j58453l43069r6596
$$ 11618985 11628490 11264593 10917419 10897678 10728087 10674262 10483303 10324850 9981781 9885185
3946I885185N1174k37968r2286k23650j42087j86052j30354n0982l22117J33797
$$ 9885185 9936359 9698391 9606105 9382455 9240368 9054316 8923962 8872980 8550863 8684660
3936H684660j51839k61249L818o6993k4635L6317k89735j14829j20760k3463j4213
$$ 8684660 8532821 8271572 8275390 8208397 8183762 8220079 7930344 7815515 7694755 7671292 7657079
3925G657079k38176J81240j23720J84696j25423l12679J58388N1852r8214O1041
$$ 7657079 7418903 7600143 7476423 7661119 7535696 7223017 7381405 7433257 7335043 7396084
3915G396084l87929O7322j08510k61554P0052P8718R1565k3949k19093L352j71243
$$ 7396084 7008155 7075477 6966967 6705413 6775465 6854183 6945748 6921799 6702706 6706058 6534815
3904F534815n4729J73666j67745j33554J21715k21241j32152n629L9843J04061
$$ 6534815 6480086 6653752 6486007 6352453 6474168 6252927 6120775 6115146 6154989 6259050
3894F259050Q6016j16666q0442l06347K44405J93625k68694Q4723P7820j24813
$$ 6259050 6345066 6228400 6147958 5841611 6086016 6279641 6010947 6095670 6173490 6048677
3884F048677j33067J97204O8851l83001l1450J54623J30065Q7648n9117J64690
$$ 6048677 5915610 6112814 6181665 5798664 5767214 5921837 6051902 6139550 6080433 6245123
3874F245123k4013j67882K5083m8787m11719p7856J61022J71404r4759L8704J83594
$$ 6245123 6221110 6053228 6078311 6029524 5617805 5539949 5700971 5872375 5777616 5816320 5999914
3863E999914J54547j41267k55617j23953J28460N7551j37420J46189q5859n1101
$$ 5999914 6154461 6013194 5757577 5633624 5762084 5819635 5682215 5828404 5742545 5691444
3853E691444L10341q877p3948M9360j22632J32226M550j49851K9461n4787k53021
$$ 5691444 6001785 5992908 5918960 5968320 5845688 5977914 5982464 5832613 5862074 5807287 5554266
3842E554266M6810K91533o5610L2342k4356l2569K63K44270J01575j80992j893
$$ 5554266 5601076 5892609 5826999 5859341 5834985 5802416 5802679 6046949 6148524 5967532 5965639
3831E965639P3029q4460k902J00056R1826Q1314J53224j27879k94203R1020J9543
$$ 5965639 6038668 5954208 5951306 6051362 6143188 6224502 6377726 6249847 5955644 6046664 6066207
3820F066207j1146P9450K8147P9592k57247Q2223L8168j96914n1742J83245m2244
$$ 6066207 6055061 6134511 6162658 6242250 5985003 6067226 6105394 5908480 5856738 6039983 5997739
3809E997739k00033J75410p1520R5649J5846k32258P5328K22328k20720m8857
$$ 5997739 5797706 5973116 5901596 5997245 6013091 5780833 5856161 6078489 5857769 5808912
3799E808912J56818J61065J67287N2100k56743j23921j94532l12419J81233o115
$$ 5808912 5965730 6126795 6294082 6346182 6089439 5965518 5770986 5458567 5639800 5633685
3789E633685J68659J89322j80341j0844q6966p3232l2912j3072M3927L7427O9035
$$ 5633685 5802344 5991666 5811325 5800481 5713515 5640283 5607371 5594299 5638226 5675653 5744688
3778E744688k70227j6170Q7045J71801O4438J9296j80983J17297n2636j92317
$$ 5744688 5474461 5458291 5545336 5717137 5781575 5800871 5619888 5737185 5684549 5492232
3768E492232J5964j15872J27781M1007j63725M20519k07638k57557p8721k10293
$$ 5492232 5508196 5392324 5520105 5561112 5397387 5817906 5610268 5352711 5273990 5063697
3758E063697P7804Q7282J84977j42157l1514j03892k23685R73R5130l7503m47596
$$ 5063697 5141501 5228783 5413760 5271603 5240089 5136197 4912512 4913485 5008615 4971112 4523516
3747D523516j57507K52222k67965K193J10162K6625j08636P7805m3157R0343J40006
$$ 4523516 4366009 4618231 4350266 4352459 4462621 4489246 4380610 4458415 4415258 4505601 4645607
3736D645607n0441n6271k20077j16157m3138R6123J26612r7434p9965k12263M8300
$$ 4645607 4595166 4538895 4318818 4202661 4159523 4255646 4382258 4284824 4204859 3992596 4040896
3725D040896j56339j06644K68435k09651M0139k27642K36679j98929l3439K09318
$$ 4040896 3884557 3777913 4046348 3836697 3876836 3649194 3885873 3686944 3653505 3862823
3715C862823l60215J03456j45084j79115l3817M3290j21796k0780J40443J48089
$$ 3862823 3502608 3606064 3460980 3281865 3248048 3291338 3169542 3148762 3289205 3437294
3705C437294J29530p9194j74026j08368n7403K3607J5032j20903j34918l4311
$$ 3437294 3566824 3487630 3313604 3205236 3147833 3171440 3186472 3065569 2930651 2896340
3695B896340Q48m9299J02153J61411j28971m1199Q5420l1483k80818k49675K12766
$$ 2896340 2897188 2847889 2950042 3111453 2982482 2941283 3026703 2995220 2714402 2464727 2677493
3684B677493q1482n5605J13297r5444N9060j94236J84614J88238j1262k79531
$$ 2677493 2596011 2540406 2653703 2558259 2617319 2423083 2607697 2795935 2784673 2505142
3674B505142K616M9729m1841j67543J20763N193q5880N5595K00475j56698r6810
$$ 2505142 2507758 2557487 2515646 2348103 2468866 2474059 2388179 2443774 2644249 2487551 2390741
3663B390741m9433k23906P0739l7616J8498J61733j13576J271K02821k56404j74975
$$ 2390741 2341308 2117402 2188141 2150525 2169023 2330756 2217180 2218451 2421272 2164868 1989893
3652A989893j3801M09898j42469j52283q0135r1341Q5399j430n0294l9535j7054
$$ 1989893 1976092 2385990 2243521 2091238 2011103 1919762 2005161 2003731 1953437 1913902 1896848
3641A896848r8522R2746J69157l0667n4555J39887L0408n7999J09487k9375r0125
$$ 1896848 1798326 1891072 2060229 2029562 1975007 2114894 2145302 2087303 2196790 2167415 2077290
3630B077290J1820m8371j34158j42676J76686R565J7533J3896j52850m7515M5542
$$ 2077290 2089110 2040739 1906581 1763905 1940591 1950156 1967689 1981585 1828735 1781220 1826762
3619A826762L6275j80607k9268K2781M2060m0184J31243k6767M0124N6405j2083
$$ 1826762 1863037 1682430 1653162 1675943 1718003 1677819 1809062 1782295 1822419 1878824 1866741
3608A866741r5689K7821J05948k33930J15250j32573k41213K22609J88496J78153
$$ 1866741 1771052 1798873 1904821 1670891 1786141 1653568 1412355 1634964 1823460 2001613
3598B001613l083j62699j5502j52153l8857K39818Q8122j61173n1895J11945K92
$$ 2001613 1998530 1835831 1820329 1668176 1629319 1869137 1957259 1796086 1744191 1856136 1856428
3587A856428k11371r2371p7931o3617o724R9489J23153q462L8550J37915j53873
$$ 1856428 1645057 1552686 1474755 1411138 1404414 1503903 1627056 1618594 1657144 1795059 1641186
3576A641186l0279N9416r0859J80481J06290j53458J8783j61154J60597j7227
$$ 1641186 1610907 1670323 1579464 1759945 1866235 1712777 1731560 1570406 1731003 1713776
3566A713776o6613P8944j82406L16362J33991j27346j48903j01950M077o7385
$$ 1713776 1647163 1726107 1543701 1860063 1994054 1866708 1717805 1615855 1619932 1552547
3556A552547J48978J28911J08769j21823j23590L55921q0161J66406j52636J94384
$$ 1552547 1701525 1830436 1939205 1817382 1693792 2049713 1969552 2135958 1983322 2177706
3546B177706O2618j14920m4948K16379R7285j55932L581J43838J4456j25893m1070
$$ 2177706 2240324 2125404 2080456 2296835 2394120 2238188 2241769 2385607 2400063 2274170 2233100
3535B233100K31991K43481O9823p8251k54587J73455L26923m9470J08753J05667
$$ 2233100 2465091 2708572 2778395 2700144 2445557 2619012 2945935 2896465 3005218 3110885
3525C110885q9485j72867n5420J21958R8710p0534r1518j21089J86273L1944k06313
$$ 3110885 3021400 2848533 2793113 2915071 3013781 2943247 2851729 2730640 2916913 2948857 2742544
3514B742544J1626m0022j96885J05946J32035j39322Q6936Q4811J39769M3165
$$ 2742544 2754170 2714148 2517263 2623209 2755244 2615922 2702858 2787669 2927438 2970603
3504B970603l385j48441L5742L22322K9809r8147K99861J53465p503k17928p0174
$$ 2970603 2967218 2818777 2854519 3176841 3206650 3108503 3408364 3561829 3554326 3336398 3266224
3493C266224j00810P3877P1375n5552k2089j53585j29812l63656l34659O7673
$$ 3266224 3165414 3239291 3310666 3255114 3233025 3079440 2949628 2585972 2251313 2318986
3483B318986l9875n6121o258n2037J26160J20217j1755q1420j07739L5594q5317
$$ 2318986 2279111 2222990 2216732 2164695 2290855 2411072 2399317 2317897 2210158 2245752 2160435
3472B160435K8355j25535j34225j15128J86547R4587n7699p1201J70784j84808
$$ 2160435 2188790 2063255 1929030 1813902 2000449 2095036 2037337 1966136 2136920 1952112
3462A952112L3133J5477j29668J22951K59741j5078k45020k74860J10389J5046
$$ 1952112 1985245 2000722 1871054 1994005 2253746 2238668 1993648 1718788 1829177 1844223
3452A844223k531M5745k41907k23002l9978j46645J6970K47332j18909j34212
$$ 1844223 1841692 1887437 1645530 1422528 1382550 1235905 1252875 1500207 1381298 1247086
3442A247086r8435n6430K42j92986k0489J72341N5604m2858k55639k12020K58307
$$ 1247086 1148651 1092221 1092463 899477 878988 1051329 1106933 1064075 808436 596416 854723
3431H54723J25013J09463P6405l74605J07225j08173K28871N9392O0240j80188
$$ 854723 979736 1089199 1165604 790999 898224 790051 1018922 1078314 1138554 958366
3421I58366q2460Q6430j80275m5555n9641r7143L5268m2307l9728K03980J65315
$$ 958366 875906 962336 782061 736506 676865 579722 614990 572683 532955 736935 902250
3410I02250j2745q1666m00j24817k26522Q2510n1450r2543K39027l6278q8454
$$ 902250 889505 807839 807439 682622 456100 538610 487160 394617 633644 597366 508912
3399E08912L7255O6434o6702j59260R0262R6235r5364j20399K31911J62335P1362
$$ 508912 546167 612601 545899 386639 476901 573136 477772 357373 589284 751619 822981
3388H22981J6304l36665j25964N1310j22070K60749j33701k2131p3456m0423R5225
$$ 822981 839285 502620 376656 427966 305896 566645 432944 410813 337357 296934 392159
3377C92159P598o0020N8572K67386m8106j9275N4497j26398R1100J09376J2102
$$ 392159 399757 339737 398309 665695 617589 598314 652811 526413 617513 726889 738991
3366G38991j28146p2971K3167J72450k43445n3355L5406l9250l7811j27225J56012
$$ 738991 610845 537874 561041 733491 490046 436691 472097 432847 395036 267811 423823
3355D23823k50808J69104l151o5475L11576J58777k28482m2037q7186N1340M2833
$$ 423823 173015 342119 338968 273493 585069 743846 515364 473327 386141 437481 480314
3344D80314P634J59723k33305k59567J46679R6739O2926K6867q4899o8904L5514
$$ 480314 487948 647671 414366 154799 301478 398217 461143 488010 403111 334207 369721
3333C69721J5086J53356l49761m3900J92633m3253J28706k12619j35940J94799
$$ 369721 384807 538163 188402 144502 337135 293882 422588 209969 74029 268828
3323B68828j9140J3967n1315K8233O2095k5709J66775J55652k50720m03518K53306
$$ 268828 249688 263655 212340 240573 302668 276959 443734 599386 348666 -54852 198454
3312A98454P092n1121K65874j68225q774r4770n3922J67800o6055P0837N4308
$$ 198454 205546 154425 420299 252074 243300 148530 94608 262408 196353 267190 321498
3301C21498l54963N4751J77076N2515J1828j68514K23830l3076J44472n107j26420
$$ 321498 -33465 21286 198362 250877 262705 94191 318021 284945 429417 424310 297890
3290B97890R630j22990J6843P8173j28615J4836K58314p5024J341R4274j52607
$$ 297890 307520 184530 201373 279546 150931 165767 424081 349057 350398 444672 292065
3279B92065J07873j3097j87980p496J86489j43288o7021P8376m8909o0641R2261
$$ 292065 399938 386841 198861 191365 377854 234566 167545 245921 197012 136371 228632
3268B28632l41449M8936K01646N3309q0560n6853J893m2336p334j25529K04506
$$ 228632 -112817 -63881 137765 191074 110514 53661 55554 13218 5884 -119645 84861
3257H4861j6573j2653O5118Q1936l2182J81638Q172j17993K52389j46343l6525
$$ 84861 68288 55635 120753 202689 170507 352145 360317 242324 494713 348370 311845
3246C11845k42332m7354K15198k6419k3304o5168p2135K9915Q1433J42023Q2024
$$ 311845 69513 22159 237357 210938 187634 122466 50331 80246 161679 303702 385726
3235C85726m072k80093q3164J05902j30144J28315K45220j5142k99956J06182
$$ 385726 381654 101561 18397 124299 -5845 122470 367690 352548 52592 158774
3225A58774j74695J27k7592J85177m3297L5052j12870j16041J08987j07102J73280
$$ 158774 -15921 -15794 -43386 141791 98494 133546 20676 -95365 13622 -93480 79800
3214G9800J28729N4338p9238o4989J09471J07200l17k08423n5104K30473K07393
$$ 79800 208529 262867 183629 118640 228111 335311 334994 126571 71467 301940 509333
3203E09333j14116k21703k22931N1104J68828J70356K5548k7923r0170p1561q0690
$$ 509333 395217 173514 -49417 1687 170515 340871 366419 338496 248326 176765 96075
3192I6075o119n5907L03533m0556p4448L5580j20412l6968Q7776n061j08353R9393
$$ 96075 89956 34049 337582 297026 222578 258158 137746 100778 188554 183493 75140 174533
3180A74533P7428O7956r3866p7111k4446K84903K9365J08141r9153j88049J53019
$$ 174533 251961 319917 226051 148940 124494 409397 438762 546903 447750 259701 412720
3169D12720p8468k73989J12776J53415J0871R7676j13446j45834M2178n1773J82176
$$ 412720 334252 60263 173039 326454 337325 435001 321555 175721 217899 166126 348302
3158C48302L5514r5842J4046N9724p0022j88986N0611q435k24433N4667J9411
$$ 348302 383816 287974 302020 361744 291722 102736 153347 144912 -79521 -24854 -5443
3147e443J75683M8594j8555k4447p717M8430J91471r0559k40113k18966j46998
$$ -5443 170240 218834 200279 175832 168115 216545 408016 317457 77344 -141622 -288620
3136b88620K30973J82402o2802J3082n869j09719L31760J03960j90468O9659n8796
$$ -288620 -57647 124755 61953 75035 69166 -40553 291207 395167 204699 274358 215562
3125B15562l85332K42909K12954j68487j16663l0786J12687M1661K8487L8967
$$ 215562 -169770 73139 286093 117606 943 -29843 82844 124505 152992 191959
3115A91959j42370Q6684K8320r0916J4872M5573j16150k7011J16509p7835K13345
$$ 191959 49589 136273 164593 73677 88549 134122 17972 -9039 107470 29635 242980
3104B42980Q1481j14241m33590k51532J79708J17282N5230j05615M0294l0916
$$ 242980 324461 210220 -223370 -474902 -295194 -177912 -122682 -228297 -188003 -218919
3094b18919J48725J59816j79509J79431n1551j45584j04263J55955R953O7811
$$ -218919 -70194 89622 -89887 89544 37993 -107591 -211854 -55899 -45946 21865
3084B1865L00347j81214j739J8745O3588M6022j20154k20673J09822O1555r5871
$$ 21865 322212 140998 139259 158004 221592 267614 147460 -73213 36609 98164 2293
3073B293j2509J60342J56660j1390J24254k45088p9584M4894J6302j31260j76222
$$ 2293 -10216 150126 306786 295396 419650 174562 94978 139872 156174 24914 -151308
3062a51308O834K21395P5920k8211N8344j3182J27252j64248r1112K1090L9905
$$ -151308 -144474 76921 152841 124630 182974 169792 297044 132796 41684 62774 102679
3051A02679K86923q0037k03152k04861K80781q0777o2895R6929J64516q7966k63440
$$ 102679 389602 309565 106413 -98448 182333 101556 38661 135590 300106 212140 -51300
3040e1300K30380k29529O8962m4179j82584K31351j41665n3410J69201O6864j00014
$$ -51300 179080 -50449 18513 -25666 -208250 23101 -118564 -171974 -2773 64091 -35923
3029c5923l8419K69272k85115K22922J97964k34345r0885L2016J11763j03348
$$ -35923 -74342 194930 -90185 132737 330701 96356 5471 37487 149250 45902
3019D5902K06672k51078l6542j28334j07970J28715j63247J2741P4288L25594
$$ 45902 252574 1496 -35046 -163380 -271350 -142635 -305882 -293141 -218853 106741
3009A06741N5254m1423l627r6457l9877Q2292o2123J20535J77326j89766j38497
$$ 106741 161995 120572 116945 20488 -19389 62903 780 121315 298641 108875 -29622
2998b9622k2171J07565J23716k30821K49232q8590o3018K66639k69141J6027J21378
$$ -29622 -51793 55772 179488 -51333 197899 109309 46291 312930 43789 59816 181194
2987A81194k32526N5843j28553J01510j90035N1750O9371K20211N1044l31749
$$ 181194 -51332 4511 -124042 -22532 -212567 -160817 -91446 128765 179809 -151940
2977a51940K7047j12942j23493O2623L01191k2218M6950P1920j33150N0677R269
$$ -151940 -124893 -237835 -361328 -298705 2486 -19732 27218 99138 -34012 16665 25934
2966B5934n3008J97861R3680k99414o5534J04848N3833j32200m6117L88899n1216
$$ 25934 -27074 170787 264467 -34947 -100481 4367 58200 -74000 -120117 268782 217566
2955B17566j81516j30680Q6606J48233l35486j44060K65198K00425K4429j61027
$$ 217566 36050 -94630 -8024 140209 -195277 -339337 -74139 126286 150715 -10312
2945a0312J69366J01749j62932j93907n7470K8582K3962N5776q9110m3853J85874
$$ -10312 159054 260803 97871 -96036 -153506 -124924 -100962 -45186 -134296 -178149 7725
2934G725o0360l4432M4l2654J26085j81670J83402J35683k02570j50935j20770
$$ 7725 -52635 -87067 -87023 -119677 6408 -175262 8140 143823 -58747 -209682 -330452
2923c30452J25174K8831r1187N1463J52785l0300Q3L3645J1429j63269k9382q9770
$$ -330452 -205278 -176447 -267634 -216171 -63386 -93686 -93603 -59958 -48529 -211798 -241180 -330950
2911c30950r9376J13817M50247l7147l61444R9923J19678K6785R1175P350o1795
$$ -330950 -430326 -316509 133738 96591 -264853 -164930 -45252 -18467 72708 80058 18263
2900A8263J0832j69199q3640J8381Q055k31271M5909m0866J60623J29985p3194
$$ 18263 29095 -140104 -223744 -205363 -197308 -428579 -382670 -423536 -262913 -132928 -206122
2889b06122j05443L37949O580j03721J76243n1398J14836P6114q4624j12977j35939
$$ -206122 -311565 26384 32964 -70757 105486 54088 168924 245038 160414 47437 -88502
2878h8502J12370J98398k67565j27664J23484N3219j31730J70446j50953m6945
$$ -88502 23868 222266 -45299 -172963 -49479 3740 -127990 42456 -108497 -155442
2868a55442M9495j63257q3011R9313J20419O8449J2352P0295n8935l8248k6256
$$ -155442 -105947 -269204 -352215 -252902 -132483 -64034 -51682 18613 -40322 -78570 -104826
2857a04826J11528j4021o0977J07960q5706k44797K67634r9512K12383l301n9916
$$ -104826 6702 -7319 -68296 39664 -46042 -290839 -23205 -122717 89666 86365 26449
2846B6449j80650L3118K49203K9549p585j66516M1378o2406m4490N8608j4094
$$ 26449 -154201 -121083 128120 157669 150084 -16432 24946 -37460 -81950 -23342 -37436
2835c7436Q8225r7469j31046L7356J35479R5417K0082K4361r0399k03230j06019
$$ -37436 50789 -46680 -177726 -140370 -4891 90526 110608 134969 44570 -158660 -264679
2824b64679K70527k20272l3941O9310n9751n901J28988J69408p3543k93081p2202
$$ -264679 5848 -214424 -248365 -179055 -238806 -244707 -115719 53689 -19854 -312935 -385137
2813c85137J45125o8262J96301J93950j66048j47011j07671L48513R870j31962
$$ -385137 -240012 -308274 -111973 81977 -84071 -231082 -338753 9760 19630 -112332
2803a12332r3638j4541O1858P245j23016J09929J76043l739o643o4634m3156J5951
$$ -112332 -205970 -220511 -158653 -151408 -274424 -164495 11548 7809 1166 -63468 -106624 -90673
2791i0673j05693K19404J68573n6648k55791p7328K99838Q9693j97169Q9537Q4637
$$ -90673 -196366 23038 191611 134963 -120828 -198156 101682 191375 -5794 83743 168380
2780A68380r9280j03198r7589N0106J57493N0312O116P711n9684M4383J07809
$$ 168380 69100 -34098 -131687 -81581 75912 126224 132340 140051 80367 124750 232559
2769B32559r4734M2440k11636K6455n2415j08106j74295L21833K61485k76322
$$ 232559 137825 180265 -31371 -4916 -57331 -165437 -339732 -17899 243586 -32736
2759c2736j06224j06342J96796K03300q5895o1857l0227J01860p1559Q076O1976
$$ -32736 -138960 -245302 -48506 154794 68899 7042 -23185 78675 7116 15192 77168
2748G7168j14314n3152L0034J38005j04753J00126j87783j30039j286R7089J24064
$$ 77168 -37146 -90298 -60264 77741 -27012 73114 -114669 -244708 -245994 -148905 -24841
2737b4841l7902j01789J28221J38731r4740K53881J2335k3738k29959k75495n4315
$$ -24841 -62743 -164532 -36311 102420 7680 261561 273896 250158 20199 -255296 -309611
2726c09611P5278L1765k09661J55960J91692J75505j51649k79499J28283K64256
$$ -309611 -234333 -202568 -412229 -256269 -64577 110928 -40721 -320220 -191937 72319
2716G2319L2004N9131n7927j49323j54417K16797N4607k77285o397L14668J25169
$$ 72319 104323 163454 105527 -43796 -198213 18584 73191 -204094 -210491 104177 229346
2705B29346k04152K4711k95852R2552J98430k84699J17485o9163J08322M5546
$$ 229346 25194 49905 -245947 -153395 45035 -239664 -122179 -191342 -83020 -37474
2695c7474l5254o7752k02014J73813L12716l2043k0291k05030J56617R4832k05196
$$ -37474 -72728 -140480 -342494 -168681 144035 111992 91701 -113329 43288 138120 -67076
2684f7076n0740L2314j8250J04429L0354K261J991Q2797K27750o136j48502j58639
$$ -67076 -117816 -85502 -103752 677 31031 33292 35283 118080 345830 339694 191192 32553
2672C2553j22580J22095K496R5533j68175K7399J74931J760r7999j76924j43796
$$ 32553 -90027 32068 34564 130097 -38078 -10679 164252 166012 68013 -108911 -252707
2661b52707Q1592L7302R4083K22879n3751o245k83297q2488J96174J13456p3285
$$ -252707 -171115 -133813 -39730 183149 129398 123153 -160144 -242632 -46458 66998 -6287
2650f287J46782k10546J05676k9658j89189K00917K7785m3287j11229J62713M3133
$$ -6287 140495 -70051 35625 5967 -183222 17695 45480 2193 -109036 53677 96810
2639I6810J31909l0732m16101j49506J79989j0226L27343j48404j28098Q4032
$$ 96810 228719 197987 -218114 -367620 -187631 -197857 129486 -18918 -147016 -62984
2629f2984j33825J22514J12734P7859k45797J74257J05111r990j70167K01468
$$ -62984 -196809 -74295 38439 116298 -129499 44758 149869 139879 -30288 171180
2619A71180k12810j2314J94391j66210Q1915J2929R4996m381r8867K31425j37009
$$ 171180 -41630 -53944 140447 -25763 56152 69081 164077 159696 60829 292254 155245
2608A55245p0495p4017k24742k3293J63269J36440n5791L2805Q7070J26762N3449
$$ 155245 84750 10733 -214009 -237302 -74033 62407 6616 39421 126491 253253 306702
2597C06702j69164j85668N008M7695J20308M0508q2397l2535o1446J33393k13428
$$ 306702 137538 -48130 -43122 4573 124881 165389 82992 50457 -10989 122404 -91024
2586i1024J49338O0162j8686K88676j71203O2273p7068r0701k53683K0801J05220
$$ -91024 58314 118476 99790 388466 217263 279536 202468 111767 -141916 -121115 -15895
2575a5895k4966K07022L4158p2060J621j0338j55608J26373J17094k2798J56644
$$ -15895 -40861 166161 200319 128259 129880 119542 -36066 90307 207401 184603 341247
2564C41247j5730k413k18126J06539K9055k3913O9814r6524M8815J13979n8421
$$ 341247 325517 323104 104978 211517 240572 216659 286473 189949 238764 352743 294322
2553B94322j25602R1502q731J4126l0472j16539J95538N5279k78061J2948K7346
$$ 294322 168720 260222 251491 265617 235145 118606 314144 369423 91362 104310 131656
2542A31656J39224Q6084N8290m6220k99622Q3267J07223N4701J47908r7875P0179
$$ 131656 270880 356964 415254 369034 69412 152679 259902 314603 462511 364636 434815
2531D34815J05500m3700r7714j67358Q3871o8270j47344J56785j5018J32561o3834
$$ 434815 540315 496615 398901 231543 315414 247144 99800 256585 241567 374128 310294
2520C10294p873k4841Q2739q4667J57501J69339j55135L90107k52350j73379N1633
$$ 310294 302421 277580 360319 275652 433153 602492 447357 837464 585114 411735 463368
2509D63368P5316n2123m4454J02045J46770q7698m0522Q3725k80781M1976M8425
$$ 463368 538684 486561 442107 544152 690922 603224 562702 646427 365646 407622 456047
2498D56047P521J36504n889Q4810l6743j17353l2855J06593N8676o6985O8010
$$ 456047 463568 600072 594183 678993 642250 524897 492042 598635 657311 590326 658336
2487F58336J50843K64527j2066k8971j51731j71573Q3379L0884k9753J10205R1928
$$ 658336 809179 1073706 1061640 1032669 880938 709365 792744 823628 793875 904080 996008
2476I96008K19578j38147K879J37494j14621j2587J07423K26104j61135K86688
$$ 996008 1215586 1077439 1080318 1217812 1103191 1090604 1198027 1424131 1262996 1549684
2466A549684J86725q6981k08921O4108K9915j68352l6886L5187R1099O3825J23346
$$ 1549684 1736409 1649428 1440507 1504615 1534530 1366178 1329292 1364479 1455578 1519403 1642749
2455A642749L2900J60544j44150n7068J05080l7892M9605M2156p4130r3960J89044
$$ 1642749 1675649 1836193 1692043 1634975 1740055 1702163 1751768 1793924 1719794 1625834 1814878
2444A814878K35051O253J02174K04162J36800j01181m2198n1215J34910J01187
$$ 1814878 2049929 2056182 2158356 2362518 2499318 2398137 2355939 2304724 2439634 2540821
2434B540821Q9818J08894L10035N0256j8380P1911R6301K12521j1984J51647l6172
$$ 2540821 2630639 2739533 3049568 3099824 3081444 3153355 3249656 3462177 3450193 3601840 3565668
2423C565668J38115K09335P2892J73268Q9212L12378L92140J64639L36857J26898
$$ 3565668 3703783 3913118 3986010 4159278 4248490 4560868 4953008 5117647 5454504 5581402
2413E581402J7356j15199N9984Q3142M41496P8028J10587O2892l0821K51690N52039
$$ 5581402 5598758 5483559 5543543 5626685 6068181 6146209 6256796 6319688 6288867 6540557 7092596
2402G092596L16348K37018L72764K35166N41880O24388N12122N73145O45893M38866
$$ 7092596 7408944 7645962 8018726 8253892 8795772 9420160 9932282 10505427 11151320 11590186
2392A1590186O82727Q76681Q40562J014905R10385J452510J701697J508119J872215
$$ 11590186 12272913 13149594 13990156 15005061 15915446 17367956 19069653 20577772 22449987
2383B2449987K110716J957421K027920K211823J384288O05265k80073o23491j541735
$$ 22449987 24560703 26518124 28546044 30757867 32142155 32747420 32467347 31843856 30302121
2374C0302121j971632k025305k319433k419445k279986j563681j651122j221699
$$ 30302121 28330489 26305184 23985751 21566306 19286320 17722639 16071517 14849818
2366A4849818j110839q41432j032884q60802l62772o86738q75061p75778l47546
$$ 14849818 13738979 12897547 11864663 11003861 10641089 9954351 9079290 8303512 7955966
2357G955966n53936m11814n35844n16478l71325j43165n13082l62158j56203M2192
$$ 7955966 7402030 6990216 6454372 5937894 5566569 5423404 4910322 4548164 4391961 4434153
2347D434153k15046k02727j88939k88212O3407k2148l36087k22096j85226j14489
$$ 4434153 4219107 4016380 3827441 3539229 3602636 3580488 3244401 3022305 2837079 2722590
2337B722590j11128n9482r389l0889k20869O5535M9121n4834K29669k08173k90170
$$ 2722590 2611462 2551980 2542591 2511702 2290833 2356368 2405489 2350655 2580324 2372151 2081981
2326B081981o0148p3892j34117j2110l64090R3302M5327k93438L3714j240P5021
$$ 2081981 2021833 1947941 1813824 1801714 1437624 1530926 1576253 1282815 1316529 1315289 1390310
2315A390310M8763n3674j93220o3603J36289L6578L6038l25491j30153K34951
$$ 1390310 1439073 1385399 1192179 1128576 1264865 1301443 1337481 1011990 881837 1116788
2305A116788j74655j49473m575m5707K26443q6700n3515O6833q1467o4084M8461
$$ 1116788 942133 792660 788085 742378 968821 882121 828606 895439 813972 749888 798349
2294G98349J63796l50924j85397O1988K15489K51953j62803l2021R4727j67271
$$ 798349 962145 611221 425824 487812 703301 955254 792451 760430 855157 687886
2284F87886k0446j50648K4995q8696q4282N534j07899P7886R0734J41971k59502
$$ 687886 667440 516792 541787 453091 368809 374343 266444 344330 435064 577035 317533
2273C17533j13579J8239K95196M0885n3563m9309j02384p2386o8858P2947N8110
$$ 317533 203954 222193 517389 558274 504711 455402 353018 280632 211774 284721 342831
2262C42831K3690l4499j03442J12323l5629j11379J47391k95429J39316K17918
$$ 342831 366521 332022 228580 340903 305274 193895 341286 45857 185173 403091
2252D03091l59684m3251J48930j24837J54547J54126K32608q4063j75239k708
$$ 403091 43407 156 149086 24249 178796 332922 565530 481467 306228 303520
2242C03520j65965o676J42804n59j01917L09972l61952n1654N6119J82586L4488
$$ 303520 137555 130879 273683 273124 171207 481179 119227 67573 123692 306278 340766
2231C40766J22440p3223J5611M9941l20825k03688K02481m0633m6736J60594m0583
$$ 340766 463206 389983 405594 455535 134710 -68978 133503 92870 46134 206728 166145
2220A66145m7181P5608P3883j58693R828j14812K66068n4247N4968J5561j04689
$$ 166145 118964 194572 268455 109762 119590 4778 270846 216599 271567 287128 182439
2209A82439q6629n6880k47116j38350K00173K89189J33976n2355J31737J10132
$$ 182439 95810 38930 -208186 -346536 -146363 142826 276802 224447 356184 466316
2199D66316l09804p7666J42061m7121J16156q0795j551j41371K07208L07038l14881
$$ 466316 156512 78846 220907 173786 289942 209147 207596 66225 273433 580471 265590
2188B65590k46877j41228K67876j09640j77472J36501J4109K4274K55541p0081
$$ 265590 18713 -122515 145361 35721 -141751 -5250 8859 33133 288674 218593
2178B18593j10322j01921l228j00628k15687K63109J16776P215R3613l2326j88446
$$ 218593 108271 6350 3122 -97506 -313193 -50084 66692 73907 167520 135194 -53252
2167e3252J22296J19787K9120P821j18197q5812P455j2225m1181p420J72034K2952
$$ -53252 69044 188831 217951 225772 107575 21763 29218 16993 -24188 -31608 140426 163378
2155A63378m7153n0674n9861q1358J90750k9711O2976k11070J02405K03699k99308
$$ 163378 116225 65551 5690 -75668 115082 85371 148347 -62723 39682 243381 -55927
2144e5927J5950J79920O7956j80869J24793l3240K7235j06246r1777K2426Q3454
$$ -55927 -39977 139943 207899 27030 151823 118583 145818 39572 -52205 -29779 53675
2133E3675k1099P9041k54805j16738K51888P9889m771q7483K05332J58029j53558
$$ 53675 32576 111617 -143188 -259926 -8038 71851 67080 -20403 184929 342958 189400
2122A89400r5410k70940J28668O4000k03070P3846O0071J84449J83591j89157
$$ 189400 93990 -176950 -48282 15718 -187352 -113506 -53435 131014 314605 125448
2112A25448K07642L4969j01841j21851j72379j1843K22371j14306j63663K27265
$$ 125448 333090 368059 266218 144367 -28012 -39855 182516 68210 -95453 131812
2102A31812j96606l3817J0955M1551j53377J61231N3759j19253m3850K5218K595
$$ 131812 -64794 -98611 -87656 -46105 -199482 -38251 15508 -103745 -147595 -122377 -119782
2091a19782J96975O0309J51509j74360j01747J1276J23980o5758M8708j51335
$$ -119782 77193 137502 289011 114651 12904 24180 148160 82402 131110 -20225
2081b0225o7964R0704L9488O3621l11J52186q2336j01409r8330q2846q38O7900
$$ -20225 -88189 2515 42003 105624 105313 257499 175163 73754 -24576 -107422 -108260 -40360
2069d0360k19993K63550O4041k45234N5770J78299J82341J25448k29995j23768
$$ -40360 -260353 3197 67238 -177996 -122226 56073 238414 363862 133867 10099
2059A0099l0465J32095n9942k98684J46391J15745m6278J74643K8544k46710o3575
$$ 10099 -20366 111729 51787 -246897 -100506 15239 -31039 143604 172148 -74562 -138137
2048a38137J67411j13998j35293J00489r276q8501N1391M8005J85817o7426l938
$$ -138137 29274 -84724 -220017 -119528 -128804 -217305 -165914 -117909 67908 482 -3456
2037c456l2603J5295j00712Q3071Q6855j21643J48656j28496p599J44038J09082
$$ -3456 -36059 -20764 -121476 -38405 48450 -73193 75463 -53033 -60632 83406 192488
2026A92488j12811P2166k12460j4230j97762O7484K94201k47861J5435j5597N4865
$$ 192488 79677 151843 -60617 -74847 -272609 -205125 89076 -158785 -143350 -158947 -104082
2015a04082M5547j09377K0854K72949m4278j55592m7717J04620J5043l70565J6471
$$ -104082 -58535 -167912 -147058 125891 81613 -73979 -121696 -17076 -2033 -372598 -356127
2004c56127J46367J81140m4458o1584n7993N1273j24235O8164J90581k00941O3770
$$ -356127 -209760 -28620 -73078 -134662 -192655 -141382 -265617 -197453 -6872 -207813 -144043
1993a44043j70201P923J0725K51355L8275K7178k8906K3579j68672j00953R9831
$$ -144043 -314244 -306321 -295596 -44241 -5966 21212 -7694 15885 -152787 -253740 -153909
1982a53909m5334Q6631N7301m2091j64111J61210L3302n189K065j8490N6805l2214
$$ -153909 -199243 -112612 -55311 -97402 -261513 -100303 -67001 -72190 -70125 -88615 -31810 -64024
1970f4024P6959j49904J96012J45930o0308K2033k05203j16815r8854O652J43966
$$ -64024 12935 -136969 59043 204973 144665 166698 -38505 -155320 -254174 -247522 -103556
1959a03556O4020o2146K58386R0005o1300o7744p6654p0901J16694k35858o8860
$$ -103556 -39536 -101682 156704 246709 185409 117665 41011 -29890 86804 -149054 -217914
1948b17914K03600m5734K1777j98447q358R9419P1383p1143J75959J03618j47671
$$ -217914 -14314 -60048 -38271 -236718 -245076 -145657 -74274 -145417 30542 134160 -13511
1937a3511o9617j5086L3167J14851j4624O0057j535k51633L1767J43029O3720
$$ -13511 -83128 -98214 -65047 49804 35180 95237 93702 -157931 -126164 16865 80585
1926H0585j85345K42832j40350j47340J83263j37412j04189P8896J11474J30872
$$ 80585 -104760 138072 -2278 -149618 33645 -103767 -207956 -129060 -17586 113286
1916A13286j44362k059n5901M0930j05220J72732K0986K3725K2586J95886j86594
$$ 113286 -31076 -33135 -89036 -48106 -153326 19406 40392 64117 86703 282589 95995
1905I5995j36257K18104q8166j14725J62071j02137k15755J77270j90976l8493
$$ 95995 -40262 177842 89676 -25049 137022 34885 -180870 -3600 -194576 -233069
1895b33069l5523K21971K7823o9331L4489l3716o5862K61298r8010j90517p9297
$$ -233069 -268592 -46621 -18798 -88129 -53640 -87356 -153218 108080 10070 -180447 -259744
1884b59744O1292n7313J11312J74939J29750K0369j30730j20960J03174J70989
$$ -259744 -198452 -255765 -144453 30486 160236 180605 49875 -71085 32089 203078
1874B03078J23954l33122K1799k7575o9645K23606o3070k56414K513K63156r8773
$$ 203078 327032 -6090 15709 -11866 -81511 142095 79025 -177389 -174876 88280 -10493
1863a0493K2252J29829j57208j92643J49905K19495j56657r2424j71946O3888
$$ -10493 11759 141588 -15620 -208263 -58358 161137 4480 -87944 -259890 -196002
1853a96002Q1626J31579K23741k42330n4742m168q571R3268J26597l5974N887
$$ -196002 -114376 17203 240944 -1386 -56128 -60296 -68867 24401 150998 115024 120911
1842A20911k11458j5778p7092R7350J06126k7666l6718M3683R7744M0797L0700
$$ 120911 -90547 -106325 -183417 -86067 20059 -7607 -44325 -642 97102 137899 168599
1831A68599j70936J12788O9891k19755o0616j61807Q416p818K1318J39226P0195
$$ 168599 -2337 110451 180342 -39413 -100029 -261836 -253420 -261238 -239920 -100694 -30499
1820c0499P2468J48231j11126j51045p6587J56359K77690j37328n904n0279j68788
$$ -30499 41969 190200 79074 -71971 -148558 7801 285491 148163 142259 91980 -76808
1809g6808j22462Q7794j20485n499L2717J0071L0161Q5546J30712m386J1509L2758
$$ -76808 -199270 -111476 -231961 -237460 -204743 -194672 -164511 -78965 51747 47361 58870 91628
1797I1628k38952J20130R2522j58051m4053k3192N5586J38203J9546n9528j5644
$$ 91628 -147324 -27194 65328 -92723 -136776 -159968 -104382 33821 53367 -6161 -21805
1786b1805j83765j30080k21602J80465J27341L2337J241P2992j94390R7109J33670
$$ -21805 -205570 -335650 -557252 -376787 -249446 -217109 -215868 -142876 -337266 -240157 -106487
1775a06487O7732p8171k27173K10712L9027M6324j38061j17799M6635K98039J5592
$$ -106487 -38755 -116926 -344099 -133387 -94360 -48036 -186097 -303896 -257261 40778 56370
1764E6370k40314N2102M2860N9263K8039J6017L3495l50314J26734M0587j11455
$$ 56370 -183944 -131842 -88982 -29719 -1680 14337 47832 -302482 -175748 -135161 -246616
1753b46616o4681j13809J58533N6394J8444J22306J7464p3580L51367J12819j39364
$$ -246616 -311297 -425106 -266573 -210179 -191735 -69429 -51965 -125545 225822 338641 199277
1742A99277k09106J18796L7436j18717k40671q9381k3872P4893j5943J22263P3450
$$ 199277 -9829 108967 146403 27686 -212985 -302366 -326238 -251345 -267288 -145025 -71575
1731g1575o2971K79975k20528k32324k5236J91491M2458Q914j83852J3906O8001
$$ -71575 -134546 145429 -75099 -307423 -332659 -141168 -98710 -89796 -273648 -259742 -191741
1720a91741R1288j9631j5376p6342K30471J59715n3512j47130K1152J6431k02951
$$ -191741 -100453 -120084 -135460 -211802 18669 178384 124872 -22258 -1106 15325 -187626
1709a87626K5932J8830m4752o5625J83632J02301N7882p1298k04127Q3226j68396
$$ -187626 -161694 -142864 -187616 -253241 -69609 32692 90574 19276 -184851 -101625 -270021
1698b70021J47563K61440m6698p2151j50110j05009k337J20915l0535J75795k20664
$$ -270021 -122458 138982 92284 20133 -129977 -234986 -237323 -116408 -146943 28852 -191812
1687a91812J27614K9683j19127O0541J4033K9866O0685p2342K57262J5680j9594
$$ -191812 -64198 -34515 -153642 -93101 -79068 -49202 11483 -60859 196403 212083 192489
1676A92489o8031j38258o0122P8502J37661k06302l8717n7329K0523Q531r3680
$$ 192489 124458 -13800 -73922 4580 142241 -64061 -102778 -160107 -139584 -131053 -224733
1665b24733K34772J61291R7715k09684k41553k27362R4701M63081O9913j38421
$$ -224733 10039 171330 269045 59361 -182192 -409554 -314853 148228 218141 79720
1655G9720j73529L3657r105R1744j45872j48845J54914K73578k2748l1833r0032
$$ 79720 -93809 -60152 -69257 22487 -123385 -272230 -117316 156262 133514 101681 11649
1644A1649Q2019J14305k14286J9597j37207r9346J5197J09166N4293j47161L419
$$ 11649 93668 207973 -6313 13284 -123923 -223269 -208072 -98906 -44613 -191774 -188355
1633a88355M9030p8529L8596K087j82579K3124P1978K6056M9414N4552K39608
$$ -188355 -139325 -217854 -179258 -177171 -359750 -336626 -264648 -238592 -189178 -134626 104982
1622A04982n1403l82340J4368J68918K01752j58203L1659r8108R2025J13380n2886
$$ 104982 53579 -328761 -314393 -145475 56277 -101926 -70267 -168375 -76350 37030 -15856
1611a5856L0793k01747k04802P954K79331O2225k25422J07865L7545j03621j09339
$$ -15856 14937 -186810 -391612 -383658 -104327 -42102 -267524 -159659 -122114 -225735 -335074
1600c35074j04265J78134J83285j40370K21353L38276k34301J9027j47160K3372
$$ -335074 -439339 -261205 -77920 -218290 3063 341339 107038 126065 -21095 2277
1590B277J3434K4021k5687J65325k06925q2095Q6885M0949O1993M8274k24563
$$ 2277 15711 39732 14045 179370 -27555 -109650 -22765 18184 80177 128451 -96112
1579i6112j12448Q2022q8800J1791K21594L8119o2709M629P9334J73452k15611
$$ -96112 -208560 -126538 -215338 -203547 18047 56166 -6543 -1914 77420 250872 35261
1568C5261K9856j21594k1936q3511k7512P5767J09814r9034L12031p0305l62245
$$ 35261 65117 -56477 -78413 -161924 -189436 -113669 -3855 -102889 209142 138837 -223408
1557b23408J19326j40033j9824J40588o0279J02368p1454O8175j600J10678P6994
$$ -223408 -104082 -244115 -263939 -123351 -183630 -81262 -152716 -84541 -86141 24537 101531
1546A01531j55057j70884J0171K41133n9166l8313K9479L1506o3410Q1688J20642
$$ 101531 -53526 -224410 -214239 26894 -32272 -70585 -41106 -9600 -73010 8678 129320
1535A29320j45331j44607r202J82807O89k49176r9584J19800R7357R4630j03675
$$ 129320 -16011 -160618 -169820 12987 13676 -235500 -335084 -215284 -117927 -23297 -126972
$$ [...]
##END NTUPLES=NMR SPECTRUM
##END=
