##TITLE=1H_CA-9214-32
 CDCl3
 8 sc, 
 1.12.2023
##JCAMPDX= 6.0         $$ Bruker NMR JCAMP-DX V2.0
##DATA TYPE= NMR SPECTRUM
##DATA CLASS= NTUPLES
##ORIGIN= UXNMR, Bruker Analytische Messtechnik GmbH
##OWNER= root
$$ XWIN-NMR		Version 3.5
$$ Fri Dec  1 14:21:09 2023 Russian Standard Time (UT+4h)  she@DPX200
##.OBSERVE FREQUENCY= 200.1313
##.OBSERVE NUCLEUS= ^1H
##.ACQUISITION MODE= SIMULTANEOUS
##.ACQUISITION SCHEME= undefined
##.AVERAGES= 8
##.DIGITISER RES= 18
##SPECTROMETER/DATA SYSTEM= spect
##.PULSE SEQUENCE= zg30
##.SOLVENT NAME= CDCl3
##.SHIFT REFERENCE= (INTERNAL, CDCl3, 0, 15.4725)
##AUDIT TRAIL= $$ (NUMBER, WHEN, WHO, WHERE, WHAT)
$$ ##TITLE= Audit trail, XWIN-NMR		Version 3.5
$$ ##JCAMPDX= 5.01
$$ ##ORIGIN= Bruker BioSpin GmbH
$$ ##OWNER= she
$$ F:/spectra/data/she/nmr/H-F/1/pdata/1/auditp.txt
$$ ##AUDIT TRAIL=  $$ (NUMBER, WHEN, WHO, WHERE, WHAT)
(   1,<2023-12-01 14:19:59.78 +0400>,<she>,<DPX200>,
      <created by zg, POWCHK disabled, PULCHK disabled
       configuration hash MD5:
       00 E9 B6 7A A2 85 ED C7 34 08 36 98 17 FE 4E 26
       data hash MD5: 16K
       30 57 A6 03 11 B4 11 C3 C8 30 B2 32 E9 50 02 F7>)
(   2,<2023-12-01 14:20:02.28 +0400>,<she>,<DPX200>,
      <Start of raw data processing
       efp BC_mod = 2 LB = 0.24 FT_mod = 6 PKNL = 1 PHC0 = -24590.01 PHC1 = 9.65271 SI = 16K 
       data hash MD5: 16K
       66 7A 81 11 AE DB 19 0E 7D 93 02 F5 FA 58 C2 7D>)
(   3,<2023-12-01 14:20:20.18 +0400>,<she>,<DPX200>,
      <pk PHC0 = -5.690463 PHC1 = 9 
       data hash MD5: 16K
       32 F6 54 06 D2 0E 19 36 94 47 8D 27 93 8C CA 9F>)
(   4,<2023-12-01 14:20:23.56 +0400>,<she>,<DPX200>,
      <abs ABSG = 5 
       data hash MD5: 16K
       E4 B5 B5 9A E0 99 44 97 23 BB 47 80 11 9F 7C 8E>)
$$ ##END=
$$ 
$$ hash MD5
$$ E3 04 8F F2 C2 06 04 80 DD 22 B7 00 52 12 0F C1
##$RELAX= 
##$RELAX= 
##$RELAX= 
##$RELAX= 
##$RELAX= 
##$RELAX= 
$$ Bruker specific parameters
$$ --------------------------
##$DU= <F:/spectra>
##$EXPNO= 1
##$NAME= <H-F>
##$PROCNO= 1
##$TYPE= <nmr>
##$USER= <she>
##$AMP= (0..31)
100 100 100 100 100 100 100 100 100 100 100 100 100 100 100 100 100 100 
100 100 100 100 100 100 100 100 100 100 100 100 100 100 
##$AQSEQ= 0
##$AQ_mod= 1
##$AUNM= <au_zg>
##$AUTOPOS= <>
##$BF1= 200.13
##$BF2= 200.13
##$BF3= 200.13
##$BF4= 200.13
##$BF5= 200.13
##$BF6= 200.13
##$BF7= 200.13
##$BF8= 200.13
##$BYTORDA= 1
##$CFDGTYP= 0
##$CFRGTYP= 5
##$CHEMSTR= <none>
##$CNST= (0..31)
1 1 145 1 1 1 1 1 1 1 1 1 1 1 1 1 1 1 1 1 1 1 1 1 1 1 1 1 1 1 1 1 
##$CPDPRG= <>
##$CPDPRG1= <>
##$CPDPRG2= <>
##$CPDPRG3= <>
##$CPDPRG4= <mlev>
##$CPDPRG5= <mlev>
##$CPDPRG6= <mlev>
##$CPDPRG7= <mlev>
##$CPDPRG8= <mlev>
##$CPDPRGB= <>
##$CPDPRGT= <>
##$D= (0..31)
0 1.2 0 0 0 0 0 0 0 0.06 0 0.03 0 0 0 0 0.0002 0 0 0 0 0 0 0 0 0 0 0 0 
0 0 0 
##$DATE= 1701425999
##$DBL= (0..7)
120 120 120 120 120 120 120 120 
##$DBP= (0..7)
150 150 150 150 150 150 150 150 
##$DBP07= 0
##$DBPNAM0= <>
##$DBPNAM1= <>
##$DBPNAM2= <>
##$DBPNAM3= <>
##$DBPNAM4= <>
##$DBPNAM5= <>
$$ [...]
##$SUBNAM3= <"">
##$SUBNAM4= <"">
##$SUBNAM5= <"">
##$SUBNAM6= <"">
##$SUBNAM7= <"">
##$SUBNAM8= <"">
##$SUBNAM9= <"">
##$SW= 18.0517328524113
##$SWIBOX= (0..15)
0 0 2 0 0 0 0 0 0 0 0 0 0 0 0 0 
##$SW_h= 3612.71676300578
##$TD= 16384
##$TD0= 1
##$TE= 0
##$TE2= 300
##$TE3= 300
##$TEG= 300
##$TL= (0..7)
0 120 120 120 120 120 120 120 
##$TP= (0..7)
150 150 150 150 150 150 150 150 
##$TP07= 0
##$TPNAME0= <>
##$TPNAME1= <>
##$TPNAME2= <>
##$TPNAME3= <>
##$TPNAME4= <>
##$TPNAME5= <>
##$TPNAME6= <>
##$TPNAME7= <>
##$TPOAL= (0..7)
0.5 0.5 0.5 0.5 0.5 0.5 0.5 0.5 
##$TPOFFS= (0..7)
0 0 0 0 0 0 0 0 
##$TUNHIN= 0
##$TUNHOUT= 0
##$TUNXOUT= 0
##$USERA1= <user>
##$USERA2= <user>
##$USERA3= <user>
##$USERA4= <user>
##$USERA5= <user>
##$V9= 5
##$VALIST= <valist>
##$VCLIST= <CCCCCCCCCCCCCCC>
##$VD= 0
##$VDLIST= <DDDDDDDDDDDDDDD>
##$VPLIST= <PPPPPPPPPPPPPPP>
##$VTLIST= <TTTTTTTTTTTTTTT>
##$WBST= 1024
##$WBSW= 4
##$XGAIN= (0..3)
0 0 0 0 
##$XL= 0
##$YL= 0
##$YMAX_a= 67040
##$YMIN_a= -102531
##$ZGOPTNS= <>
##$ZL1= 120
##$ZL2= 120
##$ZL3= 120
##$ZL4= 120
##$ABSF1= 15.41635
##$ABSF2= -2.635497
##$ABSG= 5
##$ABSL= 3
##$ALPHA= 0
##$AQORDER= 0
##$ASSFAC= 0
##$ASSFACI= 0
##$ASSFACX= 0
##$ASSWID= 0
##$AUNMP= <proc_1d>
##$AZFE= 0.1
##$AZFW= 0.1
##$BCFW= 0
##$BC_mod= 2
##$BYTORDP= 0
##$COROFFS= 0
##$CY= -3
##$DATMOD= 1
##$DC= 0
##$DFILT= <>
##$DTYPP= 0
##$F1P= 0
##$F2P= 0
##$FCOR= 1
##$FTSIZE= 16384
##$FT_mod= 6
##$GAMMA= 0
##$GB= 0
##$INTBC= 1
##$INTSCL= 3.70164e-10
##$ISEN= 128
##$LB= 0.24
##$LEV0= 0
##$LPBIN= 0
##$MAXI= 10000
##$MC2= 0
##$MEAN= 0
##$ME_mod= 0
##$MI= 1.114404
##$NCOEF= 0
##$NC_proc= -9
##$NLEV= 6
##$NOISF1= 3.799351
##$NOISF2= 2.8
##$NSP= 0
##$NTH_PI= 0
##$NZP= 0
##$OFFSET= 15.47254
##$PC= 1
##$PHC0= -24595.7
##$PHC1= 18.65271
##$PH_mod= 1
##$PKNL= yes
##$PPARMOD= 0
##$PSCAL= 0
##$PSIGN= 0
##$REVERSE= no
##$SF= 200.130009839438
##$SI= 16384
##$SIGF1= 3
##$SIGF2= 2
##$SINO= 5.538805
##$SIOLD= 16384
##$SREGLST= <1H.CDCl3>
##$SSB= 0
##$STSI= 16384
##$STSR= 0
##$SW_p= 3612.71676300578
##$SYMM= 0
##$S_DEV= 0
##$TDeff= 16384
##$TDoff= 0
##$TI= <>
##$TILT= no
##$TM1= 0
##$TM2= 0
##$TOPLEV= 0
##$USERP1= <user>
##$USERP2= <user>
##$USERP3= <user>
##$USERP4= <user>
##$USERP5= <user>
##$WDW= 1
##$XDIM= 16384
##$YMAX_p= 282095726
##$YMIN_p= -2153185
$$ End of Bruker specific parameters
$$ ---------------------------------
##NTUPLES= NMR SPECTRUM
##VAR_NAME=  FREQUENCY,     SPECTRUM/REAL,   SPECTRUM/IMAG
##SYMBOL=    X,             R,               I
##VAR_TYPE=  INDEPENDENT,   DEPENDENT,       DEPENDENT
##VAR_FORM=  AFFN,          ASDF,            ASDF
##VAR_DIM=   16384,         16384,           16384
##UNITS=     HZ,            ARBITRARY UNITS, ARBITRARY UNITS
##FACTOR=    0.220516191357247, 1,           1
##FIRST=     3096.519562775, 0,              0
##LAST=      -516.197200230778, 0,           0
##MIN=       -516.197200230778, -2153185,    0
##MAX=       3096.519562775, 282095726,      0
$$ Real data points
##PAGE= N=1
##DATA TABLE= (X++(R..R)), XYDATA
$$ [...]
$$ plain form
7559 -232689 -700380 -257986 -488273 -1658293 -181285 -600233 -714098 -401633 -181594
7550 -181594 -457652 -156820 -466983 -856120 -14534 164545 -511980 130483 420823 -538493
7540 -538493 -899507 -567099 376175 201134 -538288 -706827 -160462 424582 402053 -316840
7530 -316840 8102 -532714 -628948 -1398299 -1776584 -605644 -1147692 -1118930 -771029 -441262
7520 -441262 133445 -449268 -772260 -526121 17203 -208790 -668026 -885244 -1171068 -57133
7510 -57133 -203659 229467 108109 302979 -86239 -568175 -299483 458397 448021 121436
7500 121436 -499675 -596492 -443925 -2194 -298527 432911 295651 -479640 -218155 -368497
7490 -368497 -967602 -430715 134656 -114955 -466301 -232478 16384 -335025 -238922 319427
$$ packed form
7559b32689m67691M42394k30287j170020J477008m18948j13865L12465K20039
7550a81594k76058L00832l10163l89137Q41586J79079o76525O42463K90340r59316
7540e38493l61014L32408R43274j75041p39422j68539N46365N85044k2529p18893
7530c16840L24942n40816r6234p69351l78285J170940n42048K8762L47901L29767
7520d41262N74707n82713l22992K46139N43324k25993m59236k17218k85824J113935
7510e7133j46526M33126j21358J94870l89218m81936K68692P57880j0376l26585
7500A21436o21111r6817J52567M41731k96333P31438j37260p75291K61485j50342
7490c68497n99105N36887N65371k49611l51346K33823K48862l51409R6103N58349
$$ plain form
7480 319427 -222957 -618058 -366794 -309640 -169024 -334413 -4088 141719 -80325 -51595
7470 -51595 895747 40036 -97874 -337561 -635128 -393285 -94690 578472 26882 57819
7460 57819 133302 -270755 -563094 -537471 1092686 -553996 -300621 29848 141777 -236964
7450 -236964 -192933 143024 17092 -1021442 -1166427 -36443 -311710 -411587 -346959 -255885
7440 -255885 -1067886 -1224399 -1142098 -729040 -191909 364778 16866 -431972 -424556 -66558
7430 -66558 -330975 -687473 -328176 185576 349690 25598 -525731 -331742 -219467 180835
7420 180835 835289 95751 -74847 404885 329486 -695719 -1368731 -777102 -496440 -197561
7410 -197561 227874 -839389 -341782 -425002 -146253 -418538 309422 481427 -294504 -300930
$$ packed form
7480C19427n42384l95101K51264N7154J40616j65389L30325J45807k22044K8730
7470e1595R47342q55711j37910k39687k97567K41843K98595O73162n51590L0937
7460E7819P5483m04057k92339K5623J630157j646682K53375L30469J11929l78741
7450b36964M4031L35957j25932j038534j44985J129984k75267r9877O4628R1074
7440b55885q12001j56513Q2301M13058N37131N56687l47912m48838P416L57998
7430f6558k64417l56498L59297N13752J64114l24092n51329J93989J12275M00302
7420A80835O54454p39538j70598M79732p5399j025205o73012N91629K80662K98879
7410a97561M25435j067263M97607q3220K78749k72285P27960J72005p75931o426
$$ plain form
7400 -300930 -645490 -19777 -199548 -446477 -1422158 -794937 -976981 -758215 -204523 -13124
7390 -13124 198330 415016 -153938 -914638 -187384 -562985 -446501 375869 96001 -877527
7380 -877527 -714755 62909 -332241 -1190618 -471248 -5921 -288648 185807 401864 16244
7370 16244 221336 -12364 271221 -134453 -159286 60774 -584392 291204 672081 385572
7360 385572 459779 -532587 -786467 -208856 -249002 -592077 -178128 -505090 -720632 -1114721
7350 -1114721 -934482 -1271792 -1025603 -573883 -701603 -845292 -1126515 -740538 -54796 251209
7340 251209 -998777 -780304 -737925 -910417 -423519 -404665 -894244 -502836 -226216 -995909
7330 -995909 -1228622 -1177305 -990115 -127154 106347 -449780 -110184 115 46611 389775
$$ packed form
7400c00930l44560O25713j79771k46929r75681O27221j82044K18766N53692J91399
7390a3124K11454K16686n68954p60700P27254l75601J16484Q22370k79868r73528
7380h77527J62772P77664l95150q58377P19370M65327k82727M74455K16057l85620
7370A6244K05092k33700K83585m05674k4833K20060o45166Q75596L80877k86509
7360C85572P4207r92366k53880N77611m0146l43075M13949l26962k15542l94089
7350a114721J80239l37310K46189M51720j27720j43689k81223L85977O85742L06005
7340B51209j249986K18473M2379j72492M86898J8854m89579L91408K76620p69693
7330i95909k32713N1317J87190Q62961K33501n56127L39596J10299M6496L43164
$$ plain form
7320 389775 313961 256405 -242232 91075 415877 -90928 -510669 238229 -893242 -1621071
7310 -1621071 -701615 -277672 -587264 -371917 -366337 226845 396101 -476452 -52478 185527
7300 185527 -56895 170306 4078 -701129 -715837 -87870 118857 67273 -264417 -141699
7290 -141699 461830 485360 418035 210679 214358 182729 133926 408645 172717 491234 52602
7279 52602 -280265 -534956 168486 -290705 8463 -173670 -967278 -680464 -893501 -1248782
7269 -1248782 -1128324 -867207 -588334 -260233 465384 392184 259180 853109 1083513 777644
7259 777644 49794 -18137 201315 539669 323214 108306 -364452 -564177 -330022 -70798
7249 -70798 -608783 -110476 390145 -263747 -1393609 -267247 610020 381624 580872 -177091
$$ packed form
7320C89775p5814n7556m98637L33307L24802n06805m19741P48898j131471p27829
7310a621071R19456M23943l09592K15347N580N93182J69256q72553M23974K38005
7300A85527k42422K27201j66228p05207j4708O27967K06727n1584l31690J22718
7290a41699O03529K3530o7325k07356L679l1629m8803K74719k35928L18517m38632
7279E2602l32867k54691P03442m59191K99168j82133p93608K86814k13037l55281
7269a248782J20458K61117K78873L28101P25617p3200j33004N93929K30404l05869
7259G77644p27850o7931K19452L38354k16455k14908m72758j99725K34155K59224
7249g0798n37985M98307N00621o53892j129862J126362Q77267k28396J99248p57963
$$ plain form
7239 -177091 -273017 -782421 -595564 -742068 -777566 332152 472797 118191 -315165 -867958
7229 -867958 -83288 -433029 -560603 226199 -37113 -106934 14750 -668399 -1234505 -1485262
7219 -1485262 -950269 -1122872 -784095 176369 -30041 -610520 -294729 532294 -614724
7210 -614724 -559128 -671631 -928174 -1147199 -532025 46287 27295 617322 392769 -75301
7200 -75301 269594 -302156 -808057 -1025093 -765859 -587557 151483 429387 385256 237711
7190 237711 -203097 54188 316191 38370 891201 472797 828319 -183452 -252086 56739
7180 56739 -757444 -624016 -735773 -1023971 412287 254006 -66021 -364020 -496776 -535081
7170 -535081 -164185 -30717 196228 401958 -265672 99608 427450 440568 -544103 142185
$$ packed form
7239a77091r5926n09404J86857j46504l5498J109718J40645l54606m33356n52793
7229h67958P84670l49741j27574P86802k63312o9821J21684o83149n66106k50757
7219a485262N34993j72603L38777R60464k06410n80479L15791Q27023j147018
7210f14724N5596j12503k56543k19025O15174N78312j8992N90027k24553m68070
7200g5301L44895n71750n05901k17036K59234J78302P39040K77904m4131j47545
7190B37711m40808K57285K62003k77821Q52831m18404L55522j011771o8634L08825
7180E6739q14183J33428j11757k88198J436258j58281l20027k97999j32756l8305
7170e35081L70896J33468K26945K05730o67630L65280L27842J3118r84671O86288
$$ plain form
7160 142185 1045756 421642 646882 550365 295547 348535 -239914 85617 -407554 -515836
7150 -515836 -497517 -479633 -760873 -549987 -518793 -832971 -1066484 -392757 -472049 -457392 -283222
7139 -283222 78099 118882 -179747 427130 98626 63713 -310456 -339078 229370 99678
7129 99678 -186002 -677954 18754 287077 550420 -144121 210069 50847 -480670 -364562
7119 -364562 -699290 136605 370909 -98660 333304 -360259 -344145 -73425 -1154987 -635362
7109 -635362 -739416 -335287 253395 694388 818068 321051 557363 119598 -35055 593052
7099 593052 446439 70643 -572857 -379913 -19481 -242789 411051 431428 85573 -856576
7089 -856576 -423644 482430 255501 -84428 356461 -484846 69751 1124788 -124711
$$ packed form
7160A42185R03571o24114K25240r6517k54818N2988n88449L25531m93171j08282
7150e15836J8319J7884k81240K10886L1194l14178k33513O73727p9292J4657J74170
7139b83222L61321M0783k98629O06877l28504l4913l74169k8622N68448j29692
7129I9678k85680m91952O96708K68323K63343o94541L54190j59222n31517J16108
7119c64562l34728Q35895K34304m69569M31964o93563J6114K70720j081562N19625
7109f35362j04054M04129N88682M40993J23680m97017K36312m37765j54653O28107
7099E93052j46613l75796o43500J92944L60432k23308O53840K0377l45855r42149
7089h56576M32932R06074k26929l39929M40889q41307N54597J055037j249499
$$ plain form
7080 -124711 -424067 -1152023 -871350 -521489 -992568 -933591 -666236 -406414 -1387683 -995591
7070 -995591 -69463 794310 585870 155520 -165261 398484 513745 374294 -389839 -658682
7060 -658682 -338859 -285727 32339 120342 -71935 -28628 401057 679099 518008 -273834
7050 -273834 -1161058 -1757662 -1042744 -873177 -677314 106312 -367805 10497 285060 223228
7040 223228 547076 73633 -772131 -979030 -714426 125762 494714 28232 48514 462871
7030 462871 314264 520299 63415 -143043 467108 -147734 59654 5877 -650771 -175971
7020 -175971 -231895 77242 140239 656785 115468 -1230430 -805565 -457021 -436711 -326877
7010 -326877 779008 -72218 -257397 -574141 60018 -213214 -203807 267216 -155612 -697586
$$ packed form
7080a24711k99356p27956K80673L49861m71079N8977K67355K59822r81269L92092
7070i95591R26128Q63773k08440m30350l20781N63745J15261j39451p64133k68843
7060f58682L19823N3132L18066Q8003j92277M3307M29685K78042j61091p91842
7050b73834q87224n96604P14918J69567J95863P83626m74117L78302K74563o1832
7040B23228L23848m73443q45764k06899K64604Q40188L68952m66482K0282M14357
7030D62871j48607K06035m56884k06458O10151o14842K07388n3777o56648M74800
7020a75971n5924L09137O2997N16546n41317j345898M24865L48544K0310J09834
7010c26877J105885q51226j85179l16744O34159k73232R407M71023m22828n41974
$$ plain form
7000 -697586 -65706 -410681 -62513 -474686 -558379 -641047 -650013 375596 -38367 3231
6990 3231 -80178 -752081 -728276 395002 411321 -64658 207830 -76560 430151 90859
6980 90859 -248354 -194341 -958749 -778519 -360442 -728559 -988312 -182749 -359758 -617639
6970 -617639 640158 245084 43540 -696591 -1008098 -593799 308246 83543 -236793 603711
6960 603711 -124931 417639 357887 197259 -185512 -545823 -1131838 -1019716 -99648 -543494
6950 -543494 -723411 -1227610 -815560 -598016 -713333 -417572 -684320 -1327263 -933372 -632785
6940 -632785 -223070 39003 -28517 -201989 -334213 -470202 -605513 -330621 41325 -348138
6930 -348138 233114 285683 -147087 353921 -113683 -1554 145116 286630 -889807 -208868
$$ packed form
7000f97586O31880l44975L48168m12173q3693q2668q966J025609m13963M1598
6990C231q3409o71903K3805J123278J6319m75979K72488k84390N06711l39292
6980I0859l39213N4013p64408J80230M18077l68117k59753Q05563j77009k57881
6970f17639J257797l95074k01544p40131l11507M14299R02045k24703l20336Q40504
6960F03711p28642N42570n9752j60628l82771l60311n86015J12122R20068m43846
6950e43494j79917n04199M12050K17544j15317K95761k66748o42943L93891L00587
6940f32785M09715K62073o7520j73472j32224j35989j35311K74892L71946l89463
6930c48138N81252N2569m32770N01008m67604J12129J46670J41514j176437O80939
$$ plain form
6920 -208868 22693 3781 111594 517783 219007 -19730 245395 265978 -8603 -370800
6910 -370800 94263 239386 491334 360658 938986 261067 -765529 -882633 -1109641 -598192
6900 -598192 -349277 49289 -31833 236067 476836 -657437 -595477 124289 -207628 133751
6890 133751 -281087 -121518 -32343 270325 98054 197757 489192 679009 457381 -40705
6880 -40705 -405340 86575 -30850 -619251 -672960 -709334 -897848 -791296 428599 119355
6870 119355 -749144 175229 896655 -86312 -467809 -524720 -275218 331705 -338405 535796
6860 535796 1160460 978249 922970 534855 -231120 -351482 -584600 -536059 858402 639749
6850 639749 -92787 -67498 -142363 -230981 -269019 684632 310992 -174345 -190344 81537 -373852
$$ packed form
6920b08868K31561j8912J07813M06189k98776k38737K65125K0583k74581l62197
6910c70800M65063J45123K51948j30676N78328o77919j026596j17104k27008N11449
6900e98192K48915L98566q1122K67900K40769j134273O1960P19766l31917L41379
6890A33751m14838J59569Q9175L02668j72271R9703K91435J89817k21628m98086
6880d0705l64635M91915j17425n88401n3709l6374j88514J06552J219895l09244
6870A19355q68499R24373P21426r82967l81497n6911K49502O06923o70110Q74201
6860E35796O24664j82211n5279l88115p65975j20362k33118M8541J394461k18653
6850F39749p32536K5289p4865q8618l8038R53651l73640m85337j5999K71881m55389
$$ plain form
6839 -373852 -925565 -605960 -575607 -551371 -609215 -654457 -401672 -928579 -1410383 154111
6829 154111 313968 -279756 107903 959547 982895 1388804 578294 297297 389445 393028
6819 393028 527094 177997 296614 -356625 -589022 -292601 168626 579604 326242 10912
6809 10912 739724 1007415 324195 198226 478515 546143 -206281 -197639 119386 342112
6799 342112 -125181 266466 824102 291446 602352 1255571 616178 47492 471120 878191
6789 878191 593349 -104268 19734 550290 941492 1074957 -554535 557474 502845 738111
6779 738111 405261 810853 330874 497667 1323535 1529011 1883349 1689946 1685388 1352640
6769 1352640 2270470 1473769 1469771 1355412 1413779 1340431 1465731 1606457 504613 833893
$$ packed form
6839c73852n51713L19605L0353K4236n7844m5242K52785n26907m81804J564494
6829A54111J59857n93724L87659Q51644K3348M05909q10510k80997R2148L583
6819C93028J34066l49097J18617o53239k32397K96421M61227M10978k53362l15330
6809A0912P28812K67691o83220j25969K80289O7628p52424Q642L17025K22726
6799C42112m67293L91647N57636n32656L10906O53219o39393n68686M23628M07071
6789H78191k84842o97617J24002N30556L91202J33465j629492J112009n4629K35266
6779G38111l32850M05592m79979J66793Q25868K05476L54338j93403m558l32748
6769A352640R17830p96701l998j14359N8367p3348J25300J40726j101844L29280
$$ plain form
6759 833893 951477 1447670 1230981 1247752 519021 28641 446047 398062 338971 -211277
6749 -211277 19155 521322 1110340 1064455 652093 635715 542635 243879 850195 1328162
6739 1328162 2295885 1702777 530821 352360 66121 -424022 500780 1390396 1423685 1013479
6729 1013479 363217 -61794 395006 35276 -157814 13 -59528 -162182 -819751 -606081
6719 -606081 49547 -335228 -796639 -337516 122684 643057 1029637 797639 990656 626887
6709 626887 347326 332504 326562 289605 406957 665685 -434094 -162044 387983 1038287
6699 1038287 1005766 242158 -829008 -593343 128988 -328279 -122772 -271810 9536 988745
6689 988745 707282 696947 880000 1193987 1009647 57815 -22640 186079 536758 539215
$$ packed form
6759H33893J17584M96193k16689J6771p28731m90380M17406m7985n9091n50248
6749b11277K30432N02167N89018m5885m12362j6378r3080k98756O06316M77967
6739A328162R67723n93108j171956j78461k86239m90143R24802Q89616L3289m10206
6729A013479o50262m25011M56800l59730j93090J57827n9541j02654o57569K13670
6719f06081O55628l84775m61411M59123M60200N20373L86580k31998J93017l63769
6709F26887k79561j4822n942l6957J17352K58728j099779K72050N50027O50304
6699A038287l2521p63608j071166K35665P22331m57267K05507j49038K81346R79209
6689I88745k81463j0335J83053L13987j84340r51832q0455K08719L50679K457
$$ plain form
6679 539215 758170 901626 700694 14126 717722 1259565 1253072 709431 719372 1477560
6669 1477560 842905 348916 1335014 562668 906725 1501647 711007 689751 290231 -317887
6659 -317887 616974 606685 1281495 214594 -324786 -99145 393063 98339 -478330 -622995
6649 -622995 -61477 101715 298047 339370 -195801 469805 -99155 1425342 1341931 920750
6639 920750 489734 472079 716123 743956 598779 -36004 -390516 -809519 -1146730 -1567058
6629 -1567058 -1037686 -339403 398671 139381 181398 450956 183173 751491 671389 -12093
6619 -12093 238483 447415 396937 60115 652318 267949 -325877 703731 1114233 1386889
6609 1386889 1071166 1363099 869996 930528 841069 -191820 -471530 45015 -52884 589138
$$ packed form
6679E39215K18955J43456k00932o86568P03596N41843o493n43641R941P58188
6669A477560o34655m93989R86098p72346L44057N94922p90640k1256l99520o08118
6659c17887R34861j0289O74810j066901n39380K25641M92208k94724n76669j44665
6649f22995N61518J63192J96332M1323n35171O65606n68960J524497q3411m21181
6639I20750m31016j7655K44044K7833j45177o34783l54512m19003l37211m20328
6629a567058N29372O98283P38074k59290M2017K69558k67783N68318q0102o83482
6619a2093K50576K08932n0478l36822N92203l84369n93826J029608M10502K72656
6609A386889l15723K91933m93103O0532q9459j032889k79710N16545r7899O42022
$$ plain form
6599 589138 992924 1017017 1081496 382760 1206683 1535102 1453111 1255559 900721 871110
6589 871110 407720 300113 356914 894361 902230 199400 1492395 2422128 1782547 1011913
6579 1011913 519492 397143 252230 729056 377888 682684 600195 751457 997948 1250842
6569 1250842 1431911 867172 1550414 1703235 915691 884628 288728 954737 516879 781739
6559 781739 609619 257272 797290 1045136 1359391 1354336 505987 396870 1040788 750816
6549 750816 869087 1449095 2023009 1962111 893829 1683015 1582331 1468822 887993 1370071
6539 1370071 1617748 790013 380566 881561 273916 525673 575579 -306553 -383182 -386732
6529 -386732 -54283 260698 1429515 891529 805789 1027937 1521435 1657285 1451896 753270
$$ packed form
6599E89138M03786K4093O4479o98736Q23923L28419q1991j97552l54838k9611
6589H71110m63390j07607N6801N37447P869p02830J292995R29733o39581p70634
6579A011913m92421j22349j44913M76826l51168L04796q2489J51262K46491K52894
6569A250842J81069n64739O83242J52821p87544l1063n95900O66009m37858K64860
6559G81739j72120l52347N40018K47846L14255n055q48349j09117O43918k89972
6549G50816J18271N80008N73914o0898j068282P89186j00684j13509n80829M82078
6539A370071K47677q27735m09447N00995o07645K51757M9906q82132p6629l550
6529c86732L32449L14981J168817n37986q5740K22148M93498J35850k05389o98626
$$ plain form
6519 753270 993446 1525888 1264742 1152161 797591 895765 1436734 1357149 1174582 1266794
6509 1266794 496160 621441 338588 442648 2219210 1066765 1122436 376749 43649
6500 43649 804651 1236850 1172625 727626 51994 1003945 366601 436436 120130 475106
6490 475106 625257 856624 1289810 1407995 785718 1563876 1593846 1733123 2389063 2182241
6480 2182241 1226732 1225678 1516822 2252932 2252586 1789014 1312245 678512 967174 1015829 2235630
6469 2235630 2626269 2057012 1401912 1008131 1306451 2385579 1888140 1781810 2038215
6460 2038215 1524870 1437006 2370741 1965047 1220009 759045 1325721 1422757 941485 1024924
6450 1024924 929081 882032 955024 1841164 1641409 1238216 1538384 1749487 1885753 397800
$$ packed form
6519G53270K40176N32442k61146j12581l54570R8174N40969p9585j82567R2212
6509A266794p70634J25281k82853J04060J776562j152445N5671p45687l33100
6500D3649P61002M32199o4225m44999o75632R51951o37344O9835l16306L54976
6490D75106J50151K31367M33186J18185o22277P78158K9970J39277O55940k06822
6480B182241r55509j054K91144P36110l46m63572m76769o33733K88662M8655J219801
6469B235630L90639n69257o55100l93781K98320J079128m97439j06330K56405
6460B038215n13345q7864R33735m05694p45038m60964N66676R7036m81272Q3439
6450A024924r5843m7049P2992Q86140j99755m03193L00168K11103J36266j487953
$$ plain form
6440 397800 928395 1518616 2308609 2223762 2164544 1077941 1105510 1882556 1584882 1576034
6430 1576034 1520262 1761610 1435343 1603530 1620625 1263816 752930 1549010 2515785 1942758
6420 1942758 1934732 1695110 2208214 1857457 1628462 2077787 2264690 2300768 2094132 2314156
6410 2314156 2418207 1482512 2832696 2698899 1825399 1923543 1520951 1695769 1632850 2234796
6400 2234796 2081004 2373890 2728751 2651959 3286052 3113995 2052939 2865935 3314906 3020296
6390 3020296 2597383 1735034 1626215 947546 533771 1669153 1919570 2044807 2507804
6381 2507804 2905589 1996027 2631777 3082855 2308122 2732240 2733309 2702711 2746291 3577042
6371 3577042 3509833 3020180 2905365 3576752 2629416 2426286 3619339 2921357 2343748 3996561
$$ packed form
6440C97800N30595N90221P89993q4847n9218j086603K7569P77046k97674q848
6430A576034n5772K41348l26267J68187J7095l56809n10886P96080R66775n73027
6420A942758q026k39622N13104l50757k28995M49325J86903L6078k06636K20024
6410B314156J04051r35695J350184j33797q73500R8144m02592J74818o2919O01946
6400B234796j53792K92886L54861p6792O34093j72057j061056Q12996M48971k94610
6390C020296m22913q62349j08819o78669m13775J135382K50417J25237M62997
6381B507804L97785r09562O35750M51078p74733M24118J069l0598M3580Q30751
6371C577042o7209m89653j14815O71387r47336k03130J193053o97982n77609J652813
$$ plain form
6361 3996561 4514718 3848030 3690901 3691634 3946853 3955421 4153245 4097660 4077981 4507926 4707903
6350 4707903 4055755 4304686 4925490 4349867 4010451 4342492 4872518 5106208 4570504 4825533
6340 4825533 5356682 5635423 5612958 5965300 6267337 6546025 6885431 6935452 7172113 7478469
6330 7478469 7259330 7637722 7999782 7896316 8280299 8815220 8354769 8380794 9475728 9954864
6320 9954864 9208681 9994459 10060648 9491639 10223557 10217733 10596521 10497442 11281790 12524407
6310 12524407 12884811 13470241 13544638 13640343 13114995 13689480 14166540 14211329 14786457 14385939
6300 14385939 14310605 14975506 15448471 15896574 16704679 17322361 17362434 17831079 16928073 17779675
6290 17779675 18219307 18048585 17910279 18080955 17659580 16993170 17234813 17347496 17164645
$$ packed form
6361C996561N18157o66688j57129P33K55219Q568J97824n5585j9679M29945J99977
6350D707903o52148K48931O20804n75623l39416L32041N30026K33690n35704K55029
6340D825533N31149K78741k2465L52342L02037K78688L39406N0021K36661L06356
6330G478469k19139L78392L62060j03466L83983N34921m60451K6025J094934M79136
6320I954864p46183P85778O6189n69009P31918n824L78788r9079P84348J242617
6310A2524407L60404N85430P4397R5705n25348N74485M77060M4789N75128m00518
6300A4385939p5334O64901M72965M48103Q08105O17682M0073M68645r03006Q51602
6290A7779675M39632j70722j38306J70676m21375o66410K41643J12683j82851
$$ plain form
6281 17164645 17126284 18272214 18661332 18251194 17741240 18990121 20136354 20756366 20814542
6272 20814542 21128761 22325378 22320924 21698824 21922300 21837612 21965703 22191492 22639340 22885102
6262 22885102 22417741 21872238 22161516 22519106 22512202 21688638 21367562 21948349 21588103 21026408
6252 21026408 20584215 20257227 20557821 20558251 20046672 20444483 21839576 22170052 21548486 21937811
6242 21937811 21881879 22429561 23107300 22860572 24497800 25256474 25622924 25427137 24797076
6233 24797076 23595001 23563109 21959128 21828997 22393237 21891830 20904424 20046134 20036694 19683449
6223 19683449 19492290 19662110 19342833 19453676 19934697 19037327 17892061 17114713 16727840
6214 16727840 16450128 16186114 15324917 14963735 15412325 14357412 13629058 14604354 15012285
$$ packed form
6281A7164645l8361J145930L89118m10138n09954J248881J146233O20012N8176
6272B0814542L14219J196617m454o22100K23476q4688J28091K25789M47848K45762
6262B2885102m67361n45503K89278L57590o904q23564l21076N80787l60246n61695
6252B1026408m42193l26988L00594M30n11579L97811J395093L30476o21566L89325
6242B1937811n5932N47682O77739k46728J637228P58674L66450j95787o30061
6233B4797076j202075l1892j603981j30131N64240n01407r87406q58290r440l53245
6223A9683449j91159J69820l19277J10843M81021q97370j145266p77348l86873
6214A6727840k77712k64014q61197l61182M48590j054913p28354R75296M07931
$$ plain form
6205 15012285 14896831 14299365 13384852 12592280 12917009 12250271 12367453 11189989 11856547
6196 11856547 11563469 10715966 10600097 10670471 11344210 10670430 10172934 10065686 10238325 10338531
6186 10338531 10791900 9975502 9612874 9832048 10370889 10738480 10836030 11275249 10941643 10648287
6176 10648287 10048286 10480495 10063752 10593835 10928901 9949143 10402327 11164700 11897002
6167 11897002 11837784 12209575 12246227 11785067 10960168 11045924 11525506 11949250 12975497 13390135
6157 13390135 13086907 13409414 13304560 14530550 14997430 15159211 14377015 14343929 15180726
6148 15180726 14939912 14276503 14411871 15433167 14166915 14558715 15147185 15478826 15506544
6139 15506544 15954175 16244976 16773947 17291026 17295516 17256506 17942184 18693065 18501665 18634362
$$ packed form
6205A5012285j15454n97466r14513p92572L24729o66738J17182j177464O66558
6196A1856547k93078q47503j15869P0374O73739o73780m97496j07248J72639J00206
6186A0338531M53369q16398l62628K19174N38841L67591R7550M39219l33606k93356
6176A0648287o00001M32209m16743N30083L35066r79758M53184P62373P32302
6167A1897002n9218L71791L6652m61160q24899Q5756M79582M23744J026247M14638
6157A3390135l03228L22507j04854J225990M66880J61781p82196l3086Q36797
6148A5180726k40814o63409J35368J021296j266252L91800N88470L31641K7718
6139A5506544M47631K90801N28971N17079M490l9010O85678P50881j91400J32697
$$ plain form
6129 18634362 19522122 20305439 20801093 20779852 20624953 21624981 21638303 20632420 21571932
6120 21571932 21671206 22902552 24089091 24286281 25331596 26563258 26853516 28080201 29125778
6111 29125778 30261731 30985453 31666390 31189934 31232548 32567003 32516140 33193486 34273853
6102 34273853 35463336 36610250 38506659 39578098 41479038 42972598 44529903 44560186
6094 44560186 44271149 42959498 40304268 38253379 36806203 35300293 35550049 35174037 34946501
6085 34946501 35102308 35431048 36051320 37202878 38104906 38266702 39172661 39377427 39213378
6076 39213378 40086486 41029855 42210488 43896616 45470487 45724057 46055290 46570593 46525632
6067 46525632 45654794 45961924 45235859 45019749 46308636 46068497 46176460 45856139 45988035
$$ packed form
6129A8634362Q87760P83317M95654k1241j54899J000028J3322j005883R39512
6120B1571932R9274J231346J186539J97190J045315J231662K90258J226685J045577
6111B9125778J135953P23722O80937m76456M2614J334455n0863O77346J080367
6102C4273853J189483J146914J896409J071439J900940J493560J557305L0283
6094D4560186k89037j311651k655230k050889j447176j505910K49756l76012k27536
6085C4946501J55807L28740O20272J151558R02028J61796R05959K04766j64049
6076C9213378Q73108R43369J180633J686128J573871K53570L31233N15303m4961
6067D6525632q70838L07130p26065k16110J288887k40139J07963l20321J31896
$$ plain form
6058 45988035 45575694 46212109 46273531 45989394 46221261 46914630 47904893 48623088 49862762
6049 49862762 50780504 52059766 53754247 54983811 57323297 60197051 63490833 65961702
6041 65961702 67391949 69365354 70946626 72602578 73671443 75940578 79909021 83583716
6033 83583716 89399606 96079823 101651225 106653762 109229567 108837757 104562320 98823735
6025 98823735 92891079 86899948 82458630 78776482 76211712 73775919 71784979 70510184
6017 70510184 70064135 70791725 71562002 72025723 73916768 74822307 75801833 77748607 80705557
6008 80705557 83506925 85727035 90013289 94963185 100916746 107566359 115531938 124615932
6000 124615932 134362321 144918434 154395028 161093562 162805325 158944820 149792846 139646332
$$ packed form
6058D5988035m12341O36415O1422k84137K31867O93369R90263P18195J239674
6049D9862762R17742J279262J694481J229564K339486K873754L293782K470869
6041F5961702J430247J973405J581272J655952J068865K269135L968443L674695
6033H3583716N815890O680217N571402N002537K575805l91810m275437n738585
6025I8823735n932656n991131m441318l682148k564770k435793j990940j274795
6017G0510184m46049P27590P70277M63721J891045R05539R79526J946774K956950
6008H0705557K801368K220110M286254M949896N953561O649613P965579R083994
6000A24615932R746389J0556113R476594O698534J711763l860505r151974j0146514
$$ plain form
5992 139646332 129419814 119505069 112035994 105121261 100286741 96818874 94304795 92792184
5984 92792184 91765122 91385882 92362491 94226114 95915967 99164372 102548547 105549223
5976 105549223 108041183 109353586 108889811 107180727 103079985 99097696 93440694 87452873
5968 87452873 82551042 78619103 74454971 71573758 70220483 67933783 66744077 64490399
5960 64490399 61926670 60005510 57090657 53919701 51838246 49549515 47617121 46174578
5952 46174578 45935268 45126655 44459407 43166362 41971831 40948845 40813327 40237245 40788498
5943 40788498 40456427 39228939 39295861 39558132 39651610 39560747 40755323 41202370 42439378
5934 42439378 43643247 44917633 46718534 48095894 48842593 48729378 48798897 47384021 45980583
$$ packed form
5992A39646332j0226518r914745p469075o914733m834520l467867k514079j512611
5984I2792184j027062l79240R76609J863623J689853L248405L384175L000676
5976A05549223K491960J312403m63775j709084m100742l982289n657002n987821
5968H7452873m901831l931939m164132k881213j353275k286700j189706k253678
5960F4490399k563729j921160k914853l170956k081455k288731j932394j442543
5952D6174578k39310q08613o67248j293045j194531j022986j35518n76082N51253
5943D0788498l32071j227488O6922K62271R3478r0863J194576M47047J237008
5934D2439378J203869J274386J800901J377360P46699j13215O9519j414876j403438
$$ plain form
5925 45980583 44303815 42918030 42390226 40926939 40220250 40491060 41374403 42596623 43887641
5916 43887641 43885968 44920958 46809641 46627839 47568065 48957221 48310572 48055620 47472869
5907 47472869 45512061 43768072 41433178 39686422 37547788 35192871 33448248 31543787
5899 31543787 29924161 27554722 26197727 25110963 25409732 25379183 24553552 24474850 23457706
5890 23457706 22468715 21578365 21338232 20375000 19555594 18803608 18395627 17857862 17403562
5881 17403562 16130886 14848751 14832369 14521656 14468843 14739339 14338086 13107185 13122634
5872 13122634 12843017 13093463 13178601 13567575 13648515 12898290 12184773 12453749 12841125 12730281
5862 12730281 12673670 14161993 14666270 14027657 14579058 14861376 14990968 14441747 13460371
$$ packed form
5925D5980583j676768j385785n27804j463287p06689K70810Q83343J222220J291018
5916D3887641j673J034990J888683j81802R40226J389156o46649k54952n82751
5907D7472869j960808j743989k334894j746756k138634k354917j744623j904461
5899C1543787j619626k369439j356995j086764K98769l0549q25631p8702j017144
5890B3457706r88991q90350k40133r63232q19406p51986m07981n37765m54300
5881A7403562j272676j282135j6382l10713n2813K70496m01253j230901J5449
5872A3122634k79617K50446Q5138L88974Q0940p50225p13517K68976L87376j10844
5862A2730281n6611J488323N04277o38613N51401K82318J29592n49221r81376
$$ plain form
5853 13460371 13227592 12707919 12591745 11949283 11613291 11290406 11106074 11569106 11875107
5844 11875107 12314147 12683692 12416159 11769784 11049613 10948205 9707402 8424887 7729818
5835 7729818 7600623 6793968 7342653 7125576 6395135 6796607 6380213 6298309 5719391 7066866
5825 7066866 6681548 5471118 6358800 6033444 5536350 5073379 5505924 5709287 5285525
5816 5285525 5819900 5723129 6157925 5550819 5183937 4842987 4904228 4634195 4692195 5401995
5806 5401995 5262133 4660620 5177603 5214651 5336600 4433108 4992969 5060785 5067420 4636507
5796 4636507 4433297 5107210 5886001 5897118 5140213 4752809 5352480 5587659 5295183 4632264
5786 4632264 5981950 6049550 5792705 5753466 5598986 6405175 6371512 6962777 6292642 5186465
$$ packed form
5853A3460371k32779n19673j16174o42462l35992l22885j84332M63032L06001
5844A1875107M39040L69545k67533o46375p20171j01408j240803j282515o95069
5835G729818j29195q06655N48685k17077p30441M01472m16394q1904n78918J347475
5825G066866l85318j210430Q87682l25356m97094m62971M32545K03363m23762
5816E285525N34375r6771M34796o07106l66882l40950O1241k70033N8000P09800
5806E401995j39862o01513N16983L7048J21949r03492N59861O7816O635m30913
5796D636507k03210O73913P78791J1117p56905l87404N99671K35179k92476o62919
5786D632264J349686O7600k56845l9239j54480Q06189l3663N91265o70135j106177
$$ plain form
5776 5186465 6016098 6454331 6109638 6189474 6217383 5129667 5136983 6101930 5710759 4717474
5766 4717474 4618017 5048649 4407947 3929582 3758489 3845549 3508326 3889998 4145903 4687942
5756 4687942 4383364 4583195 4324813 3568262 3576771 4500491 4510695 4668026 5088231 5504317
5746 5504317 5201422 4980492 5197187 5754939 5568679 5749690 5894287 5325414 5248257 5577568
5736 5577568 5765751 5940887 5911335 6004731 5843160 6898151 6068440 5754594 5824466 5345761
5726 5345761 5413618 6225630 6239277 5515418 5665924 6557205 5657244 6035087 6155133 6038639
5716 6038639 6005845 5500701 4654601 5171394 5267002 4741127 4581392 4657016 5945640 6012405
5706 6012405 5379655 5284756 5127450 4503733 4824175 5094839 5709209 5142107 6148141 5824254
$$ packed form
5776E186465Q29633M38233l44693P9836K7909j087716P316R64947l91171r93285
5766D717474r9457M30632o40702m78365j71093Q7060l37223L81672K55905N42039
5756D687942l04578J99831k58382p56551Q509R23720J0204J57331M20205M16086
5746E504317l02895k20930K16695N57752j86260J81011J44597n68873p7157L29311
5736E577568J88183J75136k9552R3396j61571J054991q29711l13846O9872m78705
5726E345761O7857Q12012J3647p23859J50506Q91281q99961L77843J20046j16494
5716F038639l2794n05144q46100N16793R5608n25875j59735P5624J288624O6765
5706F012405o32750r4899j57306o23717L20442K70664O14370n67102J006034l23887
$$ plain form
5696 5824254 5982304 6531674 6667972 5784128 5335064 4651920 5609569 6283908 5388849 5340861
5686 5340861 5155801 5696935 5457857 5038832 4867146 5227419 5357043 5615085 6338717 5865024
5676 5865024 5068021 5097692 4619571 4542113 5690659 5765670 5948470 5957021 5976736 5703620
5666 5703620 6320067 5670548 5298365 5688501 5365945 5463100 4960800 5041720 5381107 4582031
5656 4582031 5090913 5708587 5488186 5028427 5186414 4744416 5271881 5477028 4958436 4624688
5646 4624688 4848067 5552781 5485926 5813371 4778226 4823979 4935403 5770965 6924839 6438016
5636 6438016 6341605 6961130 6743744 6983737 8057132 8088109 7433385 7194436 7756103 7631755
5626 7631755 6751260 6476591 6443521 6627447 6430635 6236039 5435806 5675225 6648991 7062465
$$ packed form
5696E824254J58050N49370J36298q83844m49064o83144R57649O74339q95059m7988
5686E340861j85060N41134k39078m19025j71686L60273J29624K58042P23632m73693
5676E865024p97003K9671m78121p7458J148546P5011J82800Q551J9715k73116
5666E703620O16447o49519l72183L90136l22556R7155n02300Q0920L39387p99076
5656D582031N08882O17674k20401m59759J57987m41998N27465K05147n18592l33748
5646D624688K23379P04714o6855L27445j035145M5753J11424Q35562J153874m86823
5636F438016r6411O19525k17386K39993J073395L0977o54724k38949N61667j24348
5626G631755q80495k74669l3070J83926j96812j94596q00233K39419R73766M13474
$$ plain form
5616 7062465 7757253 6739089 7295001 7548612 7782360 8428359 8552735 9014926 9704775
5607 9704775 9660328 9916639 9899770 9423736 9532773 9202909 9202698 8181692 7705510 7639836
5597 7639836 8168366 8657601 9065113 9325552 8493302 8019541 7690357 7584260 7969396 7245960
5587 7245960 7192239 7382766 7265958 6787480 6628847 6521473 5708554 5930745 6244112 6323744
5577 6323744 6454503 6665231 6749829 6776570 6882598 6351050 6877087 6696076 6813695 6363897
5567 6363897 6347865 6330145 6100165 6414963 7291637 8063424 8600385 8601960 8509000 8185009
5557 8185009 7578458 7209810 7239844 7361175 7029303 6477395 6173234 6262991 5601324 4838926
5547 4838926 5571299 5999030 5266796 5371207 5155740 5027340 4948832 4962297 4722275 4189873
$$ packed form
5616G062465O94788j018164N55912K53611K33748O45999J24376M62191O89849
5607I704775m4447K56311j6869m76034J09037l29864k11j021006m76182o5674
5597G639836N28530M89235M07512K60439q32250m73761l29184j06097L85136p23436
5587G245960n3721J90527j16808m78478j58633j07374q12919K22191L13367P9632
5577F323744J30759K10728Q4598K6741J06028n31548N26037j81011J17619m49798
5567F363897j6032j7720k29980L14798Q76674P71787N36961J575r2960l23991
5557H185009o06551l68648L0034J21331l31872n51908l04161Q9757o61667p62398
5547D838926P32373M27731p32234J04411k15467j28400p8508J3465k40022n32402
$$ plain form
5537 4189873 4346676 4473475 4549825 4577009 4367807 4868682 4533238 4536431 3847828 4347254
5527 4347254 5121843 5350443 4224320 3833597 3810983 4084661 5099426 4685092 4711522 5100157
5517 5100157 4585039 4288949 3945215 3865076 4176037 4344209 4852946 5094212 5825780 6162732
5507 6162732 6382755 5727597 5603769 6008743 6160421 7055654 7154552 6423849 6282654 6794948
5497 6794948 7871526 8179952 8470603 7517186 6641570 6840402 7488679 7554482 6913521 7157291
5487 7157291 6450197 6695852 6743150 6565172 6918331 6629012 5960701 5611179 5033049 5134612
5477 5134612 4966049 5382078 5493271 5135938 5517348 5797549 6595402 6176044 5698739 5141987
5467 5141987 6183860 5856082 5147363 4878541 4823684 4931305 5463966 6259764 5807158 5711996
$$ packed form
5537D189873J56803J26799P6350K7184k09202N00875l35444L193o88603M99426
5527D347254P74589K28600j126123l90723k2614K73678J014765m14334K6430L88635
5517E100157n15118k96090l43734q0139L10961J68172N08737K41266P31568L36952
5507F162732K20023o55158j23828M04974J51678Q95233R8898p30703j41195N12294
5497F794948J076578L08426K90651r53417q75616J98832O48277O5803o40961K43770
5487G157291p07094K45655M7298j77978L53159k89319o68311l49522n78130J01563
5477E134612j68563M16029J11193l57333L81410K80201P97853m19358m77305n56752
5467E141987J041873l27778p08719k68822n4857J07621N32661P95798m52606r5162
$$ plain form
5457 5711996 6131248 6020668 5802961 6564487 6444709 5935209 5879205 5928965 5304320 5332688
5447 5332688 5606615 4724421 4505011 5415180 5441228 5701673 5263714 5377313 5767980 5240233
5437 5240233 5177410 5271994 5401367 6353332 6529619 5613615 5381279 5182430 5455738 5720057
5427 5720057 5193551 5112679 5581236 5115291 4430961 4273083 5073087 4650452 4787785 4054991
5417 4054991 3983833 4766254 5294092 5929670 5327869 4679326 5567199 5804455 6008091 4612005
5407 4612005 4859143 5087091 4096625 5410250 6125130 5708177 5469242 5293601 4343410
5398 4343410 4341469 3892021 4414750 4184120 4098913 4078894 4291225 3644102 3732084 4669526
5388 4669526 4564550 4907176 4836272 4341875 4042166 4556233 5195611 4338144 4037906 4736085
$$ packed form
5457E711996M19252j10580k17707P61526j19778n09500n6004M9760o24645K8368
5447E332688K73927q82194k19410R10169K6048K60445m37959J13599L90667n27747
5437E240233o2823R4584J29373R51965J76287r16004k32336j98849K73308K64319
5427E720057n26506q0872M68557m65945o84330j57878Q00004m22635J37333p32794
5417D054991p1158P82421N27838O35578o01801o48543Q87873K37256K03636j396086
5407D612005K47138K27948r90466J313625P14880m16953k38935j75641r50191
5398D343410j941m49448N22729k30630q5207k0019K12331o47123Q7982R37442
5388D669526j04976L42626p0904m94397k99709N14067O39378q57467l00238O98179
$$ plain form
5378 4736085 4834948 4721861 5758645 4865187 4793526 4538901 3681844 3707510 3797114 4008318
5368 4008318 4467385 3882157 3827299 3646936 4076748 3769531 3518728 3735695 3816161 3714621
5358 3714621 3669884 4019991 4146297 5084659 5291201 5600337 5040941 5548789 5427146 5633118
5348 5633118 5129023 4881154 4981538 5451086 4966850 4545123 4038529 4327811 4962379 4081724
5338 4081724 4347597 4598950 5070289 4980163 4238394 4490809 5230125 4338365 4079052 4153517
5328 4153517 4253999 4623651 4863463 5679546 6095750 5767332 4826422 4926318 5742612 5449981
5318 5449981 4901679 5069150 4419459 4172962 4720116 4675095 4299247 3851689 3395053 3408174
5308 3408174 3285605 4021003 3689780 3402952 3656828 3144973 3407765 2917359 2345077 3179341
$$ packed form
5378D736085R8863j13087J036784q93458p1661k54625q57057K5666Q9604K11204
5368D008318M59067n85228n4858j80363M29812l07217k50803K16967Q0466j01540
5358C714621m4737L50107J26306R38362K06542L09136n59396N07848j21643K05972
5348E633118n04095k47869J00384M69548m84236m21727n06594K89282O34568q80655
5338D081724K65873K51353M71339r0126p41769K52415P39316q91760k59313P4465
5328D153517J00482L69652K39812Q16083M16204l28418r40910R9896Q16294k92631
5318E449981n48302J67471o49691k46497N47154m5021l75848m47558m56636J3121
5308C408174j22569P35398l31223k86828K53876n11855K62792m90406n72282Q34264
$$ plain form
5298 3179341 3924807 4226018 4048713 3774773 2624516 3325830 4113614 4216019 4113379
5289 4113379 3618987 3140997 2918969 3730031 3670310 3837390 3481365 4587424 4643308 3127498
5279 3127498 3421382 4085006 4787563 4386301 4074989 4308733 4626418 5065404 5698853 5844985
5269 5844985 5579526 4949946 4311868 4528551 4210755 5349065 5370358 5336786 5893469 5689641
5259 5689641 5297238 5849870 6263999 6349162 6708158 6250351 6399612 6452142 6577775 6347979
5249 6347979 6212334 6293113 6282422 6435079 7193377 7792148 7330897 7299956 7274238 6980229
5239 6980229 7179445 7310720 7275915 7030913 7315688 7559971 7932388 7386460 6217371 6097707
5229 6097707 6203559 5400794 5355105 6241214 6065184 6890047 7163877 6868475 6114785 6495378
$$ packed form
5298C179341P45466L01211j77305k73940j150257P01314P87784J02405j02640
5289D113379m94392m77990k22028Q11062n9721J67080l56025J106059N5884j515810
5279C127498K93884O63624P02557m01262l11312K33744L17685M38986O33449J46132
5269E844985k65459o29580o38078K16683l17796J138310K1293l3572N56683k03828
5259E689641l92403N52632M14129Q5163L58996m57807J49261N2530J25633k29796
5249F347979j35645Q0779j0691J52657P58298N98771m61251l0941k5718k94009
5239F980229J99216J31275l4805k45002K84775K44283L72417n45928j169089j19664
5229F097707J05852q02765m5689Q86109j76030Q24863K73830k95402p53690L80593
$$ plain form
5219 6495378 7179092 6174410 5718114 6097994 6037135 5639728 6137084 6033218 5093733 4895977
5209 4895977 5271592 4957809 4501671 4118232 4550677 5076516 5777074 6268811 5818378 5485066
5199 5485066 5347012 4779434 4110289 4335593 5065903 5379088 4922512 4884300 4843736 4885117
5189 4885117 4352309 4145283 4541000 4308375 5290647 4794770 3369549 3353369 3875404 4839461
5179 4839461 4506403 3953824 3848852 3722480 4103825 4650096 3970444 4022991 4173849 3728624
5169 3728624 3586378 3684788 4061532 3596684 4130508 3326169 3423310 4182713 4180757 4712010
5159 4712010 4313297 4185182 3637198 3854216 4157724 3719143 3594162 4212391 5068600 5125788
5149 5125788 4553438 4419401 4766497 4829714 3776149 3805663 4672914 5725482 5881344 5408670
$$ packed form
5219F495378O83714j004682m56296L79880o0859l97407M97356j03866r39485j97756
5209D895977L75615l13783m56138l83439M32445N25839P00558M91737m50433l33312
5199E485066j38054n67578o69145K25304P30310L13185m56576l8212m0564M1381
5189D885117n32808k07026L95717k32625R82272m95877j425221j6180N22035R64057
5179D839461l33058n52579j04972j26372L81345N46271o79652N2547J50858m45225
5169C728624j42246R8410L76744m64848N33824q04339R7141P59403j956N31253
5159D712010l98713j28115n47984K17018L03508m38581j24981O18229Q56209N7188
5149E125788n72350j34037L47096O3217j053565K9514Q67251J052568J55862m72674
$$ plain form
5139 5408670 4800405 4584055 3907471 4531427 4915532 5349685 5823928 5611215 5553874 6015823
5129 6015823 6064415 5787256 6131631 7178663 7750351 8903166 10074258 10552771 11091726
5120 11091726 11615318 12021130 12505142 13074859 10851879 9938612 9570837 9793785 9699488
5111 9699488 9747621 9762605 9645131 10508791 12247795 12162587 12905940 13674936 13740091 13389054
5101 13389054 12492044 11703386 10920813 9607805 9760211 9382356 8885191 8293891 8089917
5092 8089917 8668331 7994181 8415199 8256170 7647334 7619839 7205938 7885714 7997503 8051630
5082 8051630 8463581 8753432 9187917 9310756 9418570 10585794 10348394 10117874 12021145
5073 12021145 11875675 12023633 13117324 15208520 17431147 19137948 20021667 21154567 20610313
$$ packed form
5139E408670o08265k16350o76584O23956L84105M34153M74243k12713n7341M61949
5129F015823M8592k77159L44375J047032N71688J152815J171092M78513N38955
5120A1091726N23592M05812M84012N69717k222980r13267l67775K22948r4297
5111I699488M8133J4984j17474Q63660J739004q5208P43353P68996O5155l51037
5101A3389054q97010p88658p82573j313008J52406l77855m97165n91300k03974
5092H089917N78414o74150M21018j59029o08836k7495m13901O79776J11789N4127
5082H051630M11951K89851M34485J22839J07814J167224k37400k30520J903271
5073A2021145j45470J47958J093691K091196K222627J706801Q83719J132900n44254
$$ plain form
5064 20610313 18960669 17923886 15465790 14622751 14300889 14281214 14005887 13963872 15886789
5055 15886789 17022383 18245644 18578385 21073900 21993698 21361009 20136634 17495311 15004891
5046 15004891 14137027 13780281 12455055 12050298 11304365 10660717 9411629 9355040 9970182
5037 9970182 9675880 9823226 9363290 9528006 9685296 9413051 9228389 9075398 8275737 8476571
5027 8476571 8825996 9273672 9136215 8796505 8761770 8393264 8138221 8699002 8938170 8083407
5017 8083407 7872089 8583273 9077544 9432035 9233862 9165238 9168915 9329098 8703917 9148222
5007 9148222 9773422 9240897 9476204 9259099 9492822 9155081 9593923 9677523 9229910 9394900
4997 9394900 8927831 9172409 9131286 8812183 9797708 9255519 9292395 10282665 10148471 10285435
$$ packed form
5064B0610313j649644j036783k458096q43039l21862j9675k75327m2015J922917
5055A5886789J135594J223261L32741K495515R19798o32689j224375k641323k490420
5046A5004891q67864l56746j325226m04757p45933o43648j249088n6589O15142
5037I970182k94302J47346m59936J64716J57290k72245j84662j52991p99661K00834
5027H476571L49425M47676j37457l39710l4735l68506k55043N60781K39168q54763
5017H083407k11318P11184M94271L54491j98173o8624L677J60183o25181M44305
5007I148222O25200n32525K35307k17105K33723l37741M38842Q3600m47613J64990
4997I394900m67069K44578m1123l19103R85525n42189L6876R90270j34194J36964
$$ plain form
4987 10285435 10864761 10562501 10724917 9873500 10846477 10987658 10145067 10636322 10489596
4978 10489596 9679885 10353471 10681689 10192797 9805793 10881052 11315366 11316015 11412366 11782917
4968 11782917 12594911 12873352 13816162 13747329 13001176 13139142 13518701 13432360 14514359 15707335
4958 15707335 14990224 15811458 16148434 16236542 15930172 17198359 18633309 19687811 20884726
4949 20884726 21608865 23371571 24666365 25772630 25068600 24980077 23052860 21670719 20026288
4940 20026288 18731780 19054317 19396742 19443332 19374933 18030690 18247540 18745556 18707091 20412404
4930 20412404 20433872 21177353 22724412 23503920 24982120 25937782 27713770 29121594 30462334
4921 30462334 32377791 33267745 33167812 32049926 30389024 28568966 27530107 26640341 25338546
$$ packed form
4987A0285435N79326l02260J62416q51417R72977J41181q42591M91255j46726
4978A0489596q09711O73586L28218m88892l87004J075259M34314O49R6351L70551
4968A1782917Q11994K78441R42810o8833p46153J37966L79559q6341J081999J192976
4958A5707335p17111Q21234L36976Q8108l06370J268187J434950J054502J196915
4949B0884726P24139J762706J294794J106265p04030q8523j927217j382141j644431
4940B0026288j294508L22537L42425M6590o8399j344243K16850M98016l8465J705313
4930B0412404K1468P43481J547059P79508J478200R55662J775988J407824J340740
4921C0462334J915457Q89954r9933j117886j660902j820058j038859q89766j301795
$$ plain form
4912 25338546 25071624 24606353 24399342 24613576 24649382 24447329 24793076 24852276 25475909 26090142
4902 26090142 27301970 27540455 27755205 28789984 29886538 30836757 32164242 33115366 33178511
4893 33178511 34110643 34686197 34530316 33790393 32501412 32661367 33099498 32842217 33389973
4884 33389973 33319333 33843081 33901881 34047143 35271359 36078063 36909308 38576257 40042018
4875 40042018 40625615 42467328 44584715 46401959 48026473 50381661 52217590 51777037
4867 51777037 51398099 50522396 48722504 47774297 46529325 45790326 45663323 45093784 46148612
4858 46148612 46615218 47395221 47539705 48871521 49631569 51253021 53676591 55622956 56862100
4849 56862100 56784614 58075636 58699824 58747038 59104186 58373182 58737687 59019841 59171432 58891338
$$ packed form
4912B5338546k66922m65271k07011K14234L5806k02053L45747N9200O23633O14233
4902B6090142J211828K38485K14750J034779J096554R50219J327485R51124O3145
4893C3178511R32132N75554j55881p39923j288981J59955M38131k57281N47756
4884C3389973p0640N23748N8800J45262J224216Q06704Q31245J666949J465761
4875D0042018N83597J841713K117387J817244J624514K355188J835929m40553
4867E1777037l78938q75703j799892r48207j244972p38999j27003n69539J054828
4858D6148612M66606P80003J44484J331816P60048J621452K423570J946365J239144
4849E6862100p7486J291022O24188M7214L57148p31004L64505K82154J51591k80094
$$ plain form
4839 58891338 59134870 59933264 60237726 61639177 61366848 61803016 63328069 64853500 65773898
4830 65773898 66555614 66984436 66430397 67283310 67720818 68452979 69097931 69131701 69850856 71449096
4820 71449096 72136450 72386968 73252012 74972668 76215794 77256901 78563132 80514210 82446081
4811 82446081 83765435 86234887 87783774 89937892 92727857 95275479 97623907 100186896
4803 100186896 102167469 104566879 106694697 108350037 110606118 112602273 114203177 116119170
4795 116119170 117493938 118825329 120298687 122134870 125527516 128744177 131665685 135426774
4787 135426774 139768931 144349875 148866251 154049031 160280002 165249652 171217588 176563311
4779 176563311 182278902 188284036 193647119 198476333 201904356 203657343 205231184 205620573
$$ packed form
4839E8891338K43532P98394L04462J401451k72329M36168J525053J525431R20398
4830F5773898P81716M28822n54039Q52913M37508P32161O44952L3770P19155J598240
4820G1449096O87354K50518Q65044J720656J243126J041107J306231J951078J931871
4811H2446081J319354K469452J548887K154118K789965K547622K348428K562989
4803A00186896J980573K399410K127818J655340K256081J996155J600904J915993
4795A16119170J374768J331391J473358J836183L392646L216661K921508L761089
4787A35426774M342157M580944M516376N182780O230971M969650N967936N345723
4779A76563311N715591O005134N363083M829214L428023J752987J573841L89389
$$ plain form
4771 205620573 206140351 206567640 205587356 205133005 205912742 205549336 204846908 206252645 207456721
4762 207456721 209760220 212517061 215638775 220510710 224834114 230446625 235843193 242180514
4754 242180514 249057954 254604627 259524743 263582599 267681252 271006439 272797263 272874531
4746 272874531 271812530 269361459 267453364 263224793 259424105 255272264 251141279 245428572
4738 245428572 240375192 236180665 233278431 230905825 228362777 225898751 223953827 222002828
4730 222002828 219942362 219079768 218106001 216039784 213519687 211625834 208931566 206292215
4722 206292215 202993183 199465503 195703398 192012131 188524998 183961139 179588206 174392169
4714 174392169 168576471 164236016 159801629 153935392 150313627 146169264 141580431 137990814
$$ packed form
4771B05620573N19778M27289r80284m54351P79737l63406p02428J405737J204076
4762B07456721K303499K756841L121714M871935M323404N612511N396568O337321
4754B42180514O877440N546673M920116M057856M098653L325187J790824P7268
4746B72874531j062001k451071j908095m228571l800688m151841m130985n712707
4738B45428572n053380m194527k902234k372606k543048k464026j944924j950999
4730B22002828k060466q62594r73767k066217k520097j893853k694268k639351
4722B06292215l299032l527680l762105l691267l487133m563859m372933n196037
4714A74392169n815698m340455m434387n866237l621765m144363m588833l589617
$$ plain form
4706 137990814 134375497 130999949 126943046 123126245 119752935 117981325 116306663 113276140
4698 113276140 112333933 111355020 110283187 110235243 109980926 109224404 108642671 108143616 107069781
4689 107069781 105306607 102802029 100877314 98619308 96720874 94204274 92854474 90637885
4681 90637885 88403364 87922617 86748931 85619694 84797880 82585687 81573634 81123505 79840698
4672 79840698 78561193 78255254 77206790 75415779 73223213 71972863 70795629 69077124
4664 69077124 68681351 68740630 67777374 66900495 66297469 65255466 63336198 61145397 60508826
4655 60508826 58466730 57195894 57740689 57162591 56918239 56656427 56483729 55810215 54712335
4646 54712335 54721171 54033963 52713917 52089854 50435785 48313591 46540166 45946028 45509024
$$ packed form
4706A37990814l615317l375548m056903l816801l373310j771610j674662l030523
4698A13276140r42207r78913j071833m7944k54317p56522n81733m99055j073835
4689A07069781j763174k504578j924715k258006j898434k516600j349800k216589
4681I0637885k234521m80747j173686j129237q21814k212193j012053m50129j282807
4672G9840698j279505l05939j048464j791011k192566j250350j177234j718505
4664F9077124l95773N9279r63256q76879o03026j042003j919268k190801o36571
4655F0508826k042096j270836N44795n78098k44352k61812j72698o73514j097880
4646E4712335Q836o87208j320046o24063j654069k122194j773425n94138m37004
$$ plain form
4637 45509024 44912308 44808243 43001354 42038896 41169964 40239664 38893358 37915474 36761142
4628 36761142 35931995 35721701 34999267 33959887 34021590 34741034 34608023 34645512 34254370 33877467
4618 33877467 32506452 32484869 32173636 32610461 32562120 32059147 31279010 31209936 31492296 30502549
4608 30502549 30508300 31274951 30423439 30209111 30847081 31979604 32460813 33227175 35093504
4599 35093504 35887391 35891606 34364471 32188491 30386662 28478745 27190859 26232434 25869476
4590 25869476 26107082 26267801 26101372 26543321 27873710 27923670 28063462 30165194 32109247
4581 32109247 33448838 34852740 36145521 37197460 36081382 36276865 35328202 32929878
4573 32929878 29541626 27926485 27010464 26692254 26461441 25463422 24530219 23997589 23538461
$$ packed form
4637D5509024n96716j04065j806889r62458q68932r30300j346306r77884j154332
4628C6761142q29147k10294p22434j039380O1703P19444j33011L7489l91142l76903
4618C3877467j371015k1583l11233M36825m8341n02973p80137o9074K82360r89747
4608C0502549N751P66651q51512k14328O37970J132523M81209P66362J866329
4599C5093504P93887M215j527135k175980j801829j907917j287886r58425l62958
4590B5869476K37606J60719j66429M41949J330389M9960J39792K101732J944053
4581C2109247J339591J403902J292781J051939j116078J95483r48663k398324
4573C2929878l388252j615141r16021l18210k30813r98019r33203n32630m59128
$$ plain form
4564 23538461 22896118 22963648 22967123 23888782 26322650 27213804 27657446 27298074 26387359 24798946
4554 24798946 22689680 20770813 18759424 17834178 17460854 17911107 18405127 18673939 17724245
4545 17724245 17211972 15601149 15274619 15680535 14851500 14719850 14773656 15027054 14212545
4536 14212545 14047169 15478762 15583918 13614824 13501124 13860131 12894304 12400766 11968194
4527 11968194 10966442 11432590 11990775 11706177 11783803 11527516 11428177 11130184 10099546
4518 10099546 10341931 10620600 9658165 10027456 9955380 10108268 10146838 10068214 9955216 9268381
4508 9268381 9051265 9005959 9560491 9732786 9573103 10293252 10628555 9488652 9300079 8942377
4498 8942377 9116056 9370165 9934954 10685133 9880431 9369765 10063280 10229107 9591767 9779261
$$ packed form
4564B3538461o42343O7530L475R21659K433868Q91154M43642l59372r10715j588413
4554B4798946k109266j918867k011389r25246l73324M50253M94020K68812r49694
4545A7724245n12273j610823l26530M05916q29035j31650N3806K53398q14509
4536A4212545j65376J431593J05156j969094j13700L59007r65827m93538m32572
4527A1968194j001752M66148N58185k84598P7626k56287r9339k97993j030638
4518A0099546K42385K78669r62435L69291p2076J52888L8570p8624j12998o86835
4508I268381k17116m5306N54532J72295j59683P20149L35303j139903j88573l57702
4498H942377J73679K54109N64789P50179q04702n10666O93515J65827o37340J87494
$$ plain form
4488 9779261 9244613 9646542 10512963 10899474 10371054 10691140 10922892 10664795 10672116 10847701
4478 10847701 11262413 10814828 10595208 10838714 11454732 11503788 11445877 11613025 11606391 11467143
4468 11467143 11532048 12013095 12073608 12063764 12420655 12665284 13876645 14094694 13151095 13424983
4458 13424983 13190746 13246630 13641807 13626462 13693564 14241736 13683277 12292181 13030454 13602135
4448 13602135 13526283 13430495 12911730 12025980 12408797 13091757 12929337 13571014 12894312 12192636
4438 12192636 11910700 11789648 11492802 11731336 11179391 11052394 11244976 11433196 11099699
4429 11099699 10746496 11010728 11168889 10944344 10815147 10097420 10067265 9985539 10377412 9810446
4419 9810446 10116547 10046202 9980893 10318820 9929896 10218098 9558496 9570137 9770115 9615756
$$ packed form
4488I779261n34648M01929Q66421L86511n28420L20086K31752k58097P321J75585
4478A0847701M14712m47585k19620K43506O16018M9056n7911J67148o634j39248
4468A1467143O4905M81047O0513r844L56891K44629J211361K18049r43599K73888
4458A3424983k34237N5884L95177j5345O7102N48172n58459j391096P38273N71681
4448A3602135p5852r5788n18765q85750L82817O82960j62420O41677o76702p01676
4438A2192636k81936j21052k96846K38534n51945j26997J92582J88220l33497
4429A1099699l53203K64232J58161k24545j29197p17727l0155q1726L91873n66966
4419I810446L06101p0345o5309L37927l88924K88202o59602J1641J99978j54359
$$ plain form
4409 9615756 8859405 9230164 8820538 8970881 9155080 8850348 9145376 9926541 9475335 10596251
4399 10596251 11372745 11351671 11237919 11769197 12338433 12478107 11982844 11547987 10889125 10051777
4389 10051777 9907441 10309749 10396680 10156026 10167034 10064896 9871359 8931485 8777128 8781929
4379 8781929 9292487 9166200 9275215 9876236 9602048 9375243 9215711 10229752 10194777 9921795
4369 9921795 9308449 9166172 9883071 10174976 9668286 9657125 10330744 9538950 9203189 9388708
4359 9388708 10648837 11025183 10067646 9108460 8872094 10329863 10448132 10467886 10933943
4350 10933943 10744724 10389464 9803050 11104003 11699043 11075212 11051341 10706017 10218678
4341 10218678 10833239 10363374 10524247 11505620 12247649 12482357 11989273 12124713 12083242 12671818
$$ packed form
4409I615756p56351L70759m09626J50343J84199l04732K95028P81165m51206J120916
4399A0596251P76494k1074j13752N31278N69236J39674m95263m34857o58862q37348
4389A0051777j44336M02308Q6931k40654J1008j02138j93537r39874j54357M801
4379H781929N10558j26287J09015O01021k74188k26805j59532J014041l4975k72982
4369I921795o13346j42277P16899K91905n06690j1161O73619p91794l35761J85519
4359I388708J260129L76346r57537r59186k36366J457769J18269J9754M66057
4350A0933943j89219l55260n86414J300953N95040o23831k3871l45324m87339
4341A0218678O14561m69865J60873R81373P42029K34708m93084J35440m1471N88576
$$ plain form
4331 12671818 12426881 11982902 12268891 12867477 12814061 13020113 13003583 12393240 12725457 13122654
4321 13122654 14198507 14530640 14895680 15051112 16081400 18422168 19875186 21869917 23289871
4312 23289871 24321392 24822627 25280308 24961510 23052963 21342584 21136404 19883280 20072362
4303 20072362 21035624 22750496 24372258 25366090 25970345 25999708 25693641 23673122 21818648
4294 21818648 21820190 22500674 23536750 24446951 25016448 25338544 24855545 23606969 21603210
4285 21603210 20895491 19845116 18869413 18433710 19679543 20267791 21265834 21804829 22280024
4276 22280024 22333591 20339938 18222805 17284838 16320776 16289971 15194786 14766425 14227492
4267 14227492 13267067 13632234 13525536 12612892 13015055 12529781 12104522 12126231 12727966 12843197
$$ packed form
4331A2671818k44937m43979K85989N98586n3416K06052j6530o10343L32217L97197
4321A3122654J075853L32133L65040J55432J030288K340768J453018J994731J419954
4312B3289871J031521N01235M57681l18798j908547j710379k06180j253124J89082
4303B0072362R63262J714872J621762R93832O04255K9363l06067k020519j854474
4294B1818648J542O80484J036076R10201N69497L22096m82999j248576k003759
4285B1603210p07719j050375r75703m35703J245833N88248R98043N38995M75195
4276B2280024N3567j993653k117133r37967r64062l0805j095185m28361n38933
4267A4227492r60425L65167j06698r12644M02163m85274m25259K1709O01735J15231
$$ plain form
4257 12843197 12656301 12687193 11570001 11877211 12096761 11269609 11235985 11510458 11140514 11271281
4247 11271281 12127347 12562170 11633338 10265533 10426332 10867325 11113952 10943494 10532285
4238 10532285 11230654 11038668 11851203 11108308 11525880 12086533 12300923 12712934 12162489
4229 12162489 12695673 13221331 13552764 14631488 14573127 14315063 14348425 13684139 14157108 13696407
4219 13696407 13402343 12829146 13669299 13470123 13813190 13693675 13850873 14193622 14720326
4210 14720326 15836857 14987194 14611854 14049271 15384065 16272691 16150451 15292284 15588977
4201 15588977 16825710 16761505 16397086 18079237 19652564 19592153 17707319 17273487 17483408
4192 17483408 17614730 18268192 19246749 18366072 18204810 18298635 19421267 19887120 19969904 19959081
$$ packed form
4257A2843197j86896L0892j117192L07210K19550q27152l3624K74473l69944J30767
4247A1271281Q56066M34823r28832j367805J60799M40993K46627j70458m11209
4238A0532285O98369j91986Q12535p42895M17572N60653K14390M12011n50445
4229A2162489N33184N25658L31433J078724n8361k58064L3362o64286M72969m60701
4219A3696407k94064n73197Q40153j99176L43067j19515J57198L42749N26704
4210A4720326J116531q49663l75340n62583J334794Q88626j22240q58167K96693
4201A5588977J236733o4205l64419J682151J573327o0411j884834m33832K09921
4192A7483408J31322O53462R78557q80677j61262R3825J122632M65853Q2784j0823
$$ plain form
4182 19959081 19660972 20404671 21169661 21328433 21370918 21905161 22405139 22294820 22593314 23219247
4172 23219247 23430436 23207430 23324924 24072278 24363504 24909563 25026238 25191292 26112677
4163 26112677 27496077 29061534 29171376 29691358 30610623 30211048 30339410 31430116 32411103
4154 32411103 32798611 32852222 33579084 34732613 35501040 37030131 38375627 38872343 39746395
4145 39746395 40172385 40696102 42389360 44259585 45019773 45759386 47638814 49347368 50839209
4136 50839209 52571347 54087371 55276248 56328712 56918737 58774725 60272410 62071119
4128 62071119 64045835 65346716 67097239 68708888 70394155 72715208 74189337 77032898
4120 77032898 79292243 81002111 82366663 84880877 87006029 89256012 90468072 92987712
$$ packed form
4182A9959081k98109P43699P64990J58772M2485N34243M99978j10319K98494O25933
4172B3219247K11189k23006J17494P47354K91226N46059J16675J65054R21385
4163B6112677J383400J565457J09842N19982R19265l99575J28362J090706R80987
4154C2411103L87508N3611P26862J153529P68427J529091J345496M96716Q74052
4145C9746395M25990N23717J693258J870225P60188P39613J879428J708554J491841
4136E0839209J732138J516024J188877J052464N90025J855988J497685J798709
4128F2071119J974716J300881J750523J611649J685267K321053J474129K843561
4120G7032898K259345J709868J364552K514214K125152K249983J212060K519640
$$ plain form
4112 92987712 95539784 97696888 100076558 102031594 104070055 105532760 107760914 110328695
4104 110328695 113236345 115857023 118645000 121332647 123343718 126127299 130312818 133053870
4096 133053870 135262054 137662483 139776216 142918727 147535810 151071240 153590703 156839907
4088 156839907 160266416 163075320 165969282 169052277 171160856 173985440 176164824 177989883
4080 177989883 180134954 182281699 183631878 184732364 185721742 187880609 188825615 189537809
4072 189537809 191253379 192895646 194199527 196158846 197267635 198142060 199865008 202696631
4064 202696631 205498668 208234863 212067466 216024686 220758438 224764205 228853913 232110142
4056 232110142 235621741 237445676 239591745 240762086 242100956 243518359 243723052 243093205
$$ packed form
4112I2987712K552072K157104K379670J955036K038461J462705K228154K567781
4104A10328695K907650K620678K787977K687647K011071K783581M185519K741052
4096A33053870K208184K400429K113733L142511M617083L535430K519463L249204
4088A56839907L426509K808904K893962L082995K108579K824584K179384J825059
4080A77989883K145071K146745J350179J100486R89378K158867R45006P12194
4072A89537809J715570J642267J303881J959319J108789Q74425J722948K831623
4064B02696631K802037K736195L832603L957220M733752M005767M089708L256229
4056B32110142L511599J823935K146069J170341J338870J417403K04693o29847
$$ plain form
4048 243093205 243405674 243074001 241260081 239768855 238541317 237518283 237394945 237111309 236765580
4039 236765580 237172331 236993573 236478859 235862992 236510971 237226727 237295947 236765315 235471390
4030 235471390 235663893 235741057 236463023 234889929 232663589 229811745 227495477 225358778 222434048
4021 222434048 220343422 216987415 212969502 208828092 204636863 199877422 196068467 191228520
4013 191228520 187146786 183703096 180484493 178177852 175488181 171977800 170179387 167182863
4005 167182863 164507430 163111833 161451520 159746941 158111660 156358912 153998985 151740685
3997 151740685 151020550 149439436 148065237 147504072 146435911 144786714 143169076 140774688
3989 140774688 138772096 137241286 134161545 131073614 127991851 126097036 124075307 122401254
$$ packed form
4048B43093205L12469l31673j813920j491226j227538j023034j23338k83636l45729
4039B36765580M06751j78758n14714o15867O47979P15756O9220n30632j293925
4030B35471390J92503P7164P21966j573094k226340k851844k316268k136699k924730
4021B22434048k090626l356007m017913m141410m191229m759441l808955m839947
4013A91228520m081734l443690l218603k306641k689671l510381j798413k996524
4005A67182863k675433j395597j660313j704579j635281j752748k359927k258300
3997A51740685p20135j581114j374199n61165j068161j649197j617638k394388
3989A40774688k002592j530810l079741l087931l081763j894815k021729j674053
$$ plain form
3981 122401254 119723410 116491691 114511223 112728747 109820468 107284914 104723479 103546951
3973 103546951 102273400 100871296 98905453 98358234 97241585 95734652 93730791 92302012
3965 92302012 91048126 89076532 86458376 84312612 82714877 81190506 78388980 76270791
3957 76270791 74101006 72344795 71078907 69671171 69109885 66913366 65018960 62911306
3949 62911306 60465559 58978552 57732159 55847642 54500475 53248758 50940352 49965875
3941 49965875 49598333 48441491 47291544 46116744 44982540 43593872 41855874 39713054
3933 39713054 39365962 38551800 37306876 36517785 35219988 34496669 33999415 33808405 33099085
3924 33099085 31534178 31295921 31181107 30305532 29142147 28799006 28417986 28287634 27733425
$$ packed form
3981A22401254k677844l231719j980468j782476k908279k535554k561435j176528
3973A03546951j273551j402104j965843n47219j116649j506933k003861j428779
3965I2302012j253886j971594k618156k145764j597735j524371k801526k118189
3957G6270791k169785j756211j265888j407736n61286k196519j894406k107654
3949F2911306k445747j487007j246393j884517j347167j251717k308406r74477
3941D9965875l67542j156842j149947j174800j134204j388668j737998k142820
3933C9713054l47092q14162j244924p89091j297797p23319m97254j91010p09320
3924C3099085j564907k38257j14814q75575j163385l43141l81020j30352n54209
$$ plain form
3915 27733425 27181637 27017515 26311914 25936093 26502935 24651183 23902176 23587459 23796699
3906 23796699 23005047 22673259 22403650 22406707 20904302 20323387 21419062 21213614 21750462
3897 21750462 20824849 19858929 19669386 18735592 19131494 19606256 18726300 18326069 18538139
3888 18538139 19105310 19276581 19102278 17623941 17657033 17780958 17856755 17400076 16960911 17420702
3878 17420702 16579409 16768761 16418003 16922243 17202262 16833582 16757712 16362924 16559788 16404729
3868 16404729 15404204 15604912 16030040 16174623 15990594 16135199 16608882 16196683 16106321
3859 16106321 15622924 15579873 16617799 16649720 16861413 15822149 15987063 16221105 15459214
3850 15459214 16462746 16858311 16674381 16948929 16623905 16605714 17072878 17275652 17056192
$$ packed form
3915B7733425n51788j64122p05601l75821N66842j851752p49007l14717K09240
3906B3796699p91652l31788k69609L057j502405n80915J095675k05448N36848
3897B1750462r25613r65920j89543r33794L95902M74762q79956m00231K12070
3888A8538139N67171J71271j74303j478337L3092J23925P5797m56679m39165M59791
3878A7420702q41293J89352l50758N04240K80019l68680p5870l94788J96864j55059
3868A6404729j000525K00708M25128J44583j84029J44605M73683m12199r0362
3859A6106321m83397m3051J037926L1921K11693j039264J64914K34042p61891
3850A5459214J003532L95565j83930K74548l25024j8191M67164K02774k19460
$$ plain form
3841 17056192 16786757 17709197 17788252 17818755 16990630 16439986 17492397 18183998 17844009 17341938
3831 17341938 18023920 18266764 18460159 19252667 18865398 18801763 19095986 19297211 19755092 20489742
3821 20489742 20616887 20498976 20328483 20290005 20881447 21599715 21692717 22192912 23033990 23214028
3811 23214028 22558149 23312608 24080399 24361829 25070522 26335659 26218003 25816726 26099839
3802 26099839 26760181 26742963 27520700 28606101 28726921 29964805 30052544 29790917 30436101
3793 30436101 30353501 31983434 32915935 33265912 33891161 34898814 35503905 35986353 36464078
3784 36464078 37849771 38222780 39588985 40412885 41270184 41679728 42946783 43412668 44549272
3775 44549272 44725293 45943001 47078936 47757195 48902481 49648351 50314511 50999821 51123015
$$ packed form
3841A7056192k69435R22440P9055L0503q28125n50644J052411O91601l39989n02071
3831A7341938O81982K42844J93395P92508l87269o3635K94223K01225M57881P34650
3821B0489742J27145j17911j70493l8478N91442P18268R3002N00195Q41078J80038
3811B3214028o55879P54459P67791K81430P08693J265137j17656m01277K83113
3802B6099839O60342j7218P77737J085401J20820J237884Q7739k61627O45184
3793C0436101q2600J629933R32501L49977O25249J007653O05091M82448M77725
3784C6464078J385693L73009J366205Q23900Q57299M09544J267055M65885J136604
3775D4549272J76021J217708J135935O78259J145286P45870O66160O85310J23194
$$ plain form
3766 51123015 51410498 51815367 51465094 52727506 52322004 51908887 51550752 51407642 50669362
3757 50669362 49958759 48669054 49029059 47526324 46321750 46124332 45116177 43330700 42952906
3748 42952906 41632498 41100457 39602958 38863387 37629417 36506554 35808289 34837136 33847333
3739 33847333 32959811 32582450 31527680 30446884 29811353 28532941 27737912 26259586 25694820
3730 25694820 26665492 25894393 25544865 25398783 24735208 23330573 23117948 23093183 22318121
3721 22318121 22418792 22811878 22819356 22167663 22388753 23005911 22231679 22015957 21803927 21297545
3711 21297545 20036030 20327642 19840870 18573665 18591785 18147325 17740572 17575186 16993705
3702 16993705 17053258 16776382 16324836 17131472 16563187 16515908 17272440 16756961 16040959 16364700
$$ packed form
3766E1123015K87483M04869l50273J262412m05502m13117l58135j43110p38280
3757E0669362p10603j289705L60005j502735j204574j97418j008155j785477l77794
3748D2952906j320408n32041j497499p39571j233970j122863o98265r71153r89803
3739C3847333q87522l77361j054770j080796o35531j278412p95029j478326n64766
3730B5694820R70672p71099l49528j46082o63575j404635k12625k4765p75062
3721B2318121J00671L93086P478o51693K21090O17158p74232k15722k12030n06382
3711B1297545j261515K91612m86772j267205J8120m44460m06753j65386n81481
3702A6993705N9553k76876m51546Q06636n68285m7279P56532n15479p16002L23741
$$ plain form
3692 16364700 16731086 16738705 15733293 14947295 14199518 13800905 13093310 12060781 12386975
3683 12386975 13100811 12470609 11523324 11122918 11044882 11408031 11154790 10738148 11386921 11069937
3673 11069937 10554979 10347544 9976770 9514077 9932862 10324349 10470340 10233972 9848704
3664 9848704 9540724 9565787 9764554 10140952 9845315 9523419 9358219 8790231 8799824 8784780
3654 8784780 8175875 8799563 8687519 8645366 8539550 8182076 8098525 8950866 9248445 7917467
3644 7917467 8390759 7972530 7899082 7085490 8256921 8860229 8562935 9238398 8852254 8372403
3634 8372403 9381379 8813154 8639532 8431081 7768551 7944319 7972059 7872825 7396009 6993310
3624 6993310 6453285 6981618 7642493 7376357 6800955 7349149 7012890 6158428 7427299
$$ packed form
3692A6364700L66386P619j005412p85998p47777l98613p07595j032529L26194
3683A2386975P13836o30202r47285m00406p8036L63149k53241m16642O48773l16984
3673A1069937n14958k07435l70774m62693M18785L91487J45991k36368l85268
3664I848704l07980K5063J98767L76398k95637l21896j65200n67988R593j5044
3654H784780o08905O23688j12044m2153j05816l57474q3551Q52341K97579j330978
3644G917467M73292m18229p3448q13592J171431O03308k97294O75463l86144m79851
3634H372403J008976n68225j73622k08451o62530J75768K7740r9234m76816m02699
3624F993310n40025N28333O60875k66136n75402N48194l36259q54462J268871
$$ plain form
3615 7427299 8027389 7707947 6820746 6833338 7224082 7216077 7150388 6935097 6545078 6272526
3605 6272526 6014121 6202323 6700455 6506920 7018507 6729918 6631511 6716205 6736835 7510478
3595 7510478 7936837 7739616 7355853 6944455 6565534 7939500 8311809 7101800 6231423
3586 6231423 7745529 7373376 7691082 7208434 7028026 7407787 6456272 6746337 7102047
3577 7102047 7254355 7661942 8175257 7910682 7469466 7683419 7843128 7868886 8378925 8687906
3567 8687906 8031987 7965313 8462280 8460801 7901822 7048204 7516895 7889736 7638546 7429482
3557 7429482 7238124 7509146 8618065 8453093 7513000 8007921 8772611 7368219 7193792
3548 7193792 7017251 7289967 7683799 7844183 8473714 8791934 8140501 8406569 7757914 8118977
$$ packed form
3615G427299O00090l19442q87201J2592L90744q005o5689k15291l90019k72552
3605F272526k58405J88202M98132j93535N11587k88589r8407Q4694K0630P73643
3595G510478M26359j97221l83763m11398l78921J373966L72309j210009q70377
3586F231423J514106l72153L17706m82648j80408L79761r51515K90065L55710
3577G102047J52308M07587N13315k64575m41216K13953J59709K5758N10039L08981
3567H687906o55919o6674M96967j479n58979q53618M68691L72841k51190k09064
3557G429482j91358K71022J108919j64972r40093M94921P64690j404392j74427
3548G193792j76541K72716L93832J60384O29531L18220o51433K66068o48655L61063
$$ plain form
3538 8118977 8271417 7532410 8150437 8347208 9343350 9301297 8956552 9419218 8897351 9419301
3528 9419301 9883551 10152184 10469732 10749805 10422824 9743260 9847510 9284205 9433839 9791959
3518 9791959 10248211 11516686 10977323 10752678 10223129 10252463 10427167 9896815 10046054 11148949
3508 11148949 10942422 10771685 12169698 11556993 11289579 11368100 12071054 11480139 11989377
3499 11989377 12735723 13262680 13367057 13589228 14484778 14990361 15719520 16059734 16082758 15988778
3489 15988778 16489046 16830472 17962512 17906391 18004406 18951681 20086014 20088883 19111901 19476508
3479 19476508 19798697 18964585 18101782 17395067 16876985 16140712 15533696 14141563 12264924
3470 12264924 11325725 10959755 10909026 10289724 10339879 10339954 9810240 9216030 8704118 8658415 8437469
$$ packed form
3538H118977J52440p39007O18027J96771R96142m2053l44745M62666n21867N21950
3528I419301M64250K68633L17548K80073l26981o79564J04250n63305J49634L58120
3518I791959M56252J268475n39363k24645n29549K9334J74704n30352J49239J102895
3508A1148949k06527j70737J398013o12705k67414P8521P02954n90915N09238
3499A1989377P46346N26957J04377K22171Q95550N05583P29159L40214K3024r3980
3489A5988778N00268L41426J132040n6121R8015R47275J134333K869r76982L64607
3479A9476508L22189q34112q62803p06715n18082p36273o07016j392133j876639
3470A2264924r39199l65970n0729o19302N0155P5n29714n94210n11912m5703k20946
$$ plain form
3459 8437469 7268496 7184256 7550450 7309664 7555528 7239251 6857061 6870870 6162210 6768023
3449 6768023 6651062 6627638 7311230 6443686 5968153 6122435 6099248 6336674 5914866 5807920
3439 5807920 5576934 5829665 5399302 5126634 5610977 5514404 4573677 4511305 4570062 4478568
3429 4478568 4715333 4391564 3965020 4415151 4803464 4351969 4570851 4783248 4463001 4177470
3419 4177470 3796987 3587955 3615844 4528092 4737742 3747295 3533080 3307798 3854062 3705118
3409 3705118 2863145 2581706 3405356 3915523 2678028 2314333 3683113 3780810 3978553
3400 3978553 3449233 3436888 2825817 2842567 3011835 3031455 2843280 3103676 2941429 2690749
3390 2690749 2663619 2932784 2734791 2787335 2900005 2970485 2812470 3044900 3059881 2573895
$$ packed form
3459H437469j168973q4240L66194k40786K45864l16277l82190J3809p08660O05813
3449F768023j16961k3424O83592q67544m75533J54282k3187K37426m21808j06946
3439E807920k30986K52731m30363k72668M84343r6573r40727o2372N8757r1494
3429D478568K36765l23769m26544M50131L88313m51495K18882K12397l20247k85531
3419D177470l80483k09032K7889R12248K09650r90447k14215k25282N46264j48944
3409C705118q41973k81439Q23650N10167j237495l63695J368780R7697J97743
3400C978553n29320j2345o11071J6750J69268J9620j88175K60396j62247k50680
3390B690749k7130K69165j97993N2544J12670P0480j58015K32430J4981m85986
$$ plain form
3380 2573895 2384995 2805602 2935492 2889423 2848731 2634379 3471885 3749692 2575408 2263345
3370 2263345 1986668 1623573 1373176 1659907 1844699 1180669 1504844 1656915 2249498 2389122
3360 2389122 2132275 1241066 1460577 1704038 2274472 1223975 2042755 2350070 2251324 2850148
3350 2850148 1807319 1269365 1939636 2994507 3256957 2653236 2058588 1727779 2176400
3341 2176400 2197250 1840656 1883863 1896035 2099995 1854913 2254877 1972517 670681 1468865
3331 1468865 1538390 1041826 1472553 1724307 2191079 1857714 1502556 2869842 2673461 2100632
3321 2100632 2570874 2387401 1763810 2308657 1470040 1644511 1582936 1533360 1905555 1338181
3311 1338181 921081 1410316 1675115 1310528 1912677 2168738 1543168 2302032 2468974 1854269
$$ packed form
3380B573895j88900M20607J29890m6069m0692k14352Q37506K77807j174284l12063
3370B263345k76677l63095k50397K86731J84792o64030L24175J52071N92583J39624
3360B389122k56847q91209K19511K43461N70434j050497Q18780L07315r8746N98824
3350B850148j042829n37954O70271J054871K62450o03721n94648l30809M48621
3341B176400K0850l56594M3207J2172K03960k45082L99964k82360j301836P98184
3331A468865O9525m96564M30727K51754M66772l33365l55158J367286j96381n72829
3321B100632M70242j83473o23591N44847q38617J74471o1575m9576L72195n67374
3311A338181m17100M89235K64799l64587O02149K56061o25570P58864J66942o14705
$$ plain form
3301 1854269 1096569 110599 1611056 2508259 1633410 1165175 773824 1095500 1601842
3292 1601842 1664349 1860945 1977973 1618141 1188079 1380740 1207738 1146045 1102166 1462311
3282 1462311 1108888 1470634 908276 503995 638156 1316509 1298868 2051349 2084981 1348703
3272 1348703 1539750 1432222 2041707 2381242 2005209 1395546 1577431 1177931 1596276 1927750
3262 1927750 1398840 970228 991800 985052 1290796 1581737 1221378 2036762 2735835 1668166
3252 1668166 1091134 1592840 2037961 1039316 902295 2547106 1882989 1691729 1071499
3243 1071499 1321338 691890 895748 2087850 2293830 1837899 1096239 1300141 1183202
3234 1183202 1269862 1674329 1273629 1042932 1808764 1945478 1554676 2043674 1205635 2117287
$$ packed form
3301A854269p57700r85970J500457Q97203q74849m68235l91351L21676N06342
3292A601842O2507J96596J17028l59832m30062J92661j73002o1693m3879L60145
3282A462311l53423L61746n62358m04281J34161O78353j7641P52481L3632p36278
3272A348703J91047j07528O09485L39535l76033o09663J81885l99500M18345L31474
3262A927750n28910m28612K1572o748L05744K90941l60359Q15384O99073j067669
3252A668166n77032N01706M45121r98645j37021J644811o64117j91260o20230
3243A071499K49839o29448K03858J192102K05980m55931p41660K03902j16939
3234A183202Q6660M04467m00700k30697P65832J36714l90802M88998q38039R11652
$$ plain form
3224 2117287 2496223 2372935 2128807 2086526 2145485 2253533 2126157 2450754 1935139 2521705
3214 2521705 3824457 4717211 4341015 3645689 3701551 3775791 3797908 3644086 3705710 2766333
3204 2766333 2161584 1956033 2744094 2522953 2866232 2756167 3253246 3609168 2778721 2836648
3194 2836648 3617174 3669041 3725904 3338118 3698993 3923162 3690004 3993750 4407380 4791505
3184 4791505 5173987 5118994 4955353 4790918 4860045 4917460 5132880 4853657 4636342 4604045
3174 4604045 4819475 5072842 4891164 4649143 5592209 5236330 4701915 5058120 6006699 6763190
3164 6763190 6023152 6044642 5404305 5441817 5628819 5589345 5594793 5287929 6073256 6138246 5721391
3153 5721391 6330037 6667635 6351207 6693360 7031966 5945986 5056499 5564239 6165284
$$ packed form
3224B117287L78936j23288k44128m2281N8959J08048j27376L24597n15615N86566
3214B521705J302752Q92754l76196o95326N5862P4240K2117j53822O1624r39377
3204B766333o04749k05551P88061k21141L43279j10065M97079L55922q30447N7927
3194B836648P80526N1867N6863l87786L60875K24169k33158L03746M13630L84125
3184D791505L82482n4993j63641j64435O9127N7415K15420k79223k17315l2297
3174D604045K15430K53367j81678k42021R43066l55879n34415L56205R48579P56491
3164F763190p40038K1490o40337L7512J87002l9474N448l06864P85327O4990m16855
3153E721391O08646L37598l16428L42153L38606j085980q89487N07740O01045
$$ plain form
3144 6165284 6842383 7402984 7007393 6666202 6664565 5559952 5279766 5220763 5017244 5090948
3134 5090948 5370795 4897207 4789709 4911786 5504033 4549126 4185358 3722711 4265125 5198221
3124 5198221 4483434 4764505 4743548 4748193 4560039 4758827 4611435 4066136 5365394 4579918
3114 4579918 4440829 5011809 4762195 4388471 4260160 3810609 3761567 3299082 3785781 4030943
3104 4030943 3763629 3276550 2837041 2936204 3342937 3377861 2181497 1959109 2710427 3591482
3094 3591482 3234786 3149563 2970089 2792457 2219899 1808318 2244902 1425213 1741942 2398379
3084 2398379 2128540 2894590 2750790 3023829 2913982 1997175 1531196 1703921 1802130 2022561
3074 2022561 1155507 1741229 2134790 1860699 1081054 1178114 1247993 1413840 1451108 1335916
$$ packed form
3144F165284O77099N60601l95591l41191j637j104613k80186n9003k03519P3704
3134E090948K79847m73588j07498J22077N92247r54907l63768m62647N42414R33096
3124E198221p14787K81071k0957M645j88154J98788j47392n45299J299258p85476
3114D579918j39089N70980k49614l73724j28311m49551m9042m62485M86699K45162
3104D030943k67314m87079m39509R9163M06733L4924j196364k22388P51318Q81055
3094C591482l56696q5223j79474j77632n72558m11581M36584q19689L16729O56437
3084B398379k69839P66050j43800K73039j09847r16807m65979J72725R8209K20431
3074B022561q67054N85722L93561k74091p79645R7060O9879J65847L7268j15192
$$ plain form
3064 1335916 1761124 1865868 1079646 1143356 1162605 1079396 1302226 1922428 1467396 950591
3054 950591 704912 202119 958510 1326298 513626 1163764 1412657 1549997 1030524 998281
3044 998281 770587 696115 495283 834631 605177 991531 1147591 1266446 1153469 542664
3034 542664 820633 948470 94602 -125759 273980 9351 99854 273901 121760 1161753
3024 1161753 1056043 617941 -3873 204521 -98555 -56868 808092 -178984 780934 776972
3014 776972 -7264 276277 587980 433949 848743 214745 91481 206996 890153 708868
3004 708868 851162 505207 -187283 -405552 26816 598452 1130890 346312 544922 759551
2994 759551 745569 995156 810778 651164 480166 324542 149839 819741 1407980 987174
$$ packed form
3064A335916M25208J04744p86222O3710J9249q3209K22830O20202m55032n16805
3054I50591k45679n02793P56391L67788q12672O50138K48893J37340n19473l2243
3044I98281k27694p4472k00832L39348k29454L86354J56060J18855j12977o10805
3034E42664K77969J27837q53868k20361L99739k64629R0503J74047j52141J039993
3024A161753j05710m38102o21814K08394l03076M1687Q64960r87076R59918l962
3014G76972p84236K83541L11703j54031M14794o33998j23264J15515O83157j81285
3004G08868J42294l45955o92490k18269M32368N71636N32438p84578J98610K14629
2994G59551j3982K49587j84378j59614j70998j55624j74703O69902N88239m20806
$$ plain form
2984 987174 884641 -278896 -187520 -655193 -59985 243236 216793 911041 979649 365080
2974 365080 300876 1093723 1142525 -19857 265777 175133 359910 593754 -201691 -2822
2964 -2822 -432416 -647652 -334497 -182592 -540742 -1334255 -272285 716232 -127373 -294535
2954 -294535 648418 641168 734352 535535 704665 1185341 871922 -127610 -394364 30978
2944 30978 368104 754209 1059608 800029 590236 370220 -170791 -348163 -211598 120916
2934 120916 -275401 722525 1275616 1203047 -229992 -79104 313410 132353 -299874 827471
2924 827471 668270 809186 559830 440739 419707 155205 148130 339115 199530 47902
2914 47902 -854971 -960248 -730967 -506909 -342488 -190667 553350 -12105 262515 237483
$$ packed form
2984I87174j02533j163537R1376m67673N95208L03221k6443O94248O8608o14569
2974C65080o4204P92847M8802j162382K85634r0644J84777K33844p95445J98869
2964b822m29594k15236L13155J51905l58150p93513J061970R88517q43605j67162
2954b94535R42953p250R3184j98817J69130M80676l13419r99532k66754M25342
2944C0978L37126L86105L05399k59579k09793k20016n41011j77372J36565L32514
2934A20916l96317R97926N53091p2569j433039J50888L92514j81057m32227J127345
2924H27471j59201J40916k49356j19091k1032k64502p075J90985j39585j51628
2914D7902r02873j05277K29281K24058J64421J51821P44017n65455K74620k5032
$$ plain form
2904 237483 -202517 -603611 -506586 228104 -146559 -359820 -262488 -62029 85285 551958
2894 551958 877210 939093 1046437 151963 -361596 -291474 451280 1369927 1082631 -173509
2884 -173509 -825734 -331666 -44216 -435406 559105 500404 66636 393639 528043 -19844
2874 -19844 68197 451135 390083 350052 469364 -360723 -327465 382676 84794 -495083 -286243
2863 -286243 269188 499356 566849 347582 539985 473405 229266 508109 291949 -152491
2853 -152491 -484633 -327097 422104 464531 94052 101374 209147 -280727 -318290 -127586
2843 -127586 829477 985634 737077 -169993 -492911 381028 285631 526846 370748 203856
2833 203856 656454 898966 386831 629708 377569 752397 249752 -64042 426955 51899
$$ packed form
2904B37483m40000m01094R7025P34690l74663k13261R7332K00459J47314M66673
2894E51958L25252O1883J07344q94474n13559P0122P42754R18647k87296j256140
2884a73509o52225M94068K87450l91190R94511n8701m33768L27003J34404n47887
2874a9844Q8041L82938o1052m0031J19312q30087L3258P10141k97882n79877K08840
2863b86243N55431K30168O7493k19267J92403o6580k44139K78843k16160m44440
2853a52491l32142J57536P49201M2427l70479P322J07773m89874l7563J90704
2843a27586R57063J56157k48557r07070l22918Q73939r5397K41215j56098j66892
2833B03856M52598K42512n12135K42877k52139L74828n02645l13794M90997l75056
$$ plain form
2823 51899 -244326 150247 206811 64850 316825 140700 -329854 -317354 -563213 -161986
2813 -161986 479541 58600 -365473 -343289 413195 974860 709350 298469 239192 374067
2803 374067 33434 -167367 423449 827856 738033 119058 -348838 -52830 228180 -141294
2793 -141294 -334523 -256222 -193732 -282997 -232605 -95206 -137984 -21750 384090 43307 527860
2782 527860 671116 723932 -345732 -297375 -124455 264578 917453 -79590 -365298 -119991
2772 -119991 -168708 -387706 -217231 -254010 35516 46 297499 550935 149208 -33080
2762 -33080 50354 321462 35663 607901 140221 -1017724 -820602 -416383 173158 290358
2752 290358 68676 277115 -381919 -797010 -16704 325137 383049 376360 384274 -690492
$$ packed form
2823E1899k96225L94573N6564j41961K51975j76125m70554J2500k45859M01227
2813a61986O41527m20941m24073K2184P56484N61665k65510m10881n9277J34875
2803C74067l40633k00801N90816M04407q9823o18975m67896K96008K81010l69474
2793a41294j93229P8301O2490q9265N0392J37399m2778J16234M05840l40783M84553
2782E27860J43256N2816j069664M8357J72920L89033O52875r97043k85708K45307
2772a19991m8717k18998J70475l6779K89526l5470K97453K53436m01727j82288
2762c3080Q3434K71108k85799N72238m67680j157945J97122M04219N89541J17200
2752B90358k21682K08439o59034m15091P80306L41841N7912o689P914j074766
$$ plain form
2742 -690492 -399511 -240032 -460150 -812419 -577114 -663438 -1690994 -829102 -496634 -339951
2732 -339951 -481116 120549 764199 251594 -314911 -483542 -522082 -389900 -836394 -746105
2722 -746105 -213552 -434401 -64200 -274782 -375930 -581584 -657501 30913 232151 -254145
2712 -254145 -590122 -92329 -99538 91842 -824093 -645587 -7237 -181909 263852 303115
2702 303115 212089 209448 -427740 -674730 -570118 -86882 -124631 -257567 469224 -38286
2692 -38286 9651 -535386 -745175 -955941 -1492418 -1464486 -1738275 -748417 -322229 175551
2682 175551 853739 914697 952926 -266002 -119825 -250901 55057 1027788 972970 929898
2672 929898 611490 392720 308510 -619009 341173 486492 -251514 -133605 216572 51884
$$ packed form
2742f90492K90981J59479k20118l52269K35305q6324j027556Q61892L32468J56683
2732c39951j41165O01665O43650n12605n66505j68631l8540J32182m46494R0289
2722g46105N32553k20849L70201k10582j01148k05654p5917O88414K01238m86296
2712b54145l35977M97793p209J91380r15935J78506O38350j74672M45761L9263
2702C03115r1026k641o37188k46990J04612M83236l7749j32936P26791n07510
2692c8286M7937n45037k09789k10766n36477K7932k73789R89858M26188M97780
2682A75551O78188O0958L8229j218928J46177j31076L05958R72731n4818m3072
2672I29898l18408k18770q4210r27519R60182J45319p38006J17909L50177j64688
$$ plain form
2662 51884 -136859 -177332 -175971 565988 226779 117076 -208919 -667920 -915562 -669880
2652 -669880 -208892 -280877 -47035 -562195 243984 901277 503089 -102298 -247150 24825
2642 24825 295183 -493885 -521214 -186415 -1210010 -394816 339350 545400 772095 1280339
2632 1280339 859034 710968 483481 627720 1038472 1342297 1343597 775652 462486 715212
2622 715212 144606 -118670 -234762 -597210 -38410 -214224 37766 563490 717895 493981
2612 493981 -484522 -624510 44266 1331604 1679904 1219211 1351662 748063 278066 190060
2602 190060 222353 -633177 -766665 -117882 -373760 36227 43733 64706 458931 518291 1391844
2591 1391844 337093 -123432 839817 643217 610867 934112 485719 -47923 -450005 171655
$$ packed form
2662E1884j88743m0473J361P41959l39209j09703l25995m59001k47642K45682
2652f69880M60988p1985K33842n15160Q06179O57293l98188o05387j44852K71975
2642B4825K70358p89068k7329L34799j023595Q15194P34166K06050K26695N08244
2632A280339m21305j48066k27487J44239M10752L03825J300n67945l13166K52726
2622G15212n70606k63276j16092l62448N58800j75814K51990N25724J54405k23914
2612D93981r78503j39988O68776J287338L48300m60693J32451o03599m69997q8006
2602A90060L2293q55530j33488O48783k55878M09987P506K0973L94225N9360Q73553
2591A391844j054751m60525R63249j96600l2350L23245m48393n33642m02082O21660
$$ plain form
2581 171655 414104 886041 832873 105870 -571504 -386447 -220665 -181029 118220 576133
2571 576133 934610 1163911 544209 -586491 -21143 19049 -437149 -231940 -498168 -77804
2561 -77804 21065 -954614 -84066 158225 -379245 -542116 492530 847053 451022 1141716
2551 1141716 685393 637386 953546 570444 375916 -80604 347459 516298 461006 -26529
2541 -26529 356760 142967 1052386 1231701 381408 -180272 95817 150046 452970 4635
2531 4635 607505 1117844 938784 1721175 1075969 827607 308314 -97742 -768109 -138815
2521 -138815 124168 -838188 -132131 84724 215129 161679 115774 145984 278048 629584
2511 629584 551252 71756 68210 513729 889218 1051062 1435576 1987318 1890485 669199
$$ packed form
2581A71655K42449M71937n3168p27003o77374J85057J65782L9636K99249M57913
2571E76133L58477K29301o19702j130700N65348M0192m56198K05209k66228M20364
2561g7804R8869r75679Q70548K42291n37470j62871J034646L54523l96031O90694
2551A141716m56323m8007L16160l83102j94528m56520M28063J68839n5292m87535
2541b6529L83289k13793R09419J79315q50293n61680K76089N4229L02924m48335
2531D635O02870N10339j79060P82391o45206k48362n19293m06056o70367O29294
2521a38815K62983r62356P06057K16855J30405n3450m5905L0210J32064L51536
2511F29584p8332m79496l546M45519L75489J61844L84514N51742r6833j221286
$$ plain form
2501 669199 238132 29988 766041 1122933 1592284 483059 192607 653180 1031574 513947
2491 513947 -110688 145601 624037 939597 149197 -276512 388502 757302 817999 1385100
2481 1385100 525764 1247666 1078896 891269 469904 312218 292083 561216 565166 1095216
2471 1095216 1612473 1445039 226700 334054 450059 342544 1037185 1053618 1162077 2278680
2461 2278680 1643739 1690198 1964152 2231402 2313877 3063618 2995459 2084823 2372903 2716575
2451 2716575 2022168 2695672 1653107 1940988 1948200 1483828 2186615 1509722 2259825 2563944
2441 2563944 2528313 2628674 2250029 1929081 2729074 3214251 3135170 3794312 3786632 3720897
2431 3720897 3790469 4033043 3743137 4037162 3662844 3653397 4013742 4369861 4822776 5258805
$$ packed form
2501F69199m31067k08144P36053L56892M69351j109225k90452M60573L78394n17627
2491E13947o24635K56289M78436L15560p90400m25709O65014L68800O0697N67101
2481A385100q59336P21902j68770j87627m21365j57686k0135K69133L950N30050
2471A095216N17257j67434j218339J07354J16005j07515O94641J6433J08459J116603
2461B278680o34941M6459K73954K67250Q2475P49741o8159r10636K88080L43672
2451B716575o94407O73504j042565K87881P212m64372P02787o76893P50103L04119
2441B563944l5631J00361l78645l20948P99993M85177p9081O59142p680o5735
2431C720897O9572K42574k89906K94025l74318r447L60345L56119M52915M36029
$$ plain form
2421 5258805 4870051 4249565 5206935 6336543 5770044 5236823 5014260 4701358 5328987
2412 5328987 5757209 7521614 7556540 7334750 7297177 6024838 5680940 6096343 6206537 6324788
2402 6324788 5653147 6955882 7156696 7613842 8199737 8403490 8766483 9044649 8462898
2393 8462898 9595980 9445902 9738679 10816921 10528727 10663369 11721861 12665585 12360730
2384 12360730 12981460 14191158 14701500 14873697 15266755 16298425 16864517 16449620 17089756
2375 17089756 17950731 19097185 18793271 18129997 19699629 19881211 20338634 21426587 22556691
2366 22556691 24238714 24553651 25158735 25345305 26356456 28720331 30832360 32678829 35586171
2357 35586171 39468267 42911269 44891499 47261572 50285776 54147503 59419773 65609562
$$ packed form
2421E258805l88754o20486R57370J129608n66499n33221k22563l12902O27629
2412E328987M28222J764405L4926k21790l7573j272339l43898M15403J10194J18251
2402F324788o71641J302735K00814M57146N85895K03753L62993K78166n81751
2393H462898J133082j50078K92777J078242k88194J34642J058492R43724l04855
2384A2360730O20730J209698N10342J72197L93058J031670N66092m14897O40136
2375A7089756Q60975J146454l03914o63274J569632J81582M57423J087953J130104
2366B2556691J682023L14937O05084J86570J011151K363875K112029J846469K907342
2357C5586171L882096L443002J980230K370073L024204L861727N272270O189789
$$ plain form
2349 65609562 74296344 85204771 98751730 118410022 143749450 174695540 216741381
2342 216741381 262217990 282095726 250237823 196985841 152148718 119142051 96974997
2335 96974997 81089388 69274615 60082306 53343923 48485186 44369716 41068673 39383670
2327 39383670 37951391 36042469 34891492 31770731 28949872 26445784 24791524 23355326
2319 23355326 21590953 19876006 18415924 17549677 16027525 15711969 15130164 15403186 14413648
2310 14413648 13728555 12853676 12029132 11217919 11201634 11094802 11409625 10466409 9169461
2301 9169461 9586917 9696885 8486875 7683173 8532175 8341694 7733813 6819864 5966796
2292 5966796 6367384 5683494 6040465 5910872 5531715 5011492 4682746 4771652 5296105 5309199
$$ packed form
2349F5609562Q686782J0908427J3546959J9658292K5339428L0946090M2045841
2342B16741381M5476609J9877736l1857903n3251982m4837123l3006667k2167054
2335I6974997j5885609j1814773r192309o738383m858737m115470l301043j685003
2327C9383670j432279j908922j150977l120761k820859k504088j654260j436198
2319B3355326j764373j714947j460082q66247j522152l15556n81805K73022r89538
2310A4413648o85093q74879q24544q11213j6285j06832L14823r43216j296948
2301I169461M17456J09968j210010q03702Q49002j90481o07881r13949q53068
2292E966796M00588o83890L56971j29593l79157n20223l28746Q8906N24453J3094
$$ plain form
2282 5309199 4874106 4806674 4261642 4411230 4742149 4810681 4130819 3500761 3458730 3473933
2272 3473933 3866160 3629301 3348356 3305793 3429719 3219543 2805628 2837858 2707279 2829772
2262 2829772 2904534 2270016 2319814 3115129 3333763 2699433 2680428 2478035 2506067 2835231
2252 2835231 2574849 2176297 2299984 2569262 3321076 2998324 2902820 2894481 2424342 2794393
2242 2794393 2369675 1449890 1629071 2023243 2080732 1376729 1787183 1661723 1214249 2164546
2232 2164546 2194715 1512072 1556190 1138905 1609679 1773666 1711445 1629191 2140233 2014531
2222 2014531 2368356 2195894 2272983 1922274 1578828 1974348 1184575 904574 1068858 1916375
2212 1916375 886704 911663 1565138 2143703 1194194 484307 639093 1250793 306920 426692
$$ packed form
2282E309199m35093o7432n45032J49588L30919O8532o79862o30058m2031J5203
2272C473933L92227k36859k80945m2563J23926k10176m13915L2230j30579J22493
2262B829772P4762o34518M9798P95315K18634o34330j9005k02393K8032L29164
2252B835231k60382l98552J23687K69278P51814l22752r5504q339m70139L70051
2242B794393m24718r19785J79181L94172N7489p04003M10454j25460m47474R50297
2232B164546L0169o82643M4118m17285M70774J63987o2221q2254N11042j25702
2222B014531L53825j72462P7089l50709l43446L95520p89773k80001J64284Q47517
2212A916375j029671K4959O53475N78565r49509p09887J54786O11700r43873J19772
$$ plain form
2202 426692 1476453 1634692 786222 568962 778536 821321 1057389 1364897 1440032 1529371
2192 1529371 1984575 1438080 680938 546656 68072 102398 430190 75718 734330 1531260
2182 1531260 1381912 783939 130809 -316425 -172232 155193 47852 1179398 608583
2173 608583 412584 1532780 1816946 1320770 599369 233107 202684 -265166 240810 52653
2163 52653 -6604 -290515 875023 1064147 633348 34458 326456 403489 -194983 165515
2153 165515 -54028 -145191 116467 44888 349108 854541 994880 82153 94268 115685
2143 115685 -1263012 -530551 368358 264053 -305422 183872 186647 -282294 -1009570 119800
2133 119800 501163 446410 944563 679818 327329 483292 -43529 600797 942746 91254
$$ packed form
2202D26692J049761J58239q48470k17260K09574M2785K36068L07508P5135Q9339
2192A529371M55204n46495p57142j34282m78584L4326L27792l54472O58612P96930
2182A531260j49348n97973o53130m47234J44193L27425j07341J131546n70815
2173F08583j95999J120196K84166m96176p21401l66262l0423m67850N05976j88157
2163E2653n9257k83911J165538J89124m30799n98890K91998P7033n98472L60498
2153A65515k19543r1163K61658p1579L04220N05433J40339r12727J2115K1417
2143A15685j378697P32461Q98909j04305n69475M89294K775m68941p27276J129370
2133A19800L81363n4753M98153k64745l52489J55963n26821O44326L41949q51492
$$ plain form
2123 91254 115423 259772 -216634 303614 538605 575267 305748 179003 -491476 -805729
2113 -805729 -412399 -641880 515490 658192 235042 -34303 -764918 -200528 -55853 -270953
2103 -270953 305859 501252 720764 614820 583146 -3686 -632576 663475 1311781 1626594
2093 1626594 1448557 439543 27307 102401 66213 652348 158928 373986 868367 545093
2083 545093 1453830 1425623 544760 471514 118546 777242 1685531 1507613 1019667 1457481
2073 1457481 1518429 816370 496786 589426 1630180 1085516 556333 502666 491423 622256
2063 622256 -173536 -805942 -543248 -260240 -516960 -4116 -220548 -440631 -93649 -184116
2053 -184116 186639 -174748 -206011 151505 292914 681868 123827 6826 261403 -513441
$$ packed form
2123I1254K4169J44349m76406N20248K34991L6662k69519j26745o70479l14253
2113h05729L93330k29481J157370J42702m23150k69345p30615N64390J44675k15100
2103b70953N76812J95393K19512j05944l1674n86832o28890J296051O48306L14813
2093A626594j78037j009014m12236P5094l6188N86135m93420K15058M94381l23274
2083E45093R08737k8207q80863p3246l52968O58696R08289j77918m87946M37814
2073A457481O0948p02059l19584R2640J040754n44664n29183n3667j1243J30833
2063F22256p95792o32406K62694K83008k56720N12844k16432k20083L46982r0467
2053a84116L70755l61387l1263L57516J41409L88954n58041j17001K54577p74844
$$ plain form
2043 -513441 -465061 -695369 -335137 -111326 -277893 -134117 -280479 -389958 -211753 136684
2033 136684 607 4392 374302 190160 -31116 846136 267299 423947 782052 -334992
2023 -334992 -1515751 -1189245 79893 302052 314542 81724 74572 -469727 -373105 -426843
2013 -426843 -650009 -177653 37764 -601012 -833177 -379112 -677757 -152201 -745905 -625587
2003 -625587 -265599 -232480 126651 266760 -601188 -1089189 -868650 -463494 -75188 103607
1993 103607 -356049 766634 1298689 -121462 425447 306993 244853 -385191 -608710 -469621
1983 -469621 -455471 -286429 742903 835143 745938 521435 532520 707987 109870 -1200778
$$ packed form
2043e13441M8380k30308L60232K23811j66567J43776j46362j09479J78205L48437
2033A36684j36077L785L69910j84142k21276Q77252n78837J56648L58105j117044
2023c34992j180759L26506J269138K22159J2490k32818p152n44299R6622n3738
2013d26843k23166M72356K15417o38776k32165M54065k98645N25556n93704J20318
2003f25587L59988L3119L59131J40109q67948m88001K20539M05156L88306J78795
1993A03607m59656J122683N32055j420151N46909j18454o2140o30044k23519J39089
1983d69621J4150J69042J029332R2240q9205k24503J1085J75467n98117j310648
$$ [...]
##END NTUPLES=NMR SPECTRUM
##END=
