##TITLE=1H_CA-9214-31
 CDCl3
 8 sc, 
 1.12.2023
##JCAMPDX= 6.0         $$ Bruker NMR JCAMP-DX V2.0
##DATA TYPE= NMR SPECTRUM
##DATA CLASS= NTUPLES
##ORIGIN= UXNMR, Bruker Analytische Messtechnik GmbH
##OWNER= root
$$ XWIN-NMR		Version 3.5
$$ Fri Dec  1 14:16:07 2023 Russian Standard Time (UT+4h)  she@DPX200
##.OBSERVE FREQUENCY= 200.1313
##.OBSERVE NUCLEUS= ^1H
##.ACQUISITION MODE= SIMULTANEOUS
##.ACQUISITION SCHEME= undefined
##.AVERAGES= 8
##.DIGITISER RES= 18
##SPECTROMETER/DATA SYSTEM= spect
##.PULSE SEQUENCE= zg30
##.SOLVENT NAME= CDCl3
##.SHIFT REFERENCE= (INTERNAL, CDCl3, 0, 15.4164)
##AUDIT TRAIL= $$ (NUMBER, WHEN, WHO, WHERE, WHAT)
$$ ##TITLE= Audit trail, XWIN-NMR		Version 3.5
$$ ##JCAMPDX= 5.01
$$ ##ORIGIN= Bruker BioSpin GmbH
$$ ##OWNER= she
$$ F:/spectra/data/she/nmr/H-F/1/pdata/1/auditp.txt
$$ ##AUDIT TRAIL=  $$ (NUMBER, WHEN, WHO, WHERE, WHAT)
(   1,<2023-12-01 14:14:40.28 +0400>,<she>,<DPX200>,
      <created by zg, POWCHK disabled, PULCHK disabled
       configuration hash MD5:
       00 E9 B6 7A A2 85 ED C7 34 08 36 98 17 FE 4E 26
       data hash MD5: 16K
       F1 C7 3A 04 5E C1 18 FC 97 AB 30 9E 62 19 69 8B>)
(   2,<2023-12-01 14:14:42.68 +0400>,<she>,<DPX200>,
      <Start of raw data processing
       efp BC_mod = 2 LB = 0.24 FT_mod = 6 PKNL = 1 PHC0 = -24588.15 PHC1 = 7.25271 SI = 16K 
       data hash MD5: 16K
       7A 18 53 E2 6D 53 52 32 07 0B 59 68 E1 A1 7D 1A>)
(   3,<2023-12-01 14:15:06.59 +0400>,<she>,<DPX200>,
      <pk PHC0 = -1.855574 PHC1 = 2.4 
       data hash MD5: 16K
       52 5D 09 5D EC 28 EA 95 C2 F5 49 90 C4 69 01 87>)
(   4,<2023-12-01 14:15:10.10 +0400>,<she>,<DPX200>,
      <abs ABSG = 5 
       data hash MD5: 16K
       76 B0 D6 DF 5A 24 57 99 3A B6 D9 F2 DE A8 FA 50>)
$$ ##END=
$$ 
$$ hash MD5
$$ FE 4C B9 3D 2B 57 3D 46 FA 2C B1 3F F0 E5 BF AF
##$RELAX= 
##$RELAX= 
##$RELAX= 
##$RELAX= 
##$RELAX= 
##$RELAX= 
$$ Bruker specific parameters
$$ --------------------------
##$DU= <F:/spectra>
##$EXPNO= 1
##$NAME= <H-F>
##$PROCNO= 1
##$TYPE= <nmr>
##$USER= <she>
##$AMP= (0..31)
100 100 100 100 100 100 100 100 100 100 100 100 100 100 100 100 100 100 
100 100 100 100 100 100 100 100 100 100 100 100 100 100 
##$AQSEQ= 0
##$AQ_mod= 1
##$AUNM= <au_zg>
##$AUTOPOS= <>
##$BF1= 200.13
##$BF2= 200.13
##$BF3= 200.13
##$BF4= 200.13
##$BF5= 200.13
##$BF6= 200.13
##$BF7= 200.13
##$BF8= 200.13
##$BYTORDA= 1
##$CFDGTYP= 0
##$CFRGTYP= 5
##$CHEMSTR= <none>
##$CNST= (0..31)
1 1 145 1 1 1 1 1 1 1 1 1 1 1 1 1 1 1 1 1 1 1 1 1 1 1 1 1 1 1 1 1 
##$CPDPRG= <>
##$CPDPRG1= <>
##$CPDPRG2= <>
##$CPDPRG3= <>
##$CPDPRG4= <mlev>
##$CPDPRG5= <mlev>
##$CPDPRG6= <mlev>
##$CPDPRG7= <mlev>
##$CPDPRG8= <mlev>
##$CPDPRGB= <>
##$CPDPRGT= <>
##$D= (0..31)
0 1.2 0 0 0 0 0 0 0 0.06 0 0.03 0 0 0 0 0.0002 0 0 0 0 0 0 0 0 0 0 0 0 
0 0 0 
##$DATE= 1701425679
##$DBL= (0..7)
120 120 120 120 120 120 120 120 
##$DBP= (0..7)
150 150 150 150 150 150 150 150 
##$DBP07= 0
##$DBPNAM0= <>
##$DBPNAM1= <>
##$DBPNAM2= <>
##$DBPNAM3= <>
##$DBPNAM4= <>
$$ [...]
##$SUBNAM3= <"">
##$SUBNAM4= <"">
##$SUBNAM5= <"">
##$SUBNAM6= <"">
##$SUBNAM7= <"">
##$SUBNAM8= <"">
##$SUBNAM9= <"">
##$SW= 18.0517328524113
##$SWIBOX= (0..15)
0 0 2 0 0 0 0 0 0 0 0 0 0 0 0 0 
##$SW_h= 3612.71676300578
##$TD= 16384
##$TD0= 1
##$TE= 0
##$TE2= 300
##$TE3= 300
##$TEG= 300
##$TL= (0..7)
0 120 120 120 120 120 120 120 
##$TP= (0..7)
150 150 150 150 150 150 150 150 
##$TP07= 0
##$TPNAME0= <>
##$TPNAME1= <>
##$TPNAME2= <>
##$TPNAME3= <>
##$TPNAME4= <>
##$TPNAME5= <>
##$TPNAME6= <>
##$TPNAME7= <>
##$TPOAL= (0..7)
0.5 0.5 0.5 0.5 0.5 0.5 0.5 0.5 
##$TPOFFS= (0..7)
0 0 0 0 0 0 0 0 
##$TUNHIN= 0
##$TUNHOUT= 0
##$TUNXOUT= 0
##$USERA1= <user>
##$USERA2= <user>
##$USERA3= <user>
##$USERA4= <user>
##$USERA5= <user>
##$V9= 5
##$VALIST= <valist>
##$VCLIST= <CCCCCCCCCCCCCCC>
##$VD= 0
##$VDLIST= <DDDDDDDDDDDDDDD>
##$VPLIST= <PPPPPPPPPPPPPPP>
##$VTLIST= <TTTTTTTTTTTTTTT>
##$WBST= 1024
##$WBSW= 4
##$XGAIN= (0..3)
0 0 0 0 
##$XL= 0
##$YL= 0
##$YMAX_a= 484498
##$YMIN_a= -670416
##$ZGOPTNS= <>
##$ZL1= 120
##$ZL2= 120
##$ZL3= 120
##$ZL4= 120
##$ABSF1= 15.46373
##$ABSF2= -2.58812
##$ABSG= 5
##$ABSL= 3
##$ALPHA= 0
##$AQORDER= 0
##$ASSFAC= 0
##$ASSFACI= 0
##$ASSFACX= 0
##$ASSWID= 0
##$AUNMP= <proc_1d>
##$AZFE= 0.1
##$AZFW= 0.1
##$BCFW= 0
##$BC_mod= 2
##$BYTORDP= 0
##$COROFFS= 0
##$CY= -3
##$DATMOD= 1
##$DC= 0
##$DFILT= <>
##$DTYPP= 0
##$F1P= 0
##$F2P= 0
##$FCOR= 1
##$FTSIZE= 16384
##$FT_mod= 6
##$GAMMA= 0
##$GB= 0
##$INTBC= 1
##$INTSCL= 3.70164e-10
##$ISEN= 128
##$LB= 0.24
##$LEV0= 0
##$LPBIN= 0
##$MAXI= 10000
##$MC2= 0
##$MEAN= 0
##$ME_mod= 0
##$MI= 1.114404
##$NCOEF= 0
##$NC_proc= -6
##$NLEV= 6
##$NOISF1= 3.799351
##$NOISF2= 2.8
##$NSP= 0
##$NTH_PI= 0
##$NZP= 0
##$OFFSET= 15.41635
##$PC= 1
##$PHC0= -24590.01
##$PHC1= 9.65271
##$PH_mod= 1
##$PKNL= yes
##$PPARMOD= 0
##$PSCAL= 0
##$PSIGN= 0
##$REVERSE= no
##$SF= 200.130021084782
##$SI= 16384
##$SIGF1= 3
##$SIGF2= 2
##$SINO= 5.538805
##$SIOLD= 16384
##$SREGLST= <1H.CDCl3>
##$SSB= 0
##$STSI= 16384
##$STSR= 0
##$SW_p= 3612.71676300578
##$SYMM= 0
##$S_DEV= 0
##$TDeff= 16384
##$TDoff= 0
##$TI= <>
##$TILT= no
##$TM1= 0
##$TM2= 0
##$TOPLEV= 0
##$USERP1= <user>
##$USERP2= <user>
##$USERP3= <user>
##$USERP4= <user>
##$USERP5= <user>
##$WDW= 1
##$XDIM= 16384
##$YMAX_p= 288509408
##$YMIN_p= -506985
$$ End of Bruker specific parameters
$$ ---------------------------------
##NTUPLES= NMR SPECTRUM
##VAR_NAME=  FREQUENCY,     SPECTRUM/REAL,   SPECTRUM/IMAG
##SYMBOL=    X,             R,               I
##VAR_TYPE=  INDEPENDENT,   DEPENDENT,       DEPENDENT
##VAR_FORM=  AFFN,          ASDF,            ASDF
##VAR_DIM=   16384,         16384,           16384
##UNITS=     HZ,            ARBITRARY UNITS, ARBITRARY UNITS
##FACTOR=    0.220516191357247, 1,           1
##FIRST=     3085.27452353481, 0,            0
##LAST=      -527.442239470973, 0,           0
##MIN=       -527.442239470973, -506985,     0
##MAX=       3085.27452353481, 288509408,    0
$$ Real data points
##PAGE= N=1
##DATA TABLE= (X++(R..R)), XYDATA
$$ [...]
7838h2404K546O1031K7404l1978n4705R7806R0324j5223m1231L9566m0202n8873
7826e939Q668J5016n9544l9272R4117J6065k0734K0204L3860k9562j22380R4779
7814E278L3093m1388L1962n9179J461L7900k9049N300p148Q4893J94474l36965
7802g9368j43554K16226L6817K3191R3719n9354n0582L0494j04152O006M203J0169
7790a6185n0336M9518L6408p7604Q0873O0832j44268M4196p1135l8631R4625L3027
7778A320k2212K8226K9849J8938o9856r1754J22093l3765o2951K5231J5497J4832
7766b4552N5603p2168K242o996j6822M1916l1998k1372j4187l3613J21514K5878
7754B5445k9728J7219M413o3090l3132l2691M0164l4582O7212M9903k9431j7714
$$ plain form
7838 -82404 -79858 -18827 8577 -23401 -78106 19700 110024 94801 53570 93136 52934 -5939
7826 -5939 2729 17745 -41799 -81071 13046 29111 8377 28581 62441 32879 -89501 5278
7814 5278 38371 -3017 28945 -30234 -28773 9127 -19922 -14622 -21770 63123 257597 -79368
7802 -79368 -222922 -6696 30121 53312 147031 87677 37095 67589 -36563 -30557 -26354 -16185
7790 -16185 -66521 -17003 19405 -58199 22674 83506 -60762 -16566 -87701 -126332 -31707 1320
7778 1320 -20892 7334 37183 56121 -13735 -105489 16604 -17161 -80112 -54881 -39384 -24552
7766 -24552 31051 -41117 -38875 -45871 -62693 -20777 -52775 -74147 -88334 -121947 -433 25445
7754 25445 -4283 12936 17349 -45741 -78873 -111564 -71400 -105982 -38770 11133 -18298 -36012
7742c6012m6467R7600m1890j207n5579n8862o830J254K3467n9799R2155k6034
7730a18204n7110k1155R1318K5054M582O8366q9585J0652M0183M4741J0148j6437
7718g447O2017n3830n077k1916m6733N0801j25277J0634J64101m7492j48689K9580
7706a39328Q0869Q1834K6154j45470m3107K6290q9904Q7997Q9383j46850O4075
7695a08057J59141r3331M5698Q4199l2731o6693q5575n5436M5198L4078j697L8273
7683c6933O9208j9403j51557O7237j8173Q6687M3833o6997k1793l0131k1141K9348
7671f9815K3890K5189J07099M9395j05497p3232P6780p3593r8897M7448N3882
7660c7351j1780M0469l1402j4402L3320p7740j34827M2922Q9050j0368m2243P3360
$$ plain form
7742 -36012 -82479 15121 -26769 -27976 -83555 -142417 -149247 -147993 -124526 -184325 -92170 -118204
7730 -118204 -175314 -196469 -105151 -80097 -75515 -7149 -96734 -86082 -45899 -1158 8990 -7447
7718 -7447 54570 740 -4337 -26253 -72986 -22185 -147462 -136828 27273 -20219 -168908 -139328
7706 -139328 -58459 23375 49529 -95941 -139048 -112758 -202662 -114665 -25282 -172132 -108057
7695 -108057 51084 -42247 3451 87650 54919 -11774 -97349 -152785 -107587 -73509 -75206 -36933
7683 -36933 32275 12872 -138685 -71448 -89621 -2934 40899 -26098 -47891 -78022 -99163 -69815
7671 -69815 -45925 -20736 86363 135758 30261 -42971 33809 -39784 -138681 -91233 -37351
7660 -37351 -49131 -8662 -40064 -54466 -21146 -98886 -233713 -190791 -101741 -112109 -154352 -80992
7648h0992p2139K0922L3509n9129Q9107N9935L526p0523p6618M6455j6083n6340
7636a78370L5915M5565P4731L5808m6132n3059k7110J921n2675L6051l5837L6621
7624a26571L4674p917J15473n4061n3164J489L1406k5080k926l5324n66P8863
7612d3704r4416J3496J721O0652K1314l04p0755R7654j32825r6437O7941j4610
7600a90273m7076J1642J34646K696O1084n0440M9820m2840j6553J0286Q8301O9504
7588H0797q8092j18146K2853m633R1267j9281q0666R1058N020k893L3827r7309
7576h6198M3357n467j02933J8881J22242r2441o240k0994O7353O0119n8955L7781
7564b3495p8284M8345l3133k5450L7649j08388n0851N0587P6795l4583j9935N3858
$$ plain form
7648 -80992 -153131 -132209 -98700 -157829 -68722 -8787 -5261 -75784 -152402 -105947 -122030 -178370
7636 -178370 -142455 -96890 -22159 13649 -32483 -85542 -112652 -110731 -163406 -127355 -163192 -126571
7624 -126571 -91897 -99814 15659 -38402 -91566 -90077 -58671 -83751 -86677 -122001 -122567 -43704
7612 -43704 -138120 -124624 -122903 -62251 -40937 -41241 -111996 -14342 -147167 -243604 -175663 -190273
7600 -190273 -237349 -225707 -91061 -88365 -27281 -77721 -27901 -70741 -87294 -77008 11293 80797
7588 80797 -7295 -125441 -102588 -107221 -15954 -35235 -115901 -24843 -19823 -22716 11111 -86198
7576 -86198 -42841 -48308 -151241 -132360 -10118 -102559 -108799 -129793 -62440 -2321 -61276 -23495
7564 -23495 -101779 -53434 -86567 -112017 -74368 -182756 -233607 -183020 -106225 -140808 -160743 -106885
7552a06885j7264n2280J5041J25802j35381m4507J6738J00855O8487j01188j09467
7541b40049N1611k8646K00175l7650p6516J2898j14279Q9169K6264M6723o7297
7530a37597R3368k4877N19J5337j04798J8611N1934k9664n9688L5904j2346m6608
7518a99905N0278O842l6533N4644K8053N1347M4832o295p2835L8805l0776K4985
7506d6558p1410r329Q268N0N9170O6245M0440m0497k4543o2985o9717k3197K1047
7493a53016j0369o187K3497L6162J2879N5618m0790P7428N8188L3581q3168k1568
7481a7745P76q0386r8309M898M0239Q6504L7484K0910o0359o1831Q7427k6870
7469f7262N0892o0756O4502O9792j51068J1895j802n2055n6275J22235M4563r267
$$ plain form
7552 -106885 -124149 -176429 -161388 -35586 -170967 -215474 -198736 -97881 -29394 -130582 -240049
7541 -240049 -188438 -217084 -16909 -54559 -131075 -118177 -232456 -143287 -117023 -70300 -137597
7530 -137597 -44229 -69106 -68587 -53250 -158048 -139437 -87503 -117167 -176855 -140951 -153297 -199905
7518 -199905 -149627 -142785 -179318 -124674 -96621 -45274 -442 -6737 -79572 -40767 -71543 -46558
7506 -46558 -117968 -127297 -119029 -118979 -59809 6436 46876 6379 -18164 -81149 -150866 -174063 -153016
7493 -153016 -163385 -169572 -146075 -109913 -97034 -41416 -82206 -4778 53410 86991 3823 -17745
7481 -17745 -16969 -97355 -195664 -190766 -150527 -64023 -26539 -5629 -65988 -127819 -40392 -67262
7469 -67262 -16370 -77126 -12624 57168 -93900 -82005 -83807 -135862 -192137 -69902 -25339 -34606
7457c4606k12O1809Q6284k0086j33223J3668L7235o5427n240l0674J47384k3829
7445C3083j05924l097J8640k9783M6100M4460j51411R3534o4910o0516O5995l7394
7433a51223K2608J1907K1648j03887K1801O7883k5103l1778o3673M3827l2750
7422b18740O0805K7694J6980N1057j16558O5230J32001l4890J0966j101O1970
7411E5414r7321j07136J63246P4748m8320j22957l1703k956N3804M1752L0625
7400I196N064q0132n3146N4294M7375k7960q4737N5847q1515K249j6324K0968
7388a48821M9462L8706K5418p9117Q2172P616m5823j05856P9515O2769l8391p5575
7376a47925j7746R0347q014m8534J01099m5326L453Q0420n2526o8165j2104J42450
$$ plain form
7457 -34606 -34818 26991 113275 93189 -40034 -26366 10869 -54558 -59798 -90472 56912 33083
7445 33083 -72841 -75938 -57298 -87081 -40981 3479 -147932 -54398 -119308 -179824 -113829 -151223
7433 -151223 -128615 -116708 -95060 -198947 -177146 -109263 -134366 -166144 -229817 -185990 -218740
7422 -218740 -157935 -130241 -113261 -62204 -178762 -113532 18469 -16421 -5455 -6556 55414
7411 55414 -41907 -149043 14203 88951 40631 -82326 -114029 -116985 -63181 -21429 9196
7400 9196 14260 -65872 -119018 -64724 -17349 -45309 -130046 -74199 -155714 -153465 -169789 -148821
7388 -148821 -99359 -60653 -35235 -114352 -32180 -24564 -70387 -176243 -96728 -33959 -72350 -147925
7376 -147925 -165671 -75324 -83338 -131872 -30773 -76099 -72646 7774 -44752 -112917 -125021 17429
7364A7429j43112L195K0993j0937l8423R0944K7623n6436N0658J0457k7892K9396
7352b6105K18n0351n5384M7591K5989p9772J6040L4577L2635K9073j10592K9576
7340a06505K133Q7446q4629K9865J26606k22710J2762R0396l9928k374o3868k6846
7328a97652J6466N4717P0451M215o8826p6042P7866K5420J6719o1199Q118J25713
7316d034l8013k7598J4881n2867n4617M2671O2286K5409P8099m2246K4308J0145
7304C8424j34115p2721J79727l489M922q380l8476n1062k1012l0364J1739R4620
7292c0187L1185l6679p6292J0954l1252l8774J03912J22547j6971p9425j122m4803
7280h6907N7533P4305L7902j15196j46737Q3739J19393Q228m2680n6979O2878
$$ plain form
7364 17429 -125683 -122488 -101495 -112432 -150855 -59911 -32288 -88724 -38066 -27609 -55501 -26105
7352 -26105 -25887 -76238 -131622 -84031 -58042 -137814 -121774 -87197 -54562 -25489 -136081 -106505
7340 -106505 -104372 -16926 -101555 -71690 54916 -167794 -155032 -64636 -104564 -106938 -170806 -197652
7328 -197652 -181186 -126469 -56018 -51803 -120629 -196671 -118805 -93385 -76666 -137865 -129747 -4034
7316 -4034 -42047 -69645 -54764 -107631 -162248 -119577 -57291 -31882 46217 3971 28279 38424
7304 38424 -95691 -168412 11315 7826 12748 4368 -34108 -85170 -106182 -136546 -124807 -30187
7292 -30187 998 -35681 -111973 -101019 -132271 -171045 -67133 55414 38443 -40982 -42104 -86907
7280 -86907 -29374 44931 82833 -32363 -179100 -95361 24032 32260 -10420 -67399 -4521
7269d521k6101K7149l4829r146J938R554J2368j49118m5153J29274k5822l0210
7257a44617J19483k826k9212K9022m7811J04658L7623j08145m9896J8609j5944
7246h9056L4937P7757o5423j6662j4821l3550M7334O497Q2680m447J0337j7997
7234A7586p3803M8932O938l9932L5015J00895r4851m9654k0713L3595P0459j60902
7222a26435M5830M7937l6883M234J5704N4211l9013L7364Q2265R836j30813J9345
7210a6418k6161j00534J5482Q8099m7243J43455J677l053r0161M230n6746l0156
7198a17529m7294r9172J97298J13586j09216m541R1991M7644N536j00511k2138
7187d4346r214o3558J08622K652k7459K2044N740q1167n4072N1774M1475J24761
$$ plain form
7269 -4521 -30622 -3473 -38302 -47448 -45510 -35956 -23588 -172706 -217859 -88585 -114407 -144617
7257 -144617 -25134 -27960 -57172 -28150 -75961 28697 66320 -41825 -91721 -73112 -89056
7246 -89056 -54119 23638 -41785 -58447 -73268 -106818 -59484 -52987 29693 25246 35583 17586
7234 17586 -56217 -7285 -347 -40279 -5264 95631 780 -48874 -69587 -35992 34467 -126435
7222 -126435 -80605 -32668 -69551 -65317 -49613 4598 -34415 2949 85214 95050 -35763 -16418
7210 -16418 -42579 -143113 -127631 -39532 -86775 56680 58357 55304 -34857 -30627 -87373 -117529
7198 -117529 -164823 -263995 -66697 46889 -62327 -66868 25123 72767 78303 -22208 -44346
7187 -44346 -53560 -117118 -8496 -5844 -33303 -11259 -5519 -86686 -140758 -88984 -47509 77252
7175G7252M7582j06001o4203l5530J4793Q589N3802K0721k8307j07031J0953K4262
7163h3118L3115J58118o691j53991o5788R9656o662k8677r1892M078Q5647K4094
7151c2111K653k4233j16050K8246J27168j02551M9256K1819l9506o1907K1278
7140a25938O0829p9848k5016M1525M9983Q092N6982K4660j9643N3405K3047o6789
7128A289l0323j0784j6384O226M5363l5461r420L1119N0352j11460o5408K6017
7116a18874k489J53330p1593q9223N1476K2013P4335n2470R084J9414K1906o1716
7104d4807o456m457K6916P8133j15348o303J11637L4318k1911q2270l8595k2333
7092i1476J22969j0268K2943J3339N2657j05932r3277j052N8539p6814N5904K4414
$$ plain form
7175 77252 124834 18833 -45370 -80900 -66107 -57518 -3716 17005 -11302 -118333 -107380 -83118
7163 -83118 -50003 108115 101424 -52567 -118355 -18699 -25361 -54038 -145930 -141852 -56205 -32111
7151 -32111 -29458 -53691 -169741 -141495 -14327 -116878 -67622 -45803 -85309 -147216 -125938
7140 -125938 -65109 -144957 -169973 -128448 -78465 -70373 -13391 11269 -8374 45031 68078 1289
7128 1289 -29034 -39818 -56202 -49976 -4613 -40074 -49494 -18375 31977 -79483 -144891 -118874
7116 -118874 -121363 31967 -39626 -128849 -77373 -55360 18975 -33495 -24411 -4997 16909 -44807
7104 -44807 -51263 -55720 -28804 49329 -66019 -72322 39315 73633 51722 -30548 -69143 -91476
7092 -91476 31493 21225 44168 57507 110164 4232 -89045 -90097 -31558 -108372 -52468 -28054
7080b8054j4500r8925j0942k7054J01602R2089l3346n1473l2127L7771o0281n0834
7068a76074J03190J08597R623m922o9726L9732j9799j7157l6294J10398p6783
7057b9215L3676n6427N0235J8194j00991Q1785Q2278n7308j07435L8156J77924
7046A30872m1234j26863p2432n183l2617J20839O8984P644j5150j22460J4399
7035g3201L3597l6257l5844R9512K5563L7849M022j51194J5530J4010L5755P3968
7023D3310Q6088L736J8126j6413m1341k7949r3511m2413P2000r0933P9119J44062
7011A33881p6428J287o7928J7107M2747j20374j6455J30470M123r2571k7168K2197
6999d9112q534Q2975M4071o4820j06355R587k3889J09501m858k9226J00697p8645
$$ plain form
7080 -28054 -42554 -141479 -152421 -179475 -77873 14216 -19130 -70603 -102730 -64959 -125240 -176074
7068 -176074 -72884 35713 45336 40414 -29312 10420 -9379 -26536 -62830 47568 -29215
7057 -29215 4461 -51966 -1731 16463 -84528 -2743 79535 22227 -85208 -47052 130872
7046 130872 89638 -37225 -109657 -114840 -147457 -26618 42366 50010 34860 -87600 -73201
7035 -73201 -39604 -75861 -111705 -12193 13370 51219 55241 -95953 -80423 -66413 -30658 43310
7023 43310 129398 133134 151260 134847 93506 65557 -27954 -70367 1633 -89300 -10181 133881
7011 133881 57453 58740 -9188 7919 50666 -69708 -86163 44307 48430 -44141 -71309 -49112
6999 -49112 -57646 25329 69400 4580 -101775 -92188 -116077 -6576 -11434 -40660 60037 -18608
6987a8608P452l5818L8415l5498K6130O6625o5904r5616m2538J27375P7099q6664
6975c7550n6865J49152q236J8818n5884j069N5076k743n0235j40703O3448N9484
6963g307Q353n1878k5384L3741Q6229j55000k7348Q2195M0993K6254J04120j31694
6951a6726K1842J71044j00676l0963k1795R8800n7593L6524m931r2934j15412
6940a12820J7640P4557j1736l7991J7687K0730j6270Q1285k6525m8671P1828r7805
6928f8091J3195n7956L2030M4460l9416J1034L3631o189n6106R7339K7991j78648
6916a46726J5116J00155l880K3873N3669n6243m0222j00163k870O5836O8625O6527
6904D3697r0159K9117p6267n0730R1767J48752p4768j696L4762k6832K902L4849
$$ plain form
6987 -18608 -11156 -46974 -8559 -44057 -17927 48698 -17206 -112822 -155360 -27985 49114 -37550
6975 -37550 -94415 54737 46501 65319 9435 8366 63442 60699 10464 -130239 -66791 -7307
6963 -7307 1046 -50832 -76216 -42475 43754 -111246 -138594 -56399 -15406 10848 114968 -16726
6951 -16726 5116 176160 75484 44521 22726 121526 63933 100457 95526 2592 -112820
6940 -112820 -95180 -20623 -32359 -70350 -52663 -31933 -48203 33082 6557 -42114 29714 -68091
6928 -68091 -54896 -112852 -80822 -36362 -75778 -64744 -31113 -37302 -93408 3931 31922 -146726
6916 -146726 -131610 -31455 -35335 -11462 42207 -14036 -54258 -154421 -157291 -91455 -22830 43697
6904 43697 -46462 -17345 -93612 -144342 -52575 96177 21409 19713 54475 27643 30545 65394
6892F5394k3837K0677j09948N2746n4846l021N9928K4027R0735m3625j5425o9105
6880f300J0493p703K608n3093m9955J22568L2847J4037j6787Q61O7967j03274
6868A4269K3787j25852m8028M2627O0085M6661q930j5714N3699n1882j08335J76316
6856E8703j04577k1983J16603Q8322o7116j03238M6179O358q1433J9279M7023
6845D120L8936N0371L0443j16515n5931K5669q7673n193O6821R3287r3633M4955
6833d343N8287j8269j96100P2099l022J41779J52273j60849Q56K0380j5513K2200
6821F9778K675L206M6316m1065k2285o642o4191n925N24L9450N923l9163O2973
6808E1574q322l5776l7067k749P9662L2726k9146n662q6672k4769R9539N6278
$$ plain form
6892 65394 41557 62234 -47714 5032 -49814 -52835 7093 31120 121855 78230 62805 -6300
6880 -6300 4193 -3510 -902 -53995 -103950 18618 51465 65502 48715 49576 117543 14269
6868 14269 38056 -87796 -135824 -93197 -33112 13549 4619 -11095 42604 -9278 -117613 58703
6856 58703 -45874 -67857 48746 137068 69952 -33286 12893 19251 -62182 -42903 4120
6845 4120 43056 93427 123870 7355 -48576 -22907 -110580 -115773 -48952 44335 -49298 -4343
6833 -4343 53944 35675 -160425 -88326 -91348 50431 202704 41855 42711 63091 47578 69778
6821 69778 72453 75659 121975 80910 58625 51983 -12208 -18133 -17609 21841 27764 -11399 51574
6808 51574 43252 7476 -29591 -32340 47322 80048 50902 45240 -41432 -66201 33338 89616
6796H9616j12055O5226K6942M253l0551p0523n7107Q8504l4655p2808R2685R6918
6784H6445m3062k5131k705K0948M3996j18109J5144P2225J4660k0254k6513J6036
6772C3680k016K6568O329Q315j18142m8154L2327K4799N7392m2037J65475j5091
6760A29445N978q0525k8594N0530p1008o0859N7176K4322R3315n6431q3004Q685
6748a0970J6985M2936j16324O5214P5175O7371N8061p4848j13728j8369J04220
6737I5723J9833P162K989M262m096p0488m0764l0108n1620k1710K508L9932j19376
6724a65753O9736P6653p9019Q1221P2911M749j6881N1439k9281L5517n0028n5687
6712d423M2624r102J04J3067p7131j9888J07784J02560k8040n4325j7959n0945
$$ plain form
6796 89616 -22439 42787 69729 73982 43431 -27092 -84199 4305 -30350 -103158 -10473 86445
6784 86445 43383 18252 15547 36495 80491 -37618 -22474 49751 64411 44157 17644 33680
6772 33680 31664 58232 64561 72876 -45266 -93420 -61093 -36294 21098 -20939 144536 129445
6760 129445 135423 54898 26304 76834 5826 -55033 2143 26465 119780 63349 -19655 -10970
6748 -10970 6015 48951 -67373 -2159 73016 140387 198448 123600 9872 -8497 95723
6737 95723 115556 122718 125707 129969 125873 55385 14621 -15487 -67107 -88817 -86309 -46377 -165753
6724 -165753 -96017 -19364 -98383 -17162 55749 60498 43617 95056 65775 101292 51264 -4423
6712 -4423 38201 29099 29203 42270 -34861 -54749 53035 155595 127555 73230 55271 4326
6700D326P0220O3452q9895r77k3220Q09m0887J2144J0342J44529l2885o110K4434
6687A36282j26261K3940N9341n296j4777J9406p843K552j02425Q5672Q7019k3847
6675A33763k0124m4590j0235J4564n492L3929K6048N6960j6499L7545m1503N61
6663A64927n0806j89642J28760K171J5346j2372R342k4279M3494O5940n0874r3889
6651H118Q7066P7216j9706M1700m847k9l3675k6743p5899R1298J48774j4163j14085
6638A65025n5866O0968J51979J19708p1613j52567o2351m7968K65R2125J00803
6627C00508o9908P9515J07564k0836p7524N1494J8607j9157M1815R4213j4590
6616D91701j5842n2166j5838J2913j9986m6981m1376m390Q5305o4264L4332J04944
$$ plain form
6700 4326 74546 137998 48103 47126 23906 24715 -16172 -4028 6314 150843 117958 111848 136282
6687 136282 10021 33961 93302 88006 73229 92635 84792 87344 -15081 70591 157610 133763
6675 133763 113639 69049 58814 73378 67886 101815 127863 184823 168324 205869 164366 164927
6663 164927 114121 -75521 53239 55410 70756 58384 67726 43447 86941 152881 102007 8118
6651 8118 95184 172400 152694 194394 189547 189518 155843 129100 53201 144499 293273 279110 165025
6638 165025 109159 170127 322106 441814 370201 217634 155283 107315 107580 199705 300508
6627 300508 230600 310115 417679 396843 319319 370813 389420 370263 412078 506291 491701
6616 491701 475859 423693 407855 420768 400782 353801 312425 308035 393340 329076 363408 468352
6604D68352K1645m3212o2960J37365r4759p8184j0254p320O1126l8565J710L8370
6592C93314K0040O30q1797R6565m9772N9885P4708j2070N2948r1320L4209k1904
6580D75436J8776N3046l1884o8663j8617Q5758J30666j9171p679L0165p3636l6260
6568E37937M6257P9465j80610J535L563J02230M0054l8636O640O5585p3300L8688
6556F29408J09137N0874P6747p9299O266L4654J6986P2436Q863k9333N5215m2957
6544I08997m9343n9877L2263M5894l6044n9756m6515n5880P5022J74333J58735
6533A087829O0774j4102N8443o1014j65657j30684n4940K9632j4749n2056K4819
6522G68295k4249q9311O2472o8416O8990J16069q3710K0486n2849l1794o879L9199
$$ plain form
6604 468352 489997 446785 383825 521190 426431 348247 337993 330673 391799 353234 354944 393314
6592 393314 413354 413984 332187 428752 378980 438865 513573 501503 554451 463131 497340 475436
6580 475436 494212 547258 515374 446711 428094 513852 644518 625347 617668 647833 574197 537937
6568 537937 584194 663659 483049 484584 488147 590377 630431 591795 598435 664020 590720 629408
6556 629408 738545 789419 866166 786867 793133 827787 844773 917209 926072 896739 951954 908997
6544 908997 859654 799777 832040 877934 841890 782134 735619 679739 754761 929094 1087829
6533 1087829 1148603 1134501 1192944 1131930 966273 835589 780649 810281 795532 743476 768295
6522 768295 744046 654735 717207 648791 717781 833850 750140 770626 717777 685983 679104 718303
6510G18303O6435J4980L2013j3689k0460r2997p1177J34005N5382M622n1802R2448
6498H68063N811Q540n8617j22575M0163k6144R96k2210O414j21172J6684N8907
6486F54860P5546j7829r1007J3103J17036K8502J3536k0913m7369p8662N1166
6475F97969K6581N1814J7811Q497K5843K9182N7618N084r1531j7508j9266K403
6463G94497M2239O9141o802K0577K2041q3232K023M8406l8093n9490R750P4893
6451H95950M9644P874P377l695J82912m5519l062m0336J9675J3971n1619K8428
6439A061600L394M759K3710O907P0001N2470R9548j5373n5457j8392M255J1758
6427A249180N0998j820K1627R2587K6385m6991K4445k3789R9229J8657L0459j03274
$$ plain form
6510 718303 784738 799718 831731 818042 797582 704585 633408 767413 822795 827417 775615 868063
6498 868063 873874 882414 823797 701222 741385 715241 716237 694027 700441 579269 595953 654860
6486 654860 730406 712577 621570 634673 751709 780211 793747 772834 725465 646803 697969
6475 697969 724550 776364 794175 802672 828515 857697 915315 920399 828868 811360 792094 794497
6463 794497 836736 905877 899075 919652 941693 858461 860484 908890 870797 811307 821057 895950
6451 895950 945594 953468 960845 957150 1140062 1094543 1091481 1051145 1070820 1084791 1033172 1061600
6439 1061600 1064994 1069753 1093463 1100370 1170371 1222841 1322389 1307016 1251559 1233167 1237422 1249180
6427 1249180 1300178 1298358 1319985 1412572 1438957 1391966 1416411 1392622 1491851 1510508 1540967 1437693
6415A437693L1930O0332J77307N3117j08734K06402R5909j38264o0744k7764J65738
6404A892922R7586p1763M3671O6838O0250J01651R7445L8981J8625P4150K50894
6393B671250l5184L2898n4441J10971L9862P5987Q8135J48025L1610P884j6529
6382C100468n1170M5106L6435L3038J01473N2413p926L4896J639N8683J62783
6371C567838K29210P9185M669Q7812J52712M3973L114Q0502K5300L8069J05487
6360D417871J1987J7430O4096J35513J98287J24783Q6367J01326J58774J55106
6350E471540j3637J55556J86260K59757J37318K60154J57309L0745K74729K56187
6340G175918K66372K06495K01681L47798L74213K39379K65094L02069M30701L11719
$$ plain form
6415 1437693 1469623 1529955 1707262 1760379 1651645 1858047 1953956 1815692 1754948 1727184 1892922
6404 1892922 1990508 1918745 1962416 2029254 2089504 2191155 2288600 2327581 2346206 2420356 2671250
6393 2671250 2636066 2668964 2614523 2725494 2765356 2841343 2929478 3077503 3109113 3116997 3100468
6382 3100468 3049298 3094404 3130839 3163877 3265350 3317763 3309837 3344733 3346372 3405055 3567838
6371 3567838 3797048 3876233 3880902 3968714 4121426 4165399 4168513 4249015 4274315 4312384 4417871
6360 4417871 4429858 4447288 4511384 4646897 4845184 4969967 5056334 5157660 5316434 5471540
6350 5471540 5457903 5613459 5799719 6059476 6196794 6456948 6614257 6645002 6919731 7175918
6340 7175918 7442290 7648785 7850466 8198264 8572477 8811856 9076950 9379019 9809720 10121439
6330A0121439L15857M40395L67939L50377N16782M71824N88724O90303P21289
6321A4584929Q67535J144451J299332J512791J873369K123060K531916L181408
6313B9118791M069845N037261N366099M971137L047219N6048k672389m372603
6305D4621408m431445l320657j890730q42937K13506J313880K463701L608152
6297D1734878M460067M615964L185054Q3425l270237n556111o119920n426501
6289C3706619m245987l129299k317171j770679j387414j120306j048662p54702
6281A7932399o01917n64612l57748q3913j79576l5483N8404N3589p825J78514
6271A6391832J32661N5043K59215K36964K12259J43438L26765L63407L51499L83511
$$ plain form
6330 10121439 10437296 10877691 11245630 11596007 12112789 12584613 13173337 13863640 14584929
6321 14584929 15452464 16596915 17896247 19409038 21282407 23405467 25937383 29118791
6313 29118791 33188636 38225897 43591996 48563133 51610352 51666400 48994011 44621408
6305 44621408 40189963 36869306 34978576 34135639 34349145 35663025 38126726 41734878
6297 41734878 46194945 50810909 53995963 54079388 50809151 45253040 39133120 33706619
6289 33706619 29460632 26331333 24014162 22243483 20856069 19735763 18687101 17932399
6281 17932399 17330482 16765870 16408122 16324209 16144633 16109150 16167554 16221143 16213318 16391832
6271 16391832 16524493 16579536 16838751 17075715 17287974 17431412 17758177 18121584 18473083 18856594
6261A8856594L05385L35893O06196O02967O40634P01646O75116P91284Q31665
6252B4347380R75493J258288J373414J790598K146546K488339L052853L643869
6244D1076780M416675N481503P015468Q717863R864729R739223O975890J785369
6236I5073500l808548p353615q275658p016901m587310k363551n86313J476960
6228F2558564L297224N323052P014774P787572O018557J622915m291323q858272
6220H0473063j0690730j0334091q607896o739088n162605l942311l196006k776148
6212B9024188k309539j864247j531552j459768j271456j067458q88122q90856
6204A7741190o52183o68710o00890o33760m71007m63554m73295l25041l13116
$$ plain form
6261 18856594 19161979 19497872 20104068 20707035 21347669 22049315 22724431 23515715 24347380
6252 24347380 25322873 26581161 27954575 29745173 31891719 34380058 37432911 41076780
6244 41076780 45493455 50974958 57990426 66708289 76573018 86312241 93288131 95073500
6236 95073500 91264952 83911337 75635679 68618778 64031468 61667917 61081604 62558564
6228 62558564 65855788 71178840 78193614 85981186 91999743 93622658 89331335 80473063
6220 80473063 69782333 59448242 50840346 44101258 38938653 34996342 31800336 29024188
6212 29024188 26714649 24850402 23318850 21859082 20587626 19520168 18632046 17741190
6204 17741190 17089007 16420297 15819407 15185647 14714640 14251086 13777791 13452750 13139634
6195A3139634l97693l14932l76511l82122k80351l44121k54797k96373k36907
6186A0255827k13590q4618o0315j96950j88877k04603k04685j22584j40410o5312
6176H773883j72708q8383p1105m4973o235j69901N4424P0287N2443o9509L8214
6165H366437J46736l109R7897K3439j93745n7402m0967q544K6667j37414q9177
6154H130818K8216n5928N8609o1230J2572J404O3036K9157R2804J22332l4647
6143H387143Q9634J53443N8950J06000J86160J16713J94385J02725J01896K07157
6133I704206J69864J40667K04757K46106L18236L57225K28946K67740L85930L99547
6123A2423224M42769L63706M91053L19553J57306J97183J87329J76598K46755
$$ plain form
6195 13139634 12741941 12427009 12050498 11668376 11388025 11043904 10789107 10492734 10255827
6186 10255827 10042237 9957619 9897304 9700354 9511477 9306874 9102189 8979605 8839195 8773883
6176 8773883 8601175 8512792 8441687 8396714 8390479 8220578 8275002 8345289 8397732 8328223 8366437
6165 8366437 8513173 8510064 8607961 8631400 8437655 8380253 8339286 8330742 8357409 8219995 8130818
6154 8130818 8159034 8103106 8161715 8100485 8113057 8114461 8177497 8206654 8299458 8421790 8387143
6143 8387143 8476777 8630220 8689170 8795170 8981330 9098043 9292428 9395153 9497049 9704206
6133 9704206 9874070 10014737 10219494 10465600 10783836 11141061 11370007 11637747 12023677 12423224
6123 12423224 12865993 13229699 13720752 14040305 14197611 14394794 14582123 14758721 15005476
6114A5005476J60390K40919L61301K76654L98673L03700J85381L46954M91236
6105A7770684L63794M14781M09186N48603M95074O11448O15585P37599Q95505
6096B2862259Q99249J101770J082178J301805J513057J699802J916865K279996
6088C4656981K641511L137736L616664M408828N476497O601009Q193508R402363
6080G8135097R490395P193337K279509l984220q675028j0096764r177726p387754
6072E7776846n466164l789563k358576j424935p52135M646P07896J536980K117545
6063D8352540K924171M040539N432994P118434Q953064R944603Q450598L647612
6055I8864555k821044q170939j0426167r955258q167959o207359m855468l870526
$$ plain form
6114 15005476 15165866 15406785 15768086 16044740 16443413 16747113 16932494 17279448 17770684
6105 17770684 18134478 18549259 18958445 19507048 20002122 20613570 21229155 21966754 22862259
6096 22862259 23761508 24863278 25945456 27247261 28760318 30460120 32376985 34656981
6088 34656981 37298492 40436228 44052892 48461720 53938217 60539226 68732734 78135097
6080 78135097 87625492 94818829 97098338 93114118 84439090 74342326 65164600 57776846
6072 57776846 52310682 48521119 46162543 44737608 43985473 43990119 44698015 46234995 48352540
6063 48352540 51276711 55317250 60750244 67868678 76821742 86766345 95216943 98864555
6055 98864555 96043511 87872572 77446405 67491147 59323188 53115829 48260361 44389835
6047D4389835l346105k914374k343760k043658j826761j511248j144435r39192
6039B8320302o36587o43029m91758l31603j76409j74232r1412L1600J13825J55051
6029B6075748J53759L81119O04287O84026P31416P26383Q43651R07211R90141
6020C2097741J171952J602513J877361K174685K428077K256403K002639J994597
6012D7605968K338833K971967M137412M850417M431439K265177j259057m300620
6004F3041536n488165n370737m388493l058362k091091j372609o60190q1633M49031
5995D0979287P91379J285474J767417K232371K797630L653325M454913N637751
5987F3599547O764379O511498M363453N28045l416861n831438o329394o028650
$$ plain form
6047 44389835 41043730 38129356 35785596 33741938 31915177 30403929 29259494 28320302
6039 28320302 27683715 27040686 26548928 26217325 26040916 25866684 25775272 25806872 25920697 26075748
6029 26075748 26229507 26610626 27214913 27898939 28630355 29356738 30200389 31107600 32097741
6020 32097741 33269693 34872206 36749567 38924252 41352329 43608732 45611371 47605968
6012 47605968 49944801 52916768 57054180 61904597 66336036 68601213 67342156 63041536
6004 63041536 57553371 52182634 47794141 44735779 42644688 41272079 40611889 40530256 40979287
5995 40979287 41770666 43056140 44823557 47055928 49853558 53506883 57961796 63599547
5987 63599547 70363926 76875424 81238877 81766922 78350061 72518623 66189229 60160579
5979F0160579n061595m217352l549470k943061k618369k209487k103015k079226
5971C5379004j799716j514837j281885r47484p36835m02710k52094j33323j12697
5962B8197423k95167l65038p24952r18876j048171j101866j230577j158919r01658
5953B0452199p68923o66470o49145n74495m21183l92115k89320m03383j36944
5944A6150221j46930k94288l41307l76748k14092q9648k29751K1769J14864j8960
5934A4575130J56794K86931K93193J19967J41121Q1215P3709K4375p7354j38793
5924A5536288L9955q8676P5279j05236l26538k25175l88296m60773n78688o15650
5914A2862490o27748n39999n83753n12296m27380l89404k64952k57081j14737
$$ plain form
5979 60160579 55098984 50881632 47332162 44389101 41770732 39561245 37458230 35379004
5971 35379004 33579288 32064451 30782566 29835082 29098247 28695537 28443443 28310120 28197423
5962 28197423 27902256 27537218 26812266 25893390 24845219 23743353 22512776 21353857 20452199
5953 20452199 19683276 19016806 18367661 17793166 17371983 16979868 16690548 16287165 16150221
5944 16150221 16003291 15709003 15367696 14990948 14776856 14687208 14457457 14479226 14594090 14575130
5934 14575130 14731924 15018855 15312048 15432015 15573136 15654351 15728060 15752435 15675081 15536288
5924 15536288 15576243 15487567 15562846 15457610 15131072 14905897 14517601 14056828 13478140 12862490
5914 12862490 12234742 11694743 11110990 10598694 10171314 9781910 9516958 9259877 9145140
5905I145140k62889k39261k11254k80585j94898k23392k83457j35341j99562k67273
5895F847228j63258M6059j74707r8866k31575m51180l36698k65752k20187q0560
5885D870504j09689l1692q1874K8587M5985n5362P109R7610J06068R4495J92385
5874E164126J90616J19564N5948P9968J2168k14386k17798j14863j40326j61910
5864D773107j49324l1989p689j4073r3079q5862r1979j91225k39895k48847k28545
5853C390600j63612j35846j50567k38426j35389n7442l4734k16233q4431l2296
5843B141624p9551p8321k5190N9702p3144q1353n0400j10754p3719o4056Q2192
5832A647030l8008r8460j05068N3973j550k4212l9159q867m668j14j923n5671
$$ plain form
5905 9145140 8882251 8642990 8431736 8151151 7956253 7732861 7449404 7314063 7114501 6847228
5895 6847228 6683970 6730029 6555322 6456456 6224881 5773701 5437003 5171251 4951064 4870504
5885 4870504 4760815 4729123 4647249 4675836 4721821 4666459 4673568 4771178 4877246 4971741 5164126
5874 5164126 5354742 5474306 5530254 5610222 5622390 5408004 5190206 5075343 4935017 4773107
5864 4773107 4623783 4591794 4584105 4570032 4476953 4391091 4299112 4107887 3867992 3619145 3390600
5853 3390600 3226988 3091142 2940575 2702149 2566760 2509318 2474584 2258351 2173920 2141624
5843 2141624 2062073 1983752 1958562 2018264 1945120 1863767 1813367 1702613 1628894 1564838 1647030
5832 1647030 1609022 1510562 1405494 1459467 1457917 1433705 1394546 1385679 1381011 1380897 1378974 1323303
5820A323303M9601o2681n6130R7732N727r129r8954k6553q430K2991M994k0446
5808A222025Q5868p7216k548J8084k7224Q03L1188o7870L927M143m2443l2254
5796A116483k8390O6237p8796N7661J5245P3328Q1588k2310p5583p0066l5254
5785A100143J7407J0192J5877j12050m0417L0985N9957n6344K9263P9514o7350
5774A067177J7425n9229J37061k0419L8812J3003N7001P1229L3220N6737j06903
5763A305114o5667l0426o6173m2387J2651K9401j02598L0654K019P7722K6188
5752A176498j6545J8697J07198n8961L3870O0455n9421J9550L5134n8539K1034
5741A278970n7094q1818M6189l7422L5681r9831n0650K0453l9056j1851J5344
$$ plain form
5820 1323303 1372904 1310223 1254093 1351825 1357552 1348423 1249469 1222916 1214486 1237477 1242471 1222025
5808 1222025 1307893 1230677 1228129 1246213 1218989 1219792 1250980 1183110 1187037 1191180 1148737 1116483
5796 1116483 1088093 1154330 1075534 1133195 1148440 1221768 1303356 1281046 1205463 1135397 1100143
5785 1100143 1117550 1127742 1143619 1031569 991152 1022137 1082094 1025750 1055013 1134527 1067177
5774 1067177 1084602 1025373 1162434 1142015 1180827 1193830 1250831 1322060 1355280 1412017 1305114
5763 1305114 1239447 1209021 1142848 1100461 1113112 1142513 1039915 1070569 1072588 1150310 1176498
5752 1176498 1159953 1178650 1285848 1226887 1260757 1321212 1261791 1281341 1316475 1257936 1278970
5741 1278970 1221876 1140058 1186247 1148825 1184506 1084675 1034025 1054478 1015422 1003571 1018915
5730A018915M264K9597r0464J4868p9876k6938J74664q7432q5768J560M9971J00582
5718A023943o3598j6614l958o984J2981l575O8443j8860k1313Q5949q193m1406
5706A006815q373j2291P5378p6829R772R6311O5297l719K5528m4618j0546Q880
5694A131605L315Q5306k9767j25260o7695O4340k5082p2245K07J54201j6038l4499
5682A068388n1689N361J53926L2045o8997J07404O0732Q0223N153o4632k0769
5671A307145k7875l5597O0774j1905r4000L2630p013j5029M9113k6063O3044Q273
5659A303497n6267M3256m6437l0832J15822O6007r0481K5069J19502L9946o3128
5648A425954N5166P7133Q0496j6757J13958J35633K4100j24039j9642p0481K879
$$ plain form
5730 1018915 1023179 1052776 962312 977180 897304 870366 1045030 957598 871830 873390 923361 1023943
5718 1023943 960345 943731 939773 932789 945770 942195 1010638 991778 970465 1056414 1048221 1006815
5706 1006815 998442 986151 1061529 984700 994472 1090783 1156080 1152361 1177889 1133271 1122725 1131605
5694 1131605 1134920 1220226 1190459 1065199 997504 1061844 1036762 964517 964724 1118925 1102887 1068388
5682 1068388 1016699 1022060 1175986 1208031 1139034 1246438 1307170 1387393 1392546 1327914 1307145
5671 1307145 1279270 1243673 1304447 1292542 1198542 1231172 1224159 1209130 1258243 1232180 1295224 1303497
5659 1303497 1247230 1290486 1244049 1213217 1329039 1395046 1304565 1329634 1449136 1489082 1425954
5648 1425954 1481120 1558253 1638749 1621992 1735950 1871583 1895683 1771644 1752002 1681521 1684400
5637A684400m7763j2204j57907r343J80588q2704j43817j19453P0543J46605l3983
5626A474962l3679l0059l8494Q8396m609J06126l6938p3371m4327J8455N6323
5615A482785M1959M933J6548L9328P479l9946n2006O3199n7952k6124J03775n4350
5603A529628l8569Q9155r753M6570j0940l5961k6573j42456n5138r6701q8453
5592A160809l5004l7315j8011O6747k9783R0760j1300K2111O4426o2099m855J06797
5580A313283P5180l7597P1388J5615N2118P575O6720L1703p2378q637l1767l7134
5568A446069p2782j08042j37474K0163j70581O035O9021O8766J8665j24004J2902
5557A028738k1291p5720L3652K385M5560l3923K0293k3275L7099k1061j55327
$$ plain form
5637 1684400 1636637 1624433 1466526 1457183 1637771 1555067 1411250 1291797 1362340 1508945 1474962
5626 1474962 1441283 1411224 1372730 1461126 1456517 1562643 1525705 1452334 1408007 1426462 1482785
5615 1482785 1524744 1529677 1546225 1585553 1593032 1553086 1501080 1564279 1506327 1480203 1583978 1529628
5603 1529628 1491059 1580214 1570461 1617031 1606091 1570130 1543557 1401101 1345963 1249262 1160809
5592 1160809 1125805 1088490 1070479 1137226 1107443 1198203 1186903 1209014 1273440 1211341 1206486 1313283
5580 1313283 1388463 1350866 1422254 1437869 1489987 1497562 1564282 1595985 1523607 1514970 1483203 1446069
5568 1446069 1373287 1265245 1127771 1147934 977353 983388 1052409 1121175 1139840 1015836 1028738
5557 1028738 1007447 931727 965379 967764 1013324 979401 999694 976419 1013518 992457 837130
5546H37130P8755Q3451J591K7708m0961N1020P8024p7268j10061k2891P2521Q5762
5534A064781L6304j12298P24N2035r22Q38R669l6322L5924M1086P8586q2453O6501
5521A154453M7789O1087J6898P4768L1457j12031J32374L0520M577Q2202n8920
5510A465174O5991N2206p1565n1772j3929j2593J09163j56242p2733L950Q6162
5499A403812M910k9238L6696j6810J0254L3813o1906k9133j9394j3883P076K5332
5487A351529J07708L5074m0736q6106J18551p1084j17179K4119r7573R875P3060
5476A307238p8706J27680p890n6645r8990K0350N3775n2193k0741O0246n8794
5465A195330n1224J14519R7135j43312o3178J42592P1124R224k8357k5668Q034
$$ plain form
5546 837130 915885 999336 1000927 1028635 987674 1038694 1116718 1039450 929389 906498 979019 1064781
5534 1064781 1101085 988787 989511 1041546 1040624 1041462 1051131 1014809 1050733 1091819 1170405 1087952 1154453
5521 1154453 1202242 1263329 1280227 1354995 1386452 1274421 1406795 1437315 1441892 1524094 1465174
5510 1465174 1531165 1583371 1511806 1460034 1446105 1433512 1542675 1386433 1313700 1317650 1403812
5499 1403812 1408722 1379484 1416180 1399370 1409624 1443437 1381531 1352398 1333004 1319121 1326197 1351529
5487 1351529 1459237 1494311 1453575 1367469 1486020 1414936 1297757 1321876 1224303 1234178 1307238
5476 1307238 1228532 1356212 1348322 1291677 1192687 1213037 1266812 1214619 1193878 1254124 1195330
5465 1195330 1144106 1258625 1355760 1212448 1149270 1291862 1362986 1372210 1343853 1318185 1326219
5454A326219N7812j24813q6601n059P7867O8479m3571N0727m3220j7497K2742
5443A283085K4992J6319j0972J8563N278L1800Q7015j72671J6086K7169j18481
5432A208183J80670M8351n2681k0655m7925r0645k6643J43790Q826l9559p7526
5421A234186J3305N4692R7339L4606L6425Q7008m9731K8216L0235l1361J5817
5410A550737J1752k4743o946M740k2570m8065P8795N8335M1228j44117J10619
5399A609765P6874m2700n3245P6551J66067o177n1817m308j04752K524J29176
5388A797958J7997M5357P9618J29344l3403M0918J33077m867j23185j05731M5108
5377B022191O3218K1830J03775p683p1324J6409M4993J16546M7682J02317N0814
$$ plain form
5454 1326219 1384031 1259218 1172617 1167558 1245425 1313904 1270333 1321060 1277840 1260343 1283085
5443 1283085 1308077 1324396 1313424 1331987 1337265 1369065 1456080 1283409 1299495 1326664 1208183
5432 1208183 1388853 1437204 1384523 1363868 1315943 1225298 1198655 1342445 1351271 1311712 1234186
5421 1234186 1247491 1302183 1399522 1434128 1470553 1557561 1507830 1536046 1566281 1534920 1550737
5410 1550737 1562489 1537746 1530800 1535540 1512970 1464905 1543700 1602035 1643263 1499146 1609765
5399 1609765 1686639 1643939 1590694 1667245 1833312 1827135 1775318 1771010 1666258 1668782 1797958
5388 1797958 1815955 1861312 1940930 2070274 2036871 2077789 2210866 2205999 2082814 1977083 2022191
5377 2022191 2085409 2107239 2211014 2203331 2132007 2148416 2193409 2309955 2357637 2459954 2510768
5366B510768R6956j4488O2912O1093M0054n150j6402J4705M0523N7359J59872
5355C008202j08208M248K41422L7773R344M7210p43J5513J97471O2985K7470K4099
5343C566786J65520N2423n49L4149L6335J05493J62578K2482M4011J65303J06829
5332D461360J57688J17740l8609R6974K17253J15954O9615J71172M8363J86849
5322E604359J37734P7618J59504J07892J36381J26115J55160K37467K26577J45217
5312G114024J27999K26291K07851K12098J96057L08360J87674K66448K59741K26322
5302I332865L24463L08269L34404L05240L98394M00897L18550M00476M27309M59151
5292A3010018N40026N78670O22053P20211Q42899R51666R59159J152310J474313
$$ plain form
5366 2510768 2607724 2593236 2656148 2717241 2757295 2752145 2735743 2750448 2790971 2848330 3008202
5355 3008202 2899994 2904242 3145664 3183437 3192781 3239991 3239248 3254761 3452232 3515217 3542687 3566786
5343 3566786 3732306 3784729 3784180 3818329 3854664 3960157 4122735 4145217 4189228 4354531 4461360
5332 4461360 4619048 4736788 4698179 4795153 5012406 5128360 5197975 5369147 5417510 5604359
5322 5604359 5742093 5819711 5979215 6087107 6223488 6349603 6504763 6742230 6968807 7114024
5312 7114024 7242023 7468314 7676165 7888263 8084320 8392680 8580354 8846802 9106543 9332865
5302 9332865 9657328 9965597 10300001 10605241 11003635 11404532 11723082 12123558 12550867 13010018
5292 13010018 13550044 14128714 14750767 15470978 16313877 17265543 18224702 19377012 20851325
5283B0851325J600752J866896K374290K650122K643218J669537K95376o81665
5275C3269851n70771j32321L95249J152645J735616K670870L660120M411400M507123
5266E1099782L982368K943407J976058P94564N30155P24368J65410m40749K6392
5257F1801755Q67512J071079P20525P68107J625748J711013J307490J516138K006295
5248G3395662J892187J950775J561461L44363j137459k334019k586959k559111
5240G0526900j807586q71461r59840j836450j664173r57008r29456j555621j421747
5231E8523558o07109k30573o21140m02127l4649q05077k081238l173462m290092
5222D6278091m876552m520091l669298k597934j692701j096105l48862J76497
$$ plain form
5283 20851325 22452077 24318973 26693263 29343385 31986603 33656140 33951516 33269851
5275 33269851 32699080 32566759 32962008 34114653 35850269 38521139 42181259 46592659 51099782
5266 51099782 55082150 58025557 60001615 60796179 61326334 62050702 62216112 61775363 61801755
5257 61801755 62669267 63740346 64460871 65228978 66854726 68565739 69873229 71389367 73395662
5248 73395662 75287849 77238624 78800085 79144448 78006989 75672970 73086011 70526900
5240 70526900 68719314 67847853 66888013 65051563 63387390 62430382 61500926 59945305 58523558
5231 58523558 57916449 57685876 57064736 56662609 56627960 55822883 53741645 50568183 46278091
5222 46278091 41401539 36881448 33212150 30614216 28921515 27825410 27476548 27653045
5214B7653045P12214R54841q814j634671k819049k851160k440405k078440j802806
5205A5684755j261633r79710q03440p66782o15052n57997n89280l76132m42070
5196I292659k74986l47438m21300l10362k99769j81886q9486j89598l37866j77747
5186F662221j25449j46892j46971j69119j93323j37638j92086j39463Q348j6021
5176E403607r7764k00627j83308M9423O0919j90645j28410J9854o6514o3383j37582
5165D465570J9776o4702l6965j0986l1801Q1141n2969l7207K4565o260p4832J1811
5153D287141j4730J2708K315P4308l6206O3345m6107Q8865J10292l1288k58Q0058
5141D590443J65157J00192K8756R6505K27048J78878K42529K88988L98459M70206
$$ plain form
5214 27653045 28365259 29320100 29311286 27676615 24857566 22006406 19566001 17487561 15684755
5205 15684755 14423122 13443412 12639972 11873190 11258138 10700141 10110861 9734729 9292659
5196 9292659 9017673 8670235 8248935 7938573 7638804 7456918 7367432 7177834 6839968 6662221
5186 6662221 6536772 6389880 6242909 6073790 5880467 5742829 5550743 5411280 5419628 5403607
5176 5403607 5305843 5105216 4921908 4971331 5032250 4841605 4713195 4733049 4666535 4603152 4465570
5165 4465570 4485346 4420644 4383679 4372693 4340892 4422033 4369064 4331857 4356422 4350162 4275330 4287141
5153 4287141 4272411 4285119 4287434 4361742 4325536 4388881 4342774 4431639 4541931 4510643 4510385 4590443
5141 4590443 4755600 4855792 4884548 4981053 5208101 5386979 5629508 5918496 6316955 6787161
5131F787161M13738K74127J19824j82870m19563l57933l13423k67173r2239P0222
5121F031871J23041J43614K22394L11134M71995L77152M03678J07195k23222l84022
5111G584830l96787m62438l80779k62669r7953l0677k0396j26584o0463K1893
5101E767977r611Q193O6696N1114P3379p0546j37634J07991j03857L2319P6746
5090E862767K7777J79037J26189K69365L24684K22917L04896L57291N48245P05156
5080H928324P00566Q31959O20314K36855k60729o38531p42324m50520k85945k29067
5070H710902j56045J47892K15779K83714M61629N64372O69984N44952K75969l92126
5060A1327022p25840r15418p53416o85865o33256m90676l12899k04388k08345
$$ plain form
5131 6787161 7200899 7475026 7594850 7411980 6992417 6634484 6321061 6053888 5961649 6031871
5121 6031871 6154912 6298526 6520920 6832054 7304049 7681201 8084879 8192074 7968852 7584830
5111 7584830 7188043 6725605 6344826 6082157 5984204 5953527 5933131 5806547 5746084 5767977
5101 5767977 5758366 5766559 5833255 5884369 5957748 5887202 5749568 5857559 5753702 5786021 5862767
5090 5862767 5890544 6069581 6195770 6465135 6789819 7012736 7317632 7674923 8223168 8928324
5080 8928324 9628890 10460849 11081163 11318018 11057289 10418758 9676434 9225914 8939969 8710902
5070 8710902 8554857 8702749 8918528 9202242 9663871 10228243 10898227 11443179 11719148 11327022
5060 11327022 10601182 9685764 8932348 8246483 7613227 7122551 6809652 6605264 6396919
5051F396919k34622o274j1552j37487l6936j24477m372j0401r6578r305j19314
5040E605601k6858j6986l7296P9020j27007m0098m3122j3503M0262N8680k8289
5029E450404R2853K055j4026Q88k109L6032Q3053k4352l2267O0244N1740K3625
5017E728140N2295J09661k7045J42014N2563O2508m0169O2154J68143J21594m2472
5006F389386M4798R7981J1663L4734J77431L1165P5268R5012N2861J25358J63097
4995G298754k3715o392J34302J25139R8356J26234P5761K3902J43515J32824J29416
4984H258096N8787K42739J11816J13608K79849K01520J95099K06195K07633K42536
4974A0117878K66940J88586M31391K96772L23006M67470N67422O30610P60470
$$ plain form
5051 6396919 6162297 6156023 6144471 6006984 5970048 5845571 5841199 5830798 5734220 5724915 5605601
5040 5605601 5578743 5561757 5524461 5603481 5476474 5436376 5393254 5379751 5420013 5478693 5450404
5029 5450404 5543257 5545312 5531286 5532174 5530065 5566097 5649150 5624798 5592531 5652775 5704515 5728140
5017 5728140 5780435 5890096 5863051 6005065 6057628 6120136 6079967 6142121 6310264 6431858 6389386
5006 6389386 6434184 6532165 6543828 6578562 6755993 6787158 6862426 6957438 7010299 7135657 7298754
4995 7298754 7275039 7268647 7402949 7528088 7626444 7752678 7828439 7852341 7995856 8128680 8258096
4984 8258096 8316883 8559622 8671438 8785046 9064895 9266415 9461514 9667709 9875342 10117878
4974 10117878 10384818 10573404 11004795 11301567 11624573 12092043 12659465 13290075 14050545
4965A4050545Q93411P31051M49334M6609l78705m76807m40446l73985j01299Q605
4955A4408313j00402r8000R8280J11371J10036K18086K07092K78846L15125L34133
4945A5882880M02676N68086O24521O63698Q90584J021602R53163Q72869O34500
4936B2514579J51877k79060m64478m81917m35481j11602k2025L322J83535J30258
4926B1189008K68798K62592L34716L98488L98570M56100M35805O77438P07226
4917B5128741P01493P56262R36450R26706J022114R95065Q48388P31963M58241
4908C2505423M00807M46532L82082N40439O35167O66742P13840P71047Q44970
4899C7907049R92430R61890J182181J198104J272359J404343J802609J811739
$$ plain form
4965 14050545 14943956 15675007 16124341 16170950 15792245 15315438 14874992 14501007 14399708 14408313
4955 14408313 14307911 14209911 14308191 14419562 14529598 14747684 14954776 15233622 15548747 15882880
4945 15882880 16285556 16853642 17478163 18141861 19032445 20054047 21007210 21880079 22514579
4936 22514579 22666456 22387396 21922918 21441001 21005520 20893918 20871893 20875215 21058750 21189008
4926 21189008 21457806 21720398 22055114 22453602 22852172 23308272 23744077 24421515 25128741
4917 25128741 25830234 26586496 27522946 28449652 29471766 30466831 31315219 32047182 32505423
4908 32505423 32906230 33352762 33734844 34275283 34910450 35577192 36291032 37062079 37907049
4899 37907049 38899479 39861369 41043550 42241654 43514013 44918356 46720965 48532704
4891D8532704K087399K349056K792713L164495L686190M243431M745954N470482
4883G7072424O345705Q024215R606209J0152855P038377j85960o439300q383276
4875A03231249p180619n069493k925104j096140K78969J625552K804743L960855
4867I5630012N302793O875541Q854449J1201450J3630913J5132277J3133543Q634359
4859A78395337N685816M067592q4190o453909j0311774j0030901p702838m439591
4851A49125542j278988J072023K968108M073828M705997N090687N012472N739963
4843A76509632O896191Q526705J0042267Q900764K946702n384439j0409317j0929665
4835A87098840q861144o212885l962657j856661J42272J631702L118262M466016
$$ plain form
4891 48532704 50620103 52969159 55761872 58926367 62612557 66855988 71601942 77072424
4883 77072424 83418129 91442344 101048553 111201408 118239785 118053825 111614525 103231249
4875 103231249 96050630 90981137 88056033 86959893 87238862 88864414 91669157 95630012
4867 95630012 100932805 107808346 116662795 127864245 141495158 156627435 169760978 178395337
4859 178395337 184081153 188148745 188064555 181610646 171298872 161267971 153565133 149125542
4851 149125542 147846554 148918577 151886685 155960513 160666510 165757197 170769669 176509632
4843 176509632 183405823 191932528 201974795 210875559 213822261 208437822 198028505 187098840
4835 187098840 178237696 172024811 168062154 166205493 166347765 167979467 171097729 175563745
4827A75563745N506160O319444O956310P886183Q631857R437482J0075119J0080418
4819B40456718R264979P578232N551374L524866J719593K11709j624411l427303
4811B63255757n269168o428303o724782o636830o265575n564636m764416l449124
4803B18152923k041428p44554O6307N10784P17497Q41979J375075K271761L376787
4794B24527131M842156O221253P273992Q053049Q593192Q617521Q028234O475587
4786B82632115M168449J708844l31875j608874k978863m661164o943922r247503
4778B62737207j1076849j1817012j1317937j0398325r015566q232309p716902
4771A93162307o968521o202279n307938m344396l457634k504213j536535n49094
$$ plain form
4827 175563745 181069905 187389349 194345659 202231842 210863699 220301181 230376300 240456718
4819 240456718 249721697 257299929 262851303 266376169 268095762 268307471 266683060 263255757
4811 263255757 257986589 251558286 244833504 238196674 231931099 226366463 221602047 218152923
4803 218152923 216111495 215366941 215433248 215944032 216661529 217503508 218878583 221150344 224527131
4794 224527131 229369287 235590540 242864532 250917581 259510773 268128294 276156528 282632115
4786 282632115 286800564 288509408 288177533 286568659 283589796 278928632 271984710 262737207
4778 262737207 251660358 239843346 228525409 218127084 209111518 200879209 193162307
4771 193162307 186193786 179991507 174683569 170339173 166881539 164377326 162840791 162291697
4763A62291697J72477M18199M75765P8651n44280r21112j380270j743569k200277
4754A56647281l426574n014139o299837p155668p473038p134423o867133o222820
4746A07053649n969059n684430n309940n019738m562299m013027l584831l223979
4738F9686346k693143k388938k245094j928102j815547j543886j424530j338333
4730E4308773j323276j077680j097314j028651r93539q82905r62122r03489p81324
4721D5258473p55838q23164j107510j028536r01575q96723q58299p35675o80935
4712C7470218n11704m54461l40400m01968m23133l11466m32042n21274m75878
4703C3597892m77902n64457n27156n53800n00963m44412m20185j97805k15214
$$ plain form
4763 162291697 162464174 162882373 163358138 163436789 162892509 161971397 160591127 158847558 156647281
4754 156647281 153220707 148206568 141906731 134751063 127278025 120143602 113276469 107053649
4746 107053649 101084590 95400160 90090220 85070482 80508183 76495156 72910325 69686346
4738 69686346 66993203 64604265 62359171 60431069 58615522 57071636 55647106 54308773
4730 54308773 52985497 51907817 50810503 49781852 48788313 47905408 46943286 46039797 45258473
4721 45258473 44502635 43679471 42571961 41543425 40641850 39745127 38886828 38151153 37470218
4712 37470218 36958514 36504053 36163653 35761685 35338552 35027086 34595044 34073770 33597892
4703 33597892 33119990 32555533 32028377 31474577 30973614 30529202 30109017 29911212 29695998
4694B9695998k05200j90391l87977l49975k99452m81525m63262n41476n23863
4685B6252877m79949m29896l61825l91256m30902l09566l98895k99922j44770
4676B3005896j75990l40901m09642n28109n14610m22142l22512k21644o8852R5669
4666B0097163P582l7529J3068j43714j89684j15670j82724k88173l48666m03994
4656A8407659l03035j60034j87006p4164r5438j11704K037J913j22439j88189
4646A7169600k68277k85097j45103k83748j89373k36287k08601r8222p2815j03360
4636A5278717Q1960P0136m1807j1029J40354K24326N186J27062Q7644K42493J98813
4625A6403855M7131J30999L54346L19330K67264L87988N11449N22571O68191Q81049
$$ plain form
4694 29695998 29490798 29300407 28912430 28562455 28263003 27781478 27318216 26776740 26252877
4685 26252877 25772928 25343032 24981207 24589951 24159049 23849483 23450588 23150666 23005896
4676 23005896 22829906 22489005 22079363 21551254 21036644 20614502 20291990 20070346 20001494 20097163
4666 20097163 20104745 20067216 20080284 19936570 19746886 19631216 19448492 19160319 18811653 18407659
4656 18407659 18104624 17944590 17757584 17683420 17587982 17476278 17478315 17480228 17357789 17169600
4646 17169600 16901323 16616226 16471123 16187375 15998002 15761715 15553114 15454892 15382077 15278717
4636 15278717 15360677 15430813 15389006 15377977 15518331 15742657 15747843 15874905 15962549 16205042 16403855
4625 16403855 16450986 16581985 16936331 17255661 17522925 17910913 18422362 18944933 19613124 20494173
4615B0494173J013030R99159Q30881L36425k35226m28765n00305j94697l9576
4606B2275099M8049K36255L19315M41203O39883Q41578Q46149Q96060J159823
4597B7703414J480934J590142J711485J794160J798341J730798J793507J727500
4589D1330281J618283J623330K159209K980143M193821N798870P618811R724094
4581G7046842J0806368Q699308K903478l691851p300388p150876m922669k145718
4573G4244494Q06513L234751N376799P330418Q019757N685252n7312n977766q280401
4564I0382505p423195m606695j080994K037665M804557O064714M072499j372714
4556I2878342o412904q449356p692174n551218k884703n32344J416821L876478
$$ plain form
4615 20494173 21507203 22506362 23337243 23673668 23438442 23009677 22509372 22314675 22275099
4606 22275099 22323148 22559403 22878718 23319921 23959804 24801382 25647531 26543591 27703414
4597 27703414 29184348 30774490 32485975 34280135 36078476 37809274 39602781 41330281
4589 41330281 42948564 44571894 46731103 49711246 53905067 59703937 67322748 77046842
4581 77046842 87853210 96552518 99455996 95764145 88463757 81312881 76390212 74244494
4573 74244494 75051007 78285758 83662557 90992975 99012732 104697984 104640672 98662906 90382505
4564 90382505 82959310 78352615 77271621 79309286 84113843 90178557 94251056 92878342
4556 92878342 86465438 78016082 70323908 64772690 61887987 61355643 62772464 66648942
4548F6648942N583744N620306K556493l407608q252812r854776r165039p220791
4540D2508459n509468m321071l297604k521887k006732j743993j379522j320599
4532B0407583j158344j025525p54149o82722o18718p10205n44432m86296n06649
4523A3920543m92339l53845l81599m92489m35036k89451j97156j93501l86177
4514A0698950k80425j62916k60430k22178j41472k37539j85995k05584j74780
4505H827631J4302m1784r7295l8212j17311j08669p8107q3253j15467j48795k5908
4494G987132j29311q997o7844p9231l3973j99944l6217r0521p1022l4598j71268
4483G064206j87876j28018J6305n4773j15546p1495m9795o4761o0979J0067p9203
$$ plain form
4548 66648942 72232686 77852992 80409485 77001877 68749065 58894289 49729250 42508459
4540 42508459 36998991 32677920 29380316 26858429 24851697 23107704 21728182 20407583
4532 20407583 19249239 18223714 17469565 16786843 16168125 15457920 14913488 14427192 13920543
4523 13920543 13428204 13074359 12692760 12200271 11765235 11475784 11278628 11085127 10698950
4514 10698950 10418525 10255609 9995179 9773001 9631529 9393990 9207995 9002411 8827631
4505 8827631 8841933 8800149 8702854 8664642 8547331 8438662 8360555 8277302 8161835 8013040 7987132
4494 7987132 7857821 7848824 7780980 7701749 7667776 7467832 7431615 7341094 7270072 7235474 7064206
4483 7064206 6876330 6748312 6764617 6709844 6594298 6522803 6473008 6408247 6347268 6357335 6278132
4472F278132j04200p9375m6010k6782j60818q1121J4577l6412J5733K8769n2698
4461E749795r5071q6996L6732m3564m825o8323j31258j73527q3343n1909j2936
4450E034775j54678n8777j02999r0408m1674P5690r9100Q224O5152n0501K6318
4439D612022N4745Q9234o37R102M7318N4692j3209J91459K31269L05166L33422
4428E914583N29757K85300k26004m56494n64740l65260k75343j96639k05083j98798
4418D241279j02334O3772k2595l1679J1721o869k34516j39042L3904k7717m739
4407C781185l8171q8360k096L1270N9237M7528j7595n3438J1062r381k0084l0352
4395C670805q4355M7709P0688J56553R6657R643k3492J8178O6616M1431k0126
$$ plain form
4472 6278132 6173932 6094557 6048547 6021765 5860947 5779826 5794403 5757991 5773724 5802493 5749795
4461 5749795 5654724 5567728 5604460 5560896 5556071 5487748 5356490 5182963 5099620 5047711 5034775
4450 5034775 4880097 4821320 4718321 4627913 4586239 4661929 4562829 4571053 4636205 4585704 4612022
4439 4612022 4666767 4756001 4755364 4764466 4811784 4866476 4853267 5044726 5275995 5581161 5914583
4428 5914583 6444340 6729640 6503636 6047142 5482402 5117142 4841799 4645160 4440077 4241279
4418 4241279 4138945 4202717 4180122 4148443 4160164 4153295 3918779 3779737 3813641 3785924 3781185
4407 3781185 3743014 3654654 3652558 3683828 3743065 3790593 3772998 3719560 3730622 3721241 3701157 3670805
4395 3670805 3586450 3634159 3704847 3861400 3958057 3967700 3944208 3962386 4029002 4070433 4050307
4384D050307o5197j4830q9957Q213J9600q303k355L6984Q9563K2041j28731K4179
4372C941514P2863O6533J2569O1696J28521R4723P0293k9641N6505q255P7129
4361D544450M6730l0385n2784n02L5099J18264O3837O2391R6929k9129k7842N6746
4349D883804O1970K5865M4450J45149j8226P8740R6300j9755K21379J68263Q5262
4338E773201K13477J32124J61143N3572J47492Q5310K18257L20005M04306N00611
4328H009498O61016P55241Q86979Q86222L90595l9323m14147o83400n35120l02700
4318I614861O8123K08201L39443L69782O07071P55078M27512m5111o51023n99810
4308A1094127m75639k96959M2256J34910M30261M91879M48094j14168m94019o25221
$$ plain form
4384 4050307 3985110 3970280 3880323 3888536 3908136 3899833 3897478 3934462 4024025 4046066 3917335 3941514
4372 3941514 4014377 4080910 4093479 4155175 4283696 4378419 4448712 4419071 4475576 4467321 4544450
4361 4544450 4591180 4560795 4508011 4507509 4542608 4660872 4724709 4787100 4884029 4854900 4827058 4883804
4349 4883804 4945774 4971639 5016089 5161238 5143012 5221752 5318052 5298297 5519676 5687939 5773201
4338 5773201 5986678 6118802 6279945 6333517 6481009 6566319 6784576 7104581 7508887 8009498
4328 8009498 8670514 9425755 10312734 11198956 11589551 11550228 11136081 10452681 9917561 9614861
4318 9614861 9682984 9891185 10230628 10600410 11207481 11962559 12390071 12344960 11693937 11094127
4308 11094127 10618488 10321529 10363785 10498695 10928956 11420835 11868929 11754761 11260742 10635521
4298A0635521m29489l70865k33584j5433N4639K31888M68535N34054K88250M8853
4288A1212369l70540q12477p16477l28951m20586m24861k05761j05463k12965
4279G614288N5093J1540j32024J6580Q1701L631N3501j0519o689K5566R6158M0163
4267G848989J32033Q4396O2781M1173K22854J47720J03295J81565L6603J46263
4257I007672L50329K59955J72452K39458K48433K94510L08761L26722L60438N14491
4247A2083221M72307N28060O72488N53847L97179K72730L19258M5227p7219k1325
4237A5245773l3002j9271M0414r7013J27488K15438K89790K36889L42500L75191
4227A6724197K80434K64292K91760M1808l381m6676j48751j41254j83234n9267
$$ plain form
4298 10635521 10206032 9835167 9601583 9586150 9640789 9872677 10341212 10875266 11163516 11212369
4288 11212369 10841829 10029352 9312875 8983924 8563338 8138477 7932716 7827253 7614288
4279 7614288 7669381 7680921 7548897 7565477 7647178 7650809 7704310 7693791 7687102 7712668 7808826 7848989
4267 7848989 7981022 8065418 8128199 8169372 8392226 8539946 8643241 8824806 8861409 9007672
4257 9007672 9358001 9617956 9790408 10029866 10278299 10572809 10881570 11208292 11568730 12083221
4247 12083221 12555528 13083588 13756076 14309923 14707102 14979832 15299090 15344317 15267098 15245773
4237 15245773 15212771 15193500 15233914 15136901 15264389 15479827 15769617 16006506 16349006 16724197
4227 16724197 17004631 17268923 17560683 17602491 17599110 17552434 17403683 17262429 17079195 17019928
4217A7019928P2082M056J14172k7336m5826K19522Q2411K01883J98870K31059
4207A8070821K35945K41107L18355M31500N73377L99813L77796L65273N75777
4198B1589764O02243O36600O91413P26516Q19984R73488R52899R95688J113276
4189B9101871J322106J424272J471563J588402J587390J545627J281448J159701
4181D0482380R90323R49599P08867O94428N44043O53799P32347R96233J200799
4172D7952818J645242J952609K268105K578345K520560K526393K224409J731828
4164F5400309J565303J370484J532442J448900J503966J496265J385708J337333
4156G7040710J299309J324961J562378J646852J766320J841490J855461J462017
$$ plain form
4217 17019928 17092010 17096066 17210238 17182902 17137076 17356598 17439009 17640892 17839762 18070821
4207 18070821 18306766 18547873 18866228 19297728 19871105 20270918 20648714 21013987 21589764
4198 21589764 22192007 22828607 23520020 24246536 25066520 26040008 26992907 27988595 29101871
4189 29101871 30423977 31848249 33319812 34908214 36495604 38041231 39322679 40482380
4181 40482380 41472703 42422302 43131169 43825597 44369640 45023439 45755786 46752019 47952818
4172 47952818 49598060 51550669 53818774 56397119 58917679 61444072 63668481 65400309
4164 65400309 66965612 68336096 69868538 71317438 72821404 74317669 75703377 77040710
4156 77040710 78340019 79664980 81227358 82874210 84640530 86482020 88337481 89799498
4148H9799498J208422J130589J447805K108869K954410L762091M508493M964349
4140A11884526M419578L037875J410434M68538L82180N88403J227794J524281
4132A24943609J577492J625460J359304J201700R71991Q92333R14094P63866M82373
4123A34732222M64615R0193n6408N9614N76668J296396K172398L214260M266164
4114A46816122N064435N439658N042713M316601L252307K494489K514493K979472
4106A77920290L285514L049289K461568J613981J295799J364745J136501M09377
4098A92537064l98141j198141j092490p79710l68860L97711J114103K135985K669084
4089A95016605L117139L215021K934256K231398J064509l52234j496784k003145
$$ plain form
4148 89799498 91007920 92138509 93586314 95695183 98649593 102411684 106920177 111884526
4140 111884526 116304104 119341979 120752413 121220951 121603131 122191534 123419328 124943609
4132 124943609 126521101 128146561 129505865 130707565 131679556 132571889 133485983 134249849 134732222
4123 134732222 135196837 135287030 135230622 135290236 135866904 137163300 139335698 142549958 146816122
4114 146816122 151880557 157320215 162362928 166679529 169931836 172426325 174940818 177920290
4106 177920290 181205804 184255093 186716661 188330642 189626441 190991186 192127687 192537064
4098 192537064 192138923 190940782 189848292 189068582 188699722 189097433 190211536 192347521 195016605
4089 195016605 198133744 201348765 204283021 206514419 207578928 207226694 205729910 203726765
4081B03726765j769683j238996l86814L26176Q50060J048600J022462P65925J85320
4072B04529815o64134j320202j677859j441687r73493p91212j177923k047332
4064A94435973k725297k586976j917843j687932k229723l766412m943897n564379
4056A69013514n559782m811359l972461k901421j905514r69535l81309k30137
4048A48281996l69839q64182j088922j417676j845190k190746k299019k409535
4040A35796887k482855k611492k542020j983947j386762p73451k52801k16005
4032A23547554r40585k296351l912116m700111m732632m206560l355653k593353
4024I6810193j893191j442670j269855j340138j913332k089920k133350k221331
$$ plain form
4081 203726765 201957082 200718086 200331272 200657448 201507508 202556108 203578570 204344495 204529815
4072 204529815 203865681 202545479 200867620 199425933 198452440 197661228 196483305 194435973
4064 194435973 191710676 189123700 187205857 185517925 183288202 179521790 174577893 169013514
4056 169013514 163453732 158642373 154669912 151768491 149862977 148893442 148512133 148281996
4048 148281996 147912157 147047975 145959053 144541377 142696187 140505441 138206422 135796887
4040 135796887 133314032 130702540 128160520 126176573 124789811 124016360 123763559 123547554
4032 123547554 122606969 120310618 116398502 111698391 106965759 102759199 99403546 96810193
4024 96810193 94917002 93474332 92204477 90864339 88951007 86861087 84727737 82506406
4016H2506406k231263k002965j707500j692866j610404j458010j340459j209024
4008F9253915j305291j499998j525646j795650k104675k524537k483971k557216
4000E3456931k389745j986167j746306j379202j178748j034342r01723j031786
3992D1808912j273200j079343r18315r66445j086503j171367j382482j387575
3984C2543682j394683j548309j418352j272167j158246j017024r66230q77351
3976B2891320q44597q44555p25389p43757n89701p00805o39501n65704m71537
3967A6765774n45271n10986n10506l66675n37335m11593l19442l88128l32144
3958A2843694l27594l85004k25116j74849l43622k61026k31693k19862k71577
$$ plain form
4016 82506406 80275143 78272178 76564678 74871812 73261408 71803398 70462939 69253915
4008 69253915 67948624 66448626 64922980 63127330 61022655 58498118 56014147 53456931
4000 53456931 51067186 49081019 47334713 45955511 44776763 43742421 42840698 41808912
3992 41808912 40535712 39456369 38538054 37571609 36485106 35313739 33931257 32543682
3984 32543682 31148999 29600690 28182338 26910171 25751925 24734901 23768671 22891320
3976 22891320 22046723 21202168 20476779 19733022 19143321 18442516 17803015 17237311 16765774
3967 16765774 16220503 15709517 15199011 14832336 14295001 13883408 13563966 13175838 12843694
3958 12843694 12516100 12131096 11905980 11731131 11387509 11126483 10894790 10674928 10403351
3949A0403351j91014j55643l25922k17346r878j70995k56569j86551k33512k03314
3939H452607l0077j27465l04338k00870M0246q1570j72815k24228j79941r1790
3929G079759j07842r7339L4700r8377r4238j93493j09219p9246q4178o8370j82772
3918E999385o574q602m7616j02593j18660M4112p3990j17296j25916k3191j1235
3907E407824j84906o9052p7114o2090O1846K1626m3130j76790L6679J4139p9423
3896D849609p2387J3811q538k8313m644M2371j3655l6863R494o4851J0947j71414
3884D525567Q774j7882O083M7853Q3442m5841o5127j3693N740M375q3452J9772
3872D475611P9165o1167m9416J9141L8590J08092r633P7954j0302O0667J3294
$$ plain form
3949 10403351 10212337 10056694 9730772 9513426 9503548 9332553 9075984 8889433 8655921 8452607
3939 8452607 8422530 8295065 7990727 7789857 7830103 7748533 7575718 7351490 7171549 7079759
3929 7079759 6971917 6874578 6909278 6810901 6716663 6523170 6413951 6334705 6250527 6182157 5999385
3918 5999385 5992811 5984209 5936593 5834000 5715340 5759452 5685462 5568166 5442250 5419059 5407824
3907 5407824 5222918 5153866 5076752 5014662 5076508 5098134 5055004 4878214 4914893 4929032 4849609
3896 4849609 4777222 4791033 4782495 4754182 4749538 4791909 4778254 4741391 4750885 4686034 4696981 4525567
3884 4525567 4534341 4516459 4522542 4570395 4653837 4607996 4542869 4529176 4534916 4539291 4455839 4475611
3872 4475611 4554776 4493609 4444193 4463334 4501924 4610016 4600383 4678337 4668035 4728702 4741996
3861D741996L5206O020M0859J09820R2838k8206P5113K00169r093n6085J6770
3850E225407R1760M6119R4891P7195J92464P1119k5870J4038j9411J23173J40787
3839F031672J28464J80062J67364J62735J95931J56318J75067L25995L46867L38570
3829H209045M49325L49673L78455M74611O50422N52104N32784O50897N55191M63502
3819A3266009K79667J86263q4772j70377m33833n71103n77406n76596n87813p18175
3809A0011864n16832m54647n72018m15876n08597m10013k38329j70703j82897
3800F541952l31470k09931j44517k65826j81377k7325j76251Q454p6722K8204
3790E165191n3000p18m5417p5643j91689j98118R649j04923n6551j13616r5843
$$ plain form
3861 4741996 4777202 4783222 4824081 4933901 5026739 4998533 5073646 5273815 5264722 5208637 5225407
3850 5225407 5317167 5363286 5458177 5535372 5727836 5798955 5773085 5787123 5767712 5890885 6031672
3839 6031672 6160136 6340198 6507562 6670297 6866228 7022546 7197613 7523608 7870475 8209045
3829 8209045 8658370 9008043 9386498 9861109 10511531 11063635 11596419 12247316 12802507 13266009
3819 13266009 13545676 13731939 13647167 13476790 13042957 12471854 11894448 11317852 10730039 10011864
3809 10011864 9495032 9040385 8468367 8052491 7543894 7133881 6895552 6724849 6541952
3800 6541952 6210482 6000551 5856034 5590208 5408831 5381506 5205255 5213709 5136987 5165191
3790 5165191 5112191 5111473 5066056 4990413 4798724 4600606 4610255 4505332 4448781 4335165 4239322
3779D239322q7759P528k242j45333m4455m1820P4949O8169q9004o36m9638L7341
3767C966422r0754j63836j66864K0137j31890j86042k3456k6468n2778K119m0451
3756C106139q2623q9226l8327j25810N6430L4049m1060o6319J7239K9166n1106
3745B748552j38466M6206j4065j56284m4905l8369j5897J0567r366k1431k9431
3734B337111q1048M3338L9619l7402j28211M534k9304L8432M7330r5697N745j04317
3722B040130j9367Q1630l3646k7864o5243J39837O341p0292R6723O8735m7956
3711B169028j5070K4617m4040o9463P1612L447j02765J2559L4466J7223q827r3865
3699A998922J8486M9564J11542Q949p2263p0169J31241k4750L329Q2667k0042
$$ plain form
3779 4239322 4151563 4159091 4156849 4011516 3967061 3925241 4000190 4068359 3979355 3978719 3929081 3966422
3767 3966422 3875668 3711832 3544968 3565105 3433215 3247173 3223717 3197249 3144471 3146590 3106139
3756 3106139 3023516 2934290 2895963 2770153 2826583 2860632 2819572 2753253 2770492 2799658 2748552
3745 2748552 2610086 2656292 2642227 2485943 2441038 2402669 2386772 2397339 2387973 2366542 2337111
3734 2337111 2256063 2299401 2339020 2301618 2173407 2177941 2148637 2187069 2234399 2138702 2144447 2040130
3722 2040130 2020763 2102393 2068747 2040883 1975640 2115477 2121818 2051526 2148249 2216984 2169028
3711 2169028 2153958 2178575 2134535 2065072 2136684 2140131 2037366 2049925 2084391 2101614 2092787 1998922
3699 1998922 2017408 2066972 2178514 2187463 2115200 2045031 2176272 2151522 2154851 2237518 2217476
3688B217476J60874J38701K00845J72185J60868K81590M88148L01842J9439j12651
3678D029317l49461m17094k83936j58433j30396k15150j4839K0711q7192J9009
3668B412536j08922n0863m2316j60582l711Q4536r5769N4420j12368n9356J4098
3657A931703k7213N4434J07859J3402l0848P5866P2901m3579k3006J9664o713
3646B144470J11573R2388J18513N8500K872m5596M2151O8748N1881K1038N6810
3635B723348n4049k5817M8536j7735J32129l114J9863j8820M4447N8768J13226
3624C020782P8010j2568K3912J04229J44087P7962M6261Q8851L6549n4227J28735
3613C682583J30888J30818J08067J79085R0295J51944J8583j2463p9767Q7691
$$ plain form
3688 2217476 2378350 2517051 2717896 2890081 3050949 3332539 3820687 4122529 4141968 4029317
3678 4029317 3679856 3262762 2978826 2820393 2689997 2474847 2460008 2480719 2393527 2412536
3668 2412536 2303614 2252751 2210435 2049853 2046142 2130678 2034909 2089329 1976961 1917605 1931703
3657 1931703 1904490 1958924 2066783 2080185 2049337 2125203 2198104 2154525 2131519 2151183 2144470
3646 2144470 2256043 2348431 2466944 2525444 2528316 2482720 2524871 2593619 2645500 2666538 2723348
3635 2723348 2669299 2643482 2692018 2674283 2806412 2803298 2823161 2804341 2848788 2907556 3020782
3624 3020782 3098792 3086224 3110136 3214365 3358452 3436414 3482675 3571526 3608075 3553848 3682583
3613 3682583 3813471 3944289 4052356 4231441 4321736 4473680 4492263 4479800 4400033 4487724
3603D487724L6597q99J06393K9475Q8754P5717R1219J19872P6989L0859L19993
3592E462693J10477j8359K44956J89345J18001R6271J03965j1390J02279J36160
3582F534398P6091J15030J32758J88157J55883J22818J31153J15563R0901L9238
3572G701990J45232K4196J91366K20070Q9712R7002J95175J64067K24401L31703
3562I384914L26147K22145K09766K85296K17328K23530L67331K76291L41622L68023
3552A2222393K63995L12464M90951N56435O31466N97079P84473Q72020R74738
3543A7706014R84132R95208J026950J003779Q87824O99399P24479K98001L04622
3534B4630408J93099k2397l39082l74768o37646q18537j201061j290341j223033
$$ plain form
3603 4487724 4524321 4523422 4629815 4659290 4748044 4823761 4914980 5034852 5111841 5142700 5462693
3592 5462693 5573170 5554811 5799767 5989112 6107113 6203384 6307349 6295959 6398238 6534398
3582 6534398 6610489 6725519 6858277 7046434 7202317 7325135 7456288 7571851 7662752 7701990
3572 7701990 7847222 7871418 8062784 8282854 8372566 8469568 8664743 8828810 9053211 9384914
3562 9384914 9711061 9933206 10142972 10428268 10645596 10869126 11236457 11512748 11854370 12222393
3552 12222393 12486388 12798852 13289803 13846238 14477704 15074783 15859256 16731276 17706014
3543 17706014 18690146 19685354 20712304 21716083 22603907 23303306 24027785 24325786 24630408
3534 24630408 24823507 24801110 24462028 24087260 23449614 22631077 21430016 20139675 18916642
3525A8916642j225857j105506j025892r99152p52311p26409o04037o28930n55458
3516A1293090n48078n58601m46146l63719l91461m10254l83384l24093l34717
3507G532637k92975k59616k59829j66993k43415l13626j28571l1469k12007j17459
3497E506677j41037k68812j10618j57916j58595q3137j91817j9050j22812j99298
3487D053585j86092j67852k7826j18783r1112q1082j46777M2524r0127k8990k8243
3476C129225j33257j22214o0933k0969l2509n2647J5640j23156j27556n1955j9138
3465B400531N968m7293k1825o2317m2736l5889j09784J82929m6382j61093m8213
3454B013896l9929M3642K532o5355k0006n0165o5748N197L7065O0323q3112r5983
$$ plain form
3525 18916642 17690785 16585279 15559387 14560235 13807924 13081515 12477478 11848548 11293090
3516 11293090 10745012 10186411 9740265 9376546 8985085 8574831 8191447 7867354 7532637
3507 7532637 7239662 6980046 6720217 6553224 6309809 5996183 5867612 5836143 5624136 5506677
3497 5506677 5365640 5096828 4986210 4828294 4669699 4586562 4394745 4375695 4252883 4053585
3487 4053585 3867493 3699641 3671815 3553032 3461920 3380838 3234061 3276585 3186458 3157468 3129225
3476 3129225 2995968 2873754 2812821 2791852 2759343 2706696 2722336 2599180 2471624 2419669 2400531
3465 2400531 2406499 2359206 2337381 2275064 2232328 2196439 2086655 2269584 2223202 2062109 2013896
3454 2013896 1973967 2017609 2020141 1954786 1934780 1884615 1818867 1824064 1861129 1921452 1838340 1742357
3442A742357K8855j22875K7713o4159j28364l567O695J8377l5027J02515K1058
3431A593578J285l0948J7144q0586k504n8490l472m7406r130l222K5511J7363
3419A419123o8885J0091N8341o2209q145o0849l5718k9934L5703J02613j01333
3408A258798P2045O9180j38960j3346j363q5254o7223Q8792q6115K5151J2515
3397A134220p6121P9384l681l9851N2020R5172j2894j0850n8467P254k452l7340
3385A126394q8845N3770L0279N8296o5431K105k4191o4470q5636O0729Q3336m1402
3373A044934N73J53909j04330L2887r3800l1003O0717j79309j0170J51715N0505
3362A076628l2878K7811L814R8571o3196M6789O8716l0907j358J995q890J01651
$$ plain form
3442 1742357 1771212 1648337 1676050 1611891 1483527 1479960 1486655 1505032 1470005 1572520 1593578
3431 1593578 1594863 1563915 1581059 1500473 1497969 1439479 1436007 1388601 1379471 1376249 1401760 1419123
3419 1419123 1350238 1360329 1418670 1356461 1348316 1287467 1251749 1221815 1257518 1360131 1258798
3408 1258798 1330843 1400023 1261063 1247717 1246354 1161100 1093877 1182669 1096554 1121705 1134220
3397 1134220 1058099 1137483 1133802 1093951 1145971 1241143 1228249 1217399 1158932 1166186 1163734 1126394
3385 1126394 1037549 1091319 1121598 1179894 1114463 1116568 1092377 1027907 942271 1003000 1086336 1044934
3373 1044934 1045507 1199416 1095086 1127973 1034173 1003170 1063887 884578 874408 1026123 1076628
3362 1076628 1043750 1071561 1075375 1173946 1110750 1157539 1226255 1195348 1193990 1195985 1187095 1288746
3350A288746p6848j47697Q046J8972M6003K7256R176j0802m9677m1264N4153M9877
3338A175941n7333J0101q9096J34630J05338N3304J0732L3126l6966K9059M5112
3327A413948m3580J363k9153P6544p0418k1063N0666N3712J2385j9663M8491J1492
3315A484724M8191P6865M5991Q8926Q8266Q7452n6844P3275J32312J34005L1572
3304B234735P504J06815J9522k727L8889O0251J7785m8780o452l1177k0892N3450
3292B428923J00936k4635L5588K5683K1186R1442q849N1762J7077n0780j4494
3281B673839k76J51565K19797n535J2647n9859M6034J54220J78735J45364K43186
3270C759717J88756K04153J94056J66790J04759Q5371J054m1247q3136p9170j50163
$$ plain form
3350 1288746 1211898 1064201 1072247 1091219 1137222 1164478 1173654 1162852 1113175 1071911 1126064 1175941
3338 1175941 1118608 1128709 1039613 1174243 1279581 1332885 1343617 1376743 1339777 1368836 1413948
3327 1413948 1370368 1371731 1342578 1419122 1348704 1327641 1378307 1432019 1444404 1424741 1473232 1484724
3315 1484724 1532915 1609780 1655771 1744697 1832963 1920415 1863571 1936846 2069158 2203163 2234735
3304 2234735 2242239 2349054 2368576 2365849 2404738 2464989 2482774 2433994 2427542 2396365 2375473 2428923
3292 2428923 2529859 2505224 2540812 2566495 2587681 2679123 2670274 2722036 2739113 2688333 2673839
3281 2673839 2673563 2825128 3044925 3039390 3052037 2992178 3038212 3192432 3371167 3516531 3759717
3270 3759717 3948473 4152626 4346682 4513472 4618231 4703602 4704656 4663409 4580273 4501103 4350940
3259D350940R5053J13491N4231l2310r9083q706j2290K7410m3768r0920j37458
3248D216590k2j20918j33358K8092J04867q0426O5439J70387J95789J14887N8936
3237D620263J76569J91430J66074L05848K46759J78661K90164L67878J67145K04198
3227F914989L41694K92151K49030K27213L15231J98869J82199R1766m954O3120
3217H871308l0910j86647o1205O788j48870J2239o4820q1996M3994L9448K7464
3206H426793K5049o0138L9234J53488J00147P5910J43116J79765L96291N28041
3196A0007696N19450P62067R63457R86286R54692O63472k00287q79256j097454
3187A2680123j159654j061252p59996p42235n33295m31090l00088j16385j33045
$$ plain form
3259 4350940 4445993 4559484 4613715 4581405 4482322 4473616 4461326 4488736 4444968 4354048 4216590
3248 4216590 4216568 4095650 3962292 3990384 4095251 4014825 4080264 4250651 4446440 4561327 4620263
3237 4620263 4796832 4988262 5154336 5460184 5706943 5885604 6175768 6543646 6710791 6914989
3227 6914989 7256683 7548834 7797864 8025077 8340308 8539177 8721376 8813142 8808188 8871308
3217 8871308 8840398 8653751 8592546 8599334 8450464 8462703 8397883 8315887 8359881 8399329 8426793
3206 8426793 8451842 8391704 8430938 8584426 8684573 8760483 8903599 9083364 9479655 10007696
3196 10007696 10527146 11289213 12252670 13238956 14193648 14857120 14656833 13777577 12680123
3187 12680123 11520469 10459217 9699221 8956986 8423691 7992601 7692513 7576128 7443083
3178G443083j39756j64737j07376j04296j04021o4132l1816K7716L2066Q7731
3168F874462J47660J9885P4757R7192J03721J36667L5976r5693j52342l67314
3158F874971l19212k32149k96851l47536l87128l68178k09105j28642j31960j88020
3148D266190k43576n2189p3422j37312j28837j01754j46672j45415j00539o4352
3138C072122j16983j27395k00088j25700L936o9628j22853p4170j20650j20087
3128A998504r9968q5404j15461k9385j2339p6057l1397R1536n3786l1622j49491
3117A405130j14547j6651o8871K7913r209K3553n9154l8205K4167j13256m2636
3106A018234O4994m3940K7920m1701q8060q6357P257O2885o882k0840o0415q582
$$ plain form
3178 7443083 7303327 7138590 7031214 6926918 6822897 6758765 6726949 6754665 6786731 6874462
3168 6874462 7022122 7042007 7116764 7213956 7317677 7454344 7490320 7394627 7242285 6874971
3158 6874971 6555759 6323610 6026759 5679223 5292095 4923917 4714812 4586170 4454210 4266190
3148 4266190 4022614 3970425 3897003 3759691 3630854 3529100 3382428 3237013 3136474 3072122
3138 3072122 2955139 2827744 2627656 2501956 2505892 2436264 2313411 2239241 2118591 1998504
3128 1998504 1898536 1813132 1697671 1668286 1655947 1579890 1548493 1640029 1586243 1554621 1405130
3117 1405130 1290583 1273932 1205061 1232974 1223765 1247318 1188164 1149959 1174126 1060870 1018234
3106 1018234 1083228 1039288 1067208 1025507 937447 851090 858347 921232 914350 893510 833095 824513
3094H24513p1380r4188R7384J5396q075j5493l0345K9966o9994n7481q7900o2205
3082D70198J22632l1274J4767r5012N6572J07184p5273o799k2502j3175N0122
3071E77440n067j00961j5235m1758N9846O7392j9633j06266m5087k3493m5903
3060C01275M9379O3969j74360m0975J69186Q643J2790J5926m17j27294p2426R1660
3048B97356R7453k3377m2498j2075l8097k2008L9352p4810p974N9915l9920k072
3036B31245L7267n1925O8331k1996M787L3686L582j22044j26246J51987J10487
3025C19161j25450k3892N733j0955O0748N988L8716J04380j36243o9430J12501
3014B81257l2472P6201j772q9361m2177m1126J23792n0036l6756L2522q2941K6791
$$ plain form
3094 824513 753133 658945 756329 771725 763650 748157 717812 747778 677784 620303 532403 470198
3082 470198 592830 561556 576323 481311 537883 645067 569794 562995 540493 527318 577440
3071 577440 572373 471412 456177 414419 474265 541657 522024 415758 370671 347178 301275
3060 301275 350654 414623 240263 199288 368474 377117 389907 405833 405416 278122 205696 297356
3048 297356 394809 371432 328934 316859 278762 256754 296106 221296 213322 273237 233317 231245
3036 231245 268512 216587 284918 262922 267709 301395 304977 182933 56687 208674 319161
3025 319161 193711 169819 175552 164597 225345 231333 270049 374429 238186 168756 281257
3014 281257 248785 324986 323214 233853 191676 150550 274342 224306 187550 220072 137131 163922
3002A63922M6696O8967o3726R0074m516k3701O3329m7539n6951n799l35l7329
2990A93092j38714M5329N0897R0609L2339j3663r8930k7522Q8736j4591J4915
2979B22497M8252J9918J15355m0123j48969L5750j1007L2206k6916k0021K8056
2968B54998K8852j5704k2376J0333n0512l8057J00006N0672M048k8131j6976O3790
2956C40943J1757j7289j17466P8060l8480Q1092n2241P5329J00265k3711K3146
2945D61405l9688O7337r164k4729O8676L4466J2644L8687J27153K4207m5277q0319
2933F35398J21539J78j11165M7960L5328j0768M0042J09101J8169j3628k5634
2922H46520M8898J5560l6789q9559K5762K3530Q3098j04129K3198l6497K8035
$$ plain form
3002 163922 210618 279585 215859 305933 301417 277716 341045 293506 236555 230756 230421 193092
2990 193092 54378 99707 150604 241213 273552 259889 160959 133437 222173 207582 222497
2979 222497 270749 290667 406022 365899 216930 252680 241673 273879 246963 226942 254998
2968 254998 283850 268146 245770 256103 205591 167534 267540 318212 322260 294129 277153 340943
2956 340943 352700 335411 217945 296005 257525 338617 286376 361705 461970 438259 461405
2945 461405 421717 489054 479890 455161 523837 558303 570947 609634 736787 760994 715717 635398
2933 635398 756937 757115 645950 693910 729238 718470 758512 867613 885782 872154 846520
2922 846520 895418 910978 874189 784630 810392 833922 917020 812891 836089 799592 827627
2911H27627J79138K1824K5233p932Q3528p5119n8898K3321P0253k4976k8869J18104
2899A153234r3158R3481j6787k5997N6821O8112l4559M0144P1107M0784j5412
2888A337770j05295J2414J4658o0748K4730n8527J8193m3020o6186r8564J1459
2877I86884O234j6597K8211k9343J6025o319m1968L6824L9091R250l9117p5653
2865I13522M7898J4687r2108j7246K2836J0388P657p52P7242R8646n09N8075J5761
2852A156097j29830p9727K9742j49439J8606p5630j29878j5065j64807l8780M3803
2841D65092J39906l9100o1960k2589j4574R7993n3795p4389J16819N2357O324
2830F12084q43p7492j34754N2886r7874q684N9486r5647K4568N1766J6806q4508
$$ plain form
2911 827627 1006765 1028589 1053822 1045890 1129418 1054299 995401 1018722 1088975 1063999 1035130 1153234
2899 1153234 1060076 1153557 1136770 1110773 1167594 1235706 1201147 1241291 1312398 1353182 1337770
2888 1337770 1232475 1244889 1259547 1198799 1223529 1165002 1183195 1140175 1073989 975425 986884
2877 986884 993118 976521 1004732 975389 991414 985095 943127 979951 1019042 1028292 989175 913522
2865 913522 961420 976107 883999 866753 889589 899977 907634 906882 984124 1082770 1082261 1140336 1156097
2852 1156097 1026267 946540 976282 826843 845449 769819 639941 624876 460069 421289 465092
2841 465092 604998 565898 503938 481349 466775 564768 510973 436584 553403 605760 612084
2830 612084 611241 533749 398995 451881 354007 345323 404809 309162 333730 385496 402302 317794
2818C17794j7613L722K8643P634j03975K8081L1726q993m9237n724o0634o4832
2806A06592m4431P2803L6855p5240m0877J5832L8527L6357m4419j2873o2271N4243
2794H1098J2046o5965N5263K2242m8364k0275j8943K5085j2681k9059n9363J03700
2782D4784n2044q6954J20205k3425o4545L3037R5504M6291m1196m1023n5884q7978
2770a13228L0807N733o2295P6873J16635Q6643r4577p3312L655R681n0730j9297
2758h3412N0170J15456r114k8833M5731p7018k1108J4131K8472j0670M6477N820
2746G6102P991n0324j04929O3278M1362j723m1584L9494n6516j09507P5725m816
2734f5447j5951n9252J42298N8409j14155k379N103p297J347O5277R385K2375
$$ plain form
2818 317794 300181 303903 332546 340180 236205 264286 296012 287019 237782 232058 171424 106592
2806 106592 62161 134964 171819 96579 55702 71534 110061 146418 101999 89126 26855 81098
2794 81098 93144 27179 82442 104684 56320 36045 17102 42187 29506 447 -58916 44784
2782 44784 -7260 -94214 25991 2566 -61979 -28942 66562 112853 71657 30634 -25250 -113228
2770 -113228 -82421 -76688 -138983 -62110 54525 141168 46591 -26721 -23066 -13385 -64115 -83412
2758 -83412 -33242 82214 73100 44267 89998 12980 -8128 6003 34475 23805 70282 76102
2746 76102 84093 33769 -71160 -7882 33480 31757 -9827 29667 -26849 -136356 -60631 -65447
2734 -65447 -81398 -140650 1648 60057 -54098 -56477 -51374 -58671 -57324 7953 17338 39713
2722C9713L922K60K662q218J2227o066m1373J5287M9527l4737Q5809L368j40079
2709a7698j1998R6245j7892n1135K8466o8965O2240P5094o3031p638j7968M0481
2697D6201J5661n6434m7375L273K5155q7884m2850Q4269O3587Q7700q0445N5592
2685F6450j21258J6604N4826r3819q1396M4526L7076J52213M6463j62779J3198
2674b7896l6019m8720J76515n1217k711M5745m3669m1881q0152j6710L0921J05909
2662A0115Q5261J9259l5308m1569M7515L3575l7160J2076p3676q2402j1323m0720
2650a14357n952J0260M1874Q3705j13836k6795J15527J2896K9793L6646j62480
2639i2719n3824K9955J7306M771K6195N2807K6352n3114k4500Q2596j03159m2123
$$ plain form
2722 39713 43635 43895 46557 38339 50566 44500 3127 18414 67941 33204 119013 122381 -17698
2709 -17698 -29696 66549 48657 -2478 25988 -42977 19263 94357 31326 23688 5720 46201
2697 46201 61862 5428 -41947 -38674 -13519 -101403 -144253 -59984 3603 91303 10858 66450
2685 66450 -54808 -38204 16622 -77197 -158593 -114067 -76991 75222 121685 -41094 -27896
2674 -27896 -63915 -112635 63880 12663 9952 55697 12028 -29853 -110005 -126715 -95794 10115
2662 10115 95376 114635 79327 37758 85273 118848 81688 93764 20088 -62314 -73637 -114357
2650 -114357 -120309 -110049 -68175 15530 -98306 -125101 -9574 3322 33115 69761 -92719
2639 -92719 -146543 -116588 -99282 -94511 -68316 -15509 10843 -42271 -66771 15825 -87334 -129457
2627a29457l3001J6604n688J47600J2954m4045L621j0115r56Q799R235L1023j8257
2614a1683P649j1043j12429Q8949L5631j1321k3917R5721q324J6007r1405n0872
2602g7037K0218M5230j25119l9391Q0638P380n9837P6488N0690K7224l5541k3463
2590e2520J9005J4700o7090R9929n7283j1632L8915n7617j16992L6677P7192m654
2578h1370L4472O7773R1680J9759p9264N382j2698J00421j9682m1223J7599p8792
2566B4057n777R956J060j50871L5488m3P3435j063k1508n7537Q4113n994N2770
2553C8086K6553K9433q5183k7255J16378K2076j10545J3070J01262r9342j7262
2542G271R9955l8314Q531k6830j25154J46422L9137P3632r469o2886M102m670
$$ plain form
2627 -129457 -162458 -145854 -151542 -3942 9012 -35033 -31412 -41527 -42483 -33684 -24449 6574 -11683
2614 -11683 -4034 -15077 -127506 -38557 -2926 -14247 -38164 57557 49233 65240 -26165 -77037
2602 -77037 -56819 -11589 -136708 -176099 -95461 -88081 -147918 -71430 -20740 6484 -29057 -52520
2590 -52520 -33515 -18815 -85905 14024 -43259 -54891 -15976 -73593 -190585 -153908 -76716 -81370
2578 -81370 -46898 20875 112555 132314 53050 58432 45734 146155 126473 85250 102849 24057
2566 24057 18280 28236 29296 -121575 -86087 -86130 -12695 -13758 -35266 -92803 -8690 -14684 38086
2553 38086 64639 94072 8889 -18366 98012 120088 9543 22613 123875 24533 7271
2542 7271 107226 68912 77443 50613 -74541 71881 111018 184650 175181 112295 116397 111727
2530A11727n3289n6747o1022O7417M8569p243j86O6561j0837r0052m5464j4646
2518d5212O7226Q3078R761o5842J6516P9220N5453l0683l6401L8544j08570J2474
2506G5564j52p4210j2121J15955M1514J855L6283l4417N7039j9473l7699R882
2494A60020O6048K1384j7454j24039k9093Q9387K570p5142N8900J63621l5386
2483B80816j6298R959K705o604k9915M1586N6912M0852N993O5108r830P8286j09038
2470D10532p9654k9418J0599M5812N4521L1838N8398K9788j1229n8180J1421k2104
2458D52324J4632j12197O7531J47537j952n0025j3647o0956O1872M7147J06913
2447F59179P5728Q9856m505R2027N5637p5344N6301J6329J5690N2626N194r8393
$$ plain form
2530 111727 58438 1691 -59331 8086 56655 49412 49226 115787 104950 14898 -30566 -45212
2518 -45212 22014 105092 114853 49011 65527 144747 200200 169517 133116 171660 63090 75564
2506 75564 75412 1202 -10919 105036 146550 148405 184688 150271 207310 187837 150138 160020
2494 160020 226068 247452 229998 105959 76866 166253 168823 93681 152581 316202 280816
2483 280816 264518 274477 277182 270578 240663 282249 339161 380013 386006 451114 441284 519570 410532
2470 410532 330878 301460 312059 357871 412392 444230 502628 532416 521187 463007 474428 452324
2458 452324 466956 354759 422290 569827 567875 517850 504203 443247 505119 552266 659179
2447 659179 734907 824763 820258 912285 967922 892578 948879 965208 980898 1033524 1038718 940325
2435I40325N7457K05852R3188m226K5573J87487j5061O4223J08632n9720L3050
2424A636780Q0106P5714j5234J16345J11026M4020M8669K02243J20368R9498J07625
2413B627160N2450R6755J87525K09973J90645K01442K78467M8657J75877L01598
2403D370549M57157M80451Q30589Q82543J102283J473421J989523K437598L561606
2394A7585720M652834N042398L92670m316719m923294m425482k953006k083146
2386H971975j590461j176675q26324n54535m34791m76565j46579j38909l6888
2377C590248k78928l31489k73958l23895j89216j67948j60171j59838j22511j09546
2367A472748p5198l2492l1864q5884j05516o2866K0023j06861j72630O2592M0655
$$ plain form
2435 940325 997782 1203634 1296822 1292596 1318169 1505656 1490595 1554818 1663450 1603730 1636780
2424 1636780 1716886 1792600 1777366 1893711 2004737 2048757 2097426 2299669 2420037 2519535 2627160
2413 2627160 2679610 2776365 2963890 3173863 3364508 3565950 3844417 3893074 4068951 4370549
2403 4370549 4827706 5308157 6138746 7021289 8123572 9596993 11586516 14024114 17585720
2394 17585720 22238554 27280952 27673622 23356903 18433609 14008127 11055121 8971975
2386 8971975 7381514 6204839 5378515 4823980 4389189 3912624 3766045 3627136 3590248
2377 3590248 3311320 2979831 2705873 2381978 2192762 2024814 1864643 1704805 1582294 1472748
2367 1472748 1397550 1365058 1333194 1247310 1141794 1078928 1098951 992090 819460 882052 922707
2356I22707K7583j40109j28348M2170P0134m5572j07198j1663K4991o0631j29803
2345D64261L6228l5539r1549n0336j9959O5905R1335l3404o8330L3285j21832
2334B70065P7802K4484o8039L9956m2939P9283k7548n5346o4737P0705n402j24187
2322A74097N574R5323j72007m5573J92480m4752o8710m8748J159K26O0252M3280
2310A92601k4002k6420n2810p2362R5017p5646J5468l2332j1607j09967J02214
2299A54N6294m1455l0482l7494Q9364L6222n6710J2701l3159O0507N3847j6665
2287I3124j56423J6190P3267L2480k1056j22789J20674k5618O5556N3583m8428
2276H0560l0442J4652n3572M8890j7366K1607q207m7712q0406j10495J06626K1498
$$ plain form
2356 922707 950290 810181 681833 724003 794137 748565 641367 629704 654695 594064 464261
2345 464261 500489 464950 373401 323065 303106 369011 460346 426942 358612 391897 270065
2334 270065 347867 372351 304312 344268 301329 380612 353064 297718 232981 303686 298284 174097
2322 174097 179671 274994 102987 57414 249894 205142 136432 87684 88843 89069 149321 192601
2310 192601 168599 142179 89369 17007 112024 36378 51846 19514 7907 -102060 154
2299 154 56448 14993 -15489 -52983 36381 72603 15893 28594 -4565 55942 109789 93124
2287 93124 -63299 -47109 26158 58638 37582 -85207 35467 9849 75405 128988 80560
2276 80560 50118 64770 11198 60088 42722 64329 56122 8410 -71996 -182491 -75865 -54367
2264e4367J8180K4500j1434P8705j7080k0601N358P2175k0690j45006Q096M0629
2252b1535Q243O6338l5985q613p7879o376j03952l3931J03686j33L9687P1094
2240F44o4498n494l4936O0481M5345L3385j05013l980M5342n0875O775O6473Q0514
2227G4163n5975j26895N0203O9392m6696o3042m5440K3298J18486n7438J971O0958
2215B985m9925M9571p5310M2783l6813J33168m4028r1338l1361L3537m1044J36696
2203B8921J08133j30376p4490n0332O9111Q559O8367M6601o0257q9555O6841J9840
2191A1363j30055P6754j8869L811L4673j1847m2441Q6638p9730m2930M3745L8920
2179b9968J19433r0987j37474k0667q797J52260M2199L7026m9564p7608L2509
$$ plain form
2264 -54367 -36187 -11687 -23121 55584 38504 17903 23261 95436 74746 -70260 -62164 -21535
2252 -21535 -13292 53046 17061 8448 -69431 -75807 -179759 -213690 -110004 -110137 -70450 644
2240 644 -63854 -69348 -104284 -43803 1542 34927 -70086 -74066 -28724 -79599 -72824 -6351 74163
2227 74163 18188 -108707 -58504 10888 -35808 -98850 -144290 -120992 -2506 -59944 -57973 2985
2215 2985 -46940 2631 -72679 -29896 -66709 66459 22431 -68907 -100268 -66731 -107775 28921
2203 28921 137054 6678 -67812 -118144 -49033 -40474 27893 74494 14237 -75318 -8477 11363
2191 11363 -118692 -41938 -60807 -56996 -22323 -34170 -76611 10027 -69703 -112633 -68888 -29968
2179 -29968 89465 -1522 -138996 -159663 -168460 -16200 25999 63025 13461 -64147 -31638
2168c1638j1232M0157L2554Q0787p9736j50869l5061O9421K7305m1855P8590p8939
2156a00516j25141J38482K9870p8308n4095J35948L5035j1282K0666K1110R1409
2145A03178l3864o364M6438n9789m6901m720o9748k1638o1963P0541J7916L5023
2133c1891J05301p8824O6160r3211K7669N8828K3992j1104q0143R4563M2226j15145
2121H421J13015p9710p0963m1295K2570J3748l1425j0444L6129K4838O3174k0444
2109B7614K3119K5418j56679j7195P1655j8491n4405O6474J6179j39152m3164
2098a98627l1823N7502J11099j02894l6328M8353Q7272M7997Q4715j5517j60818
2087a09069m0971O0055J6956o930p0147M3787N5201L7320p6886p8014J45339l645
$$ plain form
2168 -31638 -42870 -2713 29841 110628 30892 -119977 -155038 -85617 -58312 -100167 -21577 -100516
2156 -100516 -225657 -87175 -57305 -135613 -189708 -53760 -18725 -30007 -9341 11769 103178
2145 103178 69314 62950 109388 49599 2698 -2022 -71770 -93408 -155371 -84830 -66914 -31891
2133 -31891 73410 -5414 60746 -32465 -4796 54032 78024 66920 -13223 81340 123566 8421
2121 8421 121436 41726 -29237 -70532 -47962 -34214 -65639 -76083 -39954 -15116 48058 27614
2109 27614 50733 76151 -80528 -97723 -26068 -44559 -98964 -32490 -16311 -155463 -198627
2098 -198627 -230450 -172948 -61849 -164743 -201071 -152718 -65446 -17449 67266 51749 -109069
2087 -109069 -150040 -89985 -73029 -79959 -150106 -106319 -51118 -13798 -90684 -168698 -23359 -27004
2075b7004J9204L5245K1271k4699o2758j2272N3034K6157j6288k1583j1366n8565
2063g9624m9346L5275K1744P7763l7081j7206k2154K5465P6469J0358k3298o2337
2051d3972j8797J39606j21852J02327o7446r7982O6591J1827l9985J00568J8646
2040D9531k3639K8436p1908L8007j04582r7845O5448M8552j02318N4950K9290
2029h6078k3030Q6693P6304k9732n4330J04350q9005j05892N5080l5094j5042
2018a15776M0009L9044J01757p5956j17054J2415k4381J8951l4175J8723Q3813
2007e2630Q3531j00554j5968P3917n0420q3808J5863N4781J9941L8008o4388J0235
1995g1492j2259M4434L315o7180J2964l560j6466j16048L5999J11527K1780j4349
$$ plain form
2075 -27004 -7800 27445 48716 24017 -38741 -51013 2021 28178 11890 -9693 -21059 -79624
2063 -79624 -128970 -93695 -71951 5812 -31269 -48475 -70629 -45164 31305 41663 18365 -43972
2051 -43972 -62769 76837 -45015 57312 -10134 -108116 -41525 -29698 -69683 30885 49531
2040 49531 25892 54328 -17580 20427 -84155 -182000 -116552 -68000 -170318 -115368 -86078
2029 -86078 -109108 -22415 53889 24157 -30173 74177 -14828 -120720 -65640 -100734 -115776
2018 -115776 -75767 -36723 65034 -10922 -127976 -115561 -139942 -120991 -155166 -136443 -52630
2007 -52630 30901 -69653 -85621 -11704 -62124 -145932 -130069 -75288 -55347 -17339 -81727 -71492
1995 -71492 -83751 -39317 -36002 -103182 -90218 -93778 -110244 -226292 -190293 -78766 -56986 -71335
1983g1335m4259L5009P2371J0721M599m6383j6042J03251p4980J9632M0612J5401
1971D8597K8288j60737m3681r7871J24779M89J1282j7632m2879Q506J0463L8856
1959i1540j010K015o695Q651j31559L9659j5592L6080R3509N2612m2352L7505
1947a8717m800o0272o7879J68180N6760J0114j31437k6367L2708q836m0185o4062
1935a54793J55569o1257j6041k624j6545l9500J34571l3274k4708P3512l9111
1924b4201n4227J59175q4590o425q024K273j10926J4407N2620l108Q6812o9454
1912d5668k5186l771K7905n5014K5211O1359o1473P1616k5798l0781J969m7207
1900a06838J124L00q4814J03699K0901o6625P9190p4217K4289m8954J0644Q4132
$$ plain form
1983 -71335 -115594 -80585 -8214 2507 7106 -39277 -55319 47932 -27048 -7416 33196 48597
1971 48597 76885 -83852 -127533 -225404 -100625 -100136 -88854 -106486 -149365 -140859 -130396 -91540
1959 -91540 -92550 -90535 -97230 -88579 -220138 -180479 -196071 -159991 -66482 -13870 -56222 -18717
1947 -18717 -23517 -83789 -151668 16512 73272 83386 -48051 -74418 -41710 -50546 -90731 -154793
1935 -154793 776 -60481 -76522 -79146 -95691 -135191 -620 -33894 -58602 14910 -24201
1924 -24201 -78428 80747 -3843 -10268 -18292 -16019 -126945 -112538 -59918 -63026 23786 -45668
1912 -45668 -70854 -74625 -46720 -101734 -76523 -15164 -76637 -5021 -30819 -61600 -59631 -106838
1900 -106838 -105714 -105414 -190228 -86529 -65628 -132253 -53063 -127280 -102991 -151945 -141301 -57169
1888e7169Q0545q4083K7821l4040m3965K4494k3637l6368N9045m4540J7766J1950
1876a02181K8082M6259K2919J9472l2891M1828R530k5905l5561l1870N825q6024
1864a40517J09611J8399n901L8337o6356n1690Q0118O4785j58320p870k2497k2134
1852a64035J16698J2390J04018K1984j21683P7353O063l7785j5218J03255q6811
1841A6229p3824q1198o5469J24140K6169K5438o5722j9864L9031J803j6688n0279
1829a40234P7406j0061L3032J10713k10961j3840Q3587M5767N3904m3872o9645
1818h4204j7348L3584J9764L4297j2614o970j4438j4527L1574M1602j7920L4829
1806B7629k3139J28887q1995j33984N5090N4315j4982m5233L6711j46o7503M547
$$ plain form
1888 -57169 23376 -60707 -32886 -66926 -110891 -86397 -110034 -146402 -87357 -131897 -114131 -102181
1876 -102181 -74099 -27840 -4921 14551 -18340 23488 33018 7113 -28448 -60318 -54493 -140517
1864 -140517 -30906 -12507 -18408 19929 -46427 -98117 -17999 46786 -111534 -119404 -141901 -164035
1852 -164035 -47337 -34947 69071 91055 -30628 46725 52788 15003 -215 103040 16229
1841 16229 -57595 -138793 -204262 -80122 -53953 -28515 -94237 -114101 -75070 -73267 -89955 -140234
1829 -140234 -62828 -72889 -39857 70856 -140105 -153945 -70358 -24591 29313 -14559 -84204
1818 -84204 -101552 -67968 -48204 -13907 -26521 -33491 -47929 -62456 -30882 10720 -7200 27629
1806 27629 4490 133377 51382 -82602 -27512 26803 11821 -33412 3299 3153 -64350 -59803
1794e9803k9531K4270J0161J9054r070M2785j8598k0794N3720J5037O346j7191
1782A6386p3759o9769J05108J4948q901N9734k0587j4205p9036l6625K5470K3020
1770e8216L9825J1750M8724j31208N7135j0404k7209J2827k375j4794k9014k5427
$$ plain form
1794 -59803 -89334 -65064 -54903 -35849 -44919 -2134 -20732 -41526 12194 27231 33577 16386
1782 16386 -57373 -127142 -22034 -7086 -15987 43747 23160 8955 -70081 -106706 -81236 -58216
1770 -58216 -18391 -6641 42083 -89125 -31990 -42394 -69603 -56776 -59151 -73945 -102959 -128386
$$ [...]
##END NTUPLES=NMR SPECTRUM
##END=
